##TITLE=1H ikalashn
K-539
16.12.2024
##JCAMPDX= 6.0         $$ Bruker NMR JCAMP-DX V2.0
##DATA TYPE= NMR SPECTRUM
##DATA CLASS= NTUPLES
##ORIGIN= UXNMR, Bruker Analytische Messtechnik GmbH
##OWNER= root
$$ TOPSPIN		Version 1.3
$$ 2024-12-16 11:13:50.718 +0400  Irina@DPX200
$$ Compression mode = diff/dup
##.OBSERVE FREQUENCY= 200.131300845
##.OBSERVE NUCLEUS= ^1H
##.ACQUISITION MODE= SIMULTANEOUS
##.ACQUISITION SCHEME= undefined
##.AVERAGES= 64
##.DIGITISER RES= 18
##SPECTROMETER/DATA SYSTEM= spect
##.PULSE SEQUENCE= zg
##.SOLVENT NAME= CDCl3
##.SHIFT REFERENCE= INTERNAL, CDCl3, 1, 17.49637
##AUDIT TRAIL= $$ (NUMBER, WHEN, WHO, WHERE, WHAT)
$$ ##TITLE= Audit trail, TOPSPIN		Version 1.3
$$ ##JCAMPDX= 5.01
$$ ##ORIGIN= Bruker BioSpin GmbH
$$ ##OWNER= Irina
$$ $$ F:/spectra/data/iren/nmr/1H/4/pdata/1/auditp.txt
$$ ##AUDIT TRAIL=  $$ (NUMBER, WHEN, WHO, WHERE, VERSION, WHAT)
(   1,<2024-12-16 11:13:19.921 +0400>,<Irina>,<DPX200>,<TOPSPIN 1.3>,
      <created by zg
	started at 2024-12-16 11:09:06.953 +0400,
	POWCHK disabled, PULCHK disabled
       configuration hash MD5:
       BE 6D 3F 07 2A EA 11 49 91 17 2B D3 AF B3 58 0D
       data hash MD5: 16K
       AA 7D D6 E8 AF 1B 9C 76 5E 96 D1 DA D9 0F 0B DD>)
(   2,<2024-12-16 11:13:32.125 +0400>,<Irina>,<DPX200>,<TOPSPIN 1.3>,
      <Start of raw data processing
       efp BC_mod = 2 LB = 0.1 FT_mod = 6 PKNL = 1 PHC0 = 127.7595 PHC1 = 11.60404 SI = 32K 
       data hash MD5: 32K
       73 0A 9A 8A 77 AC 27 2A 31 AA 81 7C BE E1 99 E3>)
(   3,<2024-12-16 11:13:41.000 +0400>,<Irina>,<DPX200>,<TOPSPIN 1.3>,
      <pk fgphup PHC0 = 0.3402344 PHC1 = -3.2 
       data hash MD5: 32K
       57 61 42 58 01 5B 1B FC 52 78 2C 37 AC 93 FD A8>)
$$ ##END=
$$ 
$$ $$ hash MD5
$$ $$ FF 59 8C A9 B0 46 35 16 13 0F BC 70 0C 22 97 23
##$RELAX= 
##$RELAX= 
##$RELAX= 
##$RELAX= 
##$RELAX= 
##$RELAX= 
##$RELAX= 
##$RELAX= 
##$RELAX= 
$$ Bruker specific parameters
$$ --------------------------
##$DU= <F:/spectra>
##$EXPNO= 4
##$NAME= <1H>
##$PROCNO= 1
##$TYPE= <nmr>
##$USER= <iren>
##$AMP= (0..31)
100 100 100 100 100 100 100 100 100 100 100 100 100 100 100 100 100 100 
100 100 100 100 100 100 100 100 100 100 100 100 100 100 
##$ANAVPT= -1
##$AQSEQ= 0
##$AQ_mod= 1
##$AUNM= <au_zg>
##$AUTOPOS= <>
##$BF1= 200.13
##$BF2= 200.13
##$BF3= 200.13
##$BF4= 200.13
##$BF5= 200.13
##$BF6= 200.13
##$BF7= 200.13
##$BF8= 200.13
##$BYTORDA= 1
##$CFDGTYP= 0
##$CFRGTYP= 5
##$CHEMSTR= <none>
##$CNST= (0..63)
1 1 145 1 1 1 1 1 1 1 1 1 1 1 1 1 1 1 1 1 1 1 1 1 1 1 1 1 1 1 1 1 1 1 
1 1 1 1 1 1 1 1 1 1 1 1 1 1 1 1 1 1 1 1 1 1 1 1 1 1 1 1 1 1 
##$CPDPRG= <>
##$CPDPRG1= <>
##$CPDPRG2= <>
##$CPDPRG3= <>
##$CPDPRG4= <mlev>
##$CPDPRG5= <mlev>
##$CPDPRG6= <mlev>
##$CPDPRG7= <mlev>
##$CPDPRG8= <mlev>
##$CPDPRGB= <>
##$CPDPRGT= <>
##$D= (0..63)
0 2 0 0 0 0 0 0 0 0.06 0 0.03 0 0 0 0 0.0002 0 0 0 0 0 0 0 0 0 0 0 0 0 
0 0 0 0 0 0 0 0 0 0 0 0 0 0 0 0 0 0 0 0 0 0 0 0 0 0 0 0 0 0 0 0 0 0 
##$DATE= 1734333198
##$DBL= (0..7)
120 120 120 120 120 120 120 120 
$$ [...]
##$SW_h= 4401.40845070422
##$TD= 16384
##$TD0= 1
##$TE= 300
##$TE2= 300
##$TE3= 300
##$TEG= 300
##$TL= (0..7)
0 120 120 120 120 120 120 120 
##$TP= (0..7)
150 150 150 150 150 150 150 150 
##$TP07= 0
##$TPNAME0= <>
##$TPNAME1= <>
##$TPNAME2= <>
##$TPNAME3= <>
##$TPNAME4= <>
##$TPNAME5= <>
##$TPNAME6= <>
##$TPNAME7= <>
##$TPOAL= (0..7)
0.5 0.5 0.5 0.5 0.5 0.5 0.5 0.5 
##$TPOFFS= (0..7)
0 0 0 0 0 0 0 0 
##$TUNHIN= 0
##$TUNHOUT= 0
##$TUNXOUT= 0
##$USERA1= <user>
##$USERA2= <user>
##$USERA3= <user>
##$USERA4= <user>
##$USERA5= <user>
##$V9= 5
##$VALIST= <valist>
##$VCLIST= <CCCCCCCCCCCCCCC>
##$VD= 0
##$VDLIST= <DDDDDDDDDDDDDDD>
##$VPLIST= <PPPPPPPPPPPPPPP>
##$VTLIST= <TTTTTTTTTTTTTTT>
##$WBST= 1024
##$WBSW= 25
##$XGAIN= (0..3)
0 0 0 0 
##$XL= 0
##$YL= 0
##$YMAX_a= 839813
##$YMIN_a= -764818
##$ZGOPTNS= <>
##$ZL1= 120
##$ZL2= 120
##$ZL3= 120
##$ZL4= 120
##$ABSF1= 0
##$ABSF2= 0
##$ABSG= 0
##$ABSL= 0
##$ALPHA= 0
##$AQORDER= 0
##$ASSFAC= 0
##$ASSFACI= 0
##$ASSFACX= 0
##$ASSWID= 0
##$AUNMP= <proc_1d>
##$AXLEFT= 0
##$AXRIGHT= 0
##$AXTYPE= 0
##$AXUNIT= <>
##$AZFE= 0.1
##$AZFW= 0.1
##$BCFW= 0
##$BC_mod= 2
##$BYTORDP= 0
##$COROFFS= 0
##$CY= 7568.61572265625
##$DATMOD= 1
##$DC= 0
##$DFILT= <>
##$DTYPP= 0
##$F1P= 17.9538593292236
##$F2P= -4.03888763876832
##$FCOR= 0.5
##$FTSIZE= 32768
##$FT_mod= 6
##$GAMMA= 0
##$GB= 0
##$INTBC= 0
##$INTSCL= 5.656564e-011
##$ISEN= 128
##$LB= 0.1
##$LEV0= 0
##$LPBIN= 0
##$MAXI= 945.577
##$MC2= 0
##$MEAN= 0
##$ME_mod= 0
##$MI= -402.1523
##$NCOEF= 0
##$NC_proc= -5
##$NLEV= 6
##$NOISF1= 8.587773
##$NOISF2= 6.764455
##$NSP= 0
##$NTH_PI= 0
##$NZP= 0
##$OFFSET= 17.49637
##$PC= 1
##$PHC0= 128.0997
##$PHC1= 8.40404
##$PH_mod= 1
##$PKNL= yes
##$PPARMOD= 0
##$PPDIAG= 0
##$PPIPTYP= 0
##$PPMPNUM= 100
##$PPRESOL= 1
##$PSCAL= 0
##$PSIGN= 0
##$REVERSE= no
##$SF= 200.13
##$SI= 32768
##$SIGF1= 16.12182
##$SIGF2= -4.496377
##$SINO= 3.521527
##$SIOLD= 32768
##$SREGLST= <1H.CDCl3>
##$SSB= 0
##$STSI= 32768
##$STSR= 0
##$SW_p= 4401.40845070422
##$SYMM= 0
##$S_DEV= 0
##$TDeff= 16384
##$TDoff= 0
##$TI= <>
##$TILT= no
##$TM1= 0
##$TM2= 0
##$TOPLEV= 0
##$USERP1= <user>
##$USERP2= <user>
##$USERP3= <user>
##$USERP4= <user>
##$USERP5= <user>
##$WDW= 1
##$XDIM= 32768
##$YMAX_p= 315913899
##$YMIN_p= -1455214
$$ End of Bruker specific parameters
$$ ---------------------------------
##NTUPLES= NMR SPECTRUM
##VAR_NAME=  FREQUENCY,     SPECTRUM/REAL,   SPECTRUM/IMAG
##SYMBOL=    X,             R,               I
##VAR_TYPE=  INDEPENDENT,   DEPENDENT,       DEPENDENT
##VAR_FORM=  AFFN,          ASDF,            ASDF
##VAR_DIM=   32768,         32768,           32768
##UNITS=     HZ,            ARBITRARY UNITS, ARBITRARY UNITS
##FACTOR=    0.134324425510551, 1,           1
##FIRST=     4401.40845070422, -670131,      -1289694
##LAST=      0,             53964,           -1186564
##MIN=       0,             -1455214,        0
##MAX=       4401.40845070422, 315913899,    0
$$ Real data points
##PAGE= N=1
##DATA TABLE= (X++(R..R)), XYDATA
$$ [...]
11823 5506118 5674767 5525880 5392008 5438285 5668243 5957536 5951007 5400320 4738842 4742677
11813 4742677 5401573 5783999 5380651 4879478 5050564 5531814 5517546 5152498 5266345 5943757
11803 5943757 6366129 6130074 5806417 5932599 6222642 6162187 5785629 5442289 5262564 5261284
11793 5261284 5552544 6027192 6177346 5727243 5177190 5224487 5823261 6317632 6387414 6319680
11783 6319680 6350464 6304189 6051223 5833226 5841665 5841363 5571373 5266553 5375746 5882242 6307460
11772 6307460 6382328 6330060 6380866 6361025 6007016 5459255 5136265 5194656 5392408 5506336
11762 5506336 5638546 5984247 6441913 6635384 6341058 5800469 5517776 5715237 6063572
11753 6063572 6074176 5723697 5469100 5574621 5712277 5481312 5089864 5112281 5643413 6141521
11743 6141521 6184930 5970260 5887756 5968534 6002025 5913630 5757530 5564634 5444428 5599779
11733 5599779 5972970 6126405 5797492 5342307 5256599 5460923 5492010 5246314 5043072 5022284
11723 5022284 4994447 4908572 4975437 5235770 5447490 5493821 5467111 5276858 4704816 4012599
11713 4012599 3906697 4567362 5237146 5211628 4783789 4680197 4952884 5086470 4958479 4939592
11703 4939592 5061457 4839605 4154489 3679996 4005658 4737985 4991825 4607612 4350368
11694 4350368 4801060 5476326 5400665 4403529 3426908 3407569 4183318 4825841 4845977 4601827
11684 4601827 4544635 4611987 4582892 4555932 4689075 4790151 4603047 4305430 4298499 4610704
11674 4610704 4888068 4900340 4717388 4466811 4251904 4220569 4377934 4444707 4266436 4198681
11664 4198681 4604866 5115905 5025086 4417139 4178367 4673833 5128269 4760670 3953544 3682117
11654 3682117 4133072 4559747 4411158 4000102 3929997 4293103 4683980 4793521 4723911 4713876
11644 4713876 4748065 4629932 4407057 4418212 4736463 4879532 4461684 3895368 3896574 4412374
11634 4412374 4704118 4511469 4369963 4577794 4667005 4320520 4036913 4273205 4604835 4477988
11624 4477988 4210721 4386554 4744540 4662427 4377560 4601608 5103326 4911887 4006464 3547173
11614 3547173 4077058 4675674 4480899 3993601 4079768 4547754 4664559 4460367 4513824 4817713
11604 4817713 4826349 4457765 4195711 4261215 4414144 4523870 4655145 4641498 4260196 3807638
11594 3807638 3807120 4135272 4154925 3766565 3562782 3806768 4069104 4129219 4393334 4997016
11584 4997016 5305806 4904080 4372547 4377586 4614811 4479591 4229629 4473449 4895418 4666892
11574 4666892 3991750 3969105 4743912 5083880 4317910 3503207 3801787 4667415 4785725 4159522
11564 4159522 3934063 4416783 4650467 4112120 3583551 3836221 4458767 4682514 4606309 4790218
11554 4790218 5153452 5145509 4751133 4504848 4578933 4592291 4374453 4247437 4380179 4455156
11544 4455156 4258435 4125132 4432606 4972197 5205794 4971305 4596374 4393659 4348360 4338774
11534 4338774 4439662 4852319 5555271 6130689 6064703 5281539 4307573 3824711 4097404 4839985
11524 4839985 5488008 5554970 4986968 4331306 4273429 4775684 5020236 4552988 4051175 4348042
11514 4348042 5064116 5090986 4306439 3776047 4078767 4486364 4275122 3883530 4033643 4480848
11504 4480848 4537846 4296813 4369690 4741532 4824646 4497503 4222863 4196323 4179241 4155920
11494 4155920 4377177 4723168 4777654 4593928 4641073 4916255 4895212 4496935 4285106 4504763
11484 4504763 4745411 4828312 5142773 5701994 5782574 5100623 4503303 4737137 5263130 5174072
11474 5174072 4666875 4578778 4894363 4844377 4324505 4106337 4548588 5072991 5167700 5100372
11464 5100372 5310646 5745663 6123772 6320011 6207862 5628923 4814248 4365548 4507342
11455 4507342 4778198 4761064 4683816 4922252 5293538 5312598 4930448 4582172 4589040 4838887
11445 4838887 5014627 4908422 4553086 4201662 4123002 4333159 4623262 4862202 5068775 5171149
11435 5171149 5003483 4638029 4396696 4395776 4420954 4406468 4615368 5090537 5389746 5265119
11425 5265119 5172208 5562342 6020906 5787337 4942373 4341891 4386285 4588401 4504326 4389151
11415 4389151 4614335 5024651 5295682 5474555 5705059 5775706 5447400 4983957 4837879 4954898
11405 4954898 4912333 4692331 4772541 5348272 5943045 6021649 5657998 5352096 5420548 5786207
11395 5786207 6168863 6260381 5886139 5246175 4878072 5120539 5673490 5929827 5704771 5382474
11385 5382474 5333508 5461264 5433210 5151709 4831640 4717443 4857771 5110244 5287134 5333408
11375 5333408 5387697 5597136 5873202 5969302 5838401 5739631 5879980 6099617 6069268 5707566
11365 5707566 5260082 5038520 5201689 5690386 6221311 6438644 6260945 6020651 6081450 6389658
11355 6389658 6623118 6719926 6959758 7481578 8023999 8300156 8405226 8629808 8980876 9122781
11345 9122781 8823825 8317487 8111185 8438167 8983521 9241917 9095489 8859059 8747106
11336 8747106 8585225 8211500 7856807 7798876 7870547 7735034 7487290 7468781 7563214 7289562
11326 7289562 6664887 6318046 6510320 6690244 6416961 6117691 6350997 6808087 6776077 6299005
11316 6299005 6083033 6328116 6432712 5985400 5377127 5157841 5299522 5422505 5382811 5303880
11306 5303880 5258221 5199761 5097060 4974571 4906539 4991707 5176630 5159849 4761057 4355597
11296 4355597 4539092 5278727 5825772 5659247 5115950 4822793 4877713 4945744 4875700 4813769
11286 4813769 4871095 5038695 5312695 5594173 5610502 5279064 5011322 5243381 5725525 5732410
11276 5732410 5044968 4304415 4221826 4776315 5415971 5762854 5817051 5653897 5300211 4920314
11266 4920314 4815248 5089595 5473567 5616058 5465306 5228908 5038170 4850715 4686614
11257 4686614 4722689 5015309 5302350 5283604 5006310 4772285 4730812 4778899 4810469 4814265 4745562
11246 4745562 4570140 4439262 4529451 4690189 4592139 4284036 4200642 4475266 4682991 4522777
11236 4522777 4323490 4500827 4891955 5091128 5129967 5287484 5468428 5379804 5174030 5249427
11226 5249427 5457285 5230498 4597969 4322332 4751440 5237583 5141626 4794786 4861310 5226505
11216 5226505 5252908 4865440 4592754 4592415 4423537 3953796 3779325 4351317 5199257 5514118
11206 5514118 5185918 4760674 4568151 4453674 4347981 4507838 4960665 5184381 4759546
11197 4759546 4078507 3927463 4440732 4951490 4955784 4744773 4815767 5058233 4980927 4551245
11187 4551245 4288458 4495435 4856006 4967116 4896694 4928588 5018155 4882712 4544063 4387709
11177 4387709 4582095 4745634 4433358 3797372 3450913 3658922 3975939 3882744 3542957 3569764
11167 3569764 4114323 4617852 4599896 4304278 4280092 4606327 4891569 4869876 4627447 4338034
11157 4338034 4128851 4135869 4331978 4369097 3998242 3602635 3826348 4623268 5201014 5075812
11147 5075812 4661001 4529626 4595599 4455322 4151249 4065404 4261634 4438255 4451636 4450775
11137 4450775 4511078 4515919 4438720 4436548 4597092 4801927 4881392 4778144 4594191 4565976 4849476
11126 4849476 5213107 5191187 4753667 4510997 4892415 5421778 5339250 4752178 4516530 4978885
11116 4978885 5515565 5520883 5246503 5287737 5672134 5895976 5631236 5038144 4517756 4411805
11106 4411805 4805614 5408965 5760717 5712786 5554391 5549428 5616584 5631170 5697888 5823526
11096 5823526 5655795 4999824 4362914 4429893 5061371 5387590 4994095 4469662 4522269 5018890
11086 5018890 5317730 5246594 5226919 5489235 5668253 5359308 4756319 4453271 4721312 5220554
11076 5220554 5437747 5243936 4945619 4871666 5017559 5119448 5017197 4844315 4811223 4895662
11066 4895662 4902730 4808418 4819340 5007309 5131945 5029829 4949709 5176850 5502441 5511985 5316729
11055 5316729 5435535 5876719 5975121 5429034 4880510 4974999 5375803 5374362 5080603 5195634
11045 5195634 5787767 6149426 5895966 5415600 5097086 4871912 4744116 5013260 5610064
11036 5610064 5901706 5607913 5289837 5430001 5643531 5431933 5158303 5468876 6118654
11027 6118654 6251670 5697195 5150480 5066228 5152267 5086400 5023790 5137934 5234420 5131734
11017 5131734 4994666 5008469 5078152 5098437 5189427 5405752 5505076 5289694 4965515 4896996
11007 4896996 5148985 5484385 5695119 5744819 5672750 5534255 5419762 5430733 5613149 5901812
10997 5901812 6119353 6120817 5999949 6000968 6112897 5987190 5496791 5110739 5304112 5787772
10987 5787772 5862171 5478044 5337013 5822014 6418211 6480605 6103701 5867229 6058417 6503377
10977 6503377 6915064 7066724 6804934 6216013 5693986 5610810 5954982 6383116 6524994 6236029
10967 6236029 5766779 5675024 6248319 6990715 7091589 6485591 5966278 6085640 6485446 6606789
10957 6606789 6500486 6499311 6588635 6635435 6818196 7240471 7482690 7182947 6752585 6800562
10947 6800562 7093642 6908568 6311699 6187735 6862333 7532031 7404245 6748689 6390754
10938 6390754 6630748 7089516 7312002 7158851 6792786 6527653 6552283 6698779 6670648 6498994
10928 6498994 6456261 6520749 6374465 6033724 5987598 6474130 7054716 7209139 6993688 6797496
10918 6797496 6760623 6758923 6717399 6648421 6584476 6670727 7051413 7491819 7490576 7005435 6631793
10907 6631793 6742555 6948416 6867505 6892856 7496202 8185431 8057652 7226615 6740636 7010671
10897 7010671 7287004 7014128 6773893 7250352 7974931 7964105 7229006 6742797 6977737 7342653
10887 7342653 7287315 7208287 7751693 8696311 9178426 8880039 8396442 8349175 8643462 8846615
10877 8846615 8896273 9031647 9239401 9226106 8924505 8631301 8548974 8510974 8309940 8043016
10867 8043016 7950883 8095059 8351226 8570746 8631358 8507687 8409910 8632306 9106508 9356668
10857 9356668 9135388 8862041 9089929 9689650 9950593 9477411 8654989 8166940 8289188
10848 8289188 8713259 8903555 8624203 8236068 8375153 9153149 9838475 9652648 8776872
10839 8776872 8148262 8255617 8616973 8616531 8394213 8530037 9128488 9680459 9796234 9684139
10829 9684139 9761784 10027899 10052827 9567616 8878791 8574312 8872740 9416864 9738538 9763951
10819 9763951 9757685 9910418 10139535 10222016 10014841 9645253 9552050 10110481 11047332 11517241
10809 11517241 11083108 10369621 10305950 10917218 11427809 11464041 11456063 11729210 11924594 11704676
10799 11704676 11448086 11699041 12302173 12654258 12600294 12526710 12652936 12761002 12691890 12677080
10789 12677080 12995408 13557146 14009924 14146146 14092871 14130841 14377429 14693898 14949705 15268014
10779 15268014 15794947 16294337 16349464 16055319 16075369 16744605 17507552 17645127 17260577 17069923
10769 17069923 17414965 18004118 18534210 19022983 19496912 19870454 20280503 21092942 22342967
10760 22342967 23496948 24022100 23975174 23817969 23826658 23890992 23792502 23496901 23173520 22988320
10750 22988320 22885567 22630081 22120300 21538131 21054324 20536974 19779816 18888156 18143670
10741 18143670 17582055 17046721 16595153 16441335 16479640 16303106 15804499 15349242 15188047
10732 15188047 15093382 14806242 14478081 14368614 14394978 14317835 14174687 14193863 14389342 14528449
10722 14528449 14451710 14214244 13951537 13756515 13641471 13527158 13343947 13177187 13158630 13185914
10712 13185914 12989845 12571082 12304367 12448742 12785235 12920714 12761974 12535409 12508003
10703 12508003 12777796 13130160 13082882 12410649 11651510 11607731 12220980 12540778 12081081 11534631
10693 11534631 11657689 12103219 12068452 11579040 11291453 11379607 11493784 11566636 11748931 11741969
10683 11741969 11187021 10608089 10872000 11694038 11884107 11269728 11048297 11751020 12231567
10674 12231567 11541103 10564178 10575595 11144187 10945126 10045532 9770920 10496419 11158446
10665 11158446 11122698 11056292 11480019 11787662 11459866 11160239 11645752 12365844 12235281 11347827
10655 11347827 10820242 11085292 11386357 11090952 10571151 10399338 10417341 10194721 9927716
10646 9927716 10170694 10844481 11210257 10929706 10547463 10622501 10890247 10793656 10491090 10627817
10636 10627817 11191069 11389258 10889222 10412028 10610144 11006542 10778176 10120914 9916239
10627 9916239 10264574 10385842 10054787 10075179 10903795 11721765 11578610 10815201 10525354 10976877
10617 10976877 11413077 11298470 10964108 10897060 11028330 11010129 10798586 10651784 10729435 10913438
10607 10913438 10982585 10876264 10760964 10779280 10762522 10405270 9787456 9422499 9597942 9970873
10597 9970873 10085572 9986605 9974459 10061034 10103809 10196687 10408051 10391221 9884413 9396037
10587 9396037 9642323 10386682 10673982 10276154 10001309 10328720 10672694 10474043 10157906
10578 10157906 10325489 10699400 10677430 10400857 10408838 10615919 10530268 10239616 10261377 10523188
10568 10523188 10413327 9874434 9553866 9715418 9862616 9717927 9753626 10315861 10920813
10559 10920813 10960818 10580019 10310573 10270861 10264389 10315695 10540859 10728920 10588812 10262766
10549 10262766 10133927 10252630 10367403 10384658 10377755 10267867 9934753 9563735 9462586 9591848
10539 9591848 9674811 9702625 9902733 10251912 10470715 10499605 10539443 10612674 10547831 10418563
10529 10418563 10478028 10588665 10307662 9718414 9543506 10078732 10597874 10329011 9571497
10520 9571497 9249117 9666670 10330161 10793232 11031079 11061043 10849438 10642956 10788777 11103438
10510 11103438 10994512 10397826 10020229 10348527 10947264 11153482 11003505 10942184 10978805 10781519
10500 10781519 10424807 10355372 10610918 10716704 10493877 10370063 10627866 10892641 10764312
10491 10764312 10518444 10674972 11156928 11418727 11266661 11027211 10944978 10920721 10888798 10970627
10481 10970627 11132629 11134470 10981936 11005357 11283509 11434859 11270514 11194370 11521940 11815749
10471 11815749 11498634 10860054 10740616 11280341 11713648 11536866 11173564 11159603 11288776
10462 11288776 11073407 10609384 10384491 10475933 10540666 10499316 10633235 10961820 11085501 10831219
10452 10831219 10577648 10659304 10839431 10739854 10495184 10520152 10774162 10761400 10304311 9863400
10442 9863400 9898739 10269762 10547005 10651494 10820244 11082310 11189385 11086465 11061864 11274988
10432 11274988 11439283 11210236 10694116 10321219 10317875 10520193 10642966 10540269 10249477 9955134
10422 9955134 9880890 10078077 10361285 10544561 10619676 10589463 10348044 9962365 9835536 10215485
10412 10215485 10707052 10729237 10369041 10262132 10631418 11024309 11110595 11124705 11275537 11327225
10402 11327225 11136075 11035350 11212350 11230839 10754385 10265052 10354481 10697466 10572115 10130571
10392 10130571 10177253 10750421 10978357 10537459 10214748 10570406 10982781 10713949 10166530
10383 10166530 10208323 10755370 10984841 10705902 10547297 10781201 10885956 10532061 10212218
10374 10212218 10428328 10837113 10803788 10466284 10581426 11352492 12009622 11794610 10980881
10365 10980881 10538399 10917105 11553922 11677556 11275945 10978763 11146864 11476457 11556160
10356 11556160 11432628 11386042 11425057 11366288 11286595 11480610 11918092 12123965 11805838 11327026
10346 11327026 11248277 11545457 11659597 11340371 11033247 11196649 11564545 11524368 11090484 10954979
10336 10954979 11462631 12068190 12128416 11783960 11593176 11660467 11743895 11973803 12670319 13454459
10326 13454459 13399390 12359804 11411066 11490632 12188859 12455176 12034683 11540450 11410226
10317 11410226 11509758 11671485 11968189 12374172 12637998 12607788 12382731 12143544 12087256 12393973
10307 12393973 12922316 13117530 12653187 12000055 11858598 12179009 12341481 12207039 12268021
10298 12268021 12703097 13041282 12987961 12877779 12970942 12953797 12585823 12274598 12468252 12914314
10288 12914314 13080968 12975519 12985413 13170555 13279061 13286368 13371828 13474324 13399389 13309309
10278 13309309 13581858 14149058 14454430 14189482 13701625 13528669 13801988 14225719 14430440
10269 14430440 14261180 13888982 13690548 13881805 14272842 14514088 14519616 14469952 14470133 14431087
10259 14431087 14268780 14023728 13789215 13663156 13714472 13859191 13876113 13711205 13628956 13849576
10249 13849576 14170351 14190350 13800824 13232007 12767811 12657176 13086490 13877161 14387507
10240 14387507 14144962 13476639 13099223 13197394 13377412 13419428 13477487 13521324 13233581 12657650
10230 12657650 12376445 12747413 13395921 13745004 13660783 13332281 12934749 12705608 12933183
10221 12933183 13491873 13732081 13238265 12438243 12083608 12352911 12831188 13158912 13312480
10212 13312480 13397909 13529537 13804089 14106359 14091712 13640300 13134775 12978007 13052716 13017580
10202 13017580 12908132 12997345 13243810 13393209 13518650 13891640 14319775 14216163 13489256
10193 13489256 12830484 12835918 13259159 13474804 13364815 13335285 13607916 13911385 13928296 13758068
10183 13758068 13753660 13998254 14151150 13907638 13484174 13417030 13860979 14347691 14377938 14014275
10173 14014275 13667234 13504510 13373804 13183204 13035128 13017048 13109323 13268630 13424942 13508790
10163 13508790 13648634 14100276 14716448 14827363 14121653 13348526 13482780 14345291 14819949
10154 14819949 14443759 13933795 13925280 14056459 13787389 13398070 13499317 14026053 14391452 14349112
10144 14349112 14116655 13885944 13761841 13967266 14545088 15018708 14896902 14391042 14111325
10135 14111325 14197331 14315293 14372886 14562904 14742675 14513112 14023201 13962285 14509719 14985661
10125 14985661 14900509 14688521 14893277 15207464 15006687 14455595 14311168 14754696 15141702
10116 15141702 14975890 14523752 14298122 14443396 14856912 15458880 16018458 16087799 15539616
10107 15539616 14951265 14991862 15500008 15635126 15024291 14326762 14407343 15248258 16024889 16118308
10097 16118308 15701149 15343254 15371875 15710738 16086096 16243962 16135706 16001208 16110295
10088 16110295 16353465 16322859 15915888 15562749 15623651 15856479 15845367 15717786 15934542 16457700
10078 16457700 16697585 16399253 16067026 16249698 16805751 17201788 17234669 17095951 16937074
10069 16937074 16761912 16649252 16721142 16898504 16959791 16837733 16641321 16437131 16258230 16270821
10059 16270821 16612097 17043942 17104476 16722953 16400917 16610418 17230867 17764004 17919536
10050 17919536 17789713 17611060 17591611 17856659 18305456 18582942 18450708 18151906 18131559 18405686
10040 18405686 18558907 18460569 18570990 19225366 19927189 19850108 18976451 18240214 18399359 19164673
10030 19164673 19703156 19707041 19607540 19863467 20401546 20795477 20755339 20366494 19985677 19938412
10020 19938412 20222814 20526248 20620312 20648230 20864978 21209908 21404725 21422500 21522659 21770426
10010 21770426 21876079 21673965 21443395 21507788 21779862 22013092 22278917 22773836 23251215
10001 23251215 23142881 22372315 21633540 21579251 21990270 22093932 21592714 21008334 20951689 21369686
9991 21369686 21716151 21672855 21421702 21250806 21177543 21061124 20884803 20756996 20728896 20751625
9981 20751625 20749907 20627278 20282817 19756858 19289260 19099264 19174540 19381865 19641443 19830386
9971 19830386 19718999 19292635 18961349 19064158 19293187 19086986 18532112 18293838 18597439
9962 18597439 18931544 18961083 19027867 19356573 19474514 19044539 18669815 19045011 19724310 19687307
9952 19687307 18934966 18504494 18842560 19168176 18775211 18103981 17997786 18519528 19064419
9943 19064419 19218399 19003021 18596119 18260503 18294463 18669235 18940129 18820698 18573204 18545258
9933 18545258 18662122 18719117 18798619 18960704 18883157 18351170 17820140 17881484 18349903 18514837
9923 18514837 18205895 17948535 18040674 18141350 17958194 17766261 17938589 18366058 18652748 18631157
9913 18631157 18457070 18384135 18576847 18954127 19153462 18883835 18355990 18093189 18283075 18625203
9903 18625203 18847405 18993595 19118824 19120297 19040606 19138229 19427813 19511634 19131846 18577209
9893 18577209 18278444 18291512 18436709 18643687 18871403 18976760 18962918 19076230 19367538 19496264
9883 19496264 19321476 19299623 19800045 20367553 20298444 19733158 19462102 19707033 19849966 19507388
9873 19507388 19158261 19358742 19880820 20097574 19911165 19848179 20331365 21163472 21746012 21698777
9863 21698777 21271991 21101934 21455961 21874155 21827080 21549113 21743296 22516621 23202650 23357720
9853 23357720 23321337 23528260 23867042 24126781 24528956 25265877 25937926 26064401 25844211 25788583
9843 25788583 25862098 25666144 25271063 25091325 25004085 24429021 23404371 22771680 22991458 23476144
9833 23476144 23485207 23068573 22682459 22436023 22242352 22222642 22364987 22196184 21452207 20741981
9823 20741981 20811805 21377121 21485870 20944811 20518252 20627406 20749893 20438471 20123520 20353122
9813 20353122 20850359 20983392 20767720 20731496 21023587 21294439 21347266 21318960 21253453 21049758
9803 21049758 20858751 21001649 21399807 21574264 21350214 21096286 21080283 21050556 20735073 20355140
9793 20355140 20295537 20556759 20860293 21041589 21029620 20709182 20163608 19811110 19912623 20174900
9783 20174900 20256320 20382001 20878879 21335939 21029164 20193390 19982044 20835278 21700677 21471331
9773 21471331 20558899 20229540 20759632 21192787 20884881 20364843 20363266 20729159 20845215 20646999
9763 20646999 20598175 20851325 21059027 21067638 21251028 21875933 22505646 22471454 21827032 21378349
9753 21378349 21631225 22088314 21936968 21226619 20870822 21417289 22287164 22541682 22088538
9744 22088538 21687404 21870318 22325439 22456618 22183932 21934653 22021907 22305464 22471273 22470048
9734 22470048 22558894 22912767 23313557 23391658 23178457 23169013 23664029 24266841 24335336 23816770
9724 23816770 23285538 23184997 23400452 23624442 23762464 23846176 23894306 24038952 24463508 25002043
9714 25002043 25134143 24670881 24143762 24135301 24457549 24450000 23976335 23626696 23864678 24392192
9704 24392192 24567215 24215605 23815599 23940987 24625814 25294830 25348882 24799757 24188209 23883114
9694 23883114 23760187 23682860 23865855 24396119 24782656 24563835 24127251 24228855 24775507 24880328
9684 24880328 24264608 23777547 24118472 24764454 24785928 24203896 23810979 23957509 24263104 24402514
9674 24402514 24454295 24449079 24247121 24013413 24199612 24783941 25063382 24593600 23929591 23949415
9664 23949415 24679933 25313338 25335167 25132645 25332093 25918978 26328821 26238083 25923270 25814326
9654 25814326 25970640 26153635 26240296 26331662 26500011 26654170 26697226 26651386 26581526 26549425
9644 26549425 26677788 27068795 27589345 27933900 27986791 27908288 27778411 27466383 27044631 26973459
9634 26973459 27494845 28096102 28050461 27371086 26746563 26582719 26641115 26677550 26842444 27186611
9624 27186611 27296140 26874021 26358829 26445251 27107617 27586673 27393571 26914902 26831113 27227709
9614 27227709 27595637 27608697 27532997 27725862 28033086 28059113 27920305 28196559 28972290 29495626
9604 29495626 29269951 29023133 29809410 31318971 32024511 31234526 30129881 30210656 31371361
9595 31371361 32268453 32211854 31845193 32005826 32676049 33284730 33520506 33521937 33528088 33595738
9585 33595738 33562907 33197607 32478215 31728361 31329624 31311931 31385901 31345977 31241526 31159932
9575 31159932 31063969 30899904 30704963 30548978 30459263 30392879 30206281 29750815 29144469 28820019
9565 28820019 29054526 29511742 29533201 28909231 28120618 27754563 27878922 28078357 27968780 27580005
9555 27580005 27263592 27243209 27309808 27115516 26747060 26671661 26971702 27054642 26486757 25738473
9545 25738473 25557190 25857039 25891738 25419968 24977358 24942865 25063800 25100527 25235948 25507362
9535 25507362 25472468 24911720 24358789 24412632 24898111 25212614 25191279 25116428 25121302 25117709 25163005
9524 25163005 25393484 25651191 25600369 25205031 24783342 24635855 24846920 25302983 25664225 25543954
9514 25543954 25018715 24703868 24968675 25375269 25347093 25073757 25133710 25439420 25308876 24575558
9504 24575558 23897420 23806890 24080054 24274006 24341594 24426340 24487999 24429633 24283786 24078686
9494 24078686 23818837 23687299 23865707 24060575 23715273 22879490 22317078 22441107 22683893
9485 22683893 22367512 21725726 21487358 21762478 21969893 21753660 21415562 21407611 21791371 22249454
9475 22249454 22370172 21938642 21163958 20552435 20375985 20412567 20397632 20465741 20816294 21196008
9465 21196008 21176198 20810365 20534436 20468965 20315717 19971688 19738168 19777519 19820235 19654371
9455 19654371 19540281 19826517 20384429 20734196 20623452 20234107 19869204 19649437 19541511
9446 19541511 19530885 19655912 19880415 20026019 19936619 19685014 19456474 19214398 18733569 18082570
9436 18082570 17763997 18095739 18707841 19026190 19050386 19191279 19485634 19551246 19317489 19176450
9426 19176450 19258379 19172235 18756962 18506738 18801281 19200945 19083639 18638184 18563985 18952476
9416 18952476 19158307 18815907 18353362 18291318 18529487 18632362 18480973 18310695 18292101 18358473
9406 18358473 18366337 18235013 17979160 17721074 17612461 17677435 17810935 17945428 18069123 18068698
9396 18068698 17801512 17428608 17406475 17927612 18568869 18758190 18456381 18109564 18031167 18126064
9386 18126064 18181921 18147806 18116285 18244729 18636811 19065732 18970253 18143583 17334390 17576885
9376 17576885 18814182 19798413 19636299 18841297 18435909 18609075 18896239 19176282 19616100
9367 19616100 19897311 19480845 18652816 18372615 18885490 19354388 19182986 18848545 18939790 19170299
9357 19170299 19023022 18720813 18752305 18902607 18612644 18008501 17720337 17831523 17835547 17595899
9347 17595899 17545437 17853276 18129228 18115057 18016889 17972228 17811813 17571551 17634753 18066709
9337 18066709 18339307 18053633 17491945 17135508 17048908 17063458 17180612 17441171 17707454 17886414
9327 17886414 18084488 18289099 18235069 17878576 17669138 18007340 18683762 19147954 19105043 18637897
9317 18637897 18053900 17838574 18382001 19441466 20221113 20292115 20071217 20083426 20207422 20084636
9307 20084636 19830861 19776592 19830361 19687591 19427694 19333083 19314360 19069048 18641064 18300831
9297 18300831 18061848 17845203 17887723 18372596 18863420 18792570 18370092 18286723 18603905 18703847
9287 18703847 18326150 17856327 17512140 17063809 16555502 16505419 17055235 17594712 17597514 17262412
9277 17262412 17002007 16854408 16740346 16767778 16917712 16906209 16685867 16604046 16762047 16758393
9267 16758393 16427515 16265322 16651257 17147946 17107693 16587908 16155501 16100769 16301185 16568605
9257 16568605 16722849 16614513 16417309 16542106 16949439 17022740 16507559 16020480 16111859 16394552
9247 16394552 16261677 15941500 16032752 16392799 16382511 15994425 15864497 16243604 16729441 16971875
9237 16971875 16948434 16629855 16087973 15841158 16331841 17118780 17368853 17103444 17103713 17568407
9227 17568407 17815202 17488117 17116156 17139310 17243837 17105678 17036332 17383746 17915603 18280104
9217 18280104 18521621 18695673 18545501 18059760 17823864 18266825 18982410 19309526 19190679
9208 19190679 18951828 18623034 18050236 17411850 17083755 17133981 17327072 17448658 17349327 16949582
9198 16949582 16472792 16322144 16449855 16283358 15604646 14996741 14994698 15320518 15466659 15485987
9188 15485987 15576943 15434836 14811274 14287304 14600710 15476658 15992953 15890727 15642900 15417166
9178 15417166 14958601 14442274 14413881 14776009 14806213 14374954 14201004 14625673 15065326 15052827
9168 15052827 14925364 15015700 15027170 14785262 14798827 15378758 15901868 15726018 15244509 15194906
9158 15194906 15407220 15155244 14436484 13978066 14110474 14481294 14828936 15230849 15556900
9149 15556900 15456786 15033147 14847838 15076827 15261686 15087582 14826749 14779495 14817485 14754260
9139 14754260 14684937 14678118 14580937 14406868 14461282 14778698 14906732 14610118 14309248 14376603
9129 14376603 14486616 14245328 14015257 14343697 14863808 14681780 13820311 13331094 13744844
9120 13744844 14286366 14087299 13436031 13170525 13365643 13397922 13038075 12705730 12683180 12749620
9110 12749620 12696726 12662361 12783281 12933923 12972303 12914637 12766255 12514170 12351736 12518147
9100 12518147 12825095 12791446 12404883 12257075 12652092 13071288 12930775 12451461 12258645 12416859
9090 12416859 12454115 12215671 12112504 12468719 13059423 13407781 13264880 12759503 12300209 12302366
9080 12302366 12792756 13349955 13626749 13758236 13993215 14169371 13962205 13461546 13021955
9071 13021955 12680111 12245385 11863537 11881710 12152963 12103801 11595452 11119367 10987345 10930767
9061 10930767 10724417 10610259 10782159 10973407 10915857 10762422 10711729 10640924 10454932 10379741
9051 10379741 10546179 10680069 10565717 10421596 10459479 10489812 10339266 10208904 10207031 10024394
9041 10024394 9566158 9379716 9833428 10362008 10266467 9841806 9865346 10289952 10398869 10096851
9031 10096851 10037552 10416418 10597926 10185788 9653680 9580231 9893456 10180911 10217829 9946476
9021 9946476 9433887 9044715 9153231 9526008 9523918 9053401 8712323 8819912 8981748 8893110
9011 8893110 8871672 9181078 9466891 9369596 9155839 9207742 9358353 9287916 9165842 9317962
9001 9317962 9586017 9582714 9315504 9039696 8767617 8453016 8383717 8791989 9275452 9223708
8991 9223708 8708531 8358462 8414785 8508163 8383784 8260290 8340364 8466352 8465644 8459244 8606075
8980 8606075 8797525 8798039 8545459 8211672 8067553 8301964 8852912 9408010 9643212 9434007
8970 9434007 8853789 8154154 7760178 7963487 8490638 8717042 8478025 8265156 8397836 8516639
8960 8516639 8285047 8050187 8227304 8499738 8350324 8017518 8095150 8429131 8324973 7760635
8950 7760635 7447576 7620174 7700700 7381972 7149182 7368072 7653134 7594829 7428653 7484561
8940 7484561 7562140 7373790 7107519 7031578 6977922 6733417 6560712 6816458 7364626 7825012
8930 7825012 8084902 8129017 7741497 6921568 6285375 6441134 7127291 7522622 7310894 6945221
8920 6945221 6933557 7320035 7833308 8153692 8072735 7715743 7517790 7682130 7832250 7544388
8910 7544388 7012938 6759701 6870772 7010864 7057020 7185035 7384351 7416525 7270041 7176385
8900 7176385 7150506 6987934 6764521 6861085 7376677 7919535 8086240 7809090 7210475 6513387
8890 6513387 6112306 6276060 6711454 6861548 6683128 6636755 6859195 6952719 6758905 6689322
8880 6689322 6973375 7195465 7017870 6814074 7039455 7419591 7381186 6964556 6658842 6544301
8870 6544301 6275485 5845811 5710017 6055398 6485819 6581118 6357510 6049935 5820562 5809965
8860 5809965 6107522 6512218 6655416 6522759 6520992 6835572 7076973 6860603 6436853 6348564
8850 6348564 6639098 6834975 6674108 6428378 6415528 6557435 6607981 6527431 6379253 6085153
8840 6085153 5619318 5322204 5619069 6387881 6976389 6992461 6749199 6704153 6782760 6634711
8830 6634711 6337474 6332195 6668660 6818558 6426422 5863262 5755055 6204340 6755999 6975118
8820 6975118 6796631 6403961 6018320 5797331 5766941 5833127 5919110 6027974 6138525 6193707
8810 6193707 6262090 6498579 6815994 6853059 6492267 6145511 6190839 6357464 6133518 5652760
8800 5652760 5596117 6146758 6628988 6450636 5911343 5676825 5830396 5948163 5875599 5854596
8790 5854596 5943482 5894147 5714400 5812622 6317647 6706263 6499265 5996542 5840520 6055418
8780 6055418 6080545 5718604 5448593 5618453 5866098 5709639 5322956 5251915 5575043 5845409
8770 5845409 5815216 5754881 5963850 6325742 6508173 6372784 6056872 5811049 5834058 6123648
8760 6123648 6445531 6569174 6508489 6392054 6217157 5985981 5943029 6274954 6635667 6463978
8750 6463978 5829691 5443484 5678921 6125048 6337405 6441939 6620717 6596626 6196191 5929486
8740 5929486 6303689 6900247 6905036 6359193 6080794 6401935 6795809 6844963 6792602 6898731
8730 6898731 6950873 6744904 6466506 6264072 5996037 5745343 5990766 6791464 7344708 6970847
8720 6970847 6142342 5866919 6311437 6731238 6635675 6316952 6179282 6185025 6163016 6171857 6297139
8709 6297139 6419971 6407598 6302202 6190150 6116438 6205321 6570290 6995650 7045080 6681939
8699 6681939 6459259 6806417 7388168 7536880 7160498 6807546 6858502 7068922 7043193 6821589
8689 6821589 6738584 6881574 6981279 6820728 6534612 6436061 6663454 7065603 7375377 7443940
8679 7443940 7329378 7192453 7125815 7112131 7130561 7199040 7261385 7168817 6912419 6757399 6936603
8668 6936603 7286794 7448827 7384320 7367929 7464630 7434810 7277882 7394151 7923072 8370800
8658 8370800 8313486 8072406 8155701 8375648 8210724 7831954 7953464 8657402 9187665 9100027
8648 9100027 8848242 8907953 9044415 8918887 8793166 9037421 9406970 9435370 9215858 9191565
8638 9191565 9423647 9654524 9901234 10390301 11005799 11352357 11330861 11193737 11101873 11080856
8628 11080856 11316852 11974678 12742874 13064488 12861058 12591066 12570559 12669694 12701546 12664491
8618 12664491 12547995 12319889 12155936 12271715 12491478 12406566 11994057 11639253 11515200 11408792
8608 11408792 11197782 10992490 10750820 10304317 9843110 9755514 9850397 9437048 8440739 7715249
8598 7715249 7829857 8230136 8159276 7800968 7804312 8133933 8193259 7856917 7617654 7757470
8588 7757470 8005249 8038215 7806822 7343244 6719146 6235235 6221062 6559323 6756292 6570364
8578 6570364 6291342 6322583 6701404 7090060 7116658 6744832 6370186 6415016 6778736 6972531
8568 6972531 6905738 7100214 7826635 8487653 8353545 7569106 6879408 6633564 6655536 6852394
8558 6852394 7241211 7491568 7186045 6563656 6320431 6582549 6725076 6341204 5762095 5432889
8548 5432889 5372265 5469717 5741782 6030361 5981886 5607209 5368591 5460129 5536947 5434749
8538 5434749 5547050 6068001 6439569 6117489 5449144 5183590 5419593 5635143 5541130 5323501
8528 5323501 5164263 5061337 5073631 5274239 5473451 5397876 5148429 5118682 5438748 5809522
8518 5809522 5913697 5739366 5487019 5358981 5422307 5526091 5434316 5176015 5099689 5396656
8508 5396656 5772526 5840864 5652764 5544621 5616793 5667930 5534479 5229235 4856650 4608770
8498 4608770 4670286 4909348 4911045 4580187 4392519 4688250 5065135 4963400 4545027 4395044
8488 4395044 4579751 4670177 4556096 4513062 4510532 4223013 3800142 3841165 4393150 4720658
8478 4720658 4401919 3978085 4087930 4545226 4774864 4685523 4563542 4454082 4203336 3909373
8468 3909373 3845861 4033196 4229220 4256203 4117431 3951696 4024954 4488698 4979270 4845424
8458 4845424 4035207 3329990 3343475 3727799 3824188 3655879 3674541 3882457 3923212 3829051
8448 3829051 3929189 4111015 3937818 3522362 3506118 4000471 4292191 3929792 3460186 3625208
8438 3625208 4296665 4712593 4477372 3871383 3351977 3151377 3281792 3612480 3940132 4145972
8428 4145972 4242907 4231145 4100882 4033439 4282494 4684649 4639303 3886642 3018843 2818459
8418 2818459 3278064 3712242 3735175 3639211 3761899 3948360 3869200 3571316 3432508 3676447
8408 3676447 4114755 4332635 4057363 3416829 2888120 2897848 3400315 3909618 3990514 3656482
8398 3656482 3265969 3121220 3219716 3328432 3250310 3053780 3033735 3362759 3791123 3839131
8388 3839131 3351130 2729924 2512521 2798819 3213302 3362222 3192558 2931867 2824068 2958195
8378 2958195 3250017 3526143 3660268 3650359 3551120 3372977 3111899 2834371 2626238 2481472
8368 2481472 2374212 2427357 2811395 3404132 3758270 3584544 3136107 2912243 3071246 3363194
8358 3363194 3576661 3744633 3859822 3716288 3254221 2847499 2937111 3418496 3678299 3340729
8348 3340729 2781561 2698602 3222859 3699449 3492772 2833541 2543402 2910907 3266902 2958668
8338 2958668 2370086 2414707 3163799 3681051 3370255 2805381 2819729 3337233 3692629 3700719
8328 3700719 3692510 3709524 3446940 2994737 2874133 3162966 3274563 2900181 2543506 2709760
8318 2709760 3115806 3225849 3122539 3226841 3459294 3359505 2916417 2640995 2812335 3207101
8308 3207101 3599060 3962880 4106740 3711308 2951074 2513670 2679377 2885571 2611857 2229525
8298 2229525 2418491 3076916 3465963 3292998 2989456 2899259 2835565 2625888 2533384 2809873
8288 2809873 3234337 3446344 3444359 3421591 3359694 3139609 2867696 2741630 2731341 2714094 2771763
8277 2771763 2995000 3136179 2881229 2388898 2118691 2159884 2197897 2137176 2220537 2457607
8267 2457607 2523479 2407240 2543813 2993659 3127701 2612644 2126687 2429345 3164502 3381190
8257 3381190 2975965 2747678 3071187 3384007 3168182 2700125 2507679 2650479 2880073 3072292
8247 3072292 3175956 3080250 2816020 2617220 2595578 2630535 2680800 2841648 2999284 2875752
8237 2875752 2561786 2514174 2823368 3002686 2766031 2481308 2530075 2752667 2892133 3027057
8227 3027057 3144536 2895192 2299557 2060675 2509474 2874392 2434233 1806290 2042692 2889652
8217 2889652 3169429 2686033 2437716 2871285 3227595 2939023 2476035 2317064 2179769 1904735
8207 1904735 2081251 2982501 3731981 3465867 2680408 2456747 2845058 3047320 2885966 2992438
8197 2992438 3553872 3870502 3409350 2564432 2048378 2044323 2268210 2496086 2705587 2871657
8187 2871657 2873188 2622146 2243232 2056241 2227660 2471213 2388633 2127266 2248867 2800483
8177 2800483 3086367 2704910 2214412 2226561 2398656 2073543 1490246 1455046 2030426 2488703
8167 2488703 2521354 2567864 2844090 2940239 2636464 2328898 2325643 2412761 2441714 2670605 3152422
8156 3152422 3442062 3346954 3345776 3754661 4060561 3693481 2983428 2672871 2819850 2878979
8146 2878979 2663890 2543547 2728023 2947864 2914278 2679043 2472386 2476817 2755362 3149190
8136 3149190 3292390 2959184 2337938 1801016 1548136 1615998 1972343 2378208 2460341 2202688
8126 2202688 2049972 2227161 2366385 2212630 2210390 2771422 3394404 3325586 2808281 2735089
8116 2735089 3167120 3235838 2646338 2227419 2587402 3156856 3164800 2807204 2732856 2946921
8106 2946921 2997415 2853262 2826849 2873845 2703629 2436800 2450848 2647576 2570321 2257036
8096 2257036 2272221 2763170 3166536 3110075 2975214 3169065 3378019 3084376 2459516 2136730
8086 2136730 2268276 2403964 2288866 2208805 2397449 2602673 2542847 2427391 2626099 3024017
8076 3024017 3137927 2844686 2601805 2831087 3370986 3725414 3684395 3502633 3523959 3773677
8066 3773677 3944492 3764142 3369368 3209895 3464892 3708320 3442631 2865663 2657637 2961296
8056 2961296 3129852 2740137 2277755 2336990 2654265 2627116 2418299 2676713 3323903 3582271
8046 3582271 3278786 3127346 3425308 3473504 2853166 2354441 2790908 3599917 3646399 2967651
8036 2967651 2608091 2923219 3208373 3083415 3095298 3556128 3787080 3181168 2303148 2163444
8026 2163444 2820474 3433563 3471190 3189726 2993641 2938391 2946463 3030964 3137401 3090493 2857053
8015 2857053 2636511 2572366 2565809 2492036 2438919 2582607 2904835 3162613 3135960 2843195 2502788
8004 2502788 2321662 2353154 2534597 2762958 2885255 2750641 2432703 2299740 2622723 3153749
7994 3153749 3387117 3252529 3188888 3422692 3592561 3363120 3024332 3041469 3267401 3137675
7984 3137675 2562302 2077901 2038219 2145354 1991571 1675377 1580507 1786174 2009483 2039223
7974 2039223 1979350 2048768 2265848 2387107 2193814 1856483 1864008 2411758 3004639 2989093
7964 2989093 2419631 1998443 2123147 2451474 2556082 2517064 2561526 2568186 2369481 2190670
7954 2190670 2275163 2345953 2023123 1596007 1719694 2378864 2830428 2683720 2390386 2443570
7944 2443570 2704963 2847693 2890720 2866813 2494843 1748596 1319121 1813695 2742396 3033469
7934 3033469 2472195 1897802 1915201 2152697 2059375 1778027 1759737 1958669 1949249 1628301
7924 1628301 1322730 1267768 1355535 1408056 1421646 1503047 1738593 2130615 2543434 2762602
7914 2762602 2722323 2589123 2505210 2388656 2158496 1996515 2116874 2365391 2352255 1983641
7904 1983641 1586419 1458222 1538359 1601300 1559906 1473528 1426585 1494267 1681461 1824454 1718971
7893 1718971 1426446 1265970 1383847 1526728 1422886 1216162 1264402 1599335 1882415 1908150
7883 1908150 1855673 1914897 1918170 1600726 1105932 914107 1216092 1627204 1689776 1454978
7873 1454978 1312185 1376578 1401259 1295375 1321712 1606203 1822153 1683308 1471450 1649692
7863 1649692 2114912 2320782 2104981 1877370 1894000 1865868 1535364 1180553 1169504 1358941
7853 1358941 1379311 1275706 1365000 1573922 1462572 971716 661032 979130 1636296 1993203
7843 1993203 1879494 1720045 1888089 2201601 2196663 1798485 1510833 1810432 2474480 2792202
7833 2792202 2484982 2068374 2077294 2278686 2089421 1549053 1277619 1475795 1608608 1291944
7823 1291944 896815 876245 991624 772638 410791 513858 1079825 1410347 1158515 840930
7813 840930 1016906 1455672 1543781 1200905 918373 1027748 1365733 1643023 1765433 1734177
7803 1734177 1559001 1388179 1449486 1706108 1802216 1536144 1185219 1128241 1309001 1366159
7793 1366159 1204170 1101782 1246782 1492491 1657345 1740717 1691241 1308139 662421 323502
7783 323502 733180 1492721 1753990 1328696 926432 1145188 1686981 1879461 1611056 1322372
7773 1322372 1280104 1336051 1366305 1495743 1767919 1940087 1810824 1539510 1441503 1585707
7763 1585707 1754808 1732547 1511586 1267234 1207820 1402574 1698359 1853711 1785191 1619576
7753 1619576 1502363 1463661 1482259 1533911 1535870 1408387 1252842 1276498 1441650 1415780 1049233
7742 1049233 686300 737758 1099829 1306011 1168047 947208 926836 1130725 1450391 1719035
7732 1719035 1658081 1137185 553063 531558 1107739 1624797 1648793 1515156 1649256 1843662
7722 1843662 1725440 1527560 1707157 2037242 1863387 1228042 932921 1318330 1749167 1656097
7712 1656097 1382170 1463167 1639661 1298833 587006 328190 861522 1576802 1736081 1316510
7702 1316510 863729 805178 1084343 1327061 1269100 1052215 1031635 1247963 1316884 1020680
7692 1020680 730513 903050 1377307 1606657 1457148 1289105 1286927 1225654 985364 823155
7682 823155 961335 1273887 1534842 1649710 1531395 1115825 641080 533127 836905 1122967
7672 1122967 1139088 1157394 1431954 1712397 1636934 1296732 1053290 1029230 1102000 1196183 1284018
7661 1284018 1279904 1191959 1192250 1333378 1435837 1432892 1492006 1586860 1388280 892457 660722
7650 660722 982621 1298654 1050270 643000 815577 1410602 1645815 1398828 1278841 1467343
7640 1467343 1463870 1124362 1013687 1417254 1829407 1813957 1639036 1628162 1569101 1268809
7630 1268809 1081536 1317789 1624836 1521358 1146041 954561 1038335 1221104 1453871 1644922
7620 1644922 1506077 1063485 879089 1212039 1446887 1035677 524198 775398 1541453 1825663
7610 1825663 1481994 1338313 1670656 1708514 1031771 432577 742745 1554028 1845309 1397493
7600 1397493 862398 714537 818883 945345 1130819 1451276 1799261 1983967 1878350 1490017
7590 1490017 1028499 811008 941028 1175059 1248093 1200271 1221761 1323472 1370885 1336768
7580 1336768 1304643 1290704 1263671 1287026 1427173 1528665 1303652 736935 253489 315526
7570 315526 855157 1255058 1021209 411371 181542 660293 1337280 1555520 1347702 1239643
7560 1239643 1407294 1515698 1393486 1355060 1657685 2039141 2076384 1735990 1303189 973525
7550 973525 779153 768431 992369 1361796 1688165 1841105 1806227 1675524 1599302 1605443 1484844
7539 1484844 1080721 662406 669495 1046177 1253137 1081875 986645 1331245 1764894 1759427
7529 1759427 1384805 1054014 810582 465853 243959 591027 1318291 1599319 1054797 332559
7519 332559 277247 874715 1396388 1391254 1135828 1104503 1325424 1446151 1291679 1097954
7509 1097954 1132581 1307184 1372320 1343614 1417314 1520986 1340922 860968 482435 472202
7499 472202 667735 869224 1077333 1148511 766035 105352 -44752 654169 1426385 1425884
7489 1425884 971432 953415 1400868 1592638 1376754 1316581 1513634 1365411 742007 407867
7479 407867 843606 1489791 1662493 1494922 1434558 1453309 1339426 1220766 1206572 999804
7469 999804 473942 193819 698358 1586883 1970809 1623998 1102625 880672 894642 851845
7459 851845 577483 153846 -22507 425373 1222122 1565924 1224610 963399 1383144 1939299
7449 1939299 1837536 1345951 1279616 1587460 1537264 1106568 1041119 1508756 1814753 1642508
7439 1642508 1509809 1680999 1659772 1218291 962198 1277429 1575449 1281915 829277 891105
7429 891105 1260128 1328694 1173751 1260405 1437226 1182217 662234 604232 1118446 1520122
7419 1520122 1442424 1316478 1485813 1574421 1174397 635922 648936 1298354 1971165 2098642
7409 2098642 1680447 1124076 809899 831236 1005581 1073990 924516 665798 532908 725474
7399 725474 1240283 1806499 2096756 2083456 2053368 2170296 2214454 1942949 1521938 1322983
7389 1322983 1403681 1482463 1358213 1066647 691192 351637 338071 856575 1585447 1884391
7379 1884391 1588326 1223226 1237012 1395862 1260179 928813 848373 1056523 1146711 1010468
7369 1010468 1096594 1696398 2365594 2435076 1887917 1323937 1129441 1104391 969063 813981
7359 813981 822142 879865 789019 647357 674744 822275 915204 1039011 1350052 1601482 1388668
7348 1388668 883446 744683 1149862 1499683 1349740 1051316 1067264 1207821 1102486 973511
7338 973511 1258454 1761066 1892053 1590644 1312548 1204655 1015177 802153 962611 1440640
7328 1440640 1653308 1433819 1339591 1695494 2007021 1781124 1346823 1298817 1566193 1632307
7318 1632307 1379988 1138418 1081008 1106611 1190834 1367179 1447453 1223635 897769 868821
7308 868821 1103188 1147696 816635 465956 465143 725983 928789 993051 1131769 1511965 1967845
7297 1967845 2086141 1647561 988433 740710 1118265 1673697 1897616 1780066 1557887 1249950
7287 1249950 842745 657639 992088 1516746 1587851 1153404 812411 915855 1156348 1201391
7277 1201391 1192488 1339054 1479059 1404003 1275227 1342348 1503498 1511247 1425781 1503406 1747658
7266 1747658 1893739 1790340 1552401 1380519 1412598 1668568 1964201 1987483 1644955 1216440
7256 1216440 990262 911067 818366 839824 1202072 1761271 2111952 2149269 2144015 2217966 2146064
7245 2146064 1828413 1587605 1732063 2083737 2235317 2102702 1922400 1822448 1726816 1645862
7235 1645862 1721059 1926093 2034049 1999817 2084128 2413640 2695556 2645814 2463556 2499990
7225 2499990 2617995 2373781 1816457 1547109 1813878 2094754 1918974 1608434 1696548 2003412
7215 2003412 1952894 1598623 1591097 2119748 2601920 2589328 2347437 2282356 2373191 2490841 2739927
7204 2739927 3104399 3250610 3096915 3083877 3412943 3561836 3175158 2888388 3405760 4165044
7194 4165044 3999251 3002118 2560150 3317914 4236233 4187668 3514576 3236934 3451325 3462521
7184 3462521 3094156 2897666 3141926 3415396 3334882 3020663 2719042 2467143 2308815 2414078
7174 2414078 2774873 3101065 3191786 3141626 3051139 2828575 2451647 2155675 2135203 2249797
7164 2249797 2250906 2169108 2259817 2630797 3097324 3377331 3310837 2928884 2430426 2087933
7154 2087933 2078308 2359291 2711375 2901058 2841600 2653517 2551206 2615101 2715927 2733113
7144 2733113 2758991 2936202 3168994 3229144 3141962 3187302 3422230 3480973 3069900 2481777
7134 2481777 2337495 2845175 3525667 3708845 3184098 2344544 1784931 1791469 2184944 2623325
7124 2623325 2981262 3334682 3640392 3677470 3395293 3086176 3016324 3053579 2904870 2606814
7114 2606814 2485441 2654467 2854956 2863094 2796352 2870951 3042889 3074768 2872376 2597481
7104 2597481 2469490 2561111 2784936 2999480 3101072 3052998 2885935 2714823 2721561 3003420
7094 3003420 3392001 3546647 3334563 3014805 2916253 3047625 3199087 3296547 3383626 3340300
7084 3340300 2989809 2523642 2432625 2846497 3274779 3251074 2962717 2931601 3265257 3579924
7074 3579924 3584658 3407389 3331144 3466603 3721659 3900579 3817516 3480585 3156237 3090670
7064 3090670 3209161 3281834 3324298 3561874 3990299 4270671 4164018 3827703 3549255 3399819
7054 3399819 3317242 3348148 3574145 3868662 3941325 3656165 3188062 2824836 2689883 2719928
7044 2719928 2874715 3234856 3786884 4210642 4130871 3631492 3253881 3334152 3610596 3714188
7034 3714188 3739665 3948136 4168944 4035809 3687005 3625119 3890252 4015173 3893799 3993946
7024 3993946 4464430 4745768 4482671 4155435 4245215 4378379 4015432 3495300 3532937 3987059
7014 3987059 4059631 3619623 3406422 3831827 4423192 4664463 4639687 4565581 4366207 4051131
7004 4051131 3928744 4102329 4280445 4374696 4692290 5201679 5286791 4740256 4355821 4847421
6994 4847421 5687096 5803518 5090912 4410636 4306158 4542070 4828748 5161443 5364857 5093235
6984 5093235 4509401 4298839 4726872 5245973 5329252 5163572 5171565 5322962 5335292 5196910
6974 5196910 5081874 5019399 5002228 5152916 5436847 5503384 5210934 5019282 5371197 5928596
6964 5928596 6022691 5724445 5756145 6284911 6573893 6162722 5699650 5997275 6742632 6929363
6954 6929363 6373425 5941526 6167265 6479230 6230418 5800042 5964140 6585026 6779362 6300392
6944 6300392 5903356 6141284 6551923 6472362 6087034 6083035 6593108 7067259 7063840 6683178
6934 6683178 6270486 6091003 6263997 6662465 6903262 6747470 6464466 6509637 6924191 7349494
6924 7349494 7510302 7361177 6943731 6517975 6622713 7443253 8264195 8213079 7492380 7134613
6914 7134613 7504930 7900399 7836808 7799533 8239007 8670299 8484052 8019120 8033121 8533255
6904 8533255 8903142 8894641 8780352 8754800 8843239 9171543 9679099 9834874 9355444 8925124
6894 8925124 9355143 10238873 10431372 9809318 9464724 9979505 10616833 10659556 10534585 10933096
6884 10933096 11618979 11915470 11819992 11832094 12042499 12152669 12171039 12390848 12787454 13040164
6874 13040164 13097054 13199656 13392676 13498304 13573874 13944341 14712726 15571028 16152120 16350561
6864 16350561 16344445 16500044 17102270 17925357 18287313 17881072 17326942 17437659 18106064 18484477
6854 18484477 18213152 17851823 17975335 18422698 18729461 18863376 19145428 19673419 20183429
6845 20183429 20447704 20601844 21017428 21855118 22769090 23214313 23143633 23157277 23724008 24527402
6835 24527402 24980323 25148760 25608841 26497148 27336419 27838031 28241759 28722351 29083566
6826 29083566 29262978 29544114 30001596 30334398 30547644 31128232 32123320 32762560 32611609
6817 32611609 32429664 33080381 34163068 34701625 34766132 35252837 36237527 36830109 36827119 37259189
6807 37259189 38793628 40643077 41764500 42310651 43075852 44140635 44989657 45598364 46486260
6798 46486260 47816123 49220704 50521328 51969335 53725068 55632630 57550607 59441357
6790 59441357 61152058 62602513 64175379 66390639 69169807 71958404 74602515 77499910
6782 77499910 80802711 84155289 87431721 91030719 95105149 99203134 103150514 107609220
6774 107609220 113107452 119091933 124731524 130232099 136490424 143734019 151413165 159296601
6766 159296601 167802968 177370685 188400141 201618114 217316671 234290148 250960483
6759 250960483 267631592 285588814 303074249 314476271 315913899 310486238 305214439
6752 305214439 302839240 299199716 289281245 273364495 255809016 239787932 225316406
6745 225316406 211326157 197357511 183343244 169568631 157113530 146979717 138543435
6738 138543435 130101136 121215559 113286398 107381033 102753811 98220122 93868871 90400636
6730 90400636 87585718 84551985 81178583 78100557 75496527 72857638 69958398 67185818
6722 67185818 64789280 62555522 60404036 58633657 57332579 56101578 54612074 52958848
6714 52958848 51254560 49383851 47413558 45741059 44510625 43341378 41984537 40784066
6706 40784066 40048986 39415500 38397481 37225001 36482019 36126325 35578509 34712410 34009859
6697 34009859 33626321 33052069 32038094 31215263 31231130 31658850 31409683 30143546 28721154
6688 28721154 28139411 28395717 28615032 28093728 26986655 26004201 25617369 25667554 25698052 25483158
6678 25483158 25106928 24654257 24085875 23439281 22901147 22562901 22288957 21940778 21541539
6669 21541539 21090731 20450560 19639083 19025501 18917476 19072999 18960204 18447408 17884271
6660 17884271 17511330 17198785 16867455 16733098 16868127 16875756 16391653 15696382 15379588 15456795
6650 15456795 15281647 14446395 13379584 12805634 12869805 13097661 13087922 12927425 12908215 13080677
6640 13080677 13188600 12941820 12321330 11694838 11573494 12071926 12636886 12573914 11897183 11346147
6630 11346147 11398853 11617378 11314673 10590800 10187040 10399543 10719178 10667456 10440234 10423921
6620 10423921 10515750 10345017 9893003 9474706 9277175 9286273 9511594 9900100 10158539 10061179
6610 10061179 9831558 9816511 9895429 9676493 9183803 8801938 8576813 8211930 7821178 7946782
6600 7946782 8574778 8877485 8389089 7768864 7791758 8164267 8104340 7647135 7465444 7630171
6590 7630171 7526989 7009442 6685217 6845366 6980308 6739700 6602003 7045807 7655324 7687872
6580 7687872 7139099 6629430 6490531 6535866 6560781 6524226 6330098 5922157 5541576 5452223
6570 5452223 5490492 5345874 5182294 5402126 5807028 5681883 4912860 4353306 4663701 5328403
6560 5328403 5387256 4776771 4297690 4420780 4789632 4938860 4894825 4862013 4808994 4677390
6550 4677390 4648119 4856108 5083340 5068863 4927698 4902326 4855988 4458185 3843039 3597223
6540 3597223 3936667 4306562 4096743 3479262 3167172 3460474 3905754 3944982 3602029 3359546
6530 3359546 3510752 3837041 3934653 3718066 3477471 3461590 3574030 3596727 3558887 3631535
6520 3631535 3721365 3518822 3031407 2713431 2858995 3176887 3249427 3132400 3136550 3247948
6510 3247948 3214731 3063870 3038715 3085416 2921785 2630510 2631560 2952508 3088051 2803656
6500 2803656 2531034 2639157 2827491 2684535 2401304 2380813 2483998 2307537 2018486 2221125
6490 2221125 2988314 3654366 3719020 3437404 3293998 3323670 3242363 2946132 2586354 2333187
6480 2333187 2289801 2489791 2783585 2857060 2555438 2112201 1910255 2078741 2432603 2722998
6470 2722998 2817886 2699655 2436144 2169582 2043902 2101606 2266539 2424746 2505116 2487665
6460 2487665 2368711 2168601 1982790 1937008 2011557 2011065 1865576 1844410 2179744 2546475 2368626
6449 2368626 1739933 1497009 2042336 2609284 2276978 1363846 1067130 1811837 2714293 2820802
6439 2820802 2214391 1601653 1340756 1292977 1304832 1415955 1689237 2069472 2366375 2345057
6429 2345057 1988934 1642748 1641577 1845848 1881619 1780018 1914583 2302583 2521526 2414234
6419 2414234 2278772 2190845 1809950 1158118 882395 1273334 1690464 1566047 1352196 1706498
6409 1706498 2274364 2227394 1678812 1524744 1969592 2245266 1934958 1610582 1797227 2108350
6399 2108350 1923312 1356898 1014953 1137381 1454336 1685214 1803163 1905759 2062170 2217552
6389 2217552 2159712 1738856 1177731 938219 1183031 1573870 1695603 1506692 1311314 1431446
6379 1431446 1892593 2286144 2069451 1250637 603849 830749 1649247 2167481 2044496 1727986
6369 1727986 1597341 1533695 1442270 1537217 1854587 2035790 1870051 1576088 1328891 1026163
6359 1026163 750322 875197 1392260 1705440 1487169 1201097 1348843 1718949 1851828 1751793
6349 1751793 1636133 1461545 1236895 1326578 1847060 2212840 1926598 1402813 1323536 1578146
6339 1578146 1592820 1350385 1260023 1303987 1182651 1089159 1435022 1953918 2019545 1783352
6329 1783352 2016160 2787347 3293644 3135865 2787099 2582645 2246034 1754320 1685476 2211696
6319 2211696 2630917 2470424 2257085 2557253 2983335 2885283 2436529 2269713 2476301 2684697
6309 2684697 2774403 2841724 2755408 2375626 1972023 1877073 1976773 2025840 2125694 2362402 2362072
6298 2362072 1846793 1298258 1369662 1890661 2153603 1964941 1690291 1454749 1092446 784958
6288 784958 922934 1314685 1322687 887059 666361 999102 1431648 1501808 1344050 1252583
6278 1252583 1228907 1247499 1441708 1733598 1751283 1390377 1030963 968531 1058764 1109507 1136621
6267 1136621 1046167 636867 180086 365732 1267732 1961502 1697293 947455 688810 1056485
6257 1056485 1370669 1222240 866091 664731 710875 932773 1117184 944544 427877 130378
6247 130378 459539 947140 819206 146766 -229254 103498 678850 985991 1091416 1215227
6237 1215227 1277110 1178486 1079776 1082745 1004325 739825 515657 539683 725357 951551 1200645
6226 1200645 1243246 704428 -213929 -617593 -35372 824487 1053200 838317 981743 1448902
6216 1448902 1429191 818932 530280 985162 1328035 786222 -16268 19702 793810 1247397
6206 1247397 1000031 719361 868840 1082269 1031149 1023228 1280316 1357767 902208 439904
6196 439904 680537 1356077 1516338 896309 281412 393054 989029 1331756 1149820 814559
6186 814559 766465 1051771 1393986 1556998 1559712 1510366 1307590 737601 -47195 -453369
6176 -453369 -128725 517751 839085 792514 805618 956651 883949 532391 366750 639372
6166 639372 986916 1046911 1001912 1150859 1347111 1296572 1119302 1159725 1411570 1538001
6156 1538001 1366501 1039168 762095 673467 836451 1100748 1118049 776604 470788 628198
6146 628198 1093759 1306182 993770 386968 -164171 -447634 -329389 194265 835446 1184446
6136 1184446 1125370 926342 893778 1044111 1100155 780171 196733 -78018 356820 1044224
6126 1044224 1104329 481704 118067 550482 1069758 876229 351432 292517 484798 180098
6116 180098 -387414 -278110 474347 829052 493063 309194 577629 463821 -310417 -656133
6106 -656133 51050 673771 115549 -715752 -311458 882722 1100488 79214 -572980
6097 -572980 77034 1051246 1203523 753865 412323 157784 -275313 -571101 -357835 41403
6087 41403 149158 157581 505890 1010362 1117892 801930 575612 715444 985566 1092911
6077 1092911 1013793 873944 776954 725574 573305 199709 -163402 -67456 505022 960747
6067 960747 841196 430833 287037 467694 641990 729999 949139 1323604 1580989 1530839
6057 1530839 1235001 840647 504131 388418 471045 473703 250518 75819 224602 471569
6047 471569 436323 258824 391843 775111 817665 316860 -172904 -147704 141671 149693 -146491
6036 -146491 -304888 -102652 240354 467424 570936 621942 577288 403249 262249 389572
6026 389572 745021 915544 530908 -223239 -702109 -514888 37984 399929 433947 400827
6016 400827 428528 387067 257791 224570 316861 325142 211759 265877 638911 1013931 1002517
6005 1002517 661322 344230 206220 147028 140323 289082 532464 574250 236101 -254217
5995 -254217 -466173 -238206 146775 310046 244305 279217 535432 648936 289891 -211324
5985 -211324 -170473 501536 1090989 994160 446809 58287 -49291 -224855 -590788 -812068
5975 -812068 -586553 -48095 404680 501576 288455 60849 118627 478677 838248 879311
5965 879311 550988 38178 -391032 -477882 -169772 182330 145121 -120246 82389 945566
5955 945566 1644474 1385167 583863 300587 725704 1045474 773585 341052 179992 70970
5945 70970 -200633 -270647 175894 759501 967336 922018 1005388 1087638 776896 197839 -116882
5934 -116882 1056 245118 404389 517462 522894 286259 -24013 -71646 107892 138650
5924 138650 -96437 -298061 -224898 47730 347778 532800 455059 188815 184684 729893
5914 729893 1372809 1439786 1016594 760973 825138 764828 526831 577881 862223 669832
5904 669832 -39315 -238984 565501 1333733 989376 72164 -195765 198607 361495 197361
5894 197361 392080 876705 776065 36785 -278109 269563 700625 190098 -620575 -668953
5884 -668953 -31994 399440 267134 -17496 -53301 168372 446518 509878 225448 -75435
5874 -75435 97821 539799 430786 -377221 -925701 -563911 3871 -114125 -528909 -317924
5864 -317924 335148 485519 92354 18479 420630 470369 -96449 -399027 152190 897274
5854 897274 1002902 627551 365724 259525 60807 -91305 51607 303931 377462 395315
5844 395315 556133 672720 571285 550189 860772 1104874 798584 236743 98154 385397
5834 385397 471647 124366 -213654 -210906 -90370 -131300 -216878 -81131 304771 719176 864566
5823 864566 578415 74780 -153247 79294 372911 363608 294156 486892 602453 145222
5813 145222 -512820 -497361 180664 528871 71542 -460186 -336444 103958 175846 -49307
5803 -49307 -67209 136173 233569 295277 635982 1097263 1166790 763721 335475 192547 238641
5792 238641 324135 388780 282871 -81887 -420816 -374523 -85638 10732 -70754 86657 489246
5781 489246 635655 397248 303814 623293 824463 462891 19359 166905 610629 479515
5771 479515 -278533 -734564 -321741 398928 622348 364177 205042 367475 548126 488559
5761 488559 263473 30771 -160313 -275379 -259473 -152857 -77387 -77910 -101658 -128627 -202035
5750 -202035 -351160 -583890 -874612 -1030519 -728178 52931 756758 792716 338248 165464
5740 165464 572942 974877 806704 357300 247649 451050 440542 136745 36860 349866
5730 349866 621885 445016 42167 -155847 -120727 -65246 21627 281806 608499 730802
5720 730802 598495 391454 217941 68892 -2144 62590 122314 -23419 -281144 -317684
5710 -317684 -31950 265794 268545 92340 114240 458582 809793 802076 520101 452130 855923
5699 855923 1323377 1228534 565569 2424 10171 300679 350204 138193 13214 83749 175770
5688 175770 248002 400542 536676 460841 305779 423135 808833 1071267 1044102 977057
5678 977057 993787 853633 491103 316693 613553 1017120 1034790 800046 817032 1120412
5668 1120412 1212342 829110 304112 57321 98432 219526 389608 685100 958765 869510
5658 869510 320948 -284682 -403839 29971 509691 580576 391483 391947 617964 663143 366575
5647 366575 82509 94703 184854 76648 -64908 24652 163735 -1776 -360597 -465121
5637 -465121 -207735 108665 321569 522878 612524 289194 -365809 -792994 -677391 -353460
5627 -353460 -237187 -243699 -76541 245761 510086 686718 817969 751028 380775 5947
5617 5947 29395 372867 579931 484456 397497 574848 838376 853061 543821 130077 -80281
5606 -80281 107069 574416 872566 643074 106232 -141175 112814 450155 476497 363938
5596 363938 466361 708169 766868 673335 749153 990765 1007559 667196 344222 318019 335624
5585 335624 97849 -153494 25890 538185 812813 604714 302545 348509 683640 909184
5575 909184 762423 320870 -74123 -47763 426615 849461 686565 78624 -296695 -145366
5565 -145366 117520 142055 194690 545507 823399 582982 142037 137779 465811 444399 -24427
5554 -24427 -277894 12729 367742 376238 295757 391110 369736 -4909 -320580 -130565 305780
5543 305780 495660 497044 584750 543443 63390 -459714 -373201 147998 343639 125201 141259
5532 141259 516945 563689 65792 -154339 464715 1223777 1214600 673249 403972 388753
5522 388753 4839 -642314 -703833 30233 705337 641485 205014 57033 192259 210651
5512 210651 44739 -110390 -243449 -397939 -358957 29528 423703 367394 4226 -125729
5502 -125729 45731 39715 -277716 -352900 169883 740052 617741 -8704 -262465 138773
5492 138773 511082 301509 -54009 170974 835583 1093763 606852 -20972 -140811 145891
5482 145891 377200 465401 589058 640491 346839 -118128 -189765 299878 834395 901013
5472 901013 578599 212043 -96561 -318228 -184164 437057 1048856 995026 388248 6699
5462 6699 194571 449618 307354 40263 82486 264999 170408 -111833 -207753 -194374 -413347
5451 -413347 -654416 -312950 519203 901661 334525 -462859 -555474 -29232 390384 531377
5441 531377 819702 1313267 1496402 1136805 679065 544572 566896 427070 222566 226536
5431 226536 365876 327047 42287 -246112 -334020 -222335 3835 242934 358509 287468
5421 287468 161919 170899 305674 382436 330325 321558 540860 889784 1028280 768545 372824
5410 372824 305763 635509 875359 609722 101186 -55666 196629 292629 -83777 -483993
5400 -483993 -320323 317841 813234 786986 391739 -24806 -236481 -198564 -71154 -136701
5390 -136701 -466611 -739903 -616489 -199208 120290 175407 102977 4113 -128218 -175741
5380 -175741 35530 374588 464007 226047 68751 343329 840878 1045698 776727 392555
5370 392555 360074 693322 878710 461036 -292759 -573442 -50702 593905 536674 -46025
5360 -46025 -283126 57815 274679 -87725 -504348 -334404 180921 370826 187405 157089
5350 157089 471734 748573 680898 420493 244656 226522 305854 386089 327074 109633 -92
5339 -92 262563 716586 884608 614899 261389 186464 347453 454216 330326 61652 -69673
5328 -69673 157334 549645 563736 9020 -506119 -282305 449100 800281 508197 237019
5318 237019 424518 589565 234290 -235333 -154701 310172 486596 323119 373120 743687
5308 743687 894016 599946 346707 461531 518127 54778 -607996 -787204 -364328 195679
5298 195679 539808 669061 623408 407597 209800 264186 447719 385565 29958 -225978
5288 -225978 -133762 57830 30799 -125628 -137066 -13257 37691 49585 298307 827676 1254236
5277 1254236 1177424 642072 76163 -167488 -125427 -96583 -253547 -436071 -388920 -153869
5267 -153869 -42812 -168101 -239285 -24239 203218 13703 -487297 -732456 -485657 -139879
5257 -139879 -74063 -121882 37464 297245 315421 71392 -174068 -339311 -525103 -637907
5247 -637907 -473536 -199405 -269859 -705034 -902417 -452972 208380 341170 -135095 -610957
5237 -610957 -613464 -265782 82420 309764 472802 568800 551712 458947 358791 233522 36887
5226 36887 -174253 -279814 -258553 -210715 -197236 -140704 51429 311285 447002 365082 176210
5215 176210 31943 -71686 -235157 -441971 -533487 -417395 -184596 33219 208717 332476
5205 332476 295646 33189 -247839 -196058 237269 646269 641717 374811 340110 654006 839589
5194 839589 497791 -89258 -346369 -205238 -77657 -102476 29525 379920 483250 108393
5184 108393 -223955 -4792 401237 318405 -110191 -151200 271792 436911 37337 -340211
5174 -340211 -248684 -49195 -77083 45748 572406 812995 87733 -957565 -1035164 -42885
5164 -42885 818130 784623 385305 314593 414160 283018 130105 332585 641008 530527
5154 530527 71879 -192546 -110082 -67067 -290977 -532336 -549015 -468346 -455695 -339525 131448
5143 131448 775268 1009180 490449 -391961 -823447 -414223 356367 671739 305210 -159628
5133 -159628 -55662 607134 1210188 1229435 740423 262408 187581 394921 457903 216680
5123 216680 -19066 55111 271664 264196 45706 -69281 -45458 -150277 -334947 -124192
5113 -124192 606291 1181566 867465 -183578 -1097139 -1236157 -689243 51779 566500 703294
5103 703294 568311 355364 122044 -164342 -357815 -210993 161742 274530 -27262 -234530
5093 -234530 93327 614793 689507 288688 -111330 -319471 -501151 -591545 -320128 156556
5083 156556 312607 85416 31449 424243 789571 682320 402552 473700 791796 822993
5073 822993 437639 34975 -99386 -102342 -142369 -106214 133690 385934 350877 100535 53959
5062 53959 350497 519438 124958 -407582 -185826 797892 1374341 728915 -355431 -541104
5052 -541104 176082 593447 181069 -273386 -111628 191005 23414 -255071 15451 638421
5042 638421 903797 694119 451213 292053 -58454 -547679 -727907 -462469 -137135 -77517
5032 -77517 -180524 -178307 70454 536465 963049 954645 457207 4865 102002 519392 645190
5021 645190 376800 148870 181560 262276 250469 254074 282850 238786 263308 563349 876787
5010 876787 693530 78898 -325392 -243628 -93898 -201567 -330860 -273690 -274649 -488230 -571208
4999 -571208 -261834 107778 148912 66292 287382 758214 1066429 1013860 678744 178721
4989 178721 -259226 -296156 56574 278419 52377 -197525 44718 531785 617081 224957
4979 224957 -146232 -212552 -81828 219930 732329 1109450 873123 215460 -76719 321009
4969 321009 844260 897821 629421 533056 686123 756849 538634 155145 -165395 -319164
4959 -319164 -373390 -444854 -483551 -274877 175090 431860 153980 -298070 -235952 378654
4949 378654 825257 593747 -14386 -419335 -435988 -188167 202144 527361 474319 55489
4939 55489 -217674 63818 651750 991278 914907 691107 584485 672704 922672 1144010
4929 1144010 1021140 493158 -22566 -63791 325539 706900 764920 486544 17687 -370838
4919 -370838 -354952 74107 450037 364478 19392 -101379 36312 42786 -214163 -424919
4909 -424919 -375256 -237041 -204030 -197739 -91003 61364 171991 282736 450164 638116
4899 638116 793742 870979 772774 473211 180591 125966 202200 113800 -111482 -129901 120093
4888 120093 220768 -131036 -654444 -839915 -535141 13978 471655 583964 296336 -98537
4878 -98537 -166963 124012 334385 207148 49905 171248 308742 72641 -314292 -279957
4868 -279957 199240 512512 259179 -283818 -617479 -548248 -183671 223694 348482 78970
4858 78970 -193761 29236 589246 771223 327706 -133825 -84651 150921 36727 -227885
4848 -227885 -64319 458201 691297 436649 183444 218492 185803 -198221 -583097 -543041
4838 -543041 -258036 -180465 -325746 -357697 -180892 7283 144023 345091 555119 553661
4828 553661 341254 175063 163587 132814 -35088 -216004 -279947 -247575 -126496 136512
4818 136512 428740 470836 202089 -69943 -77917 61546 97292 33318 50273 194268 365037
4807 365037 506412 624929 712561 778082 818510 676518 192486 -343825 -270797 561072
4797 561072 1327015 1178062 419925 86893 431198 627925 150107 -383015 -216799 343950
4787 343950 469758 125903 22561 384257 636838 470605 401970 840921 1250853 914943
4777 914943 155081 -31239 513322 797333 165707 -647551 -552554 298641 755224 352869
4767 352869 -115766 94666 603641 627057 192260 -53155 70579 111335 -166994 -452821
4757 -452821 -495114 -450983 -432525 -225804 250224 617523 508091 74296 -257756 -298610
4747 -298610 -112776 193414 406543 201187 -426017 -904155 -665137 113369 687032 616230
4737 616230 151380 -209819 -240625 -48176 125149 123971 59781 217069 616532 805890
4727 805890 354270 -534160 -1198469 -1266342 -933253 -552598 -287497 -171258 -159751 -52639
4717 -52639 326773 795458 956338 764074 623756 795226 1019640 931478 560813 191784
4707 191784 -47950 -197576 -237955 -128233 31943 116706 190852 399225 666379 703971
4697 703971 359635 -151531 -413215 -191393 331802 717938 722716 550154 548274 712318
4687 712318 703919 373020 5713 -48024 219995 557016 733999 638334 318900 94408
4677 94408 355422 1018682 1418990 1071835 367343 106589 431283 682523 402524 -1650
4667 -1650 98094 575623 696964 186327 -331302 -164003 499976 845935 494869 -109191
4657 -109191 -396646 -313838 -88093 205119 479074 411587 -100561 -508626 -241666 353918
4647 353918 387819 -248929 -675712 -321285 325047 622420 713598 992855 1246245 1043647
4637 1043647 595671 479422 731789 893301 802902 700918 641483 438000 152866 44851
4627 44851 50477 -103901 -297943 -132784 336463 601145 485727 327412 317337 309349 357347
4616 357347 714427 1131921 933933 83769 -576731 -529997 -278882 -372824 -497756 -179470
4606 -179470 270328 283119 -877 -95211 -82317 -332092 -629127 -462233 17482 214647
4596 214647 151319 397354 940930 1071147 561901 92873 185862 507965 610704 632029
4586 632029 788639 822015 527111 306915 561636 911720 695093 451 -441590 -292452
4576 -292452 56621 165210 30782 -173625 -385062 -523617 -433435 -131380 118258 113765
4566 113765 -69781 -244341 -299879 -175374 145816 508723 643242 479089 262231 236725
4556 236725 348225 400441 361927 307642 145838 -302096 -878481 -1017171 -347986 714352
4546 714352 1268772 903961 180064 -26964 465721 1020400 1023684 582526 255129 309284
4536 309284 507193 560990 509571 534054 606829 536890 294282 80466 56143 168011 295314
4525 295314 411543 528448 636682 788065 1047248 1240668 1011566 367189 -95436 99669
4515 99669 576241 602107 200180 103216 537761 806256 405891 -134722 -73631 444295
4505 444295 745481 650579 427523 68223 -567746 -1072896 -824670 -469 548182 517161
4495 517161 449125 661945 728265 363648 44456 222482 540540 408598 -84898 -383196
4485 -383196 -252603 98073 396978 426240 84787 -314975 -201072 429324 780636 315773
4475 315773 -427565 -643161 -422468 -411440 -667356 -678100 -332220 -44494 42395 212304
4465 212304 495460 556034 361358 294137 452346 460703 152071 -153946 -248535 -341470 -540521
4454 -540521 -558397 -215117 222995 458167 506805 451370 304679 289130 712925 1329083
4444 1329083 1391355 692351 3073 59752 606961 916139 795874 550457 330577 126042
4434 126042 115220 411943 654673 423545 -64977 -217548 89136 436905 538197 442691
4424 442691 154179 -364698 -795246 -679002 -153544 95833 -178204 -384749 13689 678402
4414 678402 883658 499797 17152 -226912 -348350 -455961 -362391 44666 452318 452504
4404 452504 109689 -107256 15450 140130 -95448 -501778 -596347 -321724 -128920 -307179
4394 -307179 -585340 -552395 -197747 159343 274311 133205 -128249 -310507 -298896 -215897
4384 -215897 -253114 -332332 -220567 -11294 -74997 -403516 -488287 -96584 332531 405187 360527
4373 360527 492751 530226 204142 -61902 190412 494508 75055 -790297 -1019399 -326656
4363 -326656 404917 510182 361288 482070 688517 575716 210903 -112287 -299622 -295872
4353 -295872 -17027 280515 148056 -270946 -291034 160363 254767 -378248 -881481 -497597
4343 -497597 152216 89275 -393843 -302108 299122 401797 -189085 -536384 -178739 173358
4333 173358 -33475 -269431 31453 392547 83540 -621930 -851836 -464805 -138862 -234272
4323 -234272 -318547 53770 658211 947334 737222 306302 3518 -41054 84701 198932
4313 198932 166204 12914 -89839 -14680 151514 195857 60404 -66441 -27894 43874 -66651
4302 -66651 -272037 -282323 -99558 -69162 -321620 -525149 -414487 -207952 -177022 -136280 205848
4291 205848 652256 780236 623728 554239 599048 474247 262479 395389 841673 960414
4281 960414 431689 -225806 -414256 -254782 -210391 -298164 -167107 254078 637798 705583
4271 705583 471318 102736 -209124 -311709 -221825 -119618 -83160 17574 221302 287336
4261 287336 33682 -313842 -372565 -92061 244140 420477 471201 510907 570773 587096 445191
4250 445191 89594 -334070 -544204 -410566 -84312 198445 321361 295319 239977 348028
4240 348028 644648 822995 625729 331739 420135 759002 722089 244920 64971 554159
4230 554159 999036 620175 -245906 -672958 -436660 -47795 185952 347640 367398 100032
4220 100032 -136336 124025 654546 766639 398502 190090 384813 483733 208355 -11015
4210 -11015 139899 292864 100930 -148005 -120423 -55897 -250092 -434410 -269621 -27446
4200 -27446 -143200 -426757 -380184 -65633 11271 -234746 -352757 -92479 285891 477342
4190 477342 455466 300640 116077 134979 506629 937765 938658 486329 67932 -9500 35479
4179 35479 -61046 -151499 58978 527337 895652 897462 594639 279352 216485 412224 602969
4168 602969 538039 251074 -39274 -227534 -357316 -404781 -232154 204055 730758 1071816
4158 1071816 1021832 576649 -7750 -389224 -500270 -601907 -832627 -918611 -594878 -101530
4148 -101530 117220 57711 52592 119082 -41289 -359952 -320572 219591 668021 510639 55060
4137 55060 -65816 196498 374456 259785 118527 195125 424045 642504 747792 631615
4127 631615 270261 -102522 -209365 -130143 -179771 -369910 -368640 -93059 76947 -85925
4117 -85925 -218911 56559 402518 143104 -683532 -1203308 -802256 92716 608353 464660
4107 464660 62474 -213524 -306439 -186547 247977 842575 1167224 1048339 816533 787693
4097 787693 778294 444939 -113985 -469669 -462901 -321498 -219944 -94866 61849 79776 -95799
4086 -95799 -262356 -251345 -133303 -8738 162136 348461 303370 -103205 -540470 -512994
4076 -512994 -15224 361378 106965 -554001 -881457 -507683 90251 197493 -177357 -315135
4066 -315135 156660 671074 549941 47707 -52671 279593 238378 -463395 -945281 -379012
4056 -379012 713557 1088418 434257 -323432 -353751 95005 242058 -164379 -649978 -663179
4046 -663179 -177185 296976 222224 -370620 -831897 -593826 120730 533924 274589 -188702
4036 -188702 -209829 199718 451938 178346 -331421 -526686 -244249 165256 292926 112448
4026 112448 -80194 -61631 117193 293357 385856 377539 264390 128314 127213 276535 345001
4015 345001 119634 -296899 -596206 -613610 -440408 -251862 -155493 -155564 -150310 -22636 177008
4004 177008 239488 78290 -149411 -309946 -458942 -568358 -383078 124682 424536 27140
3994 27140 -718623 -947540 -384702 367501 683239 537350 190709 -176064 -309842 56907
3984 56907 660547 753403 135465 -357792 28893 787541 810993 -9146 -689564 -646665
3974 -646665 -406708 -555649 -771373 -464626 151415 340090 -34531 -341305 -147476 243193
3964 243193 398648 416711 633556 982872 1064913 756195 376909 220283 218125 175675 90829
3953 90829 74480 118982 123313 51313 -80430 -283515 -523016 -641992 -511486 -203523 103645
3942 103645 315188 400722 311475 85318 -83910 -80479 -57099 -174493 -283794 -142564 176070
3931 176070 415559 562403 743183 780390 354435 -352544 -704581 -470735 -155962 -244585
3921 -244585 -565549 -710181 -673905 -707918 -831788 -859778 -710944 -429953 -116902 -12285
3911 -12285 -318692 -744341 -668857 -48944 355673 70731 -331032 -137483 354238 363791
3901 363791 -82815 -272240 -3296 237225 225034 226252 249268 -28257 -460321 -467407 -91405
3890 -91405 -90504 -629275 -815377 -99372 719811 635670 -89919 -431996 -108077 293098 399414
3879 399414 410870 456862 360515 105895 -47257 3451 111007 238261 469200 650434
3869 650434 471282 -27218 -414761 -433808 -267423 -165184 -115159 -7191 123025 153897
3859 153897 57597 -50291 649 240483 412897 205342 -261860 -425614 21613 657180
3849 657180 825058 398242 -238180 -729203 -930872 -779092 -393246 -151527 -262329 -411926
3839 -411926 -227084 115174 194223 38130 -48887 -157449 -585943 -1054306 -865630 19763
3829 19763 753040 670408 41066 -470026 -561708 -307517 79444 261083 22699 -307531
3819 -307531 -180333 294527 401424 -46111 -340494 -7438 437861 390568 132043 225460
3809 225460 504233 460607 230110 325876 624841 484906 -169264 -652231 -492937 33339
3799 33339 463584 688110 784125 757977 620563 423821 165060 -109518 -198834 -41629
3789 -41629 54514 -136701 -294210 -36388 325060 158601 -445801 -714572 -327018 172250
3779 172250 260922 103055 82575 229092 389307 511651 518836 314022 88578 177675 474517
3768 474517 504904 222144 119509 359657 489676 322147 336168 738802 893896 334321
3758 334321 -335780 -330742 87083 130563 -215296 -361682 -251482 -326911 -545247 -434839
3748 -434839 -71153 4299 -142444 115632 716742 798678 147849 -323435 -46532 293834
3738 293834 10056 -384757 -136093 367592 257169 -299583 -415846 -52504 -72076 -719663
3728 -719663 -1175344 -873151 -290783 -22440 92952 377871 539019 164213 -426415 -498555
3718 -498555 108122 828635 1094537 788512 101490 -630221 -984017 -740670 -164940 267824
3708 267824 423591 541564 751664 865818 701066 355132 70060 -5241 128445 333329
3698 333329 378424 151258 -140890 -159829 138021 445213 504039 358194 151336 -85925
3688 -85925 -318496 -386146 -195640 79631 160238 -34997 -340994 -520513 -414465 -39350
3678 -39350 374902 569122 559688 600184 747886 702561 272689 -223159 -317285 -6358 322370
3667 322370 466960 524576 473609 119136 -407828 -546752 -24559 621556 639382 49887
3657 49887 -367180 -98937 466569 621116 278413 -1662 139852 377778 240837 -169381
3647 -169381 -361633 -224892 -154833 -358946 -524239 -407913 -288914 -432133 -512936 -131917
3637 -131917 399453 467169 176728 190294 563610 612029 126261 -172114 180539 570654
3627 570654 315916 -196080 -173218 290662 477860 267242 168331 301239 275052 80087
3617 80087 193399 647680 839809 529436 256104 408771 585053 330963 -78240 -120253
3607 -120253 157809 307831 131055 -257978 -688964 -880657 -506444 255944 619258 136179
3597 136179 -572441 -593452 43000 511087 388239 51895 -74746 -35454 -345 55176
3587 55176 151625 173337 95865 58027 113209 164233 183723 237997 284104 220355 135876 221340
3575 221340 436786 555134 509936 399655 204607 -142644 -449281 -425409 -147233 46415
3565 46415 105291 268143 517832 551261 344313 196567 123606 -175596 -578576 -476259
3555 -476259 199593 574712 -5426 -969886 -1299917 -875374 -384313 -231171 -243385 -248972
3545 -248972 -234213 -20622 549406 1120979 1130720 630593 250982 303338 459250 376282 104703
3534 104703 -207962 -483505 -491419 -17319 612440 747113 340331 78401 336409 627356
3524 627356 460005 136562 165865 375546 245663 -189050 -404023 -178368 232502 587861
3514 587861 802052 701519 185401 -390016 -486679 -83791 313966 372661 223090 78670
3504 78670 20784 181008 639285 1060563 937458 332897 -116508 -103334 -12698 -140960
3494 -140960 -163244 174592 388629 -58977 -757054 -778399 -14109 636528 495995 -89171
3484 -89171 -392792 -249032 -23793 6524 -112819 -233251 -263204 -180926 -72181 -90979 -253392
3473 -253392 -352831 -205561 88103 242342 101836 -224128 -503931 -589624 -495220 -311144
3463 -311144 -78777 177506 306459 128783 -190261 -133511 483653 1043468 833921 124196
3453 124196 -103146 419823 808458 357661 -380099 -448806 113610 497553 405457 260587
3443 260587 262151 111596 -227185 -300496 63835 442136 539157 577733 670667 494576 11347
3432 11347 -165842 294601 741248 472962 -116862 -146848 340684 474812 -72713 -698658
3422 -698658 -886158 -790068 -655296 -409678 -92885 -24472 -227005 -252255 95849 393396
3412 393396 284640 24789 -41710 -59377 -282715 -542826 -558031 -423379 -342899 -216083
3402 -216083 53935 195245 15893 -134433 72054 257465 -85292 -597496 -460233 299031
3392 299031 769047 503521 60721 -34419 -42030 -299861 -482535 -165838 360958 469843
3382 469843 83337 -349953 -536388 -490506 -203505 317096 771938 812815 527643 275923
3372 275923 101523 -245472 -717372 -883145 -536983 18502 424439 612742 559202 131288
3362 131288 -530094 -855029 -482283 179734 460541 348182 416629 857517 1128938 772160
3352 772160 118379 -195310 -113395 -103320 -357991 -576398 -575137 -601418 -809585 -861072 -428351
3341 -428351 189019 404564 163649 -37077 73237 201387 37703 -258795 -341429 -166778
3331 -166778 28373 71286 -7995 -63061 47241 283099 331283 -67954 -629870 -702063 -136388
3320 -136388 357436 77349 -699101 -1044321 -580127 99204 254393 -125728 -451316 -295037
3310 -295037 192687 573853 661857 663486 773350 790141 379212 -324790 -742781 -611801
3300 -611801 -354580 -427020 -632805 -473376 60957 490635 504303 208382 -175482 -462079
3290 -462079 -445561 -96027 268630 391944 507900 897272 1214091 897054 151639 -232600
3280 -232600 -74076 14330 -208909 -169772 407164 822930 477256 -107665 -104953 330861
3270 330861 429075 52685 -281470 -378514 -504305 -679046 -661069 -599663 -896596 -1363899
3260 -1363899 -1312042 -641742 -107449 -225259 -567153 -475733 57415 571152 745107 517729
3250 517729 -3152 -457351 -434299 -23433 201289 -27167 -312343 -280155 -139653 -200863
3240 -200863 -301173 -180255 -33525 -154789 -329773 -164566 187525 230074 -45666 -140889
3230 -140889 115184 281157 8272 -446210 -644155 -536714 -328007 -40993 426417 906223
3220 906223 974870 490681 -86160 -154352 277427 586416 406007 165187 403530 831911
3210 831911 694622 4871 -338516 115000 669842 573273 119677 8997 166109 44270
3200 44270 -258718 -138129 390708 638633 369413 102039 119178 29415 -367306 -570881
3190 -570881 -201642 316460 412040 187420 64178 55948 -54769 -166346 -38847 222275
3180 222275 355096 397357 503570 535537 309046 47609 97373 346909 422805 329942 380542
3169 380542 569484 561550 310133 183199 388806 693819 798624 636165 267195 -149421
3159 -149421 -270103 125161 678422 736220 187731 -387454 -509419 -296383 -40551 220798
3149 220798 460869 454480 169661 -376 214571 480270 337013 -77535 -230440 25879
3139 25879 317491 339138 172040 -5165 -159621 -274276 -258930 -105391 52147 98208
3129 98208 13794 -202894 -500664 -658360 -445716 25731 339808 293997 185226 387924
3119 387924 786899 891074 496642 -27037 -228596 -141041 -130289 -300213 -382306 -252646
3109 -252646 -182369 -354231 -470548 -232002 42047 -187180 -749618 -875172 -339693 160734
3099 160734 96101 -72754 299346 913991 941964 295474 -302888 -467835 -581490 -932705
3089 -932705 -1163308 -925176 -509629 -358142 -356257 -120546 272185 367140 52798 -270417
3079 -270417 -295048 -210769 -342745 -609167 -567179 251 686002 816057 260013 -315865
3069 -315865 -249077 217619 257935 -323704 -754674 -410695 267636 451333 122866 -25653
3059 -25653 299435 663444 691573 550093 475662 385044 226937 240102 492221 547192 41867
3048 41867 -658756 -863952 -496626 -162135 -278679 -575330 -578261 -239956 128879 317729
3038 317729 368790 394975 450928 529426 531631 289981 -224756 -743173 -903133 -639037 -240509
3027 -240509 -5731 22503 -52112 -154065 -186805 -9187 323306 449351 132773 -289949
3017 -289949 -275207 113955 220584 -235989 -710043 -682403 -469221 -618787 -878173 -535377
3007 -535377 338257 844015 581962 191861 242961 381836 134176 -156050 31596 333627
2997 333627 27069 -653625 -741810 -85957 329092 -124379 -794819 -797801 -256647 119713
2987 119713 163932 255587 508160 630400 493113 284046 129593 -3066 -70621 -10375
2977 -10375 29745 -104572 -226053 -69084 192385 163623 -85386 -87884 241622 474317 425513
2966 425513 424515 583665 448885 -172985 -612861 -206173 630504 926472 557151 325522
2956 325522 639518 916623 580470 -36154 -258907 -55641 117617 156022 355282 692639
2946 692639 681246 119610 -481377 -527622 -110956 183056 75118 -148593 -147661 30553 128519
2935 128519 67595 -18437 -26621 10645 35000 37889 4729 -117760 -329885 -481746 -349869
2924 -349869 110587 599126 690771 330895 -9587 118956 509428 511576 -80565 -714580
2914 -714580 -832761 -580882 -437264 -435632 -230552 217146 542192 549336 400063 186117
2904 186117 -185977 -586122 -660906 -424318 -318176 -438822 -291911 298291 660610 271246
2894 271246 -261778 -46711 594058 479105 -592906 -1371835 -850777 386893 1023397
2885 1023397 611891 -244783 -889364 -1144844 -1054564 -695585 -296199 -138829 -236369 -315051
2875 -315051 -163345 143536 370910 371152 205565 56802 -17260 -195252 -609749 -1006430
2865 -1006430 -949496 -395206 220069 515255 476404 188496 -311755 -746018 -630419 65313
2855 65313 679690 661681 271249 67794 55663 -117682 -382293 -323057 42198 196251
2845 196251 -84905 -389947 -261282 269564 839732 1099946 839443 129476 -569680 -767669
2835 -767669 -490165 -203639 -210465 -425908 -677723 -813583 -577746 101230 695536 535259
2825 535259 -212461 -619141 -246318 270911 175080 -441044 -972685 -1110830 -915591 -529957
2815 -529957 -221544 -299982 -625057 -637327 -222751 18124 -199441 -236920 370847 902606
2805 902606 492248 -348809 -425815 214780 378687 -245216 -544287 119217 755806 271337
2795 271337 -840714 -1288407 -814959 -261837 -180832 -335192 -449786 -604301 -797873 -771175
2785 -771175 -425148 18514 368886 624105 748414 640476 359854 80120 -180830 -480090
2775 -480090 -651552 -473009 -130911 -91414 -418810 -639170 -450075 -174043 -245108 -560530
2765 -560530 -667606 -389518 57538 438691 673870 704987 505553 243363 172597 306070
2755 306070 410804 384478 394945 527347 541198 216692 -217016 -304564 21506 346952
2745 346952 340953 124860 -46587 -185282 -409349 -594154 -511147 -233994 -82281 -150513
2735 -150513 -189332 -27897 155816 127701 -47024 -125144 -47179 -2579 -153581 -393187 -407859
2724 -407859 -9544 563883 777416 364807 -307978 -624768 -399349 41145 366417 517265
2714 517265 491800 247169 -85506 -238700 -196348 -215830 -342919 -302496 -60316 -42874 -474889
2703 -474889 -907486 -826166 -400069 -172280 -282615 -478366 -645935 -795866 -716651 -226568
2693 -226568 347045 517407 373946 365642 442462 141577 -440467 -577253 -52251 407227
2683 407227 243194 -85348 62366 396934 158127 -622786 -1078353 -696569 52436 412809
2673 412809 233502 -51638 -89089 4729 -72847 -289579 -264969 126529 420822 185230
2663 185230 -237393 -158224 363072 560830 206734 -165 364489 684474 356288 -112545
2653 -112545 103818 781709 1026019 701056 492648 666959 750060 497678 270934 269239
2643 269239 208547 -191 -6149 269854 374215 70973 -290371 -434350 -522179 -575990 -285343
2632 -285343 236536 290907 -303467 -728834 -433391 -103676 -536660 -1224100 -1103004 -248461
2622 -248461 313650 225547 72135 112659 -81686 -565414 -702490 -260032 146063 113103
2612 113103 53194 242744 184849 -388188 -696316 -10884 1008419 1097673 200117 -523810
2602 -523810 -412743 -45690 -116941 -450460 -515025 -270522 -34560 71698 111834 51087
2592 51087 -135914 -267201 -186561 -50750 -103686 -291847 -382086 -357718 -389577 -446642 -259718
2581 -259718 235459 668996 625238 138013 -363782 -554106 -507946 -500502 -643987 -797064
2571 -797064 -759336 -466710 -33652 304975 321938 -11448 -451358 -708382 -750354 -740640 -692772
2560 -692772 -442179 -49693 77850 -275640 -717717 -704767 -252135 188739 414594 547174
2550 547174 501507 2684 -736818 -999823 -552791 -78791 -172367 -443308 -244337 174603
2540 174603 79045 -438746 -534286 -21295 281702 -88647 -457212 -135425 442191 448758
2530 448758 -31567 -286578 -212138 -336626 -706955 -667561 70800 888287 1089401 720657
2520 720657 250330 -87904 -291314 -314717 -158833 16741 111714 169437 106401 -261466
2510 -261466 -736821 -762707 -236311 199983 113317 4641 454263 1002145 739109 -207041
2500 -207041 -730269 -336701 237882 243228 -104668 -280364 -331950 -512788 -613376 -350888
2490 -350888 -34119 -142884 -493762 -501902 -125089 114329 -16521 -233654 -366812 -560263
2480 -560263 -740951 -539262 28509 385544 214372 -67103 -10615 171876 78169 -150144
2470 -150144 -125147 58314 13110 -179338 -40258 474993 814825 635005 265251 174611
2460 174611 383065 632854 791709 821653 628145 223330 -151008 -301853 -330783 -411828
2450 -411828 -496798 -433658 -206950 123934 532048 870242 845705 418862 10355 -17529
2440 -17529 111179 -32233 -345296 -347046 -14010 110867 -220219 -518832 -275000 285304
2430 285304 523741 217296 -291541 -611545 -639988 -468976 -245850 -111318 -78226 -1537
2420 -1537 193613 355303 343648 291173 381439 465442 208816 -363904 -765169 -614061 -129051
2409 -129051 110788 -157625 -565140 -523154 63252 602783 476464 -179732 -625537 -494156
2399 -494156 -247840 -421593 -780931 -691792 -123082 286804 169023 -114589 -117061 49340
2389 49340 177 -318110 -630947 -737325 -630539 -368230 -72305 57988 -40594 -164449
2379 -164449 -124772 -47545 -163505 -390651 -399149 -83348 286181 442593 446849 518528 682787
2368 682787 738336 543609 209736 -39608 -138665 -222642 -401122 -595935 -669134 -609775 -479441
2357 -479441 -268184 25401 239632 193869 -24909 -137243 -43669 95795 163556 213126
2347 213126 262200 237660 194086 284960 415730 258275 -229186 -633082 -645934 -466714 -394084
2336 -394084 -372447 -270852 -269260 -531790 -760508 -567332 -123395 54837 -136511 -330126
2326 -330126 -326908 -300776 -355247 -340747 -179859 21827 237161 514564 697569 549003 179141
2315 179141 -61172 -125039 -254193 -416309 -305289 15106 66855 -256558 -456375 -249926
2305 -249926 -35982 -181200 -407810 -343603 -165209 -162715 -120710 257297 675932 659235 363214
2294 363214 297734 433313 306097 -78198 -198068 69059 201346 -105685 -457534 -420976
2284 -420976 -142743 16796 30196 20937 -107173 -446000 -719377 -558026 -48989 327615
2274 327615 296111 54140 -82582 -82940 -145528 -361985 -571011 -553373 -283798 70581 335949
2263 335949 411094 237856 -98331 -262703 31246 543143 674946 292615 -11230 224445
2253 224445 611355 516320 46520 -176824 -24410 51044 -120525 -183695 16104 130430
2243 130430 -51102 -246733 -235338 -224105 -359604 -374822 -74939 271451 384633 394899
2233 394899 450383 347652 -15652 -238132 35885 517537 735294 748764 827101 748663
2223 748663 136974 -690642 -975840 -607406 -244793 -278653 -361098 -156087 104944 138681
2213 138681 125666 305546 483315 375066 135143 103659 245646 259425 91832 -68374
2203 -68374 -216939 -514491 -831724 -760131 -238297 201157 86595 -345078 -495744 -243061
2193 -243061 -12406 -37262 -36715 191198 334930 122623 -72926 237055 733118 588727
2183 588727 -298380 -1083494 -1151795 -817500 -547238 -219429 315188 593839 209847 -333871
2173 -333871 -266027 234628 311887 -207858 -590847 -362082 115912 384869 484623 577637
2163 577637 603388 536681 447521 167810 -484964 -1041128 -719995 301501 817141 246573
2153 246573 -483788 -368760 171429 126359 -394142 -428384 152078 436505 27918 -311858
2143 -311858 45564 566872 441188 -119132 -203183 428908 999153 799826 118037 -197255
2133 -197255 170711 699010 793801 517632 329509 342832 247123 -71206 -283212 -147292
2123 -147292 88884 57769 -238591 -549098 -736745 -787344 -684243 -487983 -316290 -97424
2113 -97424 332727 740498 580123 -140882 -614434 -297742 289046 402545 207405 322967
2103 322967 657184 610767 229719 183209 602686 863097 640015 340111 296375 327184
2093 327184 312384 433466 585165 322290 -292295 -544958 -138967 338249 406314 369559
2083 369559 528175 529370 140142 -105449 184879 385879 -191860 -1005000 -955063 -39610
2073 -39610 690152 667763 339948 191471 170488 189525 362263 540703 332881 -186579
2063 -186579 -405634 -51952 401253 425954 45892 -433342 -811144 -912275 -598992 -93208
2053 -93208 131885 -16586 -134234 -2020 73935 -168327 -491687 -565634 -431845 -262484
2043 -262484 -16739 340027 597040 607055 550292 568893 421461 -123469 -769094 -975457
2033 -975457 -667390 -311126 -309421 -581400 -746784 -552019 -111622 191132 94006 -233067
2023 -233067 -398163 -306018 -230510 -322111 -353286 -119741 178009 188384 -134299 -528803 -747962
2012 -747962 -734125 -610161 -593544 -758179 -832199 -466863 235543 749573 764936 485944
2002 485944 222476 72027 113078 432276 757877 594191 26127 -166063 379836 946080
1992 946080 767106 199426 100232 434680 422621 -91527 -387104 -82579 282990 184448
1982 184448 -95634 -25191 351404 585010 476615 187733 -76061 -212297 -220275 -229016 -361066
1971 -361066 -481906 -312617 126877 442322 336985 -56035 -375076 -363856 -19736 349977
1961 349977 293784 -250376 -702892 -529114 -31210 95946 -128536 -55637 388484 483725
1951 483725 -23440 -354884 71202 650653 542496 -41288 -309031 -149392 -31878 -3169
1941 -3169 270147 620963 480264 -118230 -459928 -198402 229003 367084 258023 42485
1931 42485 -300551 -619739 -613752 -398942 -447361 -742705 -673017 -84645 268121 -168947 -815240
1920 -815240 -772375 -100256 435791 550403 593316 692557 550745 150160 -54359 141565
1910 141565 345912 218955 -5001 21439 152492 12882 -355577 -531072 -326412 720
1900 720 189468 316051 551687 804904 833038 622980 422229 366839 303817 109049 -12287
1889 -12287 216112 670769 900032 692900 321650 141445 189600 293887 335108 245911
1879 245911 -9053 -253525 -156386 262938 449585 21820 -548976 -487618 137665 431113
1869 431113 -48693 -636570 -520842 154404 626961 590158 357803 168077 -49304 -241722
1859 -241722 -182114 30883 -23575 -369025 -449079 -6033 356226 6209 -683909 -795923
1849 -795923 -191013 328366 229127 -71195 6757 329232 399471 166149 -25466 -50273
1839 -50273 -81659 -181260 -262875 -394599 -687179 -892932 -583759 176486 763153 758355 411633
1828 411633 138048 -52738 -307682 -447125 -202501 207036 242730 -150661 -361405 39988
1818 39988 614084 602351 1782 -397096 -131654 268132 104126 -379232 -348004 265222
1808 265222 551022 16491 -591571 -443056 41063 -108469 -771443 -900460 -265185 141803
1798 141803 -241900 -606053 -139798 577225 484213 -280893 -652391 -276820 137698 45815
1788 45815 -287352 -461342 -450746 -244863 300812 970984 1166352 709396 171647 70413
1778 70413 199866 121097 -100710 -93271 161712 306893 143081 -138049 -223863 -5395 323819
1767 323819 432083 221325 18232 186981 593734 764409 542646 189552 -158584 -598295
1757 -598295 -934932 -687737 93057 608656 324717 -310807 -609319 -579956 -574820 -496390
1747 -496390 -72112 432360 541782 394380 477818 700930 537979 44820 -124065 184243
1737 184243 335300 -34761 -444857 -419833 -238786 -359253 -632967 -622910 -323073 -65466
1727 -65466 23907 45654 15406 -93016 -163235 -99901 -7363 29391 108711 222732 101141
1716 101141 -350069 -739071 -671429 -299890 -38582 26176 56689 38129 -128855 -297028
1706 -297028 -275095 -191652 -212051 -97370 407634 915524 797984 216343 21611 487995
1696 487995 874975 573408 23902 -15891 382122 531179 215675 -75020 48981 366727
1686 366727 435401 134435 -294669 -526327 -402154 -72721 97905 -77564 -351282 -355256
1676 -355256 -111077 32329 -54295 -122266 -15896 36317 -181291 -453354 -431829 -195616
1666 -195616 -142938 -369899 -555408 -535406 -557368 -723334 -604141 117555 894344 857681
1656 857681 93385 -335221 127578 715941 511101 -176287 -366952 15741 114733 -353447
1646 -353447 -604072 -145024 306788 -48653 -744390 -716342 55516 548290 273202 -93480
1636 -93480 114883 562566 562003 140692 -121431 -2783 164578 82081 -183618 -414970 -439907
1625 -439907 -155637 322154 576648 297170 -237135 -435458 -194004 -29232 -286267 -614716
1615 -614716 -510638 -70454 179577 49233 -125166 -53012 103838 28992 -270249 -467991
1605 -467991 -335304 -20622 123604 -26782 -191901 -61401 212433 160564 -289241 -587989
1595 -587989 -311073 194929 327323 132433 127341 351201 300644 -110695 -272099 150271
1585 150271 646317 715442 653275 883738 1065786 653832 -39352 -235607 50207 83574
1575 83574 -283698 -357802 159079 619451 514383 265853 381534 532617 176945 -414541
1565 -414541 -519742 -63930 339585 291667 -47173 -403910 -640854 -623055 -327026 -40991
$$ [...]
##END NTUPLES=NMR SPECTRUM
##END=
