##TITLE=1H ikalashn
K-539-DMSO
16.12.2024
##JCAMPDX= 6.0         $$ Bruker NMR JCAMP-DX V2.0
##DATA TYPE= NMR SPECTRUM
##DATA CLASS= NTUPLES
##ORIGIN= UXNMR, Bruker Analytische Messtechnik GmbH
##OWNER= root
$$ TOPSPIN		Version 1.3
$$ 2024-12-16 15:03:33.953 +0400  Irina@DPX200
$$ Compression mode = diff/dup
##.OBSERVE FREQUENCY= 200.131300845
##.OBSERVE NUCLEUS= ^1H
##.ACQUISITION MODE= SIMULTANEOUS
##.ACQUISITION SCHEME= undefined
##.AVERAGES= 64
##.DIGITISER RES= 18
##SPECTROMETER/DATA SYSTEM= spect
##.PULSE SEQUENCE= zg
##.SOLVENT NAME= DMSO
##.SHIFT REFERENCE= INTERNAL, DMSO, 1, 17.49637
##AUDIT TRAIL= $$ (NUMBER, WHEN, WHO, WHERE, WHAT)
$$ ##TITLE= Audit trail, TOPSPIN		Version 1.3
$$ ##JCAMPDX= 5.01
$$ ##ORIGIN= Bruker BioSpin GmbH
$$ ##OWNER= Irina
$$ $$ F:/spectra/data/iren/nmr/1H/4/pdata/1/auditp.txt
$$ ##AUDIT TRAIL=  $$ (NUMBER, WHEN, WHO, WHERE, VERSION, WHAT)
(   1,<2024-12-16 15:03:05.250 +0400>,<Irina>,<DPX200>,<TOPSPIN 1.3>,
      <created by zg
	started at 2024-12-16 14:58:51.953 +0400,
	POWCHK disabled, PULCHK disabled
       configuration hash MD5:
       BE 6D 3F 07 2A EA 11 49 91 17 2B D3 AF B3 58 0D
       data hash MD5: 16K
       71 C8 10 A6 DB 8E E5 41 28 1C F3 84 A6 E4 CF 6C>)
(   2,<2024-12-16 15:03:09.062 +0400>,<Irina>,<DPX200>,<TOPSPIN 1.3>,
      <Start of raw data processing
       efp BC_mod = 2 LB = 0.02 FT_mod = 6 PKNL = 1 PHC0 = 126.8541 PHC1 = 1.380095 SI = 32K 
       data hash MD5: 32K
       59 57 3F 54 FA 8B D9 02 6B 4C 64 71 BC 6F A7 9C>)
(   3,<2024-12-16 15:03:11.203 +0400>,<Irina>,<DPX200>,<TOPSPIN 1.3>,
      <apk 
       data hash MD5: 32K
       23 18 22 9A 68 BE 1C 64 AB FE C4 47 30 F4 37 CA>)
(   4,<2024-12-16 15:03:16.703 +0400>,<Irina>,<DPX200>,<TOPSPIN 1.3>,
      <abs n ABSG = 5 
       data hash MD5: 32K
       6B E0 62 CD C1 62 8C A8 C4 E5 3E 0D 0D 54 BB 8D>)
$$ ##END=
$$ 
$$ $$ hash MD5
$$ $$ C4 C7 91 BF 81 99 B9 54 C3 FF D3 73 1B D5 E3 5E
##$RELAX= 
##$RELAX= 
##$RELAX= 
##$RELAX= 
##$RELAX= 
##$RELAX= 
##$RELAX= 
##$RELAX= 
##$RELAX= 
$$ Bruker specific parameters
$$ --------------------------
##$DU= <F:/spectra>
##$EXPNO= 4
##$NAME= <1H>
##$PROCNO= 1
##$TYPE= <nmr>
##$USER= <iren>
##$AMP= (0..31)
100 100 100 100 100 100 100 100 100 100 100 100 100 100 100 100 100 100 
100 100 100 100 100 100 100 100 100 100 100 100 100 100 
##$ANAVPT= -1
##$AQSEQ= 0
##$AQ_mod= 1
##$AUNM= <au_zg>
##$AUTOPOS= <>
##$BF1= 200.13
##$BF2= 200.13
##$BF3= 200.13
##$BF4= 200.13
##$BF5= 200.13
##$BF6= 200.13
##$BF7= 200.13
##$BF8= 200.13
##$BYTORDA= 1
##$CFDGTYP= 0
##$CFRGTYP= 5
##$CHEMSTR= <none>
##$CNST= (0..63)
1 1 145 1 1 1 1 1 1 1 1 1 1 1 1 1 1 1 1 1 1 1 1 1 1 1 1 1 1 1 1 1 1 1 
1 1 1 1 1 1 1 1 1 1 1 1 1 1 1 1 1 1 1 1 1 1 1 1 1 1 1 1 1 1 
##$CPDPRG= <>
##$CPDPRG1= <>
##$CPDPRG2= <>
##$CPDPRG3= <>
##$CPDPRG4= <mlev>
##$CPDPRG5= <mlev>
##$CPDPRG6= <mlev>
##$CPDPRG7= <mlev>
##$CPDPRG8= <mlev>
##$CPDPRGB= <>
##$CPDPRGT= <>
##$D= (0..63)
0 2 0 0 0 0 0 0 0 0.06 0 0.03 0 0 0 0 0.0002 0 0 0 0 0 0 0 0 0 0 0 0 0 
$$ [...]
##$SW_h= 4401.40845070422
##$TD= 16384
##$TD0= 1
##$TE= 300
##$TE2= 300
##$TE3= 300
##$TEG= 300
##$TL= (0..7)
0 120 120 120 120 120 120 120 
##$TP= (0..7)
150 150 150 150 150 150 150 150 
##$TP07= 0
##$TPNAME0= <>
##$TPNAME1= <>
##$TPNAME2= <>
##$TPNAME3= <>
##$TPNAME4= <>
##$TPNAME5= <>
##$TPNAME6= <>
##$TPNAME7= <>
##$TPOAL= (0..7)
0.5 0.5 0.5 0.5 0.5 0.5 0.5 0.5 
##$TPOFFS= (0..7)
0 0 0 0 0 0 0 0 
##$TUNHIN= 0
##$TUNHOUT= 0
##$TUNXOUT= 0
##$USERA1= <user>
##$USERA2= <user>
##$USERA3= <user>
##$USERA4= <user>
##$USERA5= <user>
##$V9= 5
##$VALIST= <valist>
##$VCLIST= <CCCCCCCCCCCCCCC>
##$VD= 0
##$VDLIST= <DDDDDDDDDDDDDDD>
##$VPLIST= <PPPPPPPPPPPPPPP>
##$VTLIST= <TTTTTTTTTTTTTTT>
##$WBST= 1024
##$WBSW= 25
##$XGAIN= (0..3)
0 0 0 0 
##$XL= 0
##$YL= 0
##$YMAX_a= 3715575
##$YMIN_a= -3074828
##$ZGOPTNS= <>
##$ZL1= 120
##$ZL2= 120
##$ZL3= 120
##$ZL4= 120
##$ABSF1= 17.49637
##$ABSF2= -4.496376
##$ABSG= 5
##$ABSL= 3
##$ALPHA= 0
##$AQORDER= 0
##$ASSFAC= 0
##$ASSFACI= 0
##$ASSFACX= 0
##$ASSWID= 0
##$AUNMP= <proc_1d>
##$AXLEFT= 0
##$AXRIGHT= 0
##$AXTYPE= 0
##$AXUNIT= <>
##$AZFE= 0.1
##$AZFW= 0.1
##$BCFW= 0
##$BC_mod= 2
##$BYTORDP= 0
##$COROFFS= 0
##$CY= 7568.61572265625
##$DATMOD= 1
##$DC= 0
##$DFILT= <>
##$DTYPP= 0
##$F1P= 17.9538593292236
##$F2P= -4.03888763876832
##$FCOR= 0.5
##$FTSIZE= 32768
##$FT_mod= 6
##$GAMMA= 0
##$GB= 0
##$INTBC= 0
##$INTSCL= 5.656564e-011
##$ISEN= 128
##$LB= 0.02
##$LEV0= 0
##$LPBIN= 0
##$MAXI= 945.577
##$MC2= 0
##$MEAN= 0
##$ME_mod= 0
##$MI= -402.1523
##$NCOEF= 0
##$NC_proc= -2
##$NLEV= 6
##$NOISF1= 8.587773
##$NOISF2= 6.764455
##$NSP= 0
##$NTH_PI= 0
##$NZP= 0
##$OFFSET= 17.49637
##$PC= 1
##$PHC0= 134.4935
##$PHC1= -2.226521
##$PH_mod= 1
##$PKNL= yes
##$PPARMOD= 0
##$PPDIAG= 0
##$PPIPTYP= 0
##$PPMPNUM= 100
##$PPRESOL= 1
##$PSCAL= 0
##$PSIGN= 0
##$REVERSE= no
##$SF= 200.13
##$SI= 32768
##$SIGF1= 16.12182
##$SIGF2= -4.496377
##$SINO= 3.521527
##$SIOLD= 32768
##$SREGLST= <1H.CDCl3>
##$SSB= 0
##$STSI= 32768
##$STSR= 0
##$SW_p= 4401.40845070422
##$SYMM= 0
##$S_DEV= 0
##$TDeff= 16384
##$TDoff= 0
##$TI= <>
##$TILT= no
##$TM1= 0
##$TM2= 0
##$TOPLEV= 0
##$USERP1= <user>
##$USERP2= <user>
##$USERP3= <user>
##$USERP4= <user>
##$USERP5= <user>
##$WDW= 1
##$XDIM= 32768
##$YMAX_p= 454830033
##$YMIN_p= -1147672
$$ End of Bruker specific parameters
$$ ---------------------------------
##NTUPLES= NMR SPECTRUM
##VAR_NAME=  FREQUENCY,     SPECTRUM/REAL,   SPECTRUM/IMAG
##SYMBOL=    X,             R,               I
##VAR_TYPE=  INDEPENDENT,   DEPENDENT,       DEPENDENT
##VAR_FORM=  AFFN,          ASDF,            ASDF
##VAR_DIM=   32768,         32768,           32768
##UNITS=     HZ,            ARBITRARY UNITS, ARBITRARY UNITS
##FACTOR=    0.134324425510551, 1,           1
##FIRST=     4401.40845070422, -75131,       -346200
##LAST=      0,             -136906,         -366406
##MIN=       0,             -1147672,        0
##MAX=       4401.40845070422, 454830033,    0
$$ Real data points
##PAGE= N=1
##DATA TABLE= (X++(R..R)), XYDATA
$$ [...]
13538B40894K3594k5470o8450q0985l2645N1578R2750O1357J8987J5184J3444
13527C10238k2465m5400j1564J9459k0571o8981k0201P7577O9690n2403j11409
13516A23970j4349R3943N2808o7059q4276Q698N3597o275m2619L5792J28922J02913
13504C86065l758m9232q093P834n2799q8015m958J15226J13357k2224j31621r7758
13492A64024R413N1839J0441k6834j8257q404j8719r1O5305R5211J2950j17398
13480B19480j42677j3285J38596J48735J5804j03009q9170J712L9504N283o284
13469B14689M1602O5053R653m4349j2430M8057L7055j3526m559M1122J9524m8275
13457C53616l7703M2887M1807o3044r7119J3428R6178K4170n9422j40P9868J598
$$ y = [240894, 264488, 239018, 170568, 89583, 56938, 108516, 201266, 262623, 281610, 296794, 310238, 287773, 242373, 230809, 250268, 229697, 160716, 140515, 218092, 287782, 235379, 123970, 109621, 203564, 256372, 189313, 105037, 113735, 167332, 161057, 118438, 154230, 283152, 386065, 382307, 333075, 324982, 332816, 280017, 192002, 187044, 302270, 415627, 393403, 261782, 164024, 173437, 225276, 235717, 208883, 190626, 182222, 163503, 163412, 228717, 323928, 336878, 219480, 76803, 63518, 202114, 350849, 366653, 263644, 174474, 176186, 215690, 220973, 214689, 256291, 321344, 330997, 286648, 274218, 322275, 359330, 345804, 341245, 382367, 401891, 353616, 315913, 358800, 400607, 337563, 240444, 253872, 350050, 374220, 314798, 314658, 394526, 396124]
13445C96124j21554n5512J32361J55782j6985j16194l0433L2680n2099r9501L3940
13434B58609J60464O5581j21024j31057K0072R4752K3664l6380J706M7634L0443
13423D14464q35j661K543j681K636l031l8158m3536L3928J08691N9995n8460q0504
13410C94391J2243P0376K3202l5960l3560o880J9436P0356J00905K7201q4430
13399E57280o5223O6379R3437l8378j02733L0446J60135R0109m3483k9200M8457
13388G67226m984j05736l5293J33539J26714m9498r5789P5080J89241P3594p2880
13377A001214l6104P7708P3325m375n772M0973K2172j9661L0331J26786J33942
13366A440539O2824L7225P1779P3864L1098J7938M2150N2219O8546J38938J95776
$$ y = [396124, 274570, 219058, 351419, 507201, 490216, 374022, 343589, 376269, 324170, 224669, 258609, 419073, 484654, 363630, 232573, 252645, 347397, 371061, 334681, 336387, 384021, 414464, 413629, 411968, 414511, 412830, 415466, 412435, 374277, 330741, 364669, 473360, 533355, 474895, 394391, 406634, 477010, 500212, 464252, 430692, 423812, 443248, 513604, 614509, 641710, 557280, 492057, 558436, 651873, 613495, 510762, 541208, 701343, 791452, 747969, 718769, 767226, 762242, 656506, 621213, 754752, 881466, 831968, 736179, 811259, 1000500, 1074094, 1001214, 965110, 1042818, 1116143, 1111768, 1105996, 1146969, 1169141, 1149480, 1179811, 1306597, 1440539, 1503363, 1540588, 1612367, 1686231, 1717329, 1735267, 1777417, 1829636, 1898182, 2037120, 2232896]
13355B232896J40346M4738O8844J83520J96332P5540J3614J02204J79498J17556
13345C355088M4680J18175K54493K80660K21253K24364K90680K92889K22423K08965
13335E513670K96665L88109M32179M94966N98817O47121N77916M62699L75099
13326I787241K75118J14269m1674j05252j17689j90607l27133m10533l74597k95667
13316H313476k88693l73187m75300n24448n13209m76259m37716l88968l18223
13307D517473k50962k34956k73918l03938k64875j78314j20333j25238j53440
13298B611499j55424j29012j00688q3108p1530o0081m3694k3534k2651o5333j20670
13287A735774j09274j1293P0522K7674r2499j33465m8181L2398k001p6844o1671
$$ y = [2232896, 2373242, 2417980, 2486824, 2670344, 2866676, 2942216, 2955830, 3058034, 3237532, 3355088, 3399768, 3517943, 3772436, 4053096, 4274349, 4498713, 4789393, 5082282, 5304705, 5513670, 5810335, 6198444, 6630623, 7125589, 7724406, 8371527, 8949443, 9412142, 9787241, 10062359, 10176628, 10134954, 10029702, 9912013, 9721406, 9394273, 8983740, 8609143, 8313476, 8024783, 7651596, 7176296, 6651848, 6138639, 5662380, 5224664, 4835696, 4517473, 4266511, 4031555, 3757637, 3453699, 3188824, 3010510, 2890177, 2764939, 2611499, 2456075, 2327063, 2226375, 2143267, 2071737, 2011656, 1967962, 1944428, 1921777, 1856444, 1735774, 1626500, 1615207, 1685729, 1713403, 1620904, 1487439, 1439258, 1471656, 1469655, 1392811, 1331140]
13276A331140J6119J9340o9968j16101m1820N8036O6910J298n2738o7095n8049
13265A087072k0765L6874N4668J327n4371m0455j324k2821p9672p2530K854M4944
13253I35801J0662k5422l411L2817K2169j9886m1983l1125p692N481j3780o5602
13241G98029r9457o4679P139L9330K6615K5698L1440j9363j00141q8466L5828
13230E91973J23202O9998k7827m3606j6140l8368o4020k039P6009K5543j08535
13219E86190j28333O700J07500M5691o6818p5147l120L4680K2293J7548J8996
13208E66180j6121o4176n5001J6139P7329P3325J5637m5169n6883k805O2474N2901
13196F23830l4831r5166n0239L9240O1956Q448l8664l2925k959J8195K5979J3714
$$ y = [1331140, 1347259, 1366599, 1296631, 1180530, 1138710, 1196746, 1263656, 1264954, 1212216, 1145121, 1087072, 1066307, 1103181, 1157849, 1159176, 1104805, 1064350, 1063026, 1040205, 960533, 888003, 890857, 935801, 946463, 921041, 917630, 950447, 972616, 952730, 910747, 879622, 871930, 877411, 863631, 798029, 698572, 633893, 641032, 680362, 706977, 732675, 764115, 744752, 644611, 556145, 591973, 715175, 785173, 757346, 713740, 697600, 659232, 595212, 593173, 669182, 694725, 586190, 457857, 464557, 572057, 617748, 550930, 475783, 472663, 507343, 529636, 547184, 566180, 550059, 485883, 430882, 447021, 524350, 597675, 613312, 568143, 511260, 508455, 570929, 623830, 588999, 493833, 443594, 482834, 544790, 553238, 514574, 481649, 478690, 496885, 522864, 536578]
13184E36578k1511m3726j2528M4573N3048p925p5702q3041k6102M7190P9452M1940
13172E32246l0196n5565l462N1302K8195l5155m1617N096Q226m8846o2227J5657
13160C63654P9157L0480o1456o9453l036K7123m170j8060J1622J7052k5361l9088
13148C08464J8272O9811L9934k4755l9145j5476j8442l5964o935M8356M6827o332
13136C84615r098O2149Q8808j0858j38509j44216k8557Q1893J09994P5681O382
13125D78284q3471j34738q2967K9211Q1436M0059l810J2787L7573J3529k4856
13114C63037k9585k3796l4625k2952L6077P5405L2939l5757m1203j996M278j5572
13102C06250L751M9728M9492P002o730N982k4409q1557o3051L6784R2207M6283
$$ y = [536578, 515067, 471341, 458813, 503386, 556434, 548509, 472807, 389766, 363664, 410854, 490306, 532246, 502050, 446485, 443023, 494325, 522520, 487365, 445748, 450844, 459070, 410224, 347997, 363654, 442811, 473291, 411835, 342382, 339346, 366469, 362299, 344239, 355861, 372913, 347552, 308464, 326736, 396547, 436481, 411726, 372581, 357105, 338663, 302699, 295764, 344120, 390947, 384615, 375517, 437666, 526474, 515616, 377107, 232891, 204334, 286227, 396221, 471902, 478284, 394813, 260075, 177108, 206319, 287755, 327814, 324004, 336791, 374364, 387893, 363037, 333452, 309656, 275031, 252079, 288156, 363561, 396500, 360743, 319540, 317544, 321822, 306250, 310001, 359729, 409221, 416223, 409493, 415475, 391066, 309509, 246458, 283242, 375449, 421732]
13090D21732p9K8091N1618p298p5716o1626j8069l1394m9124J2211P3466P272
13078C51084j06347o6774J06850J64284J1994j25452n5227Q5425O6775o2434p9612
13067B90566L0502O5462l5385q5083K6205J33264O2220q3910r2452K0753N3377
13056C85519m7125j07798k1047Q4663N9663l0261k0191Q7767J29475L0116q9602
13045D61179r3346j2011K1491l5232q6824m3136N4092Q7401K1330n3442m9992
13034B71510k234L785k5938r237N9362Q1003J1385n8245m3283O521Q019j3526
13022B89122O261L3344L69m4453o085O9794M7449o0863q9405J0396P8023M699
13010C38651q4661l6733P9654Q5992k9056j08420o5141K3267N5840K6218j6196
$$ y = [421732, 421653, 449744, 501362, 494064, 418348, 356722, 338653, 307259, 258135, 270346, 343812, 351084, 244737, 177963, 284813, 449097, 461091, 335639, 280412, 365837, 432612, 370178, 290566, 321068, 386530, 351145, 266062, 292267, 425531, 487751, 403841, 311389, 332142, 385519, 338394, 230596, 209549, 294212, 353875, 323614, 303423, 391190, 520665, 550781, 461179, 367833, 355822, 377313, 342081, 255257, 212121, 266213, 353614, 374944, 321502, 271510, 269276, 273061, 247123, 237886, 297248, 378251, 389636, 331391, 288108, 294629, 302648, 289122, 295383, 328727, 329096, 284643, 278558, 348352, 395801, 334938, 245533, 255929, 333952, 338651, 253990, 217257, 296911, 382903, 353847, 245427, 180286, 203553, 259393, 285611, 269415]
12999B69415l7206k7746M426L9899O7875Q7843P9590J7443o3419p8813j1702N0840
12987C98445L9471j3249n4767q6516r9505m3971N8224Q5841Q08o2193n709O3257
12975B80136K5209l0931K6444J09652N3669p4270p6392K4716L0476o3746o0722
12964B44241N7999P8657m6923r1458L5383J04248k1929j20985j253J41151N9838
12953D38969j00680n8487J03779Q7606q8335j21630M0968J17522j3200j15558
12943B90954j8978J01688M8213p1993n6553N2001O7375k4373o7334K738P8748
12932D02486N5632l9168r8787n6944M4221Q8275J8414p0958n0272M9418P4866
12921D17183m769m4005L2714R2387J1058j08363q8559M2915R6267M155r6900p9993
$$ y = [269415, 232209, 204463, 208889, 248788, 316663, 404506, 484096, 501539, 438120, 359307, 347605, 398445, 437916, 424667, 369900, 283384, 183879, 139908, 198132, 283973, 284781, 222588, 216879, 280136, 305345, 274414, 300858, 410510, 464179, 389909, 313517, 338233, 368709, 304963, 244241, 302240, 380897, 333974, 242516, 277899, 382147, 360218, 239233, 237980, 379131, 438969, 338289, 279802, 383581, 471187, 382852, 261222, 302190, 419712, 406512, 290954, 271976, 373664, 421877, 349884, 293331, 345332, 412707, 388334, 321000, 323738, 402486, 458118, 418950, 320163, 263219, 307440, 395715, 414129, 343171, 292899, 342317, 417183, 412414, 368409, 401123, 493510, 504568, 396205, 307646, 350561, 446828, 450983, 354083, 274090]
12909B74090R761N1277J6367j9183M791N5491N8075K922l4290j568M2221J2911
12897D72865n5555n1850L0309P0318J4524l4354Q001O1737J7376p7622r4817k6227
12885C34705K4901K2309K9176O3948N5656k0573p1145j3464Q8432R5734j6022
12874E93657j09451n6606Q1001J12146k8677j66437j06482Q7371J67362M5405
12864F19289r3449o9276N2331R6905L5931k4321k7516q117M732Q081j4503n5631
12852E24456m9764K9367R0513M8658l0527l0370K6186K4438m1489o6553j8951
12841E05964K1423J2237m04Q735R886L079J7748K7237j1887m4685J4062J03931
12829F67326P9026m5542r3375q961N6272O422m9753j3292L2242l244l9838J1795
$$ y = [274090, 283851, 335128, 351495, 332312, 337103, 392594, 450669, 453591, 419301, 417733, 459954, 472865, 417310, 365460, 395769, 466087, 480611, 446257, 454258, 515995, 533371, 455749, 360932, 334705, 359606, 381915, 411091, 475039, 530695, 510122, 438977, 425513, 513945, 609679, 593657, 484206, 427600, 508601, 620747, 592070, 425633, 319151, 406522, 573884, 619289, 525840, 456564, 508895, 605800, 641731, 617410, 589894, 581777, 586509, 594590, 580087, 524456, 474692, 504059, 594572, 643230, 612703, 582333, 608519, 632957, 591468, 524915, 505964, 527387, 539624, 539220, 547955, 557841, 560920, 578668, 605905, 594018, 549333, 563395, 667326, 746352, 700810, 607435, 598474, 654746, 661168, 611415, 598123, 630365, 627121, 587283, 599078]
12817E99078O1853k346r0548m3308Q8231J06732k1655j21237p5906K7824N9633
12806E88351J1399l9701l8616J2107O2615N3468j1059n2972l1972q443k6609j9072
12794D99496O3572J16617K8751j01733q7019M6478Q5013l0730j10557k5366R3728
12783E78250Q0016j5829m2586O543K3608j6232l7055p528K1033J1242j8251l9910
12771E43301l9605q460L3563L4822j6011n3792k6419K5412L7722K0471J4698O765
12759E72467k8457m7875m686M6195K0677m3381l6054L1810L1086o4457j10320
12748C67005j4897J02925Q7929k0394o2603l467M1760P653l2893o569M5691M5220
12736E57360p702m9787m2613j250L4590L0419j3585m8939l0387J4566K0077j0527
$$ y = [599078, 660931, 658585, 568037, 524729, 612960, 719692, 698037, 576800, 500894, 528718, 588351, 599750, 560049, 521433, 533540, 596155, 649623, 638564, 585592, 553620, 545177, 518568, 499496, 563068, 679685, 708436, 606703, 519684, 566162, 651175, 620445, 509888, 484522, 578250, 658266, 642437, 599851, 606394, 630002, 613770, 576715, 569187, 590220, 601462, 583211, 543301, 503696, 495236, 528799, 563621, 547610, 493818, 467399, 492811, 530533, 551004, 565702, 572467, 544010, 496135, 491449, 537644, 558321, 514940, 478886, 510696, 541782, 477325, 367005, 352108, 455033, 542962, 522568, 459965, 456498, 498258, 505911, 473018, 466449, 512140, 557360, 549658, 499871, 457258, 456008, 490598, 521017, 507432, 458493, 428106, 442672, 462749, 452222]
12724D52222p866L4794L3906l5053o8159J296P0105K1393p1589n5533M5805O9438
12712D90759j1722n4843r821j461p9212r8672K3472J29971O7231n3281m0407N7940
12700D19954N5264l8633m2050O5398R7233j7107j08080m9093M8167M0665j9468
12689D52250j1059L6496J1919p0520q8831p327P4964O8738l824o0903n6114j1083
12677C34706K0067J6277J3393L8405M7453n916o5761l8064M6484O0582j1005l7673
12665D18948L0767O2764l3088j32646q2150N5503J02262L5018j3898J6349N0548
12654E10377K9685j3653l9145m3817j9866L3204O0878J4945n0444m3335K1937
12643D60766M9880J5469k1075l4370m7545l9769K4816Q0357K2435r7866j06838
$$ y = [452222, 444356, 479150, 513056, 478003, 409844, 411140, 481245, 502638, 431049, 375516, 421321, 490759, 479037, 424194, 414373, 412912, 333700, 235028, 258500, 388471, 455702, 402421, 362014, 419954, 475218, 436585, 394535, 459933, 557166, 540059, 431979, 382886, 431053, 471718, 452250, 441191, 477687, 489606, 419086, 330255, 322928, 397892, 466630, 462806, 401903, 345789, 334706, 354773, 371050, 384443, 422848, 470301, 464385, 398624, 360560, 407044, 467626, 456621, 418948, 449715, 512479, 479391, 346745, 264595, 320098, 422360, 457378, 443480, 459829, 510377, 540062, 526409, 487264, 443447, 423581, 456785, 517663, 532608, 482164, 438829, 460766, 510646, 526115, 505040, 470670, 423125, 383356, 408172, 488529, 510964, 413098, 306260]
12632C06260K2888J05818K4935q2624m2504Q7357J19157K2418n7760l7153R939
12621D78731L673k2355p365K2619J213o0137p4626l748P7786P5840M360l6269
12609D59722k759L9107K8923M47J107k095n0118q6559l5472N4888O9255O419k6475
12596D56390M637K3736K069N715M8066M0294m7206j06823n8134K5801M4396J7752
12584D56693J4837K5426M148k9928l0850m991K0016M2597M6781k786o9364n2796
12572D19783M2636P4426j4286p9116p909P7179K1695q8113o7001N0922P6207p789
12560D98634l6922K3378K2929p6699j05641K0035J33736Q1837l4751m1786L1002
12549E15752L1967m8352p7073m210P0602N9406o238m9090m2259o456L0374M6217
$$ y = [306260, 329148, 434966, 459901, 377277, 334773, 422130, 541287, 563705, 505945, 468792, 478731, 482404, 460049, 452684, 475303, 476516, 416379, 341753, 338005, 415791, 491631, 495991, 459722, 456963, 496070, 524993, 525440, 526547, 524452, 474334, 387775, 352303, 407191, 476446, 482865, 456390, 461027, 484763, 486832, 492547, 540613, 580907, 533701, 426878, 368744, 394545, 438941, 456693, 471530, 496956, 501104, 471176, 440326, 435335, 455351, 497948, 544729, 541943, 472579, 419783, 462419, 536845, 522559, 443443, 435534, 512713, 534408, 446295, 379294, 430216, 506423, 498634, 461712, 485090, 508019, 431320, 325679, 345714, 479450, 561287, 526536, 484750, 515752, 547719, 499367, 422294, 418084, 488686, 548092, 541854, 492764, 450505, 444049, 474423, 520640]
12537E20640L2156M140r466j64R449p684m3906n1959l69O7098O8626l625o2640
12524E22296m8797p417M311R159L4580L1917k4581m4316L7115J03486K1091j09172
12512E29672p9385P7525J18980j0795q8967K212P6237k4080j43756p6945Q4592
12501D65290J08641n954o5564q579M5530L5945K7140M0786J5779m9085p5828m6899
12489D87202k3587j8653J3809N7665M0230k9785n6786o279N4490P0920M9403k612
12477F36017p2215r0492j0027Q2451O6022j9379l1788L1320L2513n1048p3867
12466D99507K0980Q8151J9260p8513o5203J6173M3088J6298J6281M2813L6800
12455F55635M139m774L968p611k2931l521K7336J7738k8391o8468q2060n7453
$$ y = [520640, 552796, 556936, 547470, 547306, 556755, 549071, 505165, 453206, 452837, 519935, 588561, 584936, 522296, 473499, 466082, 470393, 479552, 514132, 546049, 521468, 477152, 514267, 617753, 638844, 529672, 450287, 527812, 646792, 635997, 547030, 549242, 625479, 601399, 457643, 380698, 465290, 573931, 567977, 502413, 493834, 539364, 575309, 602449, 643235, 659014, 609929, 534101, 487202, 463615, 444962, 458771, 516436, 556666, 526881, 470095, 463816, 518306, 589226, 638629, 636017, 563802, 473310, 463283, 545734, 611756, 592377, 560589, 591909, 624422, 573374, 499507, 520487, 608638, 627898, 549385, 484182, 500355, 543443, 559741, 576022, 618835, 655635, 659774, 655000, 658968, 651357, 628426, 624905, 652241, 669979, 641588, 573120, 491060, 433607]
12443D33607K0915J07518R6977k4236j09112m1856P7064P0884m6037r7445j8931
12432D69348O2227M1280k0062k0617K6421M1960P065l0177l0518K305L3515J9493
12420F02240m5415r2533m2145P7425J34448N4853p3812j10170l3326M9407N1242
12409E72214m24k8220r741J6163J9262R117j50j2462k2839q133K7744L7848K650
12396F03029k0869K0562P7856N8507l1051q9508o6921j4886J8004L9234L9979
12385F33936j6695r2998p9020L7241J16114O3740k8107l7857J193m291k9690O92
12373E64258M7323K1368l7901k3401L9086L2180k9024j0386Q8393R7161m6978
12362G42079j69957j09601N1708J21114N6447k5334l3070J1375L8573J1930m1205
$$ y = [433607, 454522, 562040, 659017, 634781, 525669, 483813, 560877, 631761, 585724, 488279, 469348, 531575, 572855, 552793, 532176, 558597, 600557, 607622, 577445, 546927, 549232, 582747, 602240, 556825, 464292, 422147, 499572, 634020, 688873, 615061, 504891, 471565, 520972, 572214, 571790, 543570, 533829, 549992, 569254, 578371, 578221, 565759, 542920, 534787, 562531, 600379, 603029, 582160, 602722, 680578, 739085, 708034, 618526, 551605, 536719, 554723, 593957, 633936, 617241, 524243, 445223, 482464, 598578, 662318, 634211, 596354, 597547, 593256, 563566, 564258, 611581, 632949, 595048, 571647, 610733, 642913, 613889, 603503, 691896, 789057, 742079, 572122, 462521, 514229, 635343, 691790, 666456, 633386, 644761, 683334, 695264, 654059]
12351F54059n2667k70L5757k4577j14031q7286N2903J36158P2841k2333k5735
12340F24819J9379K2908J0365L6567M8451j8505r1672o3979J7211K2586m0614
12329E87516m7589K4251O1645J5630k2600R851M1493j243o3665m9484L3376R4984
12317F84165Q8523M2105r676n9819r5551q5156k2745M1201M9571J6561J5277O6523
12305G30979Q7390P295j02419j06051j126P1002L3264k5317q524M0462L5176o882
12293G55249j3784J5272L2270K9778K0115j2788n7969m9974J5539L4025l4556
12282G33177o1200L9212J16329O671j58068j20646Q0248J48497l046j26350n1392
12271F03432O5836M4755k9089j559P0718N2762j3402o286L6884r76q0092o2780
$$ y = [654059, 601392, 601122, 636879, 612302, 498271, 410985, 463888, 600046, 672887, 650554, 624819, 644198, 667106, 677471, 714038, 762489, 743984, 652312, 588333, 605544, 628130, 587516, 539927, 564178, 625823, 641453, 618853, 628704, 670197, 668954, 605289, 555805, 589181, 684165, 772688, 814793, 805117, 745298, 649747, 564591, 541846, 583047, 632618, 649179, 664456, 730979, 818369, 825664, 723245, 617194, 616068, 687070, 720334, 695017, 686493, 726955, 762131, 755249, 741465, 756737, 789007, 818785, 838900, 826112, 768143, 718169, 733708, 767733, 733177, 671977, 711189, 827518, 834189, 676121, 555475, 635723, 784220, 781174, 654824, 603432, 669268, 714023, 684934, 683375, 754093, 806855, 793453, 787167, 824051, 823075, 742983, 680203]
12259F80203L7445P3521J3506k5400J393j374p3764j06708j9053R7813J04256
12248G81838L594p5872n1231L0166O8693L2664j6821j4688K1894K9297J71j4425
12236G95280m194j4195m1482k0063M9085O6753k89m4773J367M0552j5633p4064
12224G38344k3011M9916L618q5159l5707J02803J00223o5852j48321k5944J04405
12213G15315N6889n6035m0989N7221O2688k7765o1886P945P4184O4270K1616m864
12201H68589k1407k8719o879K5549K2696r245j7061J0849K8266Q533k1326k9443
12189H30402j3911J1636K7308J0187l3546n5422k3839K3594L0564L393p019J4069
12177H17416L4216L1737J6455J024o843N461L3892M1823P246l0963k0690K2521
$$ y = [680203, 717648, 791169, 804675, 779275, 780668, 779294, 705530, 598822, 579769, 677582, 781838, 785432, 709560, 658329, 688495, 757188, 789852, 773031, 758343, 780237, 809534, 809705, 795280, 791086, 776891, 735409, 715346, 764431, 831184, 830895, 786122, 787489, 828041, 812408, 738344, 715333, 765249, 768867, 683708, 648001, 750804, 851027, 785175, 636854, 610910, 715315, 772204, 716169, 675180, 732401, 795089, 767324, 705438, 713383, 787567, 851837, 873453, 868589, 847182, 818463, 811584, 837133, 859829, 850584, 833523, 844372, 872638, 881171, 859845, 830402, 816491, 828127, 855435, 865622, 832076, 776654, 752815, 776409, 806973, 810366, 803347, 817416, 851632, 883369, 899824, 900848, 894005, 899466, 933358, 975181, 982427, 951464, 930774, 953295]
12165I53295L3009j0198n5619n4369k1666l705p540P751O3590J04822N1166p7468
12153I83068j42564n6304P6063Q3297k5883p6086L720P6880K7616n9321n4287
12142H36199J2001L4079J8295L2361N0036Q243m2060j0589N2934L1069m2524k8837
12130I51207O2185O9560m2488j14093n4404K1593R228j7854K6727P0673J8500
12119A000834o9396p8325j8442L4262P9970J35910J27997M623j13179p3939N5993
12108A086308P4152m1281r3922J7374J36311Q9964n5550j05651j4964P7161N7318
12097A227220k9378p1235l6698J0618J0365k2836l2352j118K8032J6298j8006
12086A080910l2323k1012j0212o531Q844L5139L9219L572l6871k9451K7629P1092
$$ y = [953295, 986304, 976106, 920487, 866118, 844452, 840747, 833207, 840958, 904548, 1009370, 1060536, 983068, 840504, 784200, 860263, 943560, 917677, 841591, 845311, 922191, 949807, 890486, 836199, 848200, 882279, 900574, 932935, 982971, 991214, 949154, 938565, 991499, 1022568, 980044, 951207, 1013392, 1082952, 1040464, 926371, 871967, 893560, 902788, 884934, 911661, 982334, 1000834, 931438, 853113, 834671, 868933, 948903, 1084813, 1212810, 1217433, 1104254, 1030315, 1086308, 1160460, 1119179, 1025257, 1042631, 1178942, 1268906, 1213356, 1107705, 1092741, 1169902, 1227220, 1197842, 1126607, 1089909, 1100527, 1110892, 1088056, 1055704, 1054586, 1082618, 1098916, 1080910, 1048587, 1027575, 1017363, 1010832, 1019676, 1054815, 1094034, 1097606, 1060735, 1031284, 1058913, 1130005]
12074A130005M2489l4683p5718m0508J8705M0006L5472M1867L5729j9930p5499
12063A097935m6446M2021P5275K4941j5885J761J3919j2211o074N7306P4665j3006
12051A294201r0950m2071O0346P2937L121l9648l2984k6487j0090L9888N0562
12040A278825l8131j17261n1591P7836Q3819j8078m4634L1860N1660k7956o2362
12029A163987k295J9917l5012k1067R9605J37844R05j18511n6227N7174M7688
12018A294008j0544J2052K9266o9943j47926l8967J12762O7093q2575n5505J18736
12007A228457J41061l3557j18527J237Q5769j3416r5448Q175J22241M5164r1696
11996A279460o3150N8440N0889o2623p1877M5951J02498K6555m6713l1883o756
$$ y = [1130005, 1172494, 1137811, 1062093, 1021585, 1040290, 1080296, 1115768, 1157635, 1193364, 1173434, 1097935, 1051489, 1093510, 1168785, 1193726, 1177841, 1179602, 1193521, 1181310, 1175236, 1232542, 1307207, 1294201, 1203251, 1161180, 1221526, 1294463, 1297584, 1257936, 1224952, 1198465, 1188375, 1228263, 1278825, 1240694, 1123433, 1071842, 1149678, 1233497, 1215419, 1170785, 1202645, 1254305, 1226349, 1163987, 1161692, 1181609, 1146597, 1125530, 1225135, 1362979, 1363884, 1245373, 1189146, 1246320, 1294008, 1283464, 1295516, 1324782, 1254839, 1106913, 1067946, 1180708, 1247801, 1165226, 1109721, 1228457, 1369518, 1335961, 1217434, 1218671, 1304440, 1291024, 1195576, 1203751, 1325992, 1371156, 1279460, 1216310, 1274750, 1325639, 1263016, 1191139, 1237090, 1339588, 1366143, 1319430, 1287547, 1280791]
11985A280791k5531k1649L5121N7542N62m1851N268O1243K0196o8611p1468K3991
11973A255604R1697N2443k5011l9367L042K2722j310j0802K4104N3636L5630P173
11961A469561J4296K6057o911n2169m4686m723j925k1825R859P3512O4547k3540
11949A502053p1105l0943l827m8315p0559j430O6172M1582j003K9036N7731j1696
11937A457696q9906l7830P4463P0844k3296k1179R1038J16125j8763j34124r2581
11926A392487j385J955k4081L0735J05616O9633m3766p7753P603Q4149M8024m6764
11914A546453p5354j797Q0415O1095m0844q0707J9786J34885R2217o3719j16762
11903A555668j660R4731K6986q5400n7508P2331J17288K5074p7761q8165l0495
$$ y = [1280791, 1255260, 1233611, 1268732, 1326274, 1326836, 1284985, 1290253, 1351496, 1371692, 1303081, 1231613, 1255604, 1347301, 1399744, 1374733, 1335366, 1338408, 1361130, 1359820, 1349018, 1373122, 1426758, 1462388, 1469561, 1483857, 1509914, 1503003, 1450834, 1406148, 1401425, 1399500, 1377675, 1387534, 1461046, 1525593, 1502053, 1430948, 1400005, 1396178, 1347863, 1277304, 1275874, 1342046, 1383628, 1382625, 1411661, 1469392, 1457696, 1367790, 1329960, 1404423, 1475267, 1451971, 1430792, 1521830, 1637955, 1619192, 1485068, 1392487, 1391102, 1393057, 1368976, 1399711, 1505327, 1574960, 1531194, 1453441, 1461044, 1545193, 1593217, 1546453, 1471099, 1469302, 1549717, 1610812, 1569968, 1489261, 1509047, 1643932, 1736149, 1672430, 1555668, 1554008, 1648739, 1675725, 1590325, 1532817, 1605148, 1722436, 1747510, 1669749, 1581584, 1551089]
11892A551089K9871N9418M5598M357j0188K3565M2788n987o4382m4711K6055M9693
11880A707166J4209l273K3619L7626O633l0787l6329j0696L6027Q0932P1404j0166
11868A886365q5534o8589Q374M4898K2035K943R795J0116P671L2320N1401P688
11856A929483o3907p4557k3007K1936N4397J04833J12547L444j20446q0254P6673
11845A941142J08173l7101j21967j2385R7578K3261r1751k9917J19813J14731
11835B111577l2619q8301J7672J12960Q0730n887o2719r4989r3980k5320N3358
11824A972482M1641j9367M683R4714Q6352l9748r8275l152Q9687N3530m643M0128
11812B218032R6022K2184j08726j19084p838P1634O0088L5264L5560J4582k8555
$$ y = [1551089, 1580960, 1640378, 1685976, 1690333, 1680145, 1703710, 1746498, 1740511, 1676129, 1631418, 1657473, 1707166, 1721375, 1718102, 1741721, 1779347, 1785980, 1755193, 1718864, 1708168, 1744195, 1825127, 1896531, 1886365, 1800831, 1732242, 1740616, 1785514, 1807549, 1810492, 1820287, 1830403, 1838074, 1870394, 1921795, 1929483, 1865576, 1791019, 1768012, 1789948, 1844345, 1949178, 2061725, 2065169, 1944723, 1864469, 1941142, 2049315, 2012214, 1890247, 1877862, 1975440, 1998701, 1906950, 1877033, 1996846, 2111577, 2078958, 1990657, 2008329, 2121289, 2202019, 2196132, 2133413, 2038424, 1944444, 1919124, 1972482, 2014123, 1994756, 1999439, 2094153, 2180505, 2140757, 2042482, 2039330, 2129017, 2182547, 2177904, 2218032, 2314054, 2336238, 2227512, 2108428, 2100590, 2172224, 2232312, 2267576, 2303136, 2317718, 2289163]
11801B289163k5913L2751P3136N6318K2070r92k9544n5021l4840K2846N0579K3249
11789B423802o128L577K5294K4634J5569K2922L4492K0260k5119p0546o6250Q755
11777B411262R5940R5563k161p7106l6022M8583M9656j7390l3350K1255M8665
11766B604895J8619J3612N7453N4277l5471r8725l9996O7824J00905N5231J984
11755B800608l6182n9320k5518P1565J31056P1476k9538m2886J9073M6034J8075
11744B964443Q255K7786J7792j4963j572M5701L8159k5426m2135K0907P4895O6053
11732C179895M4050L3224j6215r1514q5705J8388Q3319L3281j6224L4253Q4300
11721C301052J7613o6146n761J29734J29975j8304j09181l8827O4479P4474L9014
$$ y = [2289163, 2263250, 2296001, 2369137, 2425455, 2447525, 2446533, 2416989, 2361968, 2327128, 2349974, 2400553, 2423802, 2417674, 2421251, 2446545, 2471179, 2486748, 2509670, 2544162, 2564422, 2539303, 2468757, 2402507, 2411262, 2507202, 2602765, 2600604, 2523498, 2487476, 2536059, 2585715, 2568325, 2534975, 2556230, 2604895, 2623514, 2637126, 2694579, 2748856, 2713385, 2614660, 2574664, 2642488, 2743393, 2798624, 2800608, 2764426, 2705106, 2679588, 2751153, 2882209, 2953685, 2924147, 2881261, 2900334, 2946368, 2964443, 2972698, 3000484, 3018276, 3003313, 3001741, 3047442, 3085601, 3060175, 3018040, 3038947, 3113842, 3179895, 3223945, 3257169, 3240954, 3149440, 3063735, 3082123, 3165442, 3198723, 3182499, 3216752, 3301052, 3318665, 3252519, 3246758, 3376492, 3506467, 3488163, 3378982, 3340155, 3404634, 3479108, 3518122]
11710C518122M3577O2704M1759P911Q782K7439K8917J7399j168l4810n0464L115
11698C673283Q6402R3273K0760j1820L7966O2933N924k7500L3373P4908N83o6039
11686C984046K1608J50619J03977o8831j04519N1807J50102L3345j15793o6397
11676D139964J13529J82116P7933l6581l4848L5274P2886N8124L2670K2182J5918
11665D679167l893k8722k0932L6978R3511P5849j432l5581K5171J02588R6855
11654E019559K1468k9441r757M4224Q1171P7830L3460k3992l8841J5087Q6602
11643E277370J02277O2083L4010N4323Q0267N7621K015j5509M0619J15748J21722
11632E932546M8130j6754o84N4744O2736K4896J6261N1153O4647M0477M7217J04913
$$ y = [3518122, 3561699, 3624403, 3666162, 3674073, 3682855, 3710294, 3739211, 3756610, 3755442, 3720632, 3670168, 3673283, 3759685, 3852958, 3873718, 3861898, 3899864, 3962797, 3968721, 3941221, 3974594, 4049502, 4050085, 3984046, 4005654, 4156273, 4260250, 4191419, 4086900, 4138707, 4288809, 4322154, 4206361, 4139964, 4253493, 4435609, 4513542, 4476961, 4442113, 4477387, 4550273, 4608397, 4641067, 4663249, 4679167, 4675274, 4646552, 4625620, 4662598, 4756109, 4831958, 4830526, 4794945, 4820116, 4922704, 5019559, 5041027, 5011586, 5001829, 5046053, 5127224, 5205054, 5238514, 5214522, 5175681, 5190768, 5277370, 5379647, 5441730, 5475740, 5530063, 5610330, 5667951, 5669966, 5654457, 5695076, 5810824, 5932546, 5980676, 5963922, 5963238, 6017982, 6080718, 6105614, 6121875, 6173028, 6237675, 6278152, 6325369, 6430282]
11620F430282J25204N5116j6769J0356R3221J20020P9038M3439L8340L6972N0716
11609G065935J04376J47668J12188M1150L9058R9341J13037N5679K6167P0567
11599G875166J07449Q2893O6585J14415J54119J09879M5059O2392J30069J35182
11589H883208P3801N7039J27283J88320J54463P5601N3324R3909J20115J04226
11579I931289J06333J59915J93109J31701L9802N6404J83924K54015J63722L9309
11569A1259523N7255J84081K40569J80685J35209J74640K06771J62732J21422
11560A2722887J58409K08089J88398J51170J82074K37656K18110J43886J24230
11551A4334909J83222K43126K62113K69275K69702K30541J71042J61415K10178
$$ y = [6430282, 6555486, 6610602, 6593833, 6604189, 6697410, 6817430, 6896468, 6939907, 6978247, 7015219, 7065935, 7170311, 7317979, 7430167, 7471317, 7510375, 7609716, 7722753, 7778432, 7804599, 7875166, 7982615, 8065508, 8132093, 8246508, 8400627, 8510506, 8555565, 8617957, 8748026, 8883208, 8957009, 9014048, 9141331, 9329651, 9484114, 9559715, 9613039, 9706948, 9827063, 9931289, 10037622, 10197537, 10390646, 10522347, 10562149, 10618553, 10802477, 11056492, 11220214, 11259523, 11316778, 11500859, 11741428, 11922113, 12057322, 12231962, 12438733, 12601465, 12722887, 12881296, 13089385, 13277783, 13428953, 13611027, 13848683, 14066793, 14210679, 14334909, 14518131, 14761257, 15023370, 15292645, 15562347, 15792888, 15963930, 16125345, 16335523]
11542A6335523K43306K22417K01731K32042K78555K81381K49058K40989K77212
11533A8562214L07104K75780K06230J90991K80087L96676M17711L37405K76189
11524B1250387L05677L53857L36375K91266K98081L36964L33575K95225K93215
11515B4094622L36832L65034L48520L16490K99549L15031L73920M35775M15851
11506B7301624L15863K65563L30511L81612L03225K20434L10127M71284M49445
11497C0349688K59826J87825L29620M38053L35038J89995K16053L34673L55066
11488C2995837K91349K69732K71798K09654J45257J95970K96270K81075J58190
11479C5115132Q5088J08873J33763J23874J35167J52381R3310j1714l1395M9769
$$ y = [16335523, 16578829, 16801246, 17002977, 17235019, 17513574, 17794955, 18044013, 18285002, 18562214, 18869318, 19145098, 19351328, 19542319, 19822406, 20219082, 20636793, 20974198, 21250387, 21556064, 21909921, 22246296, 22537562, 22835643, 23172607, 23506182, 23801407, 24094622, 24431454, 24796488, 25145008, 25461498, 25761047, 26076078, 26449998, 26885773, 27301624, 27617487, 27883050, 28213561, 28595173, 28898398, 29118832, 29428959, 29900243, 30349688, 30609514, 30797339, 31126959, 31565012, 31900050, 32090045, 32306098, 32640771, 32995837, 33287186, 33556918, 33828716, 34038370, 34183627, 34379597, 34675867, 34956942, 35115132, 35200220, 35309093, 35442856, 35566730, 35701897, 35854278, 35947588, 35935874, 35904479, 35954248]
11469C5954248R7985M3970l1334n7761o6493q2179p4685n9012r8921j72555j80968
11458C5272295j27618j30743k10223k36070j62141j32412k43933l65916l37103
11449C3326136k14776j70693k32650k88649k88362k87058l13872l27856l05906
11440C0896314k78876k76711l01993l46715l85268l77336l24993k91429l16880
11431B7996113l57663l54441l15274k86087k86417l12838l51521l58030k97201
11422B5076641k29954k62300l70250l99320l00296k22125k72586l39292k92330
11413B2388188k20293k71891l75129l44115k02009j53484k48995l16820k59849
11404A9995603j95276k30768k98006k99621k58791k28336j91304j44134j52185
$$ y = [35954248, 36052233, 36096203, 36064869, 36007108, 35940615, 35858436, 35783751, 35724739, 35625818, 35453263, 35272295, 35144677, 35013934, 34803711, 34567641, 34405500, 34273088, 34029155, 33663239, 33326136, 33111360, 32940667, 32708017, 32419368, 32131006, 31843948, 31530076, 31202220, 30896314, 30617438, 30340727, 30038734, 29692019, 29306751, 28929415, 28604422, 28312993, 27996113, 27638450, 27284009, 26968735, 26682648, 26396231, 26083393, 25731872, 25373842, 25076641, 24846687, 24584387, 24214137, 23814817, 23514521, 23292396, 23019810, 22680518, 22388188, 22167895, 21896004, 21520875, 21176760, 20974751, 20821267, 20572272, 20255452, 19995603, 19800327, 19569559, 19271553, 18971932, 18713141, 18484805, 18293501, 18149367, 17997182]
11395A7997182k31438k89258k66818k28179k28880k18786j65655j47054k08861
11386A6012253k54611k03571j44795j86467k54105k11080j03465r2880j83945
11377A4377334k16843j35708p5105j32809k18926k09400j27642q3463j11451j53692
11367A2912295j58143j31226j14478j40130j90447j99660j33471n6581o2206j39264
11357A1586689j82261j40496p9753p4911j15409j48018j48234j17181o6553l5093
11347A0478780o1632j17416j28678q8980p3799j13767j40826j07564o9244p9854
11337I497020r4539o2852l8977q9043j50366j11952l188L1057n8007j59357j67445
11326H592351j01992l6089n573k4209r3887j56840j26742j7496M2550j8461j11548
$$ y = [17997182, 17765744, 17476486, 17209668, 16981489, 16752609, 16533823, 16368168, 16221114, 16012253, 15757642, 15554071, 15409276, 15222809, 14968704, 14757624, 14654159, 14561279, 14377334, 14160491, 14024783, 13949678, 13816869, 13597943, 13388543, 13260901, 13177438, 13065987, 12912295, 12754152, 12622926, 12508448, 12368318, 12177871, 11978211, 11844740, 11788159, 11725953, 11586689, 11404428, 11263932, 11184179, 11109268, 10993859, 10845841, 10697607, 10580426, 10513873, 10478780, 10417148, 10299732, 10171054, 10082074, 10008275, 9894508, 9753682, 9646118, 9576874, 9497020, 9402481, 9339629, 9300652, 9211609, 9061243, 8949291, 8946103, 8977160, 8919153, 8759796, 8592351, 8490359, 8454270, 8448697, 8424488, 8330601, 8173761, 8047019, 8029523, 8072073, 8053612, 7942064]
11315G942064j20283o2013l2845n4312p1103o3349o5508q8130j00261q4370m9952
11304G149938p438K0972l304p1111j00631m9430j352m7361j28541j18781k9715
11293F613246R512l4584o4118m0617m3893r6342r8063j2908M1490j2514q1051
11282F180158p4294n9391r9748r8925J6012J01132Q472j26902p6161Q8340R0109
11271E948802q5088j51301o29J14305N990j45746j14919M523Q10q5406o9891K7955
11259E449405L0959p2270j18146n7956j2564l5916m9530l2987o6285j42960j41623
11248D750127m0549K4192j8179o6622m1340j3431m6882p0325k0861K3693j8072
11237D461751q1255p1145k4569k2146l4965l95L1856j8286r7638r5372l4988k8969
$$ y = [7942064, 7821781, 7759768, 7726923, 7672611, 7601508, 7538159, 7472651, 7384521, 7284260, 7199890, 7149938, 7142500, 7163472, 7160168, 7089057, 6988426, 6938996, 6937644, 6890283, 6761742, 6642961, 6613246, 6622758, 6588174, 6524056, 6483439, 6439546, 6343204, 6245141, 6232233, 6273723, 6261209, 6180158, 6105864, 6046473, 5946725, 5847800, 5863812, 5964944, 5973416, 5846514, 5770353, 5858693, 5948802, 5863714, 5712413, 5711784, 5826089, 5832079, 5686333, 5571414, 5575937, 5576747, 5491341, 5421450, 5449405, 5480364, 5408094, 5289948, 5231992, 5219428, 5183512, 5133982, 5100995, 5034710, 4891750, 4750127, 4709578, 4733770, 4715591, 4648969, 4607629, 4594198, 4547316, 4476991, 4456130, 4479823, 4461751, 4380496, 4309351, 4284782, 4262636, 4227671, 4227276, 4259132, 4240846, 4143208, 4047836, 4012848, 3983879]
11225C983879p3086n7386K3144M4968k9434q0277l1058K9069N062m9718m1008
11214C724155L862m450o0854q2397m4801j234J5310J7059P03m8361q9475n4860
11202C374657L4985O9603L922o2663k9931M3254K2336q6046j23331j5531R7728
11191C328983N8553p1851j04137j1130L5129n4820j32772m1266J27412J52349
11181C286450K054j32263j14787k2737J0481k2761m8464l8337j1225K5187N6998
11170B990596M0594k9813p5870l3340L9580L5824m2695r2150o5478k6491k6117
11159B714640k1179L0378P2221K9796n7015p6153j0449L1413k2891j01016r8453
11148B491292l3577l099k0628r953M0428L9906l8233p1734K9069J43593Q6798
$$ y = [3983879, 3910793, 3853407, 3876551, 3921519, 3892085, 3811808, 3780750, 3809819, 3814881, 3765163, 3724155, 3728017, 3723567, 3662713, 3580316, 3535515, 3534281, 3549591, 3566650, 3567353, 3518992, 3429517, 3374657, 3409642, 3479245, 3483167, 3420504, 3390573, 3433827, 3456163, 3370117, 3246786, 3231255, 3328983, 3387536, 3315685, 3211548, 3200418, 3235547, 3180727, 3047955, 3006689, 3134101, 3286450, 3288504, 3156241, 3041454, 3018717, 3029198, 3006437, 2957973, 2919636, 2908411, 2933598, 2990596, 3031190, 3001377, 2925507, 2892167, 2931747, 2967571, 2924876, 2832726, 2767248, 2740757, 2714640, 2693461, 2723839, 2796060, 2825856, 2768841, 2692688, 2682239, 2713652, 2690761, 2589745, 2491292, 2457715, 2454616, 2433988, 2424035, 2464463, 2504369, 2466136, 2394402, 2423471, 2567064, 2653862]
11137B653862j05969j98745p6746J00395J28720J7949p4166p0487k1302K1543
11127B375054N4414O0782J0716o3187p6556j0735M5892J3149o9280r1620j7669
11116B230960O5039N3085l7985q6087k2982O4718N1138m4599q3102j4689N0376
11105B225872K4926k0329Q452O2283L9613l2513m7052n70J6231j3723k1654K346
11093B243882N65j7709J1398N3509R519p6704m4085R7505J27113l2370j47905
11082B224718l6460J21044O5875j06408j00686Q3159J44871k3206j62945o4960
11072B145002J19215J36620k35q9401m8601L0412O1519M5970J0342k4559l4215
11061B352069k1658k4223m1846j9895M7281P6129K1538l9957l1010Q142J0579
$$ y = [2653862, 2547893, 2349148, 2272402, 2372797, 2501517, 2519466, 2445300, 2374813, 2353511, 2375054, 2429468, 2490250, 2500966, 2437779, 2361223, 2350488, 2396380, 2409529, 2340249, 2248629, 2230960, 2295999, 2349084, 2311099, 2225012, 2202030, 2266748, 2317886, 2273287, 2190185, 2175496, 2225872, 2250798, 2230469, 2238921, 2301204, 2340817, 2308304, 2261252, 2260682, 2276913, 2263190, 2241536, 2243882, 2244447, 2226738, 2238136, 2291645, 2301164, 2224460, 2180375, 2277880, 2404993, 2372623, 2224718, 2188258, 2309302, 2375177, 2268769, 2168083, 2251242, 2396113, 2372907, 2209962, 2145002, 2264217, 2400837, 2400602, 2311201, 2262600, 2293012, 2354531, 2400501, 2410843, 2386284, 2352069, 2330411, 2306188, 2264342, 2244447, 2291728, 2367857, 2389395, 2349438, 2318428, 2326570, 2337149]
11050B337149N909M6614Q6454N1071k7114o0188m0850j6598J5715O9043P8678
11039B545883n765r0204n0063O3942R8549M7090L9509R0394O7018n2842j01919
11028B651592R649J31725R7952l2215q4345j3188Q6274J29085R6582J3474m7068
11017C039517j0213Q2056R5226R895k2275P8235J64685Q9968m5921m8515P1917
11006C504575J44121J08495N2170J9923j3726j3591P5134J66279J15718k8003
10996D131095o2202N3381J31095O3845j3379L2029J16293J00574J2126l6832l0993
10985D497032j7500R218N8168O6633J200m7662J085O8828L6067n6532p4955j3670
10973D527912N445n9005j09197p2499j654J9966j8241p1890r4275n9804O773L0132
$$ y = [2337149, 2343058, 2389672, 2476126, 2527197, 2500083, 2439895, 2399045, 2382447, 2398162, 2467205, 2545883, 2540118, 2449914, 2399851, 2463793, 2562342, 2609432, 2648941, 2739335, 2806353, 2753511, 2651592, 2661241, 2792966, 2890918, 2858703, 2774358, 2761170, 2847444, 2976529, 3073111, 3086585, 3039517, 3029304, 3111360, 3206586, 3216481, 3194206, 3272441, 3437126, 3527094, 3481173, 3432658, 3504575, 3648696, 3757191, 3809361, 3829284, 3815558, 3801967, 3877101, 4043380, 4159098, 4131095, 4068893, 4122274, 4253369, 4317214, 4303835, 4335864, 4452157, 4552731, 4564857, 4528025, 4497032, 4479532, 4488750, 4546918, 4613551, 4614751, 4567089, 4568174, 4637002, 4673069, 4616537, 4541582, 4527912, 4533357, 4474352, 4365155, 4292656, 4291002, 4310968, 4292727, 4220837, 4126562, 4066758, 4073531, 4103663]
10961D103663k6768r4008q7541m2983o0807j33635j44251n2618K8834l029r5011
10950C391846j22140o1915p337k5510p1851o6090j5330j0629q8452j49680q4382
10939B688530N0160Q2399k7675j19969p2185K0002P586p6863r5034l5940n931
10928B415080k8137k4906J2682Q447l6678l1406L2033N1328j667l0294L293O894
10916B376669n8294q3122K820R2429O4411l2289p4426m4929m533K6479M9027L2345
10904B346587j7553k4710K4942K5107o7171j13592o154J24495R5799l1416n7408
10893B298926K6755N1048k2399n0231J4155M1307j7614l1438N7500J01476L720
10882B473205r0447k9941P8313M6065p4659p6275N7867J28425M6181l9034n05
$$ y = [4103663, 4076895, 3982887, 3895346, 3852363, 3791556, 3657921, 3513670, 3461052, 3489886, 3486857, 3391846, 3269706, 3207791, 3200454, 3174944, 3103093, 3037003, 3021673, 3011044, 2922592, 2772912, 2688530, 2738690, 2821089, 2793414, 2673445, 2601260, 2621262, 2628848, 2551985, 2456951, 2421011, 2415080, 2386943, 2362037, 2374719, 2383166, 2346488, 2315082, 2347115, 2398443, 2396776, 2366482, 2369775, 2376669, 2318375, 2235253, 2238073, 2330502, 2394913, 2362624, 2288198, 2243269, 2238736, 2265215, 2314242, 2346587, 2329034, 2304324, 2329266, 2354373, 2287202, 2173610, 2167456, 2291951, 2387750, 2356334, 2298926, 2325681, 2376729, 2354330, 2304099, 2318254, 2359561, 2341947, 2310509, 2368009, 2469485, 2473205, 2382758, 2352817, 2431130, 2477195, 2402536, 2326261, 2384128, 2512553, 2558734, 2519700, 2519195]
10871B519195O3467P407j16614j40412l4771O6775P8531N4225M6877J4302o4233
10860B494749r2477K892J12033P2521o9744j03428K3889J12665K5920q8132m0486
10849B450402Q5318P7249m6366p4669K9666P0494l4567j07218j7241R1674M7161
10838B571903o5076n8745M0198N7946k3394m8309M0205J11583O2198m2027r0060
10827B556422o8382k1977K9084P3041P6441K6418l8604p2866o4235k0953L9385
10816B513774Q0775P3924L6375P080j2494m3365o7627m4682J4904N5718N6977
10805B671359M3085K1246j7510l9530N87O2960N4431j9165l9089M1459J05740
10794B885573M3912p5763j07105l3259L8533N1415M8727N5840L0527l7325p3186
$$ y = [2519195, 2582662, 2590069, 2473455, 2333043, 2298272, 2365047, 2443578, 2497803, 2544680, 2558982, 2494749, 2402272, 2405164, 2517197, 2589718, 2519974, 2416546, 2440435, 2553100, 2579020, 2490888, 2450402, 2535720, 2612969, 2566603, 2491934, 2521600, 2592094, 2557527, 2450309, 2433068, 2524742, 2571903, 2506827, 2448082, 2488280, 2546226, 2522832, 2474523, 2514728, 2626311, 2688509, 2646482, 2556422, 2488040, 2466063, 2495147, 2568188, 2644629, 2671047, 2632443, 2559577, 2495342, 2474389, 2513774, 2594549, 2668473, 2704848, 2711928, 2699434, 2656069, 2588442, 2543760, 2558664, 2614382, 2671359, 2714444, 2735690, 2718180, 2678650, 2679237, 2742197, 2796628, 2777463, 2738374, 2779833, 2885573, 2929485, 2853722, 2746617, 2713358, 2751891, 2803306, 2852033, 2907873, 2938400, 2901075, 2827889]
10783B827889k2423N6322O6393N368m0684k0541K4043L1510K886j6166n718J2072
10771B920951J6943J5759J9019K0807J4512P144N869R978K4665N5214P6203M5949
10759C233013k3392n5243j0204M6027L5711j0480o536M3697N5889J5041J967M5329
10747C370819O3732J1006l0390J3555P1817M1165l2306j7682Q5420J34751N8637
10736C770524m2690m7531L4283J08620J19822P5292J0521k2264J3902P7628P7018
10725D175125L185l6365K2399Q7940N4361j7709N958R9468R8819k9228j08842
10714D355111j6664J25756J36735L7939j3815J7498L0107m866L877P8879J04784
10703D855341J7326p7535o6507L462K9662K8516P4505J33919J08964J6312k7370
$$ y = [2827889, 2805466, 2861788, 2928181, 2933549, 2892865, 2872324, 2896367, 2927877, 2930763, 2914597, 2908879, 2920951, 2937894, 2953653, 2972672, 2993479, 3007991, 3015135, 3021004, 3030982, 3055647, 3110861, 3187064, 3233013, 3209621, 3154378, 3144174, 3190201, 3225912, 3215432, 3208896, 3252593, 3308482, 3323523, 3325490, 3370819, 3434551, 3445557, 3415167, 3428722, 3500539, 3541704, 3509398, 3491716, 3577136, 3711887, 3770524, 3727834, 3680303, 3714586, 3823206, 3943028, 4018320, 4028841, 4006577, 4020479, 4098107, 4175125, 4178310, 4141945, 4164344, 4252284, 4306645, 4288936, 4294894, 4394362, 4493181, 4463953, 4355111, 4338447, 4464203, 4600938, 4638877, 4625062, 4642560, 4672667, 4667801, 4671678, 4750557, 4855341, 4872667, 4795132, 4728625, 4732087, 4761749, 4790265, 4864770, 4998689, 5107653, 5123965, 5096595]
10692E096595L821J3928l1964l7281N4418J43169J17845K4727j1986K4851M8714
10681E446837K4284R070L8649O5955M5531R354J3837N2590P0492M8112K5657L6525
10669E886893N6589M8039K7751M3847Q8674R5722M5825J3319N6510J18035J07811
10658F589015M3363J6324M3893N8271L8545L9074O9883O7440K4737L2307J23555
10647G146407J88122J29225J7642j3834M1467R0235R6755R7679R7477O9783M6665
10636H007623R0362J73752J94708J23830M4693K9221N9981R7605J38275J70040
10626I130090J52665R0364O1216J17008J97047K00279J20803N6594Q2686J59238
10616A0367990J89219J46266J03956J25570J70559J62748J20323J32512K08046
$$ y = [5096595, 5100416, 5114344, 5082380, 5045099, 5099517, 5242686, 5360531, 5385258, 5373272, 5398123, 5446837, 5471121, 5480191, 5518840, 5584795, 5630326, 5639680, 5653517, 5706107, 5776599, 5824711, 5850368, 5886893, 5943482, 5991521, 6019272, 6063119, 6151793, 6247515, 6293340, 6306659, 6363169, 6481204, 6589015, 6632378, 6648702, 6692595, 6750866, 6789411, 6828485, 6898368, 6965808, 6990545, 7022852, 7146407, 7334529, 7463754, 7481396, 7467562, 7509029, 7599264, 7696019, 7793698, 7891175, 7960958, 8007623, 8097985, 8271737, 8466445, 8590275, 8634968, 8664189, 8724170, 8821775, 8960050, 9130090, 9282755, 9373119, 9434335, 9551343, 9748390, 9948669, 10069472, 10126066, 10208752, 10367990, 10557209, 10703475, 10807431, 10933001, 11103560, 11266308, 11386631, 11519143, 11727189]
10607A1727189K49635K11136J73788K05602K48370K30717J99388K31041K92011
10598A3768877L03423K79388K79935K90635K75518K80263L40518L62200K63251
10589A6444008J63754K30026L81670L91696K56137J98069K83901L21284K14413
10580A8884958J37300K22703L36607L29714K85102L27067L87070L65615L46477
10571B1622613M31596N21960M88676M18481M57136N45031N54803N59272O86825
10562B6286393Q24482P73295O21644O36851Q23633R27312Q74812Q64718R74822
10553C3607962J031983R70983R85287J170325J323601J288885J228803J336845
10545D2944674J510566J553886J518720J590414J765707J889305J922751J961279
$$ y = [11727189, 11976824, 12187960, 12361748, 12567350, 12815720, 13046437, 13245825, 13476866, 13768877, 14072300, 14351688, 14631623, 14922258, 15197776, 15478039, 15818557, 16180757, 16444008, 16607762, 16837788, 17219458, 17611154, 17867291, 18065360, 18349261, 18670545, 18884958, 19022258, 19244961, 19581568, 19911282, 20196384, 20523451, 20910521, 21276136, 21622613, 22054209, 22576169, 23064845, 23483326, 23940462, 24485493, 25040296, 25599568, 26286393, 27110875, 27884170, 28505814, 29142665, 29966298, 30893610, 31768422, 32633140, 33607962, 34639945, 35610928, 36596215, 37766540, 39090141, 40379026, 41607829, 42944674, 44455240, 46009126, 47527846, 49118260, 50883967, 52773272, 54696023, 56657302]
10537E6657302K049142K162282K308443K480905K592668K617315K698752K944775
10529G6511584L218354L342849L414739L660450M043597M295096M332463M371897
10521A07191029M571554M823210N001617N195637N541403N985416O372203O668746
10513A51350815O960401P277646P541686P669263P671357P657086P751406P977949
10505B11857609Q241587Q484785Q810895R327462R891505J0179293J0042802R641060
10497B86476998R173358Q664976Q118921P705928P629572P889775Q325288Q815960
10489C52800776R293752R612510R581648R140470Q383690P416115O292394N104912
10481D17626267M025948L238250K884132L047048L652232M364738M717096M427749
$$ y = [56657302, 58706444, 60868726, 63177169, 65658074, 68250742, 70868057, 73566809, 76511584, 79729938, 83072787, 86487526, 90147976, 94191573, 98486669, 102819132, 107191029, 111762583, 116585793, 121587410, 126783047, 132324450, 138309866, 144682069, 151350815, 158311216, 165588862, 173130548, 180799811, 188471168, 196128254, 203879660, 211857609, 220099196, 228583981, 237394876, 246722338, 256613843, 266793136, 276835938, 286476998, 295650356, 304315332, 312434253, 320140181, 327769753, 335659528, 343984816, 352800776, 362094528, 371707038, 381288686, 390429156, 398812846, 406228961, 412521355, 417626267, 421652215, 424890465, 427774597, 430821645, 434473877, 438838615, 443555711, 447983460]
10473D47983460L557937K341380R47256n45336k043303l426431m609334n517557
10465D38688072o006579n920127n307690m542518m132532m370509n171494o229142
10457C97007481p271343q157630q832673r301224r632247r875250r947813r708018
10449C24281283r189210q665608q401910q412165q555041q774387r088918r392591
10441B53801453r478018r315149r127828r077440r008841q673656q122311p674676
10433A83323534p501031p421516p192458o835182o546679o375433o153447n746616
10425A29551172n229901m762157m388978m050557l723803l457175l270794l104060
10417I7563747k892588k652300k454001k335410k263603k175517k038201j872134
$$ y = [447983460, 451541397, 453882777, 454830033, 454284697, 452241394, 448814963, 444205629, 438688072, 432681493, 426761366, 421453676, 416911158, 412778626, 408408117, 403236623, 397007481, 389736138, 381578508, 372745835, 363444611, 353812364, 343937114, 333989301, 324281283, 315092073, 306426465, 298024555, 289612390, 281057349, 272282962, 263194044, 253801453, 244323435, 235008286, 225880458, 216803018, 207794177, 199120521, 190998210, 183323534, 175822503, 168400987, 161208529, 154373347, 147826668, 141451235, 135297788, 129551172, 124321271, 119559114, 115170136, 111119579, 107395776, 103938601, 100667807, 97563747, 94671159, 92018859, 89564858, 87229448, 84965845, 82790328, 80752127, 78879993]
10409G8879993j725078j623937j553333j484807j417992j376036j362491j345915
10401F6990404j298517j233936j188556j171174j151674j106849j059323j046337
10393E7734038j054223j022348r33411q59507q68400r13874q97124q28791q25374
10384D9530986r13777r56301q52789p14136p06197p92885p97191o88575o23410
10375D2485725o73361p04596o16894n34614o11869p64112p74387o16135m88636
10366C6701121n22385o10666n92719m81035m12778m43578m91715m75184m20553
10357C2250508m03739m29869m28696l67750l11878l30951l90270l99424l49686
10348B8838245l18023l31929l28218k76835k43984k72847k96604k52018j95336
$$ y = [78879993, 77154915, 75530978, 73977645, 72492838, 71074846, 69698810, 68336319, 66990404, 65691887, 64457951, 63269395, 62098221, 60946547, 59839698, 58780375, 57734038, 56679815, 55657467, 54724056, 53864549, 52996149, 52082275, 51185151, 50356360, 49530986, 48617209, 47660908, 46808119, 46093983, 45387786, 44594901, 43797710, 43109135, 42485725, 41812364, 41107768, 40490874, 39956260, 39344391, 38580279, 37805892, 37189757, 36701121, 36178736, 35568070, 34975351, 34494316, 34081538, 33637960, 33146245, 32671061, 32250508, 31846769, 31416900, 30988204, 30620454, 30308576, 29977625, 29587355, 29187931, 28838245, 28520222, 28188293, 27860075, 27583240, 27339256, 27066409, 26769805, 26517787, 26322451]
10339B6322451k05513k46014k40029k20939k68871l37286k99422j62967q3068
10330B4258342j36201k24514k47167k29987k24619k08670j69028j71125k44633
10321B2402398k90934k15777q9300o1321j57862k67001l01764k76618k31361j75362
10311B0335098j22727j09069j45631j99478k35047k45691k40585k28626k17507
10302A8590737k08248j93768j75687j68443j74656j79529j83562k09304k54690
10293A6842850k74892k40369j83625j58173j76323k11603k34330k24539j83911
10284A4955085j52941j74522k24753k34896k00623j96119k45208k63996j92024
10275A3070003r9991q8890j51031k13639k51248k64061k19811j28352j00402j96968
$$ y = [26322451, 26116938, 25870924, 25630895, 25409956, 25141085, 24803799, 24504377, 24341410, 24258342, 24122141, 23897627, 23650460, 23420473, 23195854, 22987184, 22818156, 22647031, 22402398, 22111464, 21895687, 21806387, 21745066, 21587204, 21320203, 21018439, 20741821, 20510460, 20335098, 20212371, 20103302, 19957671, 19758193, 19523146, 19277455, 19036870, 18808244, 18590737, 18382489, 18188721, 18013034, 17844591, 17669935, 17490406, 17306844, 17097540, 16842850, 16567958, 16327589, 16143964, 15985791, 15809468, 15597865, 15363535, 15138996, 14955085, 14802144, 14627622, 14402869, 14167973, 13967350, 13771231, 13526023, 13262027, 13070003, 12970012, 12881122, 12730091, 12516452, 12265204, 12001143, 11781332, 11652980, 11552578, 11355610]
10265A1355610k86441k14410o4908n5988j92483k48625j34165m3298j34180k71096
10255I710016k48350j10078n2528j11671j51580j14967r1420j36510j86649j81689
10245H324574j45338j13168q4957p4233j09201j59364j53021r4358p1262j13698
10235G205974j39220q9219k9769m6066j08009j25263q8538o6646q5333r5865o7467
10224F264579l7900n0124r0168j14513j05319p6428n0755m9633p9174j08390q7939
10213E414236j6589L6695J3167n3386q2733o5071o7119j11427j25780n8720K1148
10202D904421J5918n6533r7945q3330p3211p7454l1291N8741P1292m9556j74741
10191D406311j56360l6804K7567l585l6462k8001m0943r9327j26600p6282j3398
$$ y = [11355610, 11069169, 10854759, 10789851, 10733863, 10541380, 10292755, 10158590, 10115292, 9981112, 9710016, 9461666, 9351588, 9299060, 9187389, 9035809, 8920842, 8829422, 8692912, 8506263, 8324574, 8179236, 8066068, 7981111, 7906878, 7797677, 7638313, 7485292, 7390934, 7319672, 7205974, 7066754, 6977535, 6947766, 6901700, 6793691, 6668428, 6579890, 6513244, 6427911, 6332046, 6264579, 6226679, 6176555, 6086387, 5971874, 5866555, 5790127, 5739372, 5689739, 5610565, 5502175, 5414236, 5397647, 5434342, 5447509, 5394123, 5311390, 5246319, 5179200, 5067773, 4941993, 4883273, 4904421, 4920339, 4863806, 4765861, 4682531, 4609320, 4531866, 4500575, 4559316, 4630608, 4581052, 4406311, 4249951, 4213147, 4240714, 4237129, 4200667, 4172666, 4131723, 4032396, 3905796, 3829514, 3816116]
10180C816116n739k5582k2988j5040l1661m2569j4294J6395K31m2347o7008q1525
10168C483989r9472p4676K0350R5953M2710r2291j47999p1309K2694L2456q441
10157C203964l4501n7484j00934j19649p1955n347J5081R596L0405N3103J5827
10146B938106o3242j02445p8037m2806k9763k0807j1792k6299n4277n2438j9660
10135B436540k690j5829k5856k5467m1820n9420k6627L5231K9831o1339j24557
10124B117997p7492P174K3785q691j2312J904k7197p4469n8903J3425N6340M1170
10112B002731J4773q776n4977q9737m2465N3947P4042j3355q9594o5163J96J5798
10100A797420q860k2347k5901l3887k2665Q924Q519l2203l8522J4113K9514n0359
$$ y = [3816116, 3810377, 3784795, 3761807, 3746767, 3715106, 3672537, 3658243, 3674638, 3674869, 3632522, 3565514, 3483989, 3384517, 3309841, 3330191, 3426144, 3468854, 3376563, 3228564, 3157255, 3179949, 3212405, 3203964, 3169463, 3111979, 3011045, 2891396, 2819441, 2814094, 2829175, 2838771, 2869176, 2922279, 2938106, 2874864, 2772419, 2694382, 2651576, 2621813, 2601006, 2589214, 2562915, 2508638, 2456200, 2436540, 2433850, 2418021, 2392165, 2366698, 2324878, 2265458, 2238831, 2274062, 2303893, 2242554, 2117997, 2040505, 2047679, 2071464, 2062773, 2050461, 2052365, 2025168, 1950699, 1891796, 1905221, 1961561, 2002731, 2017504, 2008728, 1953751, 1864014, 1821549, 1875496, 1949538, 1936183, 1846589, 1781426, 1781622, 1797420, 1788560, 1766213, 1740312, 1706425, 1683760, 1692684, 1701203, 1669000, 1630478, 1644591, 1674105, 1623746]
10088A623746j19183o2605M9253P0537R144j3744J7257R618m1274l6806L2043
10077A537986N1469j6314o2125j6573L7951J6327l5981m2208j7008l799J3775
10066A463500N0065N3162p598o3709m4453J2732L0248O453j4980k9167m3849l1445
10054A380959J2490K7654j1893l0117K4875O6972L840q9093p1433L3460P1003
10043A418717k914p2240n6784l363M0603R2532J32591Q3235m4158j12242m6217
10032A429760N1631N8490J399j9575R390L1714K8205J6538k371j8817N936O1275
10020A653575O2018j5010n5824K0110J03615N6824m3783j3419J25430J51667M93
10009B045696j09705n715J72022J84227M3248l8002K1720Q7786N7486J2220N6927
$$ y = [1623746, 1504563, 1441958, 1491211, 1561748, 1570892, 1557148, 1574405, 1584023, 1542749, 1505943, 1537986, 1589455, 1573141, 1511016, 1494443, 1532394, 1548721, 1512740, 1470532, 1453524, 1449725, 1463500, 1513565, 1566727, 1559129, 1495420, 1450967, 1463699, 1493947, 1500400, 1485420, 1456253, 1412404, 1380959, 1393449, 1421103, 1409210, 1379093, 1403968, 1470940, 1474780, 1385687, 1314254, 1347714, 1418717, 1415803, 1343563, 1286779, 1283416, 1324019, 1416551, 1549142, 1632377, 1588219, 1475977, 1429760, 1481391, 1539881, 1541280, 1521705, 1531095, 1562809, 1591014, 1607552, 1605181, 1586364, 1592300, 1653575, 1715593, 1700583, 1644759, 1664869, 1768484, 1825308, 1781525, 1768106, 1893536, 2045203, 2045696, 1935991, 1930276, 2102298, 2286525, 2329773, 2291771, 2313491, 2401277, 2458763, 2470983, 2527910]
9998B527910J37350J22305P248o8032k825J37683K08959J59848P2968M2066O5075
9987C410555Q7804J02375J33697J54042J05650J8222J087P5486J18349M8964k7695
9976D228536K0580J29336J22659j4555j15026q5044j7431q613k1786o529q536
9965D223591n4958n7362L8894J11164K1980j43074j72423l7921O5847Q784j07739
9954C896783j27633n3978k495k7701q3135j09603r3163n5177k8231l0517m7017
9943C238133n3968n9478q4502j11973j08372r1926j11768j51598j30790k9834
9933B303924N5500K9746q0881j63895j45711n5592R754k2484j17833j57242q5140
9922A570146J895j0225p4667o1152J5341P139j07658j61712o3390M8240K3749
$$ y = [2527910, 2665260, 2787565, 2794813, 2726781, 2723956, 2861639, 3070598, 3230446, 3303414, 3345480, 3410555, 3498359, 3600734, 3734431, 3888473, 3994123, 4012345, 4013432, 4088918, 4207267, 4256231, 4228536, 4249116, 4378452, 4501111, 4486556, 4371530, 4286486, 4269055, 4260442, 4238656, 4232127, 4223591, 4168633, 4111271, 4150165, 4261329, 4283309, 4140235, 3967812, 3929891, 3995738, 4004522, 3896783, 3769150, 3715172, 3712677, 3684976, 3601841, 3492238, 3399075, 3343898, 3315667, 3285150, 3238133, 3184165, 3124687, 3040185, 2928212, 2819840, 2727914, 2616146, 2464548, 2333758, 2303924, 2359424, 2389170, 2308289, 2144394, 1998683, 1943091, 1952845, 1930361, 1812528, 1655286, 1570146, 1572041, 1561816, 1487149, 1425997, 1441338, 1448477, 1340819, 1179107, 1115717, 1163957, 1187706]
9911A187706p2339r3475m0956j1645j8906j9892l4846q4688r0452N284R4578N2343
9899H72712m6952m8631J6753J855p6039o4222L3717N2802k8538m2001N6473R1231
9887H19160j6140r0283m714R2083L3955p9153o6195K2900J1364r2398j19467k6510
9875D84602N3225L4294k0608l4707j3085J2238L0789L7264L5733M5751N4245J0869
9863G30610p3542r9874k4605N6595N4543J7396J5964J1459l5593m3314M5481J07887
9851G63007K2299r3680m8941R3006J04431k6684q2070J1562P4970Q663l8677M7245
9839H35131J34287P5773l5995l1037O1352Q2275Q84o9818o6946l9815l3960k7528
9827H84603Q171N1829M7611l5332j41478j49964k1354J06986P9244m8919q5280
$$ y = [1187706, 1115367, 1021892, 980936, 969291, 950385, 930493, 895647, 810959, 720507, 725791, 820369, 872712, 825760, 777129, 793882, 795737, 719698, 655476, 689193, 741995, 713457, 671456, 727929, 819160, 803020, 712737, 708023, 800106, 834061, 754908, 688713, 711613, 722977, 630579, 511112, 484602, 537827, 572121, 551513, 516806, 503721, 515959, 546748, 584012, 619745, 665496, 719741, 730610, 657068, 557194, 532589, 589184, 643727, 661123, 677087, 688546, 652953, 609639, 655120, 763007, 785306, 691626, 642685, 735691, 840122, 813438, 731368, 742930, 817900, 826563, 787886, 835131, 969418, 1045191, 1009196, 978159, 1039511, 1121786, 1122670, 1052852, 985906, 946091, 912131, 884603, 892774, 944603, 992214, 956882, 815404, 665440, 644086, 751072, 830316, 781397, 696117]
9816F96117L22L9385l9762r3466k8358K8390l3877r6780k3397Q1009L8403r0601
9804D77385j01938J7013Q6488L9561k107L0862N0502n149o1078m5813m629k770
9792D78327k2600k0355k676O334J1512K1577K5295J4073o853k8978l3417k385
9780D39854K9216p171r1621r7377K0948J16925N3809p4349q3561J1364M2072k1990
9768C38119m3763K0032M8030j3114n1102M612O0267L0362k7401m1234m3237o5920
9756B15651n9244n863J3893l0932m3108L0682Q4385K9529m1926j0895O6769O3400
9744C12341q861m6270l7751m3427m8194N019P5484O8339o775n4835m8326l4448
9732A32296j9918K0237M7006P104m4566j3481O1352N3495l7821p9821k4267K7320
$$ y = [696117, 696439, 735824, 696062, 602596, 574238, 602628, 568751, 471971, 448574, 529583, 567986, 477385, 375447, 392460, 478948, 518509, 516402, 547264, 597766, 592617, 531539, 485726, 481097, 478327, 455727, 435372, 432696, 439030, 450542, 472119, 497414, 511487, 504634, 475656, 442239, 439854, 469070, 461899, 370278, 272901, 293849, 410774, 464583, 390234, 306673, 318037, 360109, 338119, 294356, 314388, 362418, 349304, 298202, 302814, 363081, 393443, 366042, 324808, 281571, 215651, 156407, 150544, 164437, 133505, 90397, 121079, 205464, 234993, 193067, 182172, 248941, 312341, 303480, 257210, 219459, 176032, 127838, 132857, 208341, 276680, 269905, 215070, 166744, 132296, 112378, 132615, 179621, 186725, 142159, 128678, 190030, 243525, 205704, 125883, 101616, 128936]
9720A28936R342j3814R157K7979J2094K0190O8134O1727l8209j06672l4457Q2501
9708B26908P6461l7237r0531j7637O8571O2121l824m4120l7079n289L7966O9276
9696C05586M4737l3253q5481n1385K1715M8823L5734N3936R7164O8839n0098j22976
9684C33341l4918J20562J49713K4307q9855p7366j0800M267p526K4098O5487L3277
9672E34587n5358r9183n4032L2139R7922J01665J7089j10951j50311l3314J11054
9661C91307J04283k7580r2273j6292P1456O3507J2044j1687l1307n5317j0614
9650C97527J01780J28935j3757j66376j34828J7884P8055J3631j1316O2549R6170
9639E70254O092q5589n0891M7639P6048K9778o625j4090k6710k6597K0076O1096
$$ y = [128936, 138278, 124464, 133621, 161600, 173694, 193884, 262018, 323745, 285536, 178864, 144407, 226908, 303369, 266132, 175601, 157964, 226535, 288656, 284832, 240712, 203633, 198344, 236310, 305586, 350323, 317070, 231589, 180204, 201919, 250742, 286476, 340412, 437576, 506415, 456317, 333341, 298423, 418985, 568698, 593005, 503150, 425784, 414984, 419251, 411725, 435823, 501310, 534587, 479229, 380046, 326014, 358153, 456075, 557740, 574829, 463878, 313567, 280253, 391307, 495590, 468010, 375737, 359445, 430901, 494408, 506452, 494765, 463458, 408141, 397527, 499307, 628242, 614485, 448109, 313281, 331165, 409220, 422851, 411535, 474084, 570254, 576346, 490757, 439866, 487505, 563553, 593331, 586706, 572616, 545906, 519309, 539385, 600481]
9627F00481K1483n2914m8434K4212L6248l5848n0578O2499J55688P6243q8579
9616G00501j38066n4440Q225l814J4713R4923J07983o366j05430o0155M0649M8365
9604F47088n503K213N1774K9541m1217k5439P5568J03896N228p8837m3484K1881
9592G42709J708n8835m7658L1575Q1985N9035N025k3138m062L3754K5063m8725
9580G98436r3338j6471R7269P3660o7504j03985M0449J47336M3935j07067o8857
9569G43863P7812P3605p9102j16504M8278J79820R3338p4579j03609j0606L3363
9558H65679j5055m7087n914L9587K7594l271J1255N8129O7218J6503k7418N09
9546I87729N8797M5308m4589q7261p692R3358P6147l5041r4592m4801L2936O0166
$$ y = [600481, 621964, 569050, 520616, 544828, 581076, 545228, 494650, 557149, 712837, 789080, 700501, 562435, 507995, 516220, 512406, 527119, 622042, 730025, 723659, 618229, 558074, 598723, 647088, 641585, 643798, 695572, 725113, 683896, 658457, 734025, 837921, 843149, 764312, 720828, 742709, 744417, 685582, 637924, 669499, 751484, 810519, 815544, 792406, 788344, 822098, 847161, 798436, 705098, 688627, 785896, 859556, 792052, 688067, 728516, 875852, 919787, 812720, 743863, 821675, 895280, 816178, 699674, 747952, 927772, 1021110, 946531, 842922, 832316, 865679, 850624, 803537, 797623, 837210, 864804, 861533, 872788, 930917, 998135, 1014638, 987220, 987729, 1046526, 1091834, 1047245, 959984, 952292, 1045650, 1121797, 1086756, 992164, 947363, 980299, 1040465]
9534A040465M1700O149k9056l1298J2186L9768m324n4759j1272P9959Q2368M623
9522A176509J930J06865J49419K9171j09828r9492M663M3736P483J725M1254M4684
9510A398119J109j3635J6116J6933l6802o7458j3418P3901R7365L7772k6350j4661
9498A468991N5096Q0845P832q1095o4391M4542J09349O4427n054j0313K1310L4128
9486A725667M9235R5840J20360O3422k8653o2285k6275J5935K6363J4726l953
9475A990382j4534j539J2676j8086p5840q0305k1868L065n0622r1735m5187K1339
9463A627746K2327l045J2094K8767n785l4004M484M0625J619l3750K4104Q1521
9451A766703P958j10449q8339M8275J05295L7898j7750j2377l2017p2965k4532
$$ y = [1040465, 1082165, 1088314, 1059258, 1027960, 1040146, 1079914, 1075590, 1020831, 1009559, 1089518, 1171886, 1176509, 1178439, 1285304, 1434723, 1463894, 1354066, 1254574, 1259237, 1302973, 1310456, 1312181, 1353435, 1398119, 1399228, 1385593, 1401709, 1418642, 1381840, 1314382, 1300964, 1374865, 1472230, 1510002, 1483652, 1468991, 1524087, 1604932, 1612764, 1531669, 1467278, 1511820, 1621169, 1685596, 1680542, 1670229, 1691539, 1725667, 1774902, 1870742, 1991102, 2054524, 2025871, 1963586, 1937311, 1953246, 1979609, 1994335, 1990382, 1975848, 1974309, 1986985, 1968899, 1893059, 1812754, 1790886, 1793951, 1743329, 1651594, 1606407, 1627746, 1650073, 1647028, 1659122, 1687889, 1682104, 1648100, 1652584, 1693209, 1694828, 1661078, 1685182, 1766703, 1774661, 1664212, 1575873, 1624148, 1729443, 1767341, 1749591, 1737214, 1705197, 1632232, 1607700]
9440A607700R0016J05154l049o6869j9826O512m9125o7453k478J0963p5589j02479
9428A433477Q042Q8151J8564n6644k609N5747j9274j03288l9665N6441J0633p0146
9416A379429J0286J44451P5361j36851j71900L6963J99504J26786k7698p4078
9406A562253m8216m4858k9636L6841P3338J8803m2715k0555L5552L3305j4003
9395A560109k8482J6676Q4160J13163N2615o8682j16869j0800J18890Q4914n7460
9384A748234o9514Q9784J77445M7676j13156q3218N9758R5640J2244j8984N9128
9373B005037J25339R6647L5799K2713M5478N3580L7942K5414L3026M3248K0347
9362B544570l2755n0482P864O7868L1093n6395n7905K2924L0305p8198j40678
$$ y = [1607700, 1697716, 1802870, 1799821, 1732952, 1713126, 1719638, 1670513, 1603060, 1600582, 1611545, 1535956, 1433477, 1441519, 1529670, 1548234, 1491590, 1488981, 1544728, 1525454, 1422166, 1382501, 1438942, 1449575, 1379429, 1389715, 1534166, 1609527, 1472676, 1300776, 1337739, 1537243, 1664029, 1636331, 1562253, 1514037, 1469179, 1439543, 1476384, 1549722, 1568525, 1525810, 1505255, 1540807, 1574112, 1560109, 1531627, 1548303, 1632463, 1745626, 1798241, 1729559, 1612690, 1601890, 1720780, 1805694, 1748234, 1678720, 1768504, 1945949, 1993625, 1880469, 1797251, 1857009, 1952649, 1964893, 1945909, 2005037, 2130376, 2227023, 2262822, 2285535, 2331013, 2384593, 2422535, 2447949, 2480975, 2524223, 2544570, 2511815, 2461333, 2469197, 2537065, 2568158, 2511763, 2453858, 2476782, 2507087, 2428889, 2288211]
9351B288211o1429J5351n0566j47463r9555L1438N4426l2520o7417j9300j9082
9340A892094j01715j45962j00723o2196p4825n1720L4149O3659k4008j02130n3252
9329A273371L7415K2665p3122j08015m6963J3500J7192R176K0882J4782k3232
9318A157651l4565J2261M5141j0334r4648p6456M7126J16864L1708r0999q0999
9307A022750K4232L7460p3363j21943j850J31930R9880l1783p8167k1762J2765
9296A000149n995l967J6743j4417o2467k4626N3885J6723j18400j37748K8813
9285G48693J65942R2084p2920j12443k4643M2472M0915K7098R253l2356m1373
9274H42722K9812Q7870J9195j03568j10456r96N8738J659n8548l4756J5603K8401
$$ y = [2288211, 2226782, 2242133, 2191567, 2044104, 1944549, 1975987, 2030413, 1997893, 1930476, 1911176, 1892094, 1790379, 1644417, 1543694, 1481498, 1406673, 1354953, 1389102, 1452761, 1428753, 1326623, 1273371, 1310786, 1333451, 1260329, 1152314, 1105351, 1118851, 1136043, 1145219, 1166101, 1180883, 1157651, 1123086, 1135347, 1180488, 1170154, 1075506, 999050, 1046176, 1163040, 1194748, 1103749, 1022750, 1046982, 1084442, 1011079, 889136, 887286, 1019216, 1119096, 1087313, 1009146, 987384, 1000149, 994154, 990187, 1006930, 992513, 930046, 905420, 959305, 976028, 857628, 719880, 748693, 914635, 1006719, 933799, 821356, 796713, 839185, 880100, 907198, 916451, 884095, 842722, 872534, 960404, 979599, 876031, 765575, 764579, 823317, 824976, 766428, 731672, 747275, 775676]
9262G75676L4237N5799L9707k9729o5230j2095M9763L1016k4459k1015L1846M8841
9250I14357J1361k1519k1418j7042k0348q802J6214K4637J7876K8343M9506L3785
9238A006950j8500l5635J8462P1074L7913m1645m6497M9006J21286O1963o4049
9227A160328r6228P121J11681Q4691l4583r3286k2893Q1594Q7277j5445j08599
9216A161658r2228j26N1780J5758l5472k2961K4093K2090l3830o8574m9428k1484
9204I51276q962K3047P2700O7102j2303o2941q420O8743N1147k5931m4310r159
9192A061989k4716q1445m9224Q4393J49680N0910p2196n8901K9191L2263l7756
9181A084188l5850N0811P1669l2423j18884n9595O8484J08275M4123j1710K170
$$ y = [775676, 809913, 865712, 905419, 875690, 810460, 798365, 848128, 879144, 854685, 833670, 865516, 914357, 925718, 904199, 882781, 865739, 845391, 836589, 852803, 877440, 895316, 923659, 973165, 1006950, 988450, 952815, 971277, 1042351, 1080264, 1038619, 992122, 1041128, 1162414, 1224377, 1160328, 1064100, 1071221, 1182902, 1267593, 1233010, 1139724, 1116831, 1198425, 1285702, 1270257, 1161658, 1069430, 1069304, 1121084, 1136842, 1101370, 1078409, 1102502, 1124592, 1090762, 1022188, 972760, 951276, 942314, 965361, 1038061, 1105163, 1092860, 1029919, 1021499, 1090242, 1141389, 1115458, 1071148, 1061989, 1037273, 955828, 906604, 990997, 1140677, 1191587, 1119391, 1060490, 1089681, 1121944, 1084188, 1048338, 1099149, 1170818, 1138395, 1019511, 959916, 1028400, 1136675, 1180798, 1169088, 1171258]
9170A171258M0258M9656K8428j2009n8820o7533n66R0243J01401K4976k6276J4371
9158A355387O3914K7658l9920k4165N2357O0640j7707n3692J4765P4730J9777
9147A533744q1107r9742m1302k700o580l450O363j5917m0096k244O3181N7998
9135A368148j2616m3574j0969k437l8461k5921N0623O2575l6366q4604L6366J70825
9123A433589J08276o8531r4769N7794J35626J3732j06906l2795J09482Q6825o0733
9112A581590q9489N5373J56860O7843p2931o8690M4237P9552q857q0837l8971
9101A625680M1624N1016J361k4124q835o644l7493n4800k0776L6398N6484J5279
9089A675170m9500p4256l7853P956J089m1833m8035p411M375m3213o6694k108
$$ y = [1171258, 1211516, 1261172, 1289600, 1277591, 1218771, 1151238, 1150672, 1240915, 1342316, 1367292, 1341016, 1355387, 1419301, 1446959, 1407039, 1382874, 1435231, 1495871, 1478164, 1424472, 1439237, 1513967, 1533744, 1452637, 1352895, 1311593, 1308893, 1302313, 1298863, 1305226, 1289309, 1249213, 1246969, 1310150, 1368148, 1355532, 1311958, 1300989, 1298552, 1260091, 1234170, 1284793, 1347368, 1311002, 1226398, 1262764, 1433589, 1541865, 1473334, 1378565, 1436359, 1571985, 1585717, 1478811, 1446016, 1555498, 1642323, 1581590, 1492101, 1547474, 1704334, 1772177, 1699246, 1630556, 1674793, 1754345, 1745488, 1664651, 1625680, 1667304, 1718320, 1719681, 1695557, 1686722, 1680078, 1642585, 1587785, 1567009, 1603407, 1659891, 1675170, 1625670, 1551414, 1513561, 1521517, 1522606, 1480773, 1432738, 1425327, 1429702, 1386489, 1319795, 1317687]
9077A317687P1300M4891m1497o0829p77L4850J0706k906J6648Q219l0531k3342
9065A344419K0408q094j02518r8484N0236J40811K1668j44590j18210M9802J17983
9054A273431L5357k8450K076J7522l4709n3750Q229M5596r727o5250l0282L7203
9042A197246M0324j2425n6761p0436n2713J339M9069K0170n9838p2170J5052Q3779
9030A082636M7350k2805k8508J0040K6200J9827J2168j2615l9770n050P4362P1757
9018A235592m9009j36084p2038L7196L8519k9427m1455j5090m0409p2208n533
9007H50054J01234R5550j2081p1483m8531m0618n1122J6617J26306J13310k8207
8996A051029r9008j2238P0632K2997m8039j7707M3432K9668l908K2366L7672l2447
$$ y = [1317687, 1388987, 1433878, 1392381, 1331552, 1330775, 1365625, 1376331, 1373425, 1390073, 1398292, 1367761, 1344419, 1364827, 1356733, 1254215, 1155731, 1205967, 1346778, 1368446, 1223856, 1105646, 1155448, 1273431, 1308788, 1280338, 1282414, 1299936, 1265227, 1211477, 1219706, 1265302, 1255575, 1190325, 1160043, 1197246, 1237570, 1225145, 1168384, 1097948, 1045235, 1046574, 1095643, 1115813, 1055975, 983805, 998857, 1082636, 1129986, 1107181, 1078673, 1088713, 1114913, 1134740, 1146908, 1134293, 1094523, 1089473, 1163835, 1235592, 1186583, 1050499, 978461, 1015657, 1054176, 1024749, 983294, 968204, 927795, 855587, 850054, 951288, 1046838, 1034757, 963274, 914743, 874125, 823003, 839620, 965926, 1079236, 1051029, 952021, 939783, 1010415, 1033412, 985373, 967666, 1011098, 1040766, 1036858, 1059224, 1096896, 1064449]
8984A064449q4054m122R6215M3991q6307p2167Q8273J60792M3833q6546o7214
8973A097143K3954L7283j4573k4299J6922L0055n421l4483l3244l5400n1219l8903
8961I67815J9009O4395L1469n4103r1471l1873N1899N9632o266o2420p0553n9942
8949H17591l5738K7265Q5754M9529n3585p2231L2485R3223k327j05897l8824R9083
8937H96328P9300p4829j20610M745R0272Q548r0582n2227L9842L8674k4558l8541
8925G56362j4174k3730m3217j4513K0155k900l0888J3644P1293L4881n2745n5455
8913F58713L2417Q2013L7987k4574n1632o8207p2912k1725N5646O1068j3743o2406
8901F12645l6016j0892l6388m7414L042M8098K8562l20K0531L7141j3370o7821
$$ y = [1064449, 980395, 976273, 1072488, 1116479, 1030172, 958005, 1046278, 1207070, 1250903, 1164357, 1097143, 1121097, 1158380, 1143807, 1119508, 1136430, 1166485, 1161064, 1126581, 1093337, 1057937, 1006718, 967815, 986824, 1051219, 1082688, 1028585, 937114, 905241, 957140, 1016772, 1010506, 948086, 877533, 817591, 781853, 809118, 894872, 944401, 890816, 818585, 851070, 944293, 941966, 836069, 797245, 896328, 975628, 900799, 780189, 784934, 875206, 883754, 793172, 740945, 780787, 819461, 794903, 756362, 742188, 718458, 675241, 660728, 680883, 677983, 647095, 660739, 732032, 766913, 714168, 658713, 691130, 773143, 811130, 786556, 734924, 666717, 593805, 572080, 627726, 688794, 675051, 612645, 576629, 565737, 529349, 481935, 484977, 533075, 561637, 561317, 581848, 618989, 605619, 537798]
8889E37798l2844M6273M8246k7334o2658j4060L1126J1473j5479J3145N5118L5877
8877F26681l0733o6330l9963N176K2033O364k2206m3471l6341R799O8956Q7343
8865E87308L8431m0892q6299p2922l0186M497K1102K2143N217j8028j3869K7700
8853D44202N9485L3387k2123l5347k292J029n8680j01886m3000P5025J23344N4766
8841E27910l7543m6005J7917N4147J1968n0652n3761l025K5284o321m9302m5304
8829C45313n260K2902L0963M3859N5774L1552k7573p0662n9078n664M8532O3462
8817D74120J9062n3022p7616k8513J8276n852m1555L776P8801N4131m5094n5766
8805C40748M2325O8680m8840j21950r201J23023N8374j08471j24798J1521P7862
$$ y = [537798, 504954, 551227, 599473, 572139, 509481, 495421, 526547, 538020, 522541, 535686, 590804, 626681, 595948, 529618, 489655, 494831, 516864, 523228, 501022, 457551, 421210, 431009, 499965, 587308, 625739, 584847, 498548, 425626, 395440, 399937, 421039, 443182, 448399, 430371, 416502, 444202, 503687, 537074, 514951, 479604, 477312, 478341, 419661, 317775, 274775, 349800, 473144, 527910, 490367, 444362, 462279, 516426, 528394, 477742, 423981, 420956, 446240, 439919, 390617, 345313, 340053, 362955, 393918, 437777, 493551, 525103, 497530, 426868, 367790, 362126, 410658, 474120, 493182, 440160, 362544, 334031, 352307, 346455, 304900, 308676, 387477, 441608, 396514, 340748, 383073, 451753, 402913, 280963, 271762, 394785, 453159, 344688, 219890, 231411, 309273]
8794C09273J0946k7664K4646L2074n5801q9828P258R2267M9140k3748j0409K7571
8782C45725K30l6854j1913J4300j6549k6932L6834O6209j4332p3483M382Q2549
8770C70166j676j19880m9096J24645J26577l9192r4101L5418J02370j9406j23760
8759C12065m7087N4971N241q0359j5547J16960J07484k9973r9179l7370L4303
8748C21509L3381n311m8434r2188q9608q99R8705R7150J3424l9722l3814l2207
8736B21986m5472k2729K3635K6693k218J2846O2066N3928j6174m4327N359M1907
8724C17500Q328l1376k0765k02k852J6293O8686O7259k7479j00398m1627O7225
8712C20592O4566m2271q8073k629R1688P3283q442l2470O301J0271n1079r0418
$$ y = [309273, 320219, 292555, 317201, 349275, 293474, 203646, 210904, 303171, 352311, 328563, 318154, 345725, 345955, 309101, 297188, 311488, 294939, 268007, 304841, 371050, 356718, 283235, 287617, 370166, 368490, 248610, 199514, 324159, 450736, 411544, 317443, 352861, 455231, 435825, 312065, 264978, 319949, 325190, 244831, 229284, 346244, 453728, 423755, 324576, 287206, 321509, 354890, 349579, 301145, 208957, 119349, 118450, 217155, 314305, 327729, 288007, 254193, 221986, 176514, 153785, 177420, 204113, 201895, 214741, 276807, 330735, 314561, 270234, 275593, 317500, 325828, 294452, 273687, 273485, 270633, 286926, 355612, 422871, 395392, 294994, 253367, 320592, 385158, 342887, 254814, 252185, 343873, 417156, 408714, 376244, 382545, 392816, 341737, 251319]
8700B51319m3847K4054K0212k7645j4535O5201R3683J2207p5476n3783L3209N7772
8688C42371o14n0576m2938j5673L319K7066M2269J8067j3079P973M5113N605q4767
8675B84136q9203J6114P9845J3610n9633r297Q5967P3525k4250o5777k9108j6700
8663B59229m9367l3479N2296R7497L4680n2060n4013J8838P7950P1270J2490n1017
8651C84314o7176k1630L3697M0772J9108K3647L2757k2577j11399j06598J8395
8640B23310J14980O1774n7584q3873j3793K4333j4146l6500K0097R0624R2702
8629D21924M1247l024k8735n2725n5732j3660L4789K7282k2681l8349P96K6995
8617C38127r81k6195Q792N7289M1704j2940j7449K9270L7884j2782l2597K3919
$$ y = [251319, 207472, 231526, 251738, 224093, 209558, 274759, 368442, 380649, 305173, 251390, 284599, 342371, 341757, 291181, 248243, 232570, 235889, 262955, 305224, 323291, 310212, 318185, 363298, 368903, 284136, 194933, 211047, 290892, 304502, 244869, 235572, 321539, 395064, 370814, 305037, 275929, 259229, 209862, 176383, 228679, 326176, 360856, 308796, 254783, 273621, 351571, 422841, 435331, 384314, 317138, 295508, 329205, 369977, 389085, 412732, 445489, 422912, 311513, 204915, 223310, 338290, 400064, 342480, 258607, 244814, 269147, 255001, 218501, 238598, 329222, 421924, 463171, 460147, 431412, 378687, 322955, 309295, 344084, 371366, 348685, 310336, 311132, 338127, 337146, 310951, 319743, 377032, 418736, 405796, 388347, 417617, 455501, 442719, 410122, 434041]
8605D34041P1864L7177j6667M82M8334K6615n0566p6335k2496L2473M1606L9247
8593E65775M2504J4513m5517p2243l1462K9597N8434N2776K2344k5159m3895J1554
8581E79221Q4140N6789o2506j13336r915J15111R4625l3659r5101l0328N2005
8570F37046N7664J8039m13J855q570k4520j1523K8688M9587K1385k0618j6934
8558G31686K5810L1132k9158p1029k4136L6525L222o2781j1475J17171J08826
8547H55793o7353j50397J7769K08448J39596q3053j43156j7569K9514p6849j07965
8536F04778M0890J47475M1738r8906m8686R5851R6756l0685p5020R398O6712L5261
8524H85562K3442O8518N3697o3179j35143m7102R7001J28679N1083k534K1783
$$ y = [434041, 505905, 543082, 526415, 526897, 575231, 601846, 551280, 474945, 452449, 484922, 526528, 565775, 608279, 622792, 577275, 505032, 473570, 503167, 561601, 614377, 636721, 611562, 567667, 579221, 663361, 720150, 657644, 544308, 534393, 649504, 744129, 710470, 615369, 585041, 637046, 694710, 712749, 712336, 714191, 705621, 681101, 669578, 698266, 747853, 769238, 748620, 731686, 757496, 788628, 759470, 688441, 664305, 700830, 704052, 641271, 629796, 746967, 855793, 788440, 638043, 655812, 864260, 1003856, 920803, 777647, 760078, 789592, 712743, 604778, 645668, 793143, 834881, 735975, 687289, 783140, 879896, 849211, 774191, 783589, 850301, 885562, 909004, 977522, 1031219, 968040, 832897, 785795, 882796, 1011475, 1062558, 1060024, 1081807]
8513A081807N2672K9652j7631l1841l303K9560K2784k7086o3000k0272P8673J26376
8501A258391O8159j0681j571O3873O2753j7898m4877N5891J63240J20059l4176
8490A683163j03205M132J58020J84871P8716k1103j3920O6083J22024J06582N1770
8479B317133J8207L2799P1685R7379J01580R9477R4478P7439N6957N4920O9048
8468C091102P6323P5510Q2491Q2360M4309q317j5534J2730n591q3497j21259o7750
8456C162877k0480o8346j34572j07220m2543p4057j71624j79390q3068m3169j27104
8445B111304j93811j20610J1203N2969j1585r7979j50542j50676q4303J3887N7430
8434A437287J6281m4753p7521j00596j00385j9659R2368P8662p7139j67483o3074
$$ y = [1081807, 1134479, 1164131, 1146500, 1114659, 1111356, 1140916, 1163700, 1136614, 1073614, 1053342, 1132015, 1258391, 1326550, 1315869, 1314298, 1378171, 1440924, 1423026, 1378149, 1434040, 1597280, 1717339, 1683163, 1579958, 1584090, 1742110, 1926981, 2005697, 1984594, 1970674, 2036757, 2158781, 2265363, 2317133, 2335340, 2368139, 2439824, 2537203, 2638783, 2738260, 2832738, 2910177, 2967134, 3022054, 3091102, 3167425, 3242935, 3325426, 3407786, 3452095, 3443778, 3428244, 3440974, 3435383, 3351886, 3230627, 3162877, 3142397, 3074051, 2939479, 2832259, 2789716, 2715659, 2544035, 2364645, 2281577, 2238408, 2111304, 1917493, 1796883, 1808086, 1861055, 1849470, 1751491, 1600949, 1450273, 1365970, 1379857, 1437287, 1453568, 1408815, 1331294, 1230698, 1130313, 1110654, 1203022, 1281684, 1204545, 1037062, 973988]
8423I73988O7671K2184j05362q7291N4778R6446j1181q1742k0105M4187L149o6828
8411H89894o5974j9806R371J5309n678o6083j05471m0619P1192P8114k4082p4935
8399F61232j9691O246o0487q1915K5015J10224L6193p5909m3641P3877Q5893j6687
8387G00350p7575m4713j2126j9105l800M2258M6404j961k7496o189L236k0217
8375E79066k9392j3291j5859l5078j4855M3208O5947K9078p198o144m371k7923
8363E63188m6462m1035m0643o1931p6187n7485j1289M7517R1037O9788k1126q9639
8351C25733m8826M7310P1407J1185k7649m915J911m5596p2181k4680L4496L6898
8339C05093J2745J4467K0003j1353n2776n2612j5308J8260K9551J8483j4028m4157
$$ y = [973988, 1041659, 1063843, 958481, 871190, 925968, 1022414, 1011233, 929491, 909386, 953573, 956722, 889894, 823920, 804114, 813485, 828794, 823116, 757033, 651562, 610943, 682135, 760249, 736167, 661232, 641541, 647787, 587300, 505385, 530400, 640624, 676817, 600908, 557267, 631144, 717037, 700350, 622775, 578062, 565936, 546831, 543031, 585289, 631693, 629732, 602236, 596047, 599283, 579066, 549674, 536383, 520524, 485446, 470591, 513799, 579746, 608824, 601626, 595482, 591111, 563188, 516726, 475691, 435048, 373117, 296930, 239445, 228156, 275673, 366710, 436498, 415372, 325733, 276907, 324217, 395624, 406809, 379160, 374245, 376156, 330560, 258379, 233699, 268195, 305093, 317838, 332305, 352308, 340955, 288179, 235567, 220259, 238519, 268070, 286553, 272525, 228368]
8327B28368l2987J5393N2485N7270M8370J9387n1568j14910q0503L0390Q0824
8316B52519J9566l5795N696N6011M060q5692p4779K3211P3508L7471M279J4585
8304B94640K998n7173q4413k2933N1381L4181n4432r4826k8328O7697Q1196P134
8292A97122n1874k6915K5836J5873m2544n7902r307K6458K562l8307n2841m9581
8280f1420k6087M1000J06929P6593l6284q9945k0729O0740N8938L4927N2749L9045
8268B36456n7353j11892j4856J07531P2211n9009q6207n664J2848n7381o7985
8257c1301J9783P3826M3640L0573O1153L0984o2020o8458M2131R4159l850j03446
8245A27174p3278N70Q061L366M5697M8737l9696r1727j6848N0612j9087j03928
$$ y = [228368, 195381, 210774, 263259, 320529, 368899, 388286, 336718, 221808, 141305, 171695, 252519, 272085, 236290, 241986, 297997, 302057, 216365, 141586, 164797, 238305, 275776, 280055, 294640, 297638, 240465, 156052, 133119, 184500, 218681, 164249, 69423, 41095, 108792, 189988, 197122, 145248, 118333, 144169, 160042, 117498, 59596, 50289, 76747, 79309, 41002, -11839, -61420, -87507, -46507, 60422, 137015, 100731, 10786, -9943, 50797, 109735, 144662, 197411, 236456, 179103, 67211, 52355, 159886, 232097, 173088, 86881, 81217, 94065, 36684, -31301, -11518, 62308, 105948, 136521, 197674, 228658, 166638, 98180, 140311, 234470, 230620, 127174, 53896, 54466, 62527, 65893, 111590, 160327, 120631, 28904, 12056, 62668, 43581, -60347]
8233f0347l7384Q9072Q1052k2457l3397M9917N9884l5010r4985n7591M073M9743
8221g430Q8637O4928n6912j39609m2428J06135P0924r4526j19783K4865Q3285
8210b1914k9593q3873M0964J36395M3678o4693m174R6812M6308o7936o1462P730
8198C8242k6618j07985n7711Q6888J24214K7750l5480m760P240m5299o1642R615
8186d5546Q0998P3472J0257n6219r0308n4239L9421Q7736L0469l3632k95N2666
8174I4780M338p3131l6587M7410O106j04428o7834R4182J18793n1013j50419l3824
8162a51627R2905M5270l9577R190P9731R179r3594m5564O4741L2407q9816q2441
8150a69196N3998J08334K2639m1656m617L1593J1641J1972M8659K3506p3998j10290
$$ y = [-60347, -97731, -8659, 72393, 49936, 16539, 66456, 126340, 91330, -3655, -61246, -57173, -7430, 81207, 146135, 89223, -50386, -92814, 13321, 84245, -10281, -130064, -105199, -21914, -51507, -135380, -94416, 41979, 85657, 20964, 16790, 113602, 159910, 91974, 30512, 38242, 11624, -96361, -154072, -67184, 57030, 84780, 49300, 44540, 51780, 6481, -55161, -45546, 35452, 108924, 119181, 62962, -27346, -81585, -42164, 45572, 76041, 42409, 42114, 94780, 99118, 25987, -10600, 36810, 42916, -61512, -129346, -35164, 83629, 32616, -117803, -151627, -58722, -13452, -53029, -43839, 35892, 45071, -48523, -94087, -29346, 3061, -86755, -169196, -115198, -6864, 15775, -25881, -30498, 1095, 12736, 24708, 73367, 96873, 22875, -87415]
8138h7415k5552O7005O8859K3725m867k8742m6921j3068M9019M4454k5331m8483
8126b7317l745O52n2136l0324Q9557J23598k0310j47753o7104J02527J28423K4501
8114A20569k7470p071l8743j06733o4979P0847J07973k436p4550L09P6151R092
8102F2959r9677p7562M1242Q6673K0074l8904j9107J8798J1766j3457j1177L628
8090a4744p998l7815l7977J2003O9168O5312j6140j06959j15597k6742P8115J07472
8078c1902N1234k2765m8946k7905j1651k9547m3084K11P3593Q4102K381p7829
8066h2108o0919J9180N8418L3957R097J0098j206k9706k2771L0697O5291M0738
8054G0766L230L048J7411L408k6512l1221m268K8428M2481K1682l2448p8739o6354
$$ y = [-87415, -112967, -45962, 22897, 46622, 41755, 13013, -33908, -46976, 2043, 46497, 21166, -27317, -31062, -30410, -82546, -112870, -23313, 100285, 79975, -67778, -134882, -32355, 96068, 120569, 93099, 86028, 47285, -59448, -124427, -53580, 54393, 51957, -22593, -22284, 53867, 62959, -36718, -114280, -73038, 13635, 33709, -5195, -24302, -5504, 6262, -7195, -18372, -14744, -22742, -60557, -98534, -86531, -17363, 47949, 31809, -75150, -190747, -217489, -139374, -31902, 19332, -3433, -52379, -80284, -91935, -121482, -164566, -164355, -90762, -6660, -4279, -82108, -143027, -123847, -65429, -31472, -22375, -12277, -13483, -43189, -65960, -35263, 30028, 70766, 73996, 77044, 94455, 97863, 71351, 40130, 35862, 64290, 106771, 128453, 96005, 17266, -49088]
8041d9088m566M1113L5375P544q147r544K778K7362L0480j2290m4582M245P8657
8028I9337M8650p2785j10627J0965J36678J07805j3339p0098m3638j6260l361
8017G3327K2513K1142m0903p4657N614J04237P2718l6620m7869L9980N4882m5572
8005A48792j05168m4623J9246M126l075N4211P0429j9703q8034k2165O8056L4497
7993A16589m8778j4900R7099R8180l1267r9561n269J10703Q4443m0974r8191k5788
7981A42286P3530P7502j1876p8841l8039N0826N4856m1950r9236j9457R8130R6438
7969C04169r968o7963j9773L1712L241n0168m4667L452K5119J0260M875K9850
7957B20139N6014M6988k692o1038p8217l3734K8174L9431m235l1123Q137O2948
$$ y = [-49088, -53654, -12541, 22834, 30378, 22231, 12687, 15465, 42827, 73307, 61017, 16435, 20680, 99337, 147987, 75202, -35425, -24460, 112218, 220023, 206684, 136586, 92948, 76688, 73327, 95840, 116982, 76079, 1422, 7036, 111273, 183991, 147371, 99502, 139482, 194364, 148792, 43624, -999, 18247, 22373, 19298, 73509, 143938, 124235, 36201, 14036, 82092, 116589, 67811, 52911, 150010, 248190, 216923, 117362, 112093, 222796, 307239, 266265, 168074, 142286, 215816, 293318, 281442, 202601, 164562, 215388, 270244, 228294, 129058, 109601, 207731, 304169, 294201, 226238, 206465, 238177, 241418, 191250, 146583, 150035, 175154, 185414, 190289, 220139, 276153, 323141, 320449, 259411, 181194, 147460, 175634, 215065, 210830, 179707, 187844, 250792]
7945B50792M6191l5888p2261N811J08506Q6367n8010j46926o4408P2279P9157
7934B71610k2050m7088N4155J21100M4706o6250p3145j2403J0263M289K8102M0761
7922C54050j9307q3028m4700M7864O4463J0205k287L2851J5088n6344o8177q88
7910B49790L6067Q427J0398O5602O3802k9265q0690r389O8045K9162o0593p6729
7898B74627l5017k2119k6938J3630P0726O1435j2098p0361o8031j8227M5366O6057
7886B79050m207j05032r3073N1649J52326P3680p5102j07488l0035J2034j6506
7875A37296k2421K4560N0994K2390j5917l6872m8046k4890N0205J02878N0279
7864B90456m8091n7716K4241O9523K4208k9602l0345j5982j9166j1004J3875O668
$$ y = [250792, 296983, 261095, 188834, 194645, 303151, 389518, 331508, 184582, 120174, 192453, 271610, 249560, 202472, 256627, 377727, 422433, 356183, 283038, 270635, 280898, 285187, 313289, 354050, 334743, 251715, 207015, 254879, 319342, 329547, 327260, 360111, 375199, 318855, 250678, 249790, 285857, 294284, 304682, 370284, 434086, 404821, 324131, 314742, 382787, 411949, 351356, 274627, 239610, 217491, 190553, 204183, 274909, 336344, 324246, 253885, 185854, 167627, 212993, 279050, 274843, 169811, 76738, 128387, 280713, 354393, 279291, 171803, 141768, 153802, 137296, 114875, 139435, 190429, 212819, 196902, 160030, 111984, 87094, 137299, 240177, 290456, 242365, 184649, 208890, 278413, 302621, 273019, 242674, 226692, 207526, 196522, 210397, 217065]
7852B17065m3874q0248o3066j2941L8297O4607L6750k0058r963Q3308J06282m6651
7840B69508k05895j35637Q1763J39838j4707j02920K1057J40024N4335r5908r6930
7829E4528r330o345n4654j9968N0580K0791n8905l1855P4148R1139N482l8466
7817G7145q551j5455p1107n5452M5204R0493K6129l3887k2087j4869m6031k1671
7805e0139Q4310J34638M5395o3958o4823j7383l3200p1052l3071L5430J8406n9408
7793g4855o5801K0164Q1447N5249R671P279J5929n867l5111m1620l9831l8991
7781a12337j0436M8179P6282L2489l3869n0895k6438j8880l2837j8842K9187N4897
7769f3500L4074J3112J9168O303n2246q7253l2308N3173O2160O161j5551O598
$$ y = [217065, 173191, 92943, 29877, 16936, 55233, 119840, 156590, 136532, 126569, 209877, 316159, 269508, 63613, -72024, 9739, 149577, 134870, 31950, 53007, 193031, 247366, 151458, 54528, 45198, 38853, -15801, -35769, 14811, 35602, -23303, -55158, 18990, 110129, 115611, 77145, 68594, 53139, -17968, -73420, -28216, 62277, 88406, 54519, 32432, 17563, -28468, -50139, 34171, 168809, 214204, 150246, 85423, 68040, 34840, -36212, -69283, -33853, -15447, -74855, -140656, -120492, -39045, 16204, 25875, 33154, 49083, 43216, 8105, -33515, -73346, -112337, -122773, -74594, 1688, 34177, 308, -50587, -77025, -95905, -128742, -147584, -118397, -63500, -29426, -16314, 2854, 9157, -43089, -130342, -162650, -109477, -47317, -41156, -56707, -50109]
7757e0109j1789o7001m3955P1766J23754K3457r2305p2415J5905K6460j2222K0843
7745f7611Q8188M9277p2243j06733k4317K4573j5959k1152N9837Q8830j2612j03217
7733a13139n3474L7193J9579n4704m4978K9470M7009J0753J8802N5689J6202p5369
7721a06967p0545N0795J18711L0897q5871o9640M2808R4665M1541k4015m2816
7710b0437n1445o5582k7165P1161J11202P593j21131q7144P0815J04229p2004
7699g9908k11661q8775J45508J81583J9512o3150K2171N9888n9516j34206r826
7688b18380J34007P5834q5094j09356o83N4087J6474M686M0595L8348K989R688
7676c6805K2195m3009j11411m7150P8058O8808n7344r1557J336L4768m0342m0224
$$ y = [-50109, -61898, -128899, -172854, -101088, 22666, 46123, -46182, -118597, -102692, -76232, -88454, -67611, 20577, 69854, -2389, -109122, -133439, -108866, -124825, -145977, -86140, 2690, -9922, -113139, -166613, -129420, -109841, -164545, -209523, -180053, -133044, -122291, -103489, -47800, -31598, -106967, -177512, -126717, -8006, 22891, -62980, -132620, -89812, 4853, 46394, 22379, -20437, -71882, -137464, -164629, -93468, 17734, 25327, -95804, -182948, -112133, -7904, -79908, -291569, -380344, -234836, -53253, -33741, -96891, -74720, -14832, -74348, -208554, -218380, -84373, -8539, -93633, -202989, -203672, -149585, -133111, -128425, -87830, -49482, -46493, -36805, -14610, -57619, -169030, -216180, -138122, -69314, -126658, -218215, -216879, -182111, -222453, -262677]
7664b62677R3777J50682J1769j26395p7574L9043M2787Q12M8214R6103l076j44790
7652a31325j16354M2705J05302K5040l1958J893J6794l1528m5439O989K5937k0927
7640a52871k7873M9830R9635L7143n8686q1580m7199k4326j9319o062J1097K5891
7628a94320M9583O1097J7074n5409o6337P32N4213L6501L3o632k1081o6958p4093
7615b65597R522J05215J03010J9047m1723m1506l4440n4029o2590k0465N3198
7604b30358J02807R0434K6840l5608n1728l2451k2470k9435j8538J5656K9297
7593a55554L750j8507o424P184j1019l0508q081L6947N2667L0117P39j6105k0440
7580a35234j1587J219m421k3163j4441K7638M4194K174l4955K204O8097N9725
$$ y = [-262677, -168900, -18218, -6449, -132844, -210418, -171375, -128588, -127776, -79562, 16541, 13465, -131325, -247679, -204974, -99672, -74632, -106590, -104697, -87903, -119431, -164870, -157881, -131944, -152871, -180744, -130914, -31279, 5864, -52822, -134402, -181601, -205927, -225246, -231308, -220211, -194320, -144737, -83640, -66566, -121975, -188312, -187580, -133367, -96866, -96833, -103465, -124546, -191504, -265597, -256075, -150860, -47850, -28803, -70526, -112032, -146472, -200501, -263091, -283556, -230358, -127551, -37117, -10277, -45885, -97613, -130064, -152534, -181969, -200507, -184851, -155554, -151804, -170311, -176735, -169551, -180570, -211078, -219159, -182212, -129545, -99428, -98689, -114794, -135234, -146821, -145602, -150023, -173186, -187627, -159989, -115795, -113621, -148576, -146372, -78275, -18550]
7568a8550k4341p6507l6133L5205N6465K6655j2644m5115o4011m4694J3416N8439
7556a31815N2060K7675K7090J8718m2851j01875n2371Q2103J32944J2957j36950
7545a12315j26995J9868J10152N5586l2725m0432j423M054j5396j2723J955M569
7533a45825K1143O1392O2054r171o8521m1565N219j5485m3395J6025Q2392J0028
7521f5709j29968j14487O8425J67789N1980r4402p4690L4138N8244N701j7653
7510a10632k3226o8841q6543Q926J20242Q6581m8492r3094l490P3840N1020L54
7498i3355r474o792j5219o287J5696R940m247K5343N8975J0037q3155q9858l956
7485a92352M2314P634L27N9287O9280k3484r6435n8840l327k2667l6941M3325
$$ y = [-18550, -42891, -119398, -155531, -120326, -63861, -37206, -49850, -94965, -158976, -203670, -190254, -131815, -79755, -52080, -24990, -6272, -49123, -150998, -203369, -121266, 11678, 24635, -112315, -239310, -219442, -109290, -53704, -86429, -126861, -128284, -124230, -139626, -152349, -150394, -145825, -124682, -63290, -1236, -10407, -78928, -120493, -115274, -130759, -174154, -158129, -75737, -65709, -195677, -310164, -241739, -73950, -21970, -116372, -191062, -156924, -98680, -92979, -110632, -133858, -202699, -289242, -280316, -160074, -73493, -121985, -215079, -218569, -144729, -93709, -93355, -102829, -109621, -124840, -131127, -115431, -105491, -109738, -84395, -25420, -15383, -98538, -188396, -192352, -150038, -142404, -142077, -82790, -13510, -36994, -133429, -192269, -195596, -218263, -255204, -211879]
7473b11879J22418O5695o3649r6872j7851M5676L8105J4057n431m8505p7605j7349
7461b53190R5423J30904N4061l1186m5617k5260k1883k3110j0945p439k0185j6514
7449a74941J3121L0694J7046K066N338N516q452j1163R516K3727L884l7296o6280
7436a87224n9276j6036K8933K6710j9012l5343K0911Q5568P4605J2244j2182J3332
7424f6770K0993j1838l7546l5904l5404l2493P781N9740N1143j2307m2377j1432
7412a46414R767j2939k1807Q890J3945l5114n8728m278N2595L1846j8938j3988
7400a95163K9937M3207K4043R821p608l8156l0266M1563Q9244K9688o5079o6447
7388a35216Q126L4214p883j7365L4072N3153k944n3204m1422k5560n2311o0910
$$ y = [-211879, -89461, -23766, -87415, -184287, -202138, -156462, -118357, -104300, -109731, -158236, -235841, -253190, -157767, -26863, 27198, -3988, -49605, -74865, -96748, -119858, -130803, -138242, -158427, -174941, -161820, -131126, -114080, -112014, -106676, -101160, -109612, -120775, -111259, -87532, -83648, -120944, -187224, -246500, -262536, -233603, -206893, -225905, -261248, -240337, -154769, -80164, -67920, -80102, -66770, -45777, -57615, -95161, -131065, -166469, -198962, -191181, -131441, -80298, -92605, -134982, -146414, -136647, -149586, -171393, -162503, -148558, -183672, -242400, -246678, -194083, -162237, -181175, -195163, -165226, -122019, -97976, -88155, -95763, -133919, -164185, -122622, -33378, -3690, -68769, -135216, -127090, -92876, -100759, -118124, -84052, -30899, -33843, -87047, -128469, -154029, -206340, -267250]
7376b67250L172P3985O0881p803l2293P606L7260P238m3796n1905q212L7687M0093
7363a43337J3019P940K9113J5399n1830q1164j633Q6757K9751j24802j54613J2283
7351c63117J74341J49663K8000r403K0912j6376j03778r7314R907O6196J6101
7340a24868k4178J0107K6192l0993n6957K2013Q8880J6232j05951r3582M6040
7329b27065J26057N7306m8467o9447k5677O496J8012L7879N6485M4898P602l0918
7317d6839n8153o1771k5834L0339N0551J4131k6491j7314K1019K8863o613m3393
7305a41505m5778j6399K1004L9594K2493j4105k5794M178L3260J7461j9801k0970
7293a46362J7155L9617J6096k4459m9567o0985n8726j9459N4224J03478P6780
$$ y = [-267250, -264078, -190093, -129212, -137015, -169308, -161702, -124442, -117204, -161000, -212905, -221117, -183430, -143337, -130318, -122378, -93265, -77866, -129696, -210860, -212493, -125736, -95985, -220787, -375400, -363117, -188776, -39113, -11113, -20516, 396, -15980, -119758, -217072, -207165, -140969, -124868, -149046, -138939, -112747, -143740, -200697, -178684, -89804, -73572, -179523, -273105, -227065, -101008, -43702, -92169, -161616, -187293, -180797, -162785, -124906, -68421, -23523, -15921, -46839, -104992, -166763, -192597, -162258, -111707, -97576, -124067, -141381, -120362, -91499, -98112, -141505, -187283, -203682, -182678, -143084, -120591, -134696, -160490, -156312, -123052, -105591, -125392, -146362, -129207, -89590, -73494, -97953, -147520, -208505, -267231, -286690, -232466, -128988, -52208]
7282e2208L53n5998o4671m8557k0642K6787P0099N4570k3079q1162m8771L5009
7270b08270O9848K5667l1864m3320j9224J0709M3282O2978K5938n9155r4679j9968
$$ y = [-52208, -51855, -107853, -172524, -221081, -241723, -214936, -144837, -90267, -113346, -194508, -243279, -208270, -138422, -112755, -144619, -187939, -207163, -196454, -153172, -90194, -64256, -123411, -218090, -238058]
$$ [...]
##END NTUPLES=NMR SPECTRUM
##END=
