##TITLE=1H ikalashn
K-533
9.12.2024
##JCAMPDX= 6.0         $$ Bruker NMR JCAMP-DX V2.0
##DATA TYPE= NMR SPECTRUM
##DATA CLASS= NTUPLES
##ORIGIN= UXNMR, Bruker Analytische Messtechnik GmbH
##OWNER= root
$$ TOPSPIN		Version 1.3
$$ 2024-12-09 15:00:56.515 +0400  Irina@DPX200
$$ Compression mode = diff/dup
##.OBSERVE FREQUENCY= 200.131300845
##.OBSERVE NUCLEUS= ^1H
##.ACQUISITION MODE= SIMULTANEOUS
##.ACQUISITION SCHEME= undefined
##.AVERAGES= 64
##.DIGITISER RES= 18
##SPECTROMETER/DATA SYSTEM= spect
##.PULSE SEQUENCE= zg
##.SOLVENT NAME= DMSO
##.SHIFT REFERENCE= INTERNAL, DMSO, 1, 17.49637
##AUDIT TRAIL= $$ (NUMBER, WHEN, WHO, WHERE, WHAT)
$$ ##TITLE= Audit trail, TOPSPIN		Version 1.3
$$ ##JCAMPDX= 5.01
$$ ##ORIGIN= Bruker BioSpin GmbH
$$ ##OWNER= Irina
$$ $$ F:/spectra/data/iren/nmr/1H/4/pdata/1/auditp.txt
$$ ##AUDIT TRAIL=  $$ (NUMBER, WHEN, WHO, WHERE, VERSION, WHAT)
(   1,<2024-12-09 15:00:21.140 +0400>,<Irina>,<DPX200>,<TOPSPIN 1.3>,
      <created by zg
	started at 2024-12-09 14:56:08.250 +0400,
	POWCHK disabled, PULCHK disabled
       configuration hash MD5:
       BE 6D 3F 07 2A EA 11 49 91 17 2B D3 AF B3 58 0D
       data hash MD5: 16K
       9B C8 57 59 CC 62 FB 07 80 02 B0 71 96 48 7E E6>)
(   2,<2024-12-09 15:00:31.546 +0400>,<Irina>,<DPX200>,<TOPSPIN 1.3>,
      <Start of raw data processing
       efp BC_mod = 2 LB = 0.02 FT_mod = 6 PKNL = 1 PHC0 = 105.4564 PHC1 = 5.746067 SI = 32K 
       data hash MD5: 32K
       C5 04 6F 7B 3F D9 98 50 07 54 9B 6D E2 5A DD 06>)
(   3,<2024-12-09 15:00:33.765 +0400>,<Irina>,<DPX200>,<TOPSPIN 1.3>,
      <apk 
       data hash MD5: 32K
       E7 D8 58 22 6F BC 7E EA 94 78 91 6A 0E 34 E8 25>)
(   4,<2024-12-09 15:00:44.812 +0400>,<Irina>,<DPX200>,<TOPSPIN 1.3>,
      <pk fgphup PHC0 = 3.020313 PHC1 = -5.6 
       data hash MD5: 32K
       67 D4 17 CF 48 9B 0B 93 4F 95 26 EF E2 1B A8 DD>)
(   5,<2024-12-09 15:00:46.593 +0400>,<Irina>,<DPX200>,<TOPSPIN 1.3>,
      <abs n ABSG = 5 
       data hash MD5: 32K
       8E 3C A8 7C 6E F0 8F 39 A8 2A 74 CD 14 5B B9 30>)
$$ ##END=
$$ 
$$ $$ hash MD5
$$ $$ 87 B0 12 67 AA 17 77 CC F1 0C 2B F8 D7 16 A9 A4
##$RELAX= 
##$RELAX= 
##$RELAX= 
##$RELAX= 
##$RELAX= 
##$RELAX= 
##$RELAX= 
##$RELAX= 
##$RELAX= 
$$ Bruker specific parameters
$$ --------------------------
##$DU= <F:/spectra>
##$EXPNO= 4
##$NAME= <1H>
##$PROCNO= 1
##$TYPE= <nmr>
##$USER= <iren>
##$AMP= (0..31)
100 100 100 100 100 100 100 100 100 100 100 100 100 100 100 100 100 100 
100 100 100 100 100 100 100 100 100 100 100 100 100 100 
##$ANAVPT= -1
##$AQSEQ= 0
##$AQ_mod= 1
##$AUNM= <au_zg>
##$AUTOPOS= <>
##$BF1= 200.13
##$BF2= 200.13
##$BF3= 200.13
##$BF4= 200.13
##$BF5= 200.13
##$BF6= 200.13
##$BF7= 200.13
##$BF8= 200.13
##$BYTORDA= 1
##$CFDGTYP= 0
##$CFRGTYP= 5
##$CHEMSTR= <none>
##$CNST= (0..63)
1 1 145 1 1 1 1 1 1 1 1 1 1 1 1 1 1 1 1 1 1 1 1 1 1 1 1 1 1 1 1 1 1 1 
1 1 1 1 1 1 1 1 1 1 1 1 1 1 1 1 1 1 1 1 1 1 1 1 1 1 1 1 1 1 
##$CPDPRG= <>
##$CPDPRG1= <>
##$CPDPRG2= <>
##$CPDPRG3= <>
##$CPDPRG4= <mlev>
$$ [...]
##$SW_h= 4401.40845070422
##$TD= 16384
##$TD0= 1
##$TE= 300
##$TE2= 300
##$TE3= 300
##$TEG= 300
##$TL= (0..7)
0 120 120 120 120 120 120 120 
##$TP= (0..7)
150 150 150 150 150 150 150 150 
##$TP07= 0
##$TPNAME0= <>
##$TPNAME1= <>
##$TPNAME2= <>
##$TPNAME3= <>
##$TPNAME4= <>
##$TPNAME5= <>
##$TPNAME6= <>
##$TPNAME7= <>
##$TPOAL= (0..7)
0.5 0.5 0.5 0.5 0.5 0.5 0.5 0.5 
##$TPOFFS= (0..7)
0 0 0 0 0 0 0 0 
##$TUNHIN= 0
##$TUNHOUT= 0
##$TUNXOUT= 0
##$USERA1= <user>
##$USERA2= <user>
##$USERA3= <user>
##$USERA4= <user>
##$USERA5= <user>
##$V9= 5
##$VALIST= <valist>
##$VCLIST= <CCCCCCCCCCCCCCC>
##$VD= 0
##$VDLIST= <DDDDDDDDDDDDDDD>
##$VPLIST= <PPPPPPPPPPPPPPP>
##$VTLIST= <TTTTTTTTTTTTTTT>
##$WBST= 1024
##$WBSW= 25
##$XGAIN= (0..3)
0 0 0 0 
##$XL= 0
##$YL= 0
##$YMAX_a= 4767098
##$YMIN_a= -4104723
##$ZGOPTNS= <>
##$ZL1= 120
##$ZL2= 120
##$ZL3= 120
##$ZL4= 120
##$ABSF1= 17.49637
##$ABSF2= -4.496376
##$ABSG= 5
##$ABSL= 3
##$ALPHA= 0
##$AQORDER= 0
##$ASSFAC= 0
##$ASSFACI= 0
##$ASSFACX= 0
##$ASSWID= 0
##$AUNMP= <proc_1d>
##$AXLEFT= 0
##$AXRIGHT= 0
##$AXTYPE= 0
##$AXUNIT= <>
##$AZFE= 0.1
##$AZFW= 0.1
##$BCFW= 0
##$BC_mod= 2
##$BYTORDP= 0
##$COROFFS= 0
##$CY= 7568.61572265625
##$DATMOD= 1
##$DC= 0
##$DFILT= <>
##$DTYPP= 0
##$F1P= 17.9538593292236
##$F2P= -4.03888763876832
##$FCOR= 0.5
##$FTSIZE= 32768
##$FT_mod= 6
##$GAMMA= 0
##$GB= 0
##$INTBC= 0
##$INTSCL= 5.656564e-011
##$ISEN= 128
##$LB= 0.02
##$LEV0= 0
##$LPBIN= 0
##$MAXI= 945.577
##$MC2= 0
##$MEAN= 0
##$ME_mod= 0
##$MI= -402.1523
##$NCOEF= 0
##$NC_proc= -2
##$NLEV= 6
##$NOISF1= 8.587773
##$NOISF2= 6.764455
##$NSP= 0
##$NTH_PI= 0
##$NZP= 0
##$OFFSET= 17.49637
##$PC= 1
##$PHC0= 122.5235
##$PHC1= -3.669699
##$PH_mod= 1
##$PKNL= yes
##$PPARMOD= 0
##$PPDIAG= 0
##$PPIPTYP= 0
##$PPMPNUM= 100
##$PPRESOL= 1
##$PSCAL= 0
##$PSIGN= 0
##$REVERSE= no
##$SF= 200.13
##$SI= 32768
##$SIGF1= 16.12182
##$SIGF2= -4.496377
##$SINO= 3.521527
##$SIOLD= 32768
##$SREGLST= <1H.CDCl3>
##$SSB= 0
##$STSI= 32768
##$STSR= 0
##$SW_p= 4401.40845070422
##$SYMM= 0
##$S_DEV= 0
##$TDeff= 16384
##$TDoff= 0
##$TI= <>
##$TILT= no
##$TM1= 0
##$TM2= 0
##$TOPLEV= 0
##$USERP1= <user>
##$USERP2= <user>
##$USERP3= <user>
##$USERP4= <user>
##$USERP5= <user>
##$WDW= 1
##$XDIM= 32768
##$YMAX_p= 453562733
##$YMIN_p= -144976
$$ End of Bruker specific parameters
$$ ---------------------------------
##NTUPLES= NMR SPECTRUM
##VAR_NAME=  FREQUENCY,     SPECTRUM/REAL,   SPECTRUM/IMAG
##SYMBOL=    X,             R,               I
##VAR_TYPE=  INDEPENDENT,   DEPENDENT,       DEPENDENT
##VAR_FORM=  AFFN,          ASDF,            ASDF
##VAR_DIM=   32768,         32768,           32768
##UNITS=     HZ,            ARBITRARY UNITS, ARBITRARY UNITS
##FACTOR=    0.134324425510551, 1,           1
##FIRST=     4401.40845070422, -42562,       -425705
##LAST=      0,             -116955,         -459990
##MIN=       0,             -144976,         0
##MAX=       4401.40845070422, 453562733,    0
$$ Real data points
##PAGE= N=1
##DATA TABLE= (X++(R..R)), XYDATA
$$ [...]
$$ plain form
14948 -54816 -43607 20671 68676 42430 -32227 -72295 -42351 1866 -3416 -40386 -46011 -11405
14936 -11405 13300 4758 -6527 -3902 -15658 -52209 -70307 -41026 -5175 -10247 -31918 -19120
14924 -19120 12511 4869 -37418 -45162 2315 38723 15256 -23718 -15243 26016 43238 29957
14912 29957 23022 26626 11441 -16424 -11571 35143 73556 65575 32304 9052 -1732 -6603 5928
14899 5928 33297 37648 -168 -35467 -18022 25832 25690 -26242 -60439 -31374 20767 34028
14887 34028 7459 -13856 -8240 5636 9554 10650 23090 43948 53847 37374 3530 -16794
14875 -16794 -3804 22954 26143 753 -19534 -11354 8777 15975 11934 9477 5572 -6265 -15924
14862 -15924 -15429 -21045 -47279 -72501 -64150 -30294 -10316 -15540 -15891 7202 28849 18120 -16807
$$ packed form
14948e4816J1209O4278M8005k6246p4657m0068K9944M4217n282l6970n625L4606
14936a1405K4705q542j1285K625j1756l6551j8098K9281L5851n072k1671J2798
14924a9120L1631p642m2287p744M7477L6408k3467l8974Q475M1259J7222j3281
14912B9957o935L604j5185k7865M853M6714L8413p981l3271k3252j0784m871J2531
14899E928K7369M351l7816l5299J7445M3854j42n1932l4197K9065N2141J3261
14887C4028k6569k1315N616J3876L918J096J2440K0858R899j6473l3844k0324
14875a6794J2990K6758L189k5390k0287Q180K0131P198m041k457l905j1837r659
14862a5924M95n616k6234k5222Q351L3856J9978n224l51K3093K1647j0729l4927
$$ plain form
14849 -16807 -39752 -29200 3570 30061 30549 11752 -236 6858 12120 -7202 -33018 -24246 21715
14836 21715 58565 53101 26743 17083 25293 26252 10917 -8569 -23849 -34818 -35602 -18710 7887
14823 7887 23722 15847 -11501 -40074 -44035 -8524 44808 66612 33788 -17032 -31488 -3572
14811 -3572 24318 21873 4368 2625 22895 46242 53093 38974 14135 -6027 -13658 -12912 -10318
14798 -10318 -6156 -481 414 -7634 -18560 -25070 -28243 -29988 -26373 -18806 -19109 -29767 -32659 -14603
14784 -14603 8881 14991 5675 -4062 -15086 -32315 -36835 -6759 38591 54345 32527 10937
14772 10937 13512 22226 21760 30297 60274 83062 65981 21588 -11909 -22115 -22901 -17574 3182
14759 3182 30741 39040 21097 267 -3203 2288 -1636 -13102 -13387 2927 15583 5078 -14904
$$ packed form
14849a6807k2945J0552L2770K6491M88j8797j1988P094N262j9322k5816Q772M5961
14836B1715L6850n464k6358r660Q210R59j5335j9486j5280j0969p84J6892K6597
14823G887J5835p875k7348k8573l961L5511N3332K1804l2824n0820j4456K7916
14811c572K7890k445j7505j743K0270K3347O851j4119k4839k0162p631P46K594
14798a0318M162N675Q95q048j0926o510l173j745L615P567l03j0658k892J8056
14784a4603K3484O110r316r737j1024j7229m520L0076M5350J5754k1818k1590
14772A0937K575Q714m66Q537K9977K2788j7081m4393l3497j0206p86N327K0756
14759C182K7559Q299j7943k0830l470N491l924j1466k85J6314J2656j0505j9982
$$ plain form
14746 -14904 -8703 31199 63755 48566 2239 -22733 -8995 10188 8499 833 6545 15200 11333
14733 11333 2319 -4019 -20789 -51771 -67018 -43517 -7314 3491 -1719 12614 41371 43227
14721 43227 9789 -18986 -17252 -7594 -17048 -34985 -35410 -15101 9301 23645 22899 12292 9244
14708 9244 25364 42240 28645 -12819 -43059 -38695 -18474 -6288 1247 12494 15580 41
14696 41 -19098 -23990 -21798 -25288 -23881 -2187 26039 31545 9903 -16738 -31086 -30290 -12903 15892
14682 15892 31127 10996 -25285 -32462 -250 27781 10781 -35317 -59205 -36317 10073 43622
14670 43622 51703 45172 35859 24180 6404 -12845 -19936 -5863 20490 36859 29603 10419 4543
14657 4543 18723 29003 12052 -16377 -15159 24444 58889 49032 16017 9916 34412 42202 8121
$$ packed form
14746a4904O201L9902L2556j5189m6327k4972J3738J9183j689p666N712Q655l867
14733A1333r014o338j6770l0982j5247K3501L6203J0805n210J4333K8757J856
14721D3227l3438k8775J734R658r454j7937m25K0309K4402J4344p46j0607l048
14708I244J6120J6876j3595m1464l0240M364K0221J2186P535J1247L086j5539
14696D1j9139m892K192l490J407K1694K8226N506k1642k6641j4348P96J7387K8795
14682A5892J5235k0131l6281p177L2212K8031j7000m6098k3888K2888M6390L3549
14670D3622Q081o531r313j1679j7776j9249p091J4073K6353J6369p256j9184n876
14657D543J4180J0280j6951k8429J218L9603L4445r857l3015o101K4496P790l4081
$$ plain form
14644 8121 -33129 -38717 -13775 8594 17969 27311 38249 36111 16133 -7253 -16464 -3114 28791
14631 28791 58628 57937 20299 -24874 -43618 -34230 -18221 -6757 3289 9460 4426 -6999 -13319
14618 -13319 -16113 -23028 -24378 -2380 34201 51172 34348 11490 13857 32739 34508 11777 -2948
14605 -2948 18084 55410 63383 31385 342 5468 25951 19915 -7757 -15246 3735 10119 -6668
14592 -6668 -2685 42620 77289 53020 4641 -6116 9959 -2532 -38559 -35621 19534 63914
14580 63914 52949 16136 -2629 -1130 8573 28091 45450 31072 -8945 -23610 7217 35414
14568 35414 18647 -15014 -18926 -1225 3175 -1636 10510 29827 24304 -1724 -11532 7871 33704
14555 33704 45714 42279 25545 1503 -13024 -10062 -5874 -13622 -18872 -6867 9395 16068 24864
$$ packed form
14644H121m1250n588K4942K2369R375R342J0938k138j9978k3386r211J3350L1905
14631B8791K9837o91l7638m5173j8744R388J6009J1464J0046O171n034j1425o320
14618a3319k794o915j350K1998L6581J6971j6824k2858K367J8882J769k2731j4725
14605b948K1032L7326P973l1998l1043N126K0483o036k7672p489J8981O384j6787
14592f668L983M5305L4669k4269m8379j0757J6075j2491l6027K938N5155M4380
14580F3914j0965l6813j8765J499R703J9518J7359j4378m0017j4665L0827K8197
14568C5414j6767l3661l912J7701M400m811J2146J9317n523k6028r808J9403K5833
14555C3704J2010l435j6734k4042j4527K962M188p748n250J2005J6262O673Q796
$$ plain form
14542 24864 39936 32458 -9399 -40394 -20740 14652 11947 -7681 13556 59176 55843 -806
14530 -806 -30523 5787 53382 64419 64777 78361 67159 7039 -44467 -26923 26900 45592
14518 45592 29197 27883 40435 20274 -25188 -27871 31171 79603 57040 3075 -6673 25432
14506 25432 28997 -20467 -58156 -22854 50173 73715 28443 -15051 -1692 35032 38168 18754
14494 18754 26735 59182 65969 39328 26459 42853 42957 3289 -29223 -11455 26442 32252 10636
14481 10636 2848 20347 45207 69137 87340 78752 37398 1094 5347 30359 36585 27407 27253
14468 27253 22939 -12943 -55790 -51210 -1399 31789 16339 -12936 -17870 -5346 4938 15523
14456 15523 31914 43923 47465 57126 79226 95004 85153 54080 21901 6698 14465 31066
$$ packed form
14542B4864J5072p478m1857l0995J9654L5392k705j9628K1237M5620l333n6649
14530h06k9717L6310M7595J1037L58J3584j1202o0120n1506J7544N3823J8692
14518D5592j6395j314J2552k0161m5462k683N9042M8432k2563n3965r748L2105
14506B5432L565m9464l7689L5302P3027K3542m5272m3494J3359L6724L136j9414
14494A8754P981L2447O787k6641j2869J6394J04l9668l2512J7768L7897N810k1616
14481A0636p788J7499K4860K3930J8203q588m1354l6304M253K5012O226r178j54
14468B7253m314l5882m2847M580M9811L3188j5450k9275m934J2524J0284J0585
14456A5523J6391J2009L542R661K2100J5778r851l1073l2179j5203P767J6601
$$ plain form
14444 31066 30766 10575 1900 23966 46124 31425 -2585 -11450 4383 7773 -5275 -1680 24602
14431 24602 42307 40614 41445 48739 41693 24936 27304 43423 37892 14832 14652 31625 14166
14418 14166 -32877 -34661 28488 72233 38369 -11742 -3260 30819 19793 -17205 -10852 34669
14406 34669 55648 40262 32934 42039 31383 86 -8414 19390 50278 62017 58592 35120
14394 35120 -10370 -39434 -12859 40376 59452 44800 42539 50353 25940 -15869 -12424 30143
14382 30143 31571 -24559 -49570 8026 73813 64038 10485 -5069 22744 42117 44284 63722
14370 63722 102752 125458 115140 85671 49976 21286 26159 70729 111230 101558 55237 21996
14358 21996 20779 33564 44836 47189 28372 -5554 -14956 21805 62865 57356 25003 24514 56104
$$ packed form
14444C1066l00k0191q675K2066K2158j4699l4010q865J5833L390j3048L595K6282
14431B4602J7705j693Q31P294p046j6757K368J6119n531k3060j80J6973j7459
14418A4166m7043j784O3149M3745l3864n0111Q482L4079j1026l6998O353M5521
14406C4669K0979j5386p328R105j0656l1297q500K7804L0888J1739l425k3472
14394C5120m5490k9064K6575N3235J9076j4652k261P814k4413m1809L445M2567
14382C0143J428n6130k5011N7596O5787r775n3553j5554K7813J9373K167J9438
14370F3722L9030K2706j0318k9469l5695k8690M873M4570M0501r672m6321l3241
14358B1996j217J2785J1272K353j8817l3926r402L6761M1060n509l2353m89L1590
$$ plain form
14345 56104 61012 21083 -6365 24217 75705 79026 24936 -28296 -27946 16170 49567 38353
14333 38353 7357 4230 32829 49578 31900 13548 28797 56724 57714 37749 32163 44046
14321 44046 45449 29584 16500 11634 1238 -12427 -10647 6890 21625 28213 34334 35559 25907
14308 25907 22854 40554 50037 16339 -32222 -30265 26476 69496 56817 25200 20917 32747
14296 32747 26451 3363 -10239 -3019 18875 44192 53492 31874 -274 -873 35120 65193 62265
14283 62265 49270 51572 55355 40031 17199 9302 17192 30495 42385 39586 12899 -9567 15540
14270 15540 74497 98233 60637 17909 17086 28190 14765 9042 51225 104465 105002 61079 28725
14257 28725 19461 7199 370 25914 58867 50898 19252 23386 57954 58657 19496 8876 48048
$$ packed form
14345E6104M908l9929k7448L0582N1488L321n4090n3232L50M4116L3397j1214
14333C8353l0996l127K8599J6749j7678j8352J5249K7927R90j9965n586J1883
14321D4046J403j5865j3084m866j0396j3665J780J7537J4735O588O121J225r652
14308B5907l053J7700R483l3698m8561J957N6741M3020j2679l1617m283J1830
14296C2747o296k3088j3602P220K1894K5317R300k1618l2148n99L5993L0073k928
14283F2265j2995K302L783j5324k2832p897P890J3303J1890k799k6687k2466K5107
14270A5540N8957K3736l7596m2728q23J1104j3425n723M2183N3240N37m3923l2354
14257B8725r264j2262o829K5544L2953p969l1646M134L4568P03l9161j0620L9172
$$ plain form
14244 48048 68991 33543 6599 51976 125572 140362 88516 32665 11332 15997 37010 71250
14232 71250 95728 84846 49777 22890 11569 2024 -3603 6765 19926 9311 -16885 -17453
14220 -17453 22365 64121 65900 38889 32548 67951 105742 92894 33181 -12254 -2846 29505
14208 29505 31712 8784 9080 42197 65392 56771 46363 55209 57116 33188 17079 42449 80697
14195 80697 78959 37674 5206 9328 34071 54793 60574 48493 25761 12258 19003 34124
14183 34124 45915 58341 65640 44379 248 -14055 29281 76698 62534 8657 -7553 31113
14171 31113 65988 59625 40588 40726 49336 49095 45782 41522 24122 2572 9527 48454 80091
14158 80091 81346 75257 81068 79081 53250 27729 28863 45756 58941 72721 87140 75797 31991
$$ packed form
14244D8048K0943l5448k6944M5377P3596J4790n1846n5851k1333M665K1013L4240
14232G1250K4478j0882l5069k6887j1321r545n627J0368J3161j0615k6196n68
14220a7453L9818M1756J779k7011o341L5403L7791j2848n9713m5435R408L2351
14208B9505K207k2928K96L3117K3195q621j0408Q846J907k3928j6109K5370L8248
14195H0697j738m1285l2468M122K4743K0722N781j2081k2732j3503O745J5121
14183C4124J1791J2426P299k1261m4131j4303M3336M7417j4164n3877j6210L8666
14171C1113L4875o363j9037J38Q610k41l313m260j7400k1550O955L8927L1637
14158H0091J255o089N811j987k5831k5521J134J6893J3185J3780J4419j1343m3806
$$ plain form
14145 31991 3378 33295 92002 114716 90072 61301 51981 43880 27706 23933 40536 51896
14133 51896 39188 21155 24378 45296 62075 67778 69395 62214 30786 -16966 -36238 10088
14121 10088 94855 142883 119567 76870 81055 118318 120572 73174 33743 35855 42791 25328
14109 25328 17084 43660 58286 16225 -33604 -12654 60097 91785 55545 18932 27404 46103
14097 46103 40301 33790 49701 60841 44389 30441 47667 67228 51326 19075 12602 29110
14085 29110 37945 38883 51348 66579 62676 51428 59235 75466 72221 62335 78579 102829 84047
14072 84047 32521 23538 82688 135784 114783 55672 35121 53639 50141 10675 -9310 25658
14060 25658 79568 99997 79684 43442 11437 -1549 17453 56635 77310 61654 40807 47214
$$ packed form
14145C1991k8613K9917N8707K2714k4644k8771r320q101j6174l773J6603J1360
14133E1896j2708j8033L223K0918J6779N703J617p181l1428m7752j9272M6326
14121A0088Q4767M8028k3316m2697M185L7263K254m7398l9431K112O936j7463
14109B5328q244K6576J4626m2061m9829K0950P2751L1688l6240l6613Q472J8699
14097D6103n802o511J5911J1140j6452j3948J7226J9561j5902l2251o473J6508
14085B9110Q835R38J2465J5231l903j1248P807J6231l245r886J6244K4250j8782
14072H4047n1526q983N9150N3096k1001n9111k0551J8518l498l9466j9985L4968
14060B5658N3910K0429k0313l6242l2005j2986J9002L9182K0675j5656k0847O407
$$ plain form
14048 47214 61873 47326 16610 20279 65354 98319 84685 59507 69375 101601 111455 94917
14036 94917 87113 97560 94768 62110 28795 27675 50504 65161 58297 42226 32789 37363 56056
14023 56056 80097 93989 89689 74705 60059 46818 30653 12727 -156 -1004 14141 40450
14011 40450 60837 60666 48848 49219 64809 68122 39917 3523 2330 47954 105114 127667 102133
13998 102133 57499 36268 52408 77521 75992 51085 39945 60963 87583 85327 56073 30132
13986 30132 28515 48786 76226 92967 85818 60081 38484 36170 47015 62074 83430 107067
13974 107067 113067 92800 68422 63774 71637 71342 62101 55491 52284 51748 64724 89895 99271 79739
13960 79739 63700 78193 92039 66897 34131 50471 93799 88908 38441 31212 93393 130436
$$ packed form
14048D7214J4659j4547l0716L669M5075L2965j3634k5178R868L2226R854j6538
14036I4917p804J0447k792l2658l3315j120K2829J4657o864j6071r437M574J8693
14023E6056K4041J3892m300j4984j4646j3241j6165j7926j2883q48J5145K6309
14011D0450K0387j71j1818L71J5590L313k8205l6394j193M5624N7160K2553k5534
13998A02133m4634k1231J6140K5113j529k4907j1140K1018K6620k256k9254k5941
13986C0132j617K0271K7440J6741p149k5737k1597k314J0845J5059K1356K3637
13974A07067O000k0267k4378m648P863k95r241o610l207n36J2976K5171R376j9532
13960G9739j6039J4493J3846k5142l2766J6340M3328m891n0467p229O2181L7043
$$ plain form
13948 130436 73646 -2866 7226 80927 111755 76883 54604 86529 122343 116474 94761 94224
13936 94224 103674 101627 100723 114053 117398 87300 49689 50069 89252 122023 113878 74789 39542
13923 39542 31930 47318 60361 51235 27107 12012 16748 30298 39955 44756 48435 54787 69573
13910 69573 89807 94527 69405 37747 37029 63324 75093 59825 54704 81616 105500 92174
13898 92174 70037 85762 122985 122080 74354 39355 57696 96870 106729 87158 67808 52564
13886 52564 27529 7744 26953 76796 100834 70206 30473 39971 85262 102597 75435 57696
13874 57696 85940 119743 105779 61698 44546 58735 56235 24084 9092 40475 83399 96710
13862 96710 91024 95824 106732 103417 90075 79673 63114 32826 14602 34777 73703 92385
$$ packed form
13948A30436n6790p6512J0092P3701L0828l4872k2279L1925L5814n869k1713n37
13936I4224R450k047r04J3330L345l0098l7611L80L9183L2771q145l9089l5247
13923C9542p612J5388J3043r126k4128j5095M736J3550R657M801L679O352J4786
13910F9573K0234M720k5122l1658p18K6295J1769j5268n121K6912K3884j3326
13898I2174k2137J5725L7223r05m7726l4999J8341L9174R859j9571j9350j5244
13886E2564k5035j9785J9209M9843K4038l0628l9733R498M5291J7335k7162j7739
13874E7696K8244L3803j3964m4081j7152J4189k500l2151j4992L1383M2924J3311
13862I6710n686M800J0908l315j3342j0402j6559l0288j8224K0175L8926J8682
$$ plain form
13850 92385 88133 82566 74597 54917 48943 85214 130285 122272 71071 53771 95474 128579 101701
13837 101701 58168 58217 84320 85221 66642 68155 82257 71682 51277 75778 142727 177800 136591
13824 136591 65316 34200 53516 83337 92791 81240 63988 60577 80775 107647 113207 100239
13812 100239 102210 128999 144848 122736 89694 85624 101303 97432 71864 64453 94407 131371
13800 131371 138674 115277 82410 54381 38340 41775 61192 77503 79721 81007 94545 107260
13788 107260 100585 87267 96922 125288 132079 102276 76892 95617 133687 135547 100160 84576
13776 84576 114243 138560 106333 48425 37886 84121 119691 98313 58011 61453 106603 133345
13764 133345 106357 56249 34148 51542 79855 95181 102306 113028 119761 107369 83630 74623
$$ packed form
13850I2385m252n567p969j9680n974L6271M5071q013n1201j7300M1703L3105k6878
13837A01701m3533M9K6103R01j8579J513J4102j0575k0405K4501O6949L5073m1209
13824A36591p1275l1116J9316K9821R454j1551j7252l411K0198K6872N560j2968
13812A00239J971K6789J5849k2112l3042m070J5679l871k5568p411K9954L6964
13800A31371P303k3397l2867k8029j6041L435J9417J6311K218J286J3538J2715
13788A07260o675j3318R655K8366O791k9803k5384J8725L8070J860l5387j5584
13776H4576K9667K4317l2227n7908j0539M6235L5570k1378m0302L442M5150K6742
13764A33345k6988n0108k2101J7394K8313J5326P125J0722O733j2392k3739r007
$$ plain form
13752 74623 85380 89474 72113 59390 79221 113319 123459 112549 116437 139312 147328 134261
13740 134261 138985 174480 192262 156241 107084 102482 127432 122617 80585 50513 55386 67876
13728 67876 72249 87958 115734 117655 78662 40989 44691 71379 81026 73340 75523 91378 99508
13715 99508 90449 76075 68781 71123 77722 75271 55918 39302 55924 96213 110121 79329 52393
13702 52393 74769 119505 131368 109879 96310 100175 96853 86386 94180 115204 116043 96405 91037
13689 91037 102464 92125 54194 36638 62353 88093 77441 60050 73584 95598 87922 69954
13677 69954 85762 123302 130330 98898 73180 75560 82735 81447 92611 122234 135470 106282
13665 106282 59841 38965 51592 74665 91255 100509 102816 96884 87967 84971 90407 99981 108654
$$ packed form
13752G4623J0757M094j7361j2723J9831L4098J0140j0910L888K2875Q016j3067
13740A34261M724L5495J7782l6021m9157m602K4950m815m2032l0072M873J2490
13728F7876M373J5709K7776J921l8993l7673L702K6688R647p686K183J5855Q130
13715I9508r059j4374p294K342O599k451j9353j6616J6622M0289J3908l0792k6936
13702E2393K2376M4736J1863k1489j3569L865l322j0467P794K1024Q39j9638n368
13689I1037J1427j0339l7931j7556K5715K5740j0652j7391J3534K2014p676j7968
13677F9954J5808L7540P028l1432k5718K380P175j288J1164K9623J3236k9188
13665A06282m6441k0876J2627K3073J6590R254K307n932q917k996N436R574Q673
$$ plain form
13652 108654 112542 109446 101841 96390 97795 104054 107840 103849 98505 107579 131874 140358 102354 40662
13638 40662 20194 66547 128710 150157 143263 151291 165721 141176 82349 51216 76754 113788
13626 113788 113505 87819 75377 81230 83103 73171 64768 70936 92538 114964 113537 84772 69465
13613 69465 107661 169774 181931 130723 85806 94914 117990 105111 79667 87081 110828 108351
13601 108351 93881 110773 144907 142371 102239 77070 84148 89287 81832 91320 117914 120683 96651
13588 96651 99293 146663 178950 149579 98875 87864 109621 120535 117594 125922 140340 137544
13576 137544 124945 123295 119575 92555 69619 96632 155642 175923 136738 100146 118394 159147
13564 159147 158456 112621 74364 73969 86351 79992 66191 79974 125053 161703 155886 123226 106376
$$ packed form
13652A08654L888l096p605n451J405O259L786l991n344R074K4295Q484l8004o1692
13638D0662k0468M6353O2163K1447o894Q028J4430k4545n8827l1133K5538L7034
13626A13788k83k5686j2442N853J873r932q403O168K1602K2426j427k8765j5307
13613F9465L8196O2113J2157n1208m4917R108K3076j2879k5444P414K3747k477
13601A08351j4470J6892L4134k536m0132k5169P078N139p455R488K6594K769k4032
13588I6651K642M7370L2287k9371n0704j1011K1757J0914k941Q328J4418k796
13576A37544j2599j650l720k7020k2936K7013N9010K0281l9185l6592J8248M0753
13564A59147o91m5835l8257l95J2382o359j3801J3783M5079L6650n817l2660j6850
$$ plain form
13551 106376 118366 134179 137009 139535 147873 139852 105005 76842 89817 124447 134533 114988
13539 114988 99678 99843 93196 77273 83223 119758 148168 139774 121419 130580 154177 152045 123941
13526 123941 110060 127869 148229 143195 124933 119880 128337 132841 131960 138686 149211 141574 113562
13513 113562 97059 115647 145367 144311 113552 98139 124603 167236 187799 182335 171047 164009
13501 164009 159279 158989 164496 166305 157658 146600 138185 122005 98208 95043 130843 176796 193802
13488 193802 191721 207989 234785 219975 150832 88974 96643 159524 208616 199784 151663 116855
13476 116855 128410 167384 182417 152015 116821 126639 168224 183557 154832 125880 133650 164317
13464 164317 190008 204516 205397 184280 155988 155631 184687 201392 185588 166605 163966 155890 138336
$$ packed form
13551A06376J1990J5813K830K526Q338q021l4847k8163J2975L4630J0086j9545
13539A14988j5310J65o647j5923N950L6535K8410q394j8355R161K3597k132k8104
13526A23941j3881J7809K0360n034j8262n053Q457M504q81O726J0525p637k8012
13513A13562j6503J8588K9720j056l0759j5413K6464M2633K0563n464j1288p038
13501A64009m730k90N507J809q647j1058q415j6180k3797l165L5800M5953J7006
13488A93802k081J6268K6796j4810o9143o1858P669O2881M9092q832m8121l4808
13476A16855J1555L8974J5033l0402l5194R818M1585J5333k8725k8952P770L0667
13464A64317K5691J4508Q81k1117k8292l57K9056J6705j5804j8983k639q076j7554
$$ plain form
13451 138336 152306 205075 228309 179704 128107 155383 220670 219727 150134 109716 137372 165719
13439 165719 149320 135251 165853 200377 189088 157852 159761 191063 209407 199459 174101 141432
13427 141432 111300 106818 133923 164834 178533 186125 192979 178990 147036 141382 175395 191371
13415 191371 147849 99917 121898 185957 200758 152946 121209 146836 178060 167751 148250
13404 148250 165390 197943 197098 167855 155920 173217 187010 178528 169501 182045 203057 204709
13392 204709 183995 164817 164968 175108 175319 162789 151172 146261 139717 131072 136753 164196 192498
13379 192498 196219 178323 163240 165605 179742 189884 179028 143834 114443 134849 200344 243054
13367 243054 215731 162829 158642 196354 204327 166288 147376 181508 209520 174135 114920 107439
$$ packed form
13451A38336J3970N2769K3234m8605n1597K7276O5287r43o9593m0418K7656K8347
13439A65719j6399j4069L0602L4524j1289l1236J909L1302J8344r948k5358l2669
13427A41432l0132m482K7105L0911J3699P592O854j3989l1954n654L4013J5976
13415A91371m3522m7932K1981O4059J4801m7812l1737K5627L1224j0309j9501
13404A48250J7140L2553q45k9243j1935J7297J3793q482r027J2544K1012J652
13392B04709k0714j9178J51J0140K11j2530j1617m911o544q645N681K7443K8302
13379A92498L721j7896j5083K365J4137J0142j0856l5194k9391K0406O5495M2710
13367B43054k7323n2902m187L7712P973l8039j8912L4132K8012l5385n9215p481
$$ plain form
13355 107439 149337 174712 159958 146838 163212 183458 181150 170865 175270 186982 187644 179981
13343 179981 178414 184234 187963 184339 172343 152941 137211 142165 166513 185466 183368 175754 180791
13330 180791 184421 161179 121968 108623 135957 169073 172666 158228 160679 185488 205421 202073
13318 202073 185157 171491 166618 168836 172719 167595 150720 140811 156499 181868 180588 148173 120528
13305 120528 122689 140780 156242 172254 188501 187353 169938 167937 189258 192640 155028 121288
13293 121288 135831 166688 162724 148306 178590 227655 220009 165583 154179 200986 212134 145081
13281 145081 91577 131315 200060 195588 139805 129292 174134 197387 171830 151444 168429 191293
13269 191293 194886 193117 189129 163524 126879 119653 144153 156013 138057 124855 139034 160624
$$ packed form
13355A07439M1898K5375j4754j3120J6374K0246k308j0285M405J1712O62p663
13343A79981j567N820L729l624j1996j9402j5730M954K4348J8953k098p614N037
13330A80791L630k3242l9211j3345K7334L3116L593j4438K451K4809J9933l348
13318B02073j6916j3666m873K218L883n124j6875r909J5688K5369j280l2415k7645
13305A20528K161J8091J5462J6012J6247j148j7415k001K1321L382l7612l3740
13293A21288J4543L0857l964j4418L0284M9065p646n4426j1404M6807J1148o7053
13281A45081n3504L9738O8745m472n5783j0513M4842K3253k5557k0386J6985K2864
13269A91293L593j769l988k5605l6645p226K4500J1860j7956j3202J4179K1590
$$ plain form
13257 160624 175274 194214 208927 188332 144515 136928 178678 201937 160373 108245 121971 187009
13245 187009 223374 196448 146492 123357 138873 175105 203175 201574 181316 178485 201497 211318
13233 211318 180132 139788 137293 168300 192603 193115 181018 163537 146756 151430 184448 211089
13221 211089 197315 164397 158918 183046 199671 194809 187535 185829 179859 174244 180899 184236 160580
13208 160580 128083 127137 152797 160709 142763 139188 165472 186004 178933 171839 188471 210880 220617
13195 220617 228083 232932 207969 158093 142057 188288 236628 220929 170212 161212 198251 215780
13183 215780 191649 180316 218568 264169 260436 215623 180882 177844 183970 176158 158398 147474
13171 147474 150785 162635 173862 180614 183904 183051 176595 171804 181957 205916 222706 219457 212259
$$ packed form
13257A60624J4650J8940J4713k0595m3817p587M1750K3259m1564n2128J3726O5038
13245A87009L6365k6926m9956k3135J5516L6232K8070j601k0258k831K3012R821
13233B11318l1186m0344k495L1007K4303N12j2097j7481j6781M674L3018K6641
13221B11089j3774l2918n479K4128J6625m862p274j706n970n615O655L337k3656
13208A60580l2497r46K5660P912j7946l575K6284K0532p071p094J6632K2409R737
13195B20617P466M849k4963m9876j6036M6231M8340j5699n0717r000L7039J7529
13183B15780k4131j1333L8252M5601l733m4813l4741l038O126p812j7760j0924
13171A47474L311J1850J1227O752L290q53o456m791J0153K3959J6790l249p198
$$ plain form
13158 212259 221108 235908 232252 213962 209579 225066 231447 210355 183563 178232 185034 176379 153510
13145 153510 146688 169018 195799 199770 188565 190260 210118 221933 205965 178132 168190 179113
13133 179113 187299 181923 182585 207953 242992 254033 229766 192078 168132 164863 172687 183027 194795
13120 194795 206862 211687 202870 188915 188873 205708 215325 199578 179986 189554 214395 204338 154254
13107 154254 129436 176478 246107 253862 195275 144645 147137 171264 176077 168173 169788 179597 195550
13094 195550 233710 286995 302873 249482 177633 164547 210508 246051 237070 223591 242000 265569
13082 265569 253359 216233 195481 203033 220598 237605 251395 245949 213035 184625 197542 229131
13070 229131 221363 176379 167311 227021 286165 271079 214029 198838 230263 239869 211237 208165
$$ packed form
13158B12259Q849J4800l656j8290m383J5487O381k1092k6792n331O802q655k2869
13145A53510o822K2330K6781L971j1205J695J9858J1815j5968k7833r942J0923
13133A79113Q186n376O62K5368L5039J1041k4267l7688k3946l269P824J0340J1768
13120A94795J2067M825q817j3955m2J6835R617j5747j9592R568K4841j0057n0084
13107A54254k4818M7042O9629P755n8587n0630K492K4127M813p904J615R809J5953
13094A95550L8160N3285J5878n3391p1849j3086M5961L5543q981j3479J8409K3569
13082B65569j2210l7126k0752P552J7565J7007J3790n446l2914k8410J2917L1589
13070B29131p768m4984r068N9710N9144j5086n7050j5191L1425R606k8632l072
$$ plain form
13058 208165 258930 297632 266173 207533 198822 240346 274294 278242 274044 267404 246452 229377
13046 229377 248009 285489 291321 261915 246676 265595 280389 263223 236587 222920 209119 188127
13034 188127 183897 203327 212902 198236 196430 226585 239281 191855 130969 132117 186265 220054
13022 220054 212291 212404 243477 265403 253410 243165 263706 281944 257281 210734 193507 213158
13010 213158 235219 242088 247381 256970 255486 239044 231719 254022 290750 305602 283526 248305
12998 248305 235900 255050 280149 284052 269632 260347 265661 271081 264242 255104 259741 273305 273841
12985 273841 254131 237538 250890 284365 294872 260263 215856 213546 250698 272674 252209 227659
12973 227659 239585 266166 261833 234402 231707 260401 273894 250360 231397 257757 305042 317496
$$ packed form
13058B08165N0765L8702l1459n8640q711M1524L3948L948m198o640k0952j7075
13046B29377J8632L7480N832k9406j5239J8919J4794j7166k6636j3667j3801k0992
13034A88127m230J9430R575j4666j806L0155J2696m7426o0886J148N4148L3789
13022B20054p763J13L1073K1926j1993j0245K0541J8238k4663m6547j7227J9651
13010B13158K2061O869N293R589j484j6442p325K2303L6728J4852k2076l5221
12998B48305j2405J9150K5099L903j4420r285N314N420o839r138M637J3564N36
12985B73841j9710j6593J3352L3475J0507l4609m4407k310L7152K1976k0465k4550
12973B27659J1926K6581m333k7431k695K8694J3493k3534j8963K6360M7285J2454
$$ plain form
12961 317496 283831 246107 241253 261041 273072 264874 257025 272710 301657 309119 284832 261197
12949 261197 266089 282053 281817 279845 303376 329462 310093 257655 240058 277937 312474 301137
12937 301137 280049 291390 309627 293432 260757 251633 256880 247980 243086 272862 307551 294588
12925 294588 252236 245727 277270 285116 257779 258735 310636 341147 293738 223722 221032 283201
12913 283201 329613 316203 276902 260585 275561 299770 314098 318028 323988 335043 330867 295176
12901 295176 253370 247086 267933 264419 228890 219440 263329 299917 273204 227304 237922 288088
12889 288088 297203 254151 231087 263466 304099 314168 317171 330574 320899 273785 242981 271782
12877 271782 317974 319872 294133 297701 324358 318642 278939 264251 292108 308029 280133 253077
$$ packed form
12961C17496l3665l7724m854J9788J2031q198p849J5685K8947P462k4287k3635
12949B61197M892J5964k36j972K3531K6086j9369n2438j7597L7879L4537j1337
12937C01137k1088J1341J8237j6195l2675r124N247q900m894K9776L4689j2963
12925B94588m2352o509L1543P846k7337R56N1901L0511m7409p0016k690O2169
12913B83201M6412j3410l9301j6317J4976K4209J4328L930N960J1055m176l5691
12901B95176m1806o284K0847l514l5529r450M3889L6588k6713m5900J0618N0166
12889B88088R115m3052k3064L2379M0633J0069L003J3403r675m7114l0804K8801
12877B71782M6192J898k5739L568K6657n716l9703j4688K7857J5921k7896k7056
$$ plain form
12865 253077 268535 292612 276482 244010 254178 301882 325244 306079 295204 323204 346565
12854 346565 316205 255861 229287 254567 293418 312938 317481 321210 325140 328581 335758 341921 334533
12841 334533 316355 307475 316262 327149 325575 315825 305162 291435 278679 282831 304879 319430
12829 319430 311411 304063 323074 349691 343903 305630 275767 276375 286745 286189 284567 294327 303869
12816 303869 301384 299758 311300 318086 298451 269487 268422 295986 313963 304194 295113 313106 337609
12803 337609 332627 304332 292840 311588 329383 320467 301459 300151 311655 312086 300748 297748 305149
12790 305149 302708 285843 277224 289800 305203 304237 295329 294837 300404 303586 308914 319274 322904 318095
12776 318095 326884 354807 364406 330304 295242 314641 361378 356637 297397 273487 330626 393179
$$ packed form
12865B53077J5458K4077j6130l2472J0168M7704K3362j9165j0875K8000K3361
12854C46565l0360o0344k6574K5280L8851J9520M543L729L930L441P177O163p388
12841C34533j8178q880Q787J0887j574r750j0663j3727j2756M152K2048J4551
12829C19430q019p348J9011K6617n788l8273k9863O08J0370n56j622R760R542
12816C03869k485j626J1542O786j9635k8964j065K7564J7977r769r081J7993K4503
12803C37609m982k8295j1492J8748J7795q916j9008j308J1504M31j1338l000P401
12790C05149k441j6865q619J2576J5403r66q908m92N567L182N328J0360L630m809
12776C18095Q789K7923R599l4102l5062J9399M6737m741n9240k3910N7139O2553
$$ plain form
12764 393179 375531 309014 288524 332760 374294 370995 351925 350137 356219 354862 355044 362754 364341
12751 364341 356385 357370 372672 381652 376787 381055 404425 415961 388167 343720 326589 343437 363061
12738 363061 362599 347686 334121 332664 347555 371944 389598 394485 398763 408014 404999 379150 355643
12725 355643 364781 392295 396046 372183 366348 405729 453317 454986 410724 369002 359705 364468 358015
12712 358015 350316 367743 407088 433979 427587 404771 391224 388432 385696 387916 405502 425405
12700 425405 423163 404047 399730 416382 420496 393825 369404 384764 425220 447540 441435 430535
12688 430535 424639 411117 390682 383590 396498 415113 432648 454261 471132 464877 443309 436007
12676 436007 446076 444431 424152 418945 447560 480697 489418 486395 486966 470888 426955 397709 422329
$$ packed form
12764C93179j7648o6517k0490M4236M1534l299j9070j788O082j357J82P710J587
12751C64341p956R85J5302Q980m865M268K3370J1536k7794m4447j7131J6848J9624
12738C63061m62j4913j3565j457J4891K4389J7654M887M278R251l015k5849k3507
12725C55643R138K7514L751k3863n835L9381M7588J669m4262m1722r297M763o453
12712C58015p699J7427L9345K6891o392k2816j3547k792k736K220J7586J9903
12700D25405k242j9116m317J6652M114k6671k4421J5360M0456K2320o105j0900
12688D30535n896j3522k0435p092J2908J8615J7535K1613J6871o255k1568p302
12676D36007J0069j645k0279n207K8615L3137Q721l023N71j6078m3933k9246K4620
$$ plain form
12663 422329 461264 443821 378914 348326 385902 433344 435958 416459 416921 422955 398279 359610
12651 359610 359599 407574 455855 464979 444476 423262 411004 402585 401710 422604 468716 516153 527409
12638 527409 491863 447123 440028 466837 479928 459516 441113 451948 461513 435136 403643 423875
12626 423875 485483 518413 495219 466215 476313 502046 501329 479652 466468 459869 440776 421029
12614 421029 429641 459552 472844 460270 454649 475570 497983 494807 481078 487884 509795 510239 477524
12601 477524 447211 456697 495437 519533 509432 490896 492952 506290 501939 477750 459728 460511
12589 460511 465709 466553 474852 491199 490418 465224 456332 500116 563594 578325 535349 497382 507396
12576 507396 534262 533020 514445 515299 531767 531437 514174 508662 512270 489622 443475 433064 489365
$$ packed form
12663D22329L8935j7443o4907l0588L7576M7442K614j9499M62O034k4676l8669
12651C59610j1M7975M8281R124k0503k1214j2258q419q75K0894M6112M7437J1256
12638E27409l5546m4740p095K6809J3091k0412j8403J0835R565k6377l1493K0232
12626D23875O1608L2930k3194k9004J0098K5733p17k1677j3184o599j9093j9747
12614D21029Q612K9911J3292j2574n621K0921K2413l176j3729O806K1911M44l2715
12601D77524l0313R486L8740K4096j0101j8536K056J3338m351k4189j8022P83
12589D60511N198Q44Q299J6347p81k5194q892M3784O3478J4731m2976l7967J0014
12576E07396K6866j242j8575Q54J6468l30j7263n512L608k2648m6147j0411N6301
$$ plain form
12563 489365 554218 550365 486950 443081 456656 486372 491315 490144 511859 535696 526382 498353
12551 498353 491850 502386 492685 470780 490029 553727 584912 533261 460346 459217 522184 558114
12539 558114 528938 494153 507012 537060 533562 511817 521488 558810 569726 534781 498650 503640
12527 503640 534317 549991 544193 542850 555708 559315 533086 492410 472299 485197 508571 515689
12515 515689 507343 505372 521915 547166 566796 579094 589154 594080 582825 550744 510815 487706
12503 487706 496861 527613 552766 559413 562197 577960 598312 603482 594760 590396 592975 588463 580275
12490 580275 592223 624425 637559 605282 558294 546063 570834 592483 589631 580167 580979 583096
12478 583096 578658 582503 605083 622207 598636 539408 495694 509958 566566 610971 615034 604621
$$ packed form
12563D89365O4853l853o3415m3869J3575K9716M943j171K1715K3837r314k8029
12551D98353o503J0536r701k1905J9249O3698L1185n1651p2915j129O2967L5930
12539E58114k9176l4785J2859L0048l498k1745R671L7322J0916l4945l6131M990
12527E03640L0677J5674n798j343J2858L607k6229m0676k0111J2898K3374P118
12515E15689q346j971J6543K5251J9630J2298J0060M926j1255l2081l9929k3109
12503D87706R155L0752K5153O647K784J5763K0352N170q722m364K579m512q188
12490E80275J1948L2202J3134l2277m6988j2231K4771K1649k852r464Q12K117
12478E83096m438L845K2580J7124k3571n9228m3714J4264N6608M4405M063j0413
$$ plain form
12466 604621 614000 634145 632259 610273 605297 628340 644478 632160 622008 645230 678036 679598
12454 679598 659525 657799 673372 667984 638028 626592 653453 682565 677836 650329 629516 622896
12442 622896 624974 634466 641737 628133 597799 583076 600700 630357 651342 667004 676697 664144
12430 664144 637707 638865 677924 704876 685516 662645 687018 725830 709053 643851 607686 633391
12418 633391 674130 689089 693503 704584 702543 676734 658122 669961 686970 678605 659018 659323
12406 659323 677675 689938 688311 680328 668877 658600 662576 679365 685023 671570 668836 699717
12394 699717 737885 744042 724263 714469 721528 720486 703618 691929 696239 701617 696200 687086 681876
12381 681876 678754 679002 686804 694910 694036 696758 724061 764260 776905 749432 720730 729333 761781
$$ packed form
12466F04621R379K0145j886k1986m976K3043J6138j2318j0152K3222L2806J562
12454F79598k0073j726J5573n388k9956j1436K6861K9112m729k7507k0813o620
12442F22896K078R492P271j3604l0334j4723J7624K9657K0985J5662R693j2553
12430F64144k6437J158L9059K6952j9360k2871K4373L8812j6777o5202l6165K5705
12418F33391M0739J4959M414J1081k041k5809j8612J1839J7009q365j9587L05
12406F59323J8352J2263j627p983j1451j0277L976J6789N658j3453k734L0881
12394F99717L8168O157j9779r794P059j042j6868j1689M310N378n417r114n210
12381F81876l122K48P802Q106q74K722K7303M0199J2645k7473k8702Q603L2448
$$ plain form
12368 761781 776236 761065 743343 745592 759103 763637 755454 746812 746820 753015 760458 770269 783739 794232
12354 794232 796418 801541 825444 855656 853394 806966 762628 771550 818005 838434 810263 778656
12342 778656 783473 803458 800617 784072 789429 815647 826221 806509 780416 769714 772948 788580
12330 788580 821047 851600 840936 785354 740594 758078 816880 852696 841441 816894 810203 813286
12318 813286 811383 814025 831810 849594 849195 841220 848170 867948 880331 882104 889077 905474 916524
12305 916524 913571 904973 899043 895348 894933 900391 905438 904562 910559 936215 960174 945784 899500 871028
12291 871028 881095 891095 869123 843783 854895 887328 901370 900924 917047 942183 940803 918823
12279 918823 921309 956444 980515 971472 960670 970508 974968 952670 930944 939660 961317 966636 964219
$$ packed form
12368G61781J4455j5171j7722K249J3511M534q183q642QO195P443R811J3470J0493
12354G94232K186N123K3903L0212k262m6428m4338Q922M6455K0429k8171l1607
12342G78656M817J9985k841j6545N357K6218J0574j9712k6093j0702L234J5632
12330G88580L2467L0553j0664n5582m4760J7484N8802L5816j1255k4547o691L083
12318H13286j903K642J7785J7784l99p975O950J9778J2383J773O973J6397J1050
12305I16524k953q598n930l695m15N458N047q76N997K5656K3959j4390m6284k8472
12291H71028J0067J0000k1972k5340J1112L2433J4042m46J6123K5136j380k1980
12279I18823K486L5135K4071r043j0802R838M460k2298k1726Q716K1657N319k417
$$ plain form
12266 964219 972282 973724 948253 923229 938401 977415 991447 981319 993550 1030803 1031928 967058
12254 967058 898453 904966 979107 1042931 1048539 1020268 1001384 1000307 1003898 1014533 1045341 1086592
12242 1086592 1105468 1089791 1071769 1086777 1119527 1121489 1083687 1058235 1089628 1152356 1184730
12231 1184730 1167244 1137113 1133847 1158868 1186051 1189659 1164754 1137127 1142977 1180468 1200326 1172650
12219 1172650 1139861 1158985 1208482 1212211 1155723 1113434 1140911 1200851 1230073 1228334 1235734 1260821
12207 1260821 1280397 1285233 1280928 1263726 1237049 1231036 1261457 1289707 1273807 1241648 1254111 1303768
12195 1303768 1318650 1276177 1244524 1280828 1345805 1363397 1324776 1285173 1282738 1307209 1335943
12184 1335943 1358652 1369203 1366135 1362033 1368808 1377930 1377207 1377331 1394019 1413227 1408905 1391169 1396889
$$ packed form
12266I64219Q063J442k5471k5024J5172L9014J4032j0128J2231L7253J125o4870
12254I67058o8605O513P4141O3824N608k8271j8884j077L591J0635L0808M1251
12242A086592J8876j5677j8022J5008L2750J962l7802k5452L1393O2728L2374
12231A184730j7486l0131l266K5021K7183L608k4905k7627N850L7491J9858k7676
12219A172650l2789J9124M9497L729n6488m2289K7477N9940K9222j739P400K5087
12207A260821J9576M836m305j7202k6677o013L0421K8250j5900l2159J2463M9657
12195A303768J4882m2473l1653L6304O4977J7592l8621l9603k435K4471K8734
12184A335943K2709J0551l068m102O775R122p23J24J6688J9208m322j7736N720
$$ plain form
12171 1396889 1428806 1447759 1439411 1442801 1483801 1522521 1512140 1479753 1490734 1544276 1567524 1523690
12159 1523690 1467582 1465557 1507650 1539198 1544858 1553010 1576519 1599479 1617152 1642085 1667004 1664908
12147 1664908 1636973 1621300 1637953 1660492 1661984 1655553 1663489 1677333 1682199 1695499 1740318 1794498
12135 1794498 1809968 1780655 1751206 1752790 1767204 1767478 1761089 1770870 1795659 1815403 1824265 1835656
12123 1835656 1856669 1875609 1879462 1873583 1876379 1895257 1913235 1905872 1872343 1841764 1843385 1877472
12111 1877472 1921071 1952254 1959832 1942853 1917922 1917431 1959156 2021020 2064038 2074998 2068060 2055202
12099 2055202 2043992 2056134 2108102 2169823 2185351 2149246 2121393 2143196 2179907 2180990 2161553
12088 2161553 2175178 2227757 2272929 2287183 2295719 2315858 2324799 2306139 2289449 2312003 2365062 2409876
$$ packed form
12171A396889L1917J8953q348L390M1000L8720j0381l2387J0981N3542K3248m3834
12159A523690n6108k025M2093L1548N660Q152K3509K2960J7673K4933K4919k096
12147A664908k7935j5673J6653K2539J492o431P936J3844M866J3300M4819N4180
12135A794498J5470k9313k9449J584J4414K74o389R781K4789J9744Q862J1391
12123A835656K1013J8940L853n879K796J8878J7978p363l3529l0579J621L4087
12111A877472M3599L1183P578j6979k4931m91M1725O1864M3018J0960o938j2858
12099B055202j1210J2142N1968O1721J5528l6105k7853K1803L6711J083j9437
12088B161553J3625N2579M5172J4254Q536K0139Q941j8660j6690K2554N3059M4814
$$ plain form
12076 2409876 2433382 2456863 2493090 2524636 2533394 2530530 2540331 2563916 2578940 2577919 2587034 2629873
12064 2629873 2684483 2704685 2686586 2682541 2731476 2802907 2839751 2837057 2839996 2872834 2912878 2938069
12052 2938069 2957833 2983128 3004864 3022605 3058376 3113718 3145932 3124392 3085503 3088455 3133157
12041 3133157 3170540 3186715 3221671 3294744 3364304 3388419 3385445 3400503 3441362 3485184 3527470
12030 3527470 3581661 3639656 3676124 3694775 3731426 3799887 3868684 3909075 3937264 3985233 4052409
12019 4052409 4115495 4171426 4237323 4312492 4374861 4421715 4482462 4573184 4662726 4711050 4729730
12008 4729730 4773633 4868866 4974723 5032007 5032982 5023343 5041449 5078024 5099843 5092675 5067013 5035067
11996 5035067 5000944 4968161 4938718 4906359 4867998 4840016 4841842 4861537 4863064 4835027 4804347 4789238
$$ packed form
12076B409876K3506K3481L6227L1546Q758k864R801K3585J5024j021R115M2839
12064B629873N4610K0202j8099m045M8935P1431L6844k694K939L2838M0044K5191
12052B938069J9764K5295K1736J7741L5771N5342L2214k1540l8889K952M4702
12041C133157L7383J6175L4956P3073O9560K4115k974J5058M0859M3822M2286
12030C527470N4191N7995L6468J8651L6651O8461O8797M0391K8189M7969O7176
12019D052409O3086N5931O5897P5169O2369M6854O0747R0722Q9542M8324J8680
12008D729730M3903R5233J05857N7284R75r639J8106L6575K1819p168k5662l1946
11996E035067l4123l2783k9443l2359l8361k7982J826J9695J527k8037l0680j5109
$$ plain form
11984 4789238 4772305 4744282 4737979 4776322 4814699 4792495 4729867 4708393 4750549 4786430 4763850
11973 4763850 4725542 4733085 4769360 4777189 4757832 4762034 4799080 4822089 4805935 4782652 4787920 4818463
11961 4818463 4855193 4888460 4908045 4905961 4902001 4929604 4982944 5016267 5011820 5008256 5039800 5087979
11949 5087979 5122931 5152884 5193331 5221104 5208838 5184333 5203224 5270017 5334546 5366075 5384049
11938 5384049 5409222 5432006 5448217 5484495 5556332 5627820 5649759 5627752 5620476 5668976 5751924
11927 5751924 5819016 5851237 5873287 5912929 5964997 6003248 6018943 6033316 6069416 6123559 6173166
11916 6173166 6205618 6229300 6259488 6302517 6352603 6397006 6425441 6440766 6458864 6492148 6535368
11905 6535368 6573939 6603548 6633122 6668870 6704674 6733029 6759979 6800482 6856302 6905763 6926504
$$ packed form
11984D789238j6933k8023o303L8343L8377k2204o2628k1474M2156L5881k2580
11973D763850l8308P543L6275P829j9357M202L7046K3009j6154k3283N268L0543
11961D818463L6730L3267J9585k084l960K7603N3340L3323m447l564L1544M8179
11949E087979L4952K9953M0447K7773j2266k4505J8891O6793O4529L1529J7974
11938E384049K5173K2784J6211L6278P1837P1488K1939k2007p276M8500Q2948
11927E751924O7092L2221K2050L9642N2068L8251J5695J4373L6100N4143M9607
11916F173166L2452K3682L0188M3029N0086M4403K8435J5325J8098L3284M3220
11905F535368L8571K9609K9574L5748L5804K8355K6950M0503N5820M9461K0741
$$ plain form
11894 6926504 6927696 6943669 6988340 7035102 7059536 7082405 7138655 7215400 7262703 7268153 7276955 7324235
11882 7324235 7388987 7436906 7469543 7501830 7527242 7541641 7570812 7633393 7700843 7735089 7743801
11871 7743801 7758100 7781800 7809804 7867591 7970756 8067473 8094361 8079530 8110351 8197666 8260155
11860 8260155 8262613 8277169 8362651 8466475 8512002 8518606 8557655 8633282 8688616 8708448 8738888
11849 8738888 8808540 8893166 8962751 9013572 9049892 9077648 9119930 9199244 9299814 9381344 9432606
11838 9432606 9480244 9544610 9618300 9689338 9756549 9821100 9887089 9965863 10055235 10125215 10154530
11827 10154530 10170016 10215740 10294166 10374730 10447783 10526007 10602736 10659151 10708544 10781509 10868828
11816 10868828 10934298 10984388 11062196 11165374 11240448 11277036 11333048 11434329 11526131 11573893 11637872
$$ packed form
11894F926504J192J5973M4671M6762K4434K2869N6250P6745M7303N450Q802M7280
11882G324235O4752M7919L2637L2287K5412J4399K9171O2581O7450L4246Q712
11871G743801J4299K3700K8004N7787J03165R6717K6888j4831L0821Q7315O2489
11860H260155K458J4556Q5482J03824M5527O604L9049P5627N5334J9832L0440
11849H738888O9652Q4626O9585N0821L6320K7756M2282P9314J00570Q1530N1262
11838I432606M7638O4366P3690P1038O7211O4551O5989P8774Q9372O9980K9315
11827A0154530J5486M5724P8426Q0564P3053P8224P6729N6415M9393P2965Q7319
11816A0868828O5470N0090P7808J03178P5074L6588N6012J01281R1802M7762O3979
$$ plain form
11805 11637872 11775925 11932242 12011638 12026885 12076780 12193415 12308339 12377581 12447012 12561303
11795 12561303 12685649 12768300 12826108 12911133 13025063 13122466 13185188 13245152 13332337 13436744
11785 13436744 13531359 13609782 13690487 13795201 13928077 14068939 14187525 14273762 14353329 14461929
11775 14461929 14602543 14740995 14850066 14944721 15059395 15199173 15335436 15450965 15564520
11766 15564520 15698089 15842295 15976386 16104741 16244273 16388021 16517447 16645342 16803625
11757 16803625 16983960 17137656 17252121 17380370 17563208 17764808 17930556 18075667 18258278
11748 18258278 18479372 18672280 18800321 18912870 19081107 19313271 19560382 19783894 19989410
11739 19989410 20200121 20420397 20635433 20840304 21055011 21299249 21561071 21813809 22062349
$$ packed form
11805A1637872J38053J56317P9396J5247M9895J16635J14924O9242O9431J14291
11795A2561303J24346Q2651N7808Q5025J13930R7403O2722N9964Q7185J04407
11785A3436744R4615P8423Q0705J04714J32876J40862J18586Q6237P9567J08600
11775A4461929J40614J38452J09071R4655J14674J39778J36263J15529J13555
11766A5564520J33569J44206J34091J28355J39532J43748J29426J27895J58283
11757A6803625J80335J53696J14465J28249J82838K01600J65748J45111J82611
11748A8258278K21094J92908J28041J12549J68237K32164K47111K23512K05516
11739A9989410K10711K20276K15036K04871K14707K44238K61822K52738K48540
$$ plain form
11730 22062349 22338654 22642041 22926294 23171934 23427169 23733426 24050194 24316316 24559107
11721 24559107 24864499 25242769 25606082 25900555 26186939 26548478 26973663 27381679 27731623
11712 27731623 28058894 28418234 28825967 29253427 29660643 30045133 30458284 30948418 31488992
11703 31488992 32004942 32477003 32966702 33517199 34088530 34630636 35165831 35743208 36354233
11694 36354233 36958639 37564401 38211685 38892447 39556549 40197359 40866246 41591312 42337749
11685 42337749 43065035 43775869 44490273 45213188 45948213 46707665 47487886 48263750 49026112
11676 49026112 49798940 50604061 51435026 52280946 53149241 54046027 54957608 55872371 56802888
11667 56802888 57766537 58758162 59759748 60767152 61793286 62852791 63952778 65089878
$$ packed form
11730B2062349K76305L03387K84253K45640K55235L06257L16768K66122K42791
11721B4559107L05392L78270L63313K94473K86384L61539M25185M08016L49944
11712B7731623L27271L59340M07733M27460M07216L84490M13151M90134N40574
11703C1488992N15950M72061M89699N50497N71331N42106N35195N77377O11025
11694C6354233O04406O05762O47284O80762O64102O40810O68887P25066P46437
11685D2337749P27286P10834P14404P22915P35025P59452P80221P75864P62362
11676D9026112P72828Q05121Q30965Q45920Q68295Q96786R11581R14763R30517
11667E6802888R63649R91625J001586J007404J026134J059505J099987J137100
$$ plain form
11659 65089878 66249740 67419301 68604603 69826653 71097583 72412604 73765384 75156190
11651 75156190 76584411 78049678 79560986 81126682 82735160 84365352 86017638 87714250
11643 87714250 89469378 91281879 93156526 95103017 97108794 99142140 101191915 103278758
11635 103278758 105419745 107610595 109852911 112169581 114579219 117081406 119679784 122393720
11627 122393720 125235855 128204939 131308549 134559947 137945895 141441756 145072538 148905991
11619 148905991 152957401 157157135 161456984 165917327 170629612 175594703 180751937 186104563
11611 186104563 191736456 197708150 204012120 210643015 217642936 225049862 232854517 241039814
11603 241039814 249623331 258632383 268070692 277936684 288242886 298982640 310093861
$$ packed form
11659F5089878J159862J169561J185302J222050J270930J315021J352780J390806
11651G5156190J428221J465267J511308J565696J608478J630192J652286J696612
11643H7714250J755128J812501J874647J946491K005777K033346K049775K086843
11635A03278758K140987K190850K242316K316670K409638K502187K598378K713936
11627A22393720K842135K969084L103610L251398L385948L495861L630782L833453
11619A48905991M051410M199734M299849M460343M712285M965091N157234N352626
11611A86104563N631893N971694O303970O630895O999921P406926P804655Q185297
11603B41039814Q583517R009052R438309R865992J0306202J0739754J1111221
$$ plain form
11596 310093861 321483585 333081872 344856348 356780713 368794284 380777341 392557669
11589 392557669 403950066 414782361 424857064 433892227 441542868 447501838 451559062
11582 451559062 453562733 453380873 450955480 446386847 439931861 431917429 422664583 412471374
11574 412471374 401621904 390383583 378988889 367615064 356380954 345370985 334661386
11567 334661386 324314931 314362400 304817695 295711840 287082595 278927656 271206403 263903463
11559 263903463 257053826 250681395 244747579 239193507 234003801 229188730 224724176 220553811
11551 220553811 216641662 212982420 209565594 206371140 203402546 200684380 198216688 195964778
11543 195964778 193907790 192069433 190482922 189144527 188017799 187071200 186300076 185721625
$$ packed form
11596C10093861J1389724J1598287J1774476J1924365J2013571J1983057J1780328
11589C92557669J1392397J0832295J0074703R035163P650641N958970M057224
11582D51559062K003671j81860k425393m568633o454986q014432r252846j0193209
11574D12471374j0849470j1238321j1394694j1373825j1234110j1009969j0709599
11567C34661386j0346455r952531r544705r105855q629245q154939p721253p302940
11559B63903463o849637o372431n933816n554072n189706m815071m464554m170365
11551B20553811l912149l659242l416826l194454k968594k718166k467692k251910
11543A95964778k056988j838357j586511j338395j126728r46599p71124n78451
$$ plain form
11535 185721625 185355978 185203073 185233867 185414237 185738749 186228308 186895296 187730207 188728703
11526 188728703 189914107 191323007 192981235 194902345 197097542 199578117 202357870 205459178
11518 205459178 208904108 212692660 216805517 221239988 226027392 231196767 236733823 242600150
11510 242600150 248786409 255312538 262161891 269241572 276436405 283693792 291025141 298414911
11502 298414911 305747254 312831024 319474440 325512344 330772637 335047069 338102991 339712042
11494 339712042 339678303 337880567 334319473 329124202 322509214 314731713 306080372 296859647
11486 296859647 287340818 277719061 268122230 258649229 249387546 240404363 231736224 223386454
11478 223386454 215334781 207570130 200121836 193035365 186306737 179873879 173698508 167825713
$$ packed form
11535A85721625l65647j52905L0794J80370L24512M89559O66988Q34911R98496
11526A88728703J185404J408900J658228J921110K195197K480575K779753L101308
11518B05459178L444930L788552M112857M434471M787404N169375N537056N866327
11510B42600150O186259O526129O849353P079681P194833P257387P331349P389770
11502B98414911P332343P083770O643416O037904N260293M274432L055922J609051
11494C39712042l3739j797736l561094n195271o614988p777501q651341r220725
11486B96859647r518829r621757r596831r473001r261683q983183q668139q349770
11478B23386454q051673p764651p448294p086471o728628o432858o175371n872795
$$ plain form
11470 167825713 162323466 157184098 152329813 147702770 143300863 139127746 135160054 131376623
11462 131376623 127776496 124349220 121062943 117902280 114887256 112032917 109317094 106712162
11454 106712162 104225766 101881283 99670361 97551658 95494415 93504385 91602804 89788341
11446 89788341 88026161 86279331 84549820 82872742 81261024 79678787 78094094 76536532
11438 76536532 75063382 73680326 72341026 71022060 69748769 68540615 67381105 66256983
11430 66256983 65180578 64153749 63152936 62170257 61226249 60321648 59424360 58528992 57677165
11421 57677165 56885692 56107855 55308099 54522588 53792332 53082324 52327527 51521455 50698404
11412 50698404 49865796 49023516 48216484 47486453 46789573 46043018 45245628 44474133 43763240
$$ packed form
11470A67825713n502247n139368m854285m627043m401907m173117l967692l783431
11462A31376623l600127l427276l286277l160663l015024k854339k715823k604932
11454A06712162k486396k344483k210922k118703k057243j990030j901581j814463
11446H9788341j762180j746830j729511j677078j611718j582237j584693j557562
11438G6536532j473150j383056j339300j318966j273291j208154j159510j124122
11430F6256983j076405j026829j000813r82679r44008r04601q97288q95368q51827
11421E7677165p91473p77837p99756p85511p30256p10008p54797q06072q23051
11412E0698404q32608q42280q07032p30031o96880p46555p97390p71495p10893
$$ plain form
11403 43763240 43070680 42367060 41679497 41028650 40395710 39773236 39181438 38612678 38026446
11394 38026446 37422692 36853583 36336465 35822283 35280029 34743621 34239558 33737855 33218614
11385 33218614 32720162 32270641 31834858 31383049 30949365 30560727 30169809 29731234 29288839
11376 29288839 28906362 28559538 28185495 27798221 27455116 27136224 26766144 26350696 25983400
11367 25983400 25700523 25428961 25108568 24776399 24484284 24207508 23892795 23546531 23220061
11358 23220061 22936942 22676800 22411236 22127432 21834249 21561487 21331359 21122748 20893240
11349 20893240 20641222 20406555 20201339 19986932 19738176 19485119 19265836 19076582 18892989
11340 18892989 18704140 18503614 18285298 18069541 17891365 17739973 17558171 17330592 17118418
$$ packed form
11403D3763240o92560p03620o87563o50847o32940o22474n91798n68760n86232
11394C8026446o03754n69109n17118n14182n42254n36408n04063n01703n19241
11385C3218614m98452m49521m35783m51809m33684l88638l90918m38575m42395
11376B9288839l82477l46824l74043l87274l43105l18892l70080m15448l67296
11367B5983400k82877k71562l20393l32169k92115k76776l14713l46264l26470
11358B3220061k83119k60142k65564k83804k93183k72762k30128k08611k29508
11349B0893240k52018k34667k05216k14407k48756k53057k19283j89254j83593
11340A8892989j88849k00526k18316k15757j78176j51392j81802k27579k12174
$$ plain form
11331 17118418 16965629 16825094 16633570 16413879 16234885 16101824 15957821 15776652 15585370
11322 15585370 15403743 15227009 15066201 14941086 14827785 14674279 14479423 14300583 14168107
11313 14168107 14046297 13899137 13742468 13602326 13466664 13314481 13160858 13036865 12942815
11304 12942815 12848139 12725985 12574181 12417471 12294364 12216979 12140505 12008315 11835282 11699499
11294 11699499 11630709 11559634 11418502 11244960 11126766 11072412 11005504 10880588 10737359 10626427
11284 10626427 10538253 10434925 10313388 10202081 10113629 10029014 9923264 9793228 9664252 9570702
11274 9570702 9517490 9464111 9369202 9248884 9157572 9105242 9037593 8921474 8804762 8746119 8718545
11263 8718545 8644562 8515216 8406651 8368132 8356870 8311944 8237531 8169696 8104342 8013907 7910360
$$ packed form
11331A7118418j52789j40535j91524k19691j78994j33061j44003j81169j91282
11322A5585370j81627j76734j60808j25115j13301j53506j94856j78840j32476
11313A4168107j21810j47160j56669j40142j35662j52183j53623j23993r4050
11304A2942815r4676j22154j51804j56710j23107p7385p6474j32190j73033j35783
11294A1699499o8790p1075j41132j73542j18194n4354o6908j24916j43229j10932
11284A0626427q8174j03328j21537j11307q8452q4615j05750j30036j28976r3550
11274I570702n3212n3379r4909j20318r1312n2330o7649j16119j16712n8643k7574
11263H718545p3983j29346j08565l8519j1262m4926p4413o7835o5354r0435j03547
$$ plain form
11252 7910360 7834199 7791092 7751228 7705193 7666949 7622583 7535849 7416513 7324565 7284129 7249028
11241 7249028 7184152 7124146 7106598 7098406 7047541 6968628 6910118 6865279 6791233 6701360 6655920
11230 6655920 6656042 6628871 6541766 6456776 6432036 6432148 6388735 6303482 6233102 6200918 6179046 6143702
11218 6143702 6099916 6057409 6020382 5997026 5987701 5969146 5917675 5840096 5758300 5679014 5606810
11207 5606810 5565778 5567856 5574678 5537241 5465699 5411506 5385107 5348036 5292329 5263466 5277874 5275859
11195 5275859 5201180 5085521 5002983 4969510 4942738 4905025 4885239 4893780 4891772 4848340 4788968
11184 4788968 4756202 4746898 4721190 4662530 4598049 4558687 4543331 4530363 4507889 4480583 4455429
11173 4455429 4432668 4408844 4381323 4351286 4327209 4320175 4326558 4320272 4277842 4212206 4163499 4148719
$$ packed form
11252G910360p6161m3107l9864m6035l8244m4366q6734j19336r1948m0436l5101
11241G249028o4876o0006j7548q192n0865p8913n8510m4839p4046q9873m5440
11230F655920J22k7171q7105q4990k4740J12m3413q5253p0380l2184k1872l5344
11218F143702m3786m2507l7027k3356r325j8555n1471p7579q1796p9286p2204
11207E606810m1032K078O822l7437p1542n4193k6399l7071n5707k8863J4408k015
11195E275859p4679j15659q2538l3473k6772l7713j9786Q541k008m3432n9372
11184D788968l2766r304k5708n8660o4481l9362j5356j2968k2474k7306k5154
11173D455429k2761k3824k7521l0037k4077p034O383o286m2430o5636m8707j4780
$$ plain form
11161 4148719 4139859 4107738 4068791 4060024 4076261 4068882 4015697 3959048 3950875 3981165 3991841 3954766
11149 3954766 3904663 3887391 3900311 3901888 3867836 3816416 3778382 3760591 3749095 3735486 3723000
11138 3723000 3709760 3685783 3653975 3636803 3646423 3659134 3640167 3590560 3547682 3535417 3534328 3511588
11126 3511588 3464189 3417955 3394644 3395615 3411286 3429643 3436023 3419906 3387568 3358974 3346061 3338715
11114 3338715 3317492 3278116 3238221 3218202 3218906 3223127 3217915 3206201 3191983 3165991 3120211 3069569
11102 3069569 3039028 3029282 3017183 2995044 2983769 2992826 2993451 2958207 2908205 2885918 2889729 2875585
11090 2875585 2827477 2785160 2783960 2802977 2802130 2783008 2775191 2779793 2771400 2751623 2752146 2773463 2768127
11077 2768127 2713070 2658802 2663618 2705086 2710323 2664702 2630865 2648479 2673832 2653388 2610687 2607246
$$ packed form
11161D148719q860l2121l8947q767J6237p379n3185n6649q173L0290J0676l7075
11149C954766n0103j7272J2920J577l4052n1420l8034j7791j1496j3609j2486
11138C723000j3240k3977l1808j7172R620J2711j8967m9607m2878j2265j089k2740
11126C511588m7399m6234k3311R71J5671J8357O380j6117l2338k8594j2913p346
11114C338715k1223l9376l9895k0019P04M221n212j1714j4218k5992m5780n0642
11102C069569l0541r746j2099k2139j1275R057O25l5244n0002k2287L811j4144
11090B875585m8108m2317j200J9017q47j9122p817M602q393j9777N23K1317n336
11077B768127n5057n4268M816M1468N237m5621l3837J7614K5353k0444m2701l441
$$ plain form
11065 2607246 2642265 2651651 2605371 2549700 2535324 2549323 2549075 2531085 2526296 2541512 2545846 2518632
11053 2518632 2479660 2458461 2454091 2443958 2422987 2413156 2430498 2458454 2467318 2453434 2441738 2447236
11041 2447236 2452854 2437810 2412005 2400805 2403732 2394946 2367347 2350046 2368539 2405981 2422768 2405748
11029 2405748 2379779 2371532 2377726 2377388 2367167 2368258 2390664 2405102 2375351 2317612 2293905 2330697
11017 2330697 2379573 2390571 2389617 2430291 2492640 2502514 2451910 2422164 2462613 2518655 2523662 2498849
11005 2498849 2503570 2537238 2559186 2569588 2597571 2632818 2644021 2651619 2704647 2788262 2833759 2830250
10993 2830250 2847466 2924295 3009506 3049433 3067120 3106896 3157366 3185461 3203084 3240061 3281817
10982 3281817 3294013 3289617 3313029 3365238 3397080 3377747 3327268 3278514 3243843 3221442 3200284
$$ packed form
11065B607246L5019R386m6280n5671j4376J3999k48j7990m789J5216M334k7214
11053B518632l8972k1199m370j0133k0971r831J7342K7956Q864j3884j1696N498
11041B447236N618j5044k5805j1200K927q786k7599j7301J8493L7442J6787j7020
11029B405748k5969q247O194l38j0221J091K2406J4438k9751n7739k3707L6792
11017B330697M8876J0998r54M0674O2349R874n0604k9746M0449N6042N007k4813
11005B498849M721L3668K1948J0402K7983L5247J1203P598N3028Q3615M5497l509
10993B830250J7216P6829Q5211L9927J7687L9776N0470K8095J7623L6977M1756
10982C281817J2196m396K3412N2209L1842j9333n0479m8754l4671k2401k1158
$$ plain form
10971 3200284 3155857 3073791 2982223 2929056 2919860 2907659 2853612 2770380 2693565 2636519 2591203
10960 2591203 2553394 2524602 2498435 2464197 2421965 2381198 2344874 2305339 2258059 2211472 2177647
10949 2177647 2157130 2140017 2119983 2096983 2066191 2022143 1982182 1982243 2026004 2058538 2026569 1952808
10937 1952808 1906189 1903026 1891906 1844398 1798653 1786430 1778320 1746103 1724782 1751639 1785964 1762516
10925 1762516 1699462 1674812 1704002 1720323 1685925 1646641 1649853 1671462 1663506 1628217 1603028 1601448
10913 1601448 1605676 1600069 1584064 1563875 1549598 1549427 1556846 1556932 1548046 1538158 1521450 1487446 1454212
10900 1454212 1456790 1494539 1525675 1525488 1513766 1510437 1502788 1478476 1456758 1460615 1482893 1500666
10888 1500666 1500663 1477816 1437024 1406485 1413799 1437912 1427620 1381664 1358248 1382419 1403516 1381254
$$ packed form
10971C200284m4427q2066r1568n3167r196j2201n4047q3232p6815n7046m5316
10960B591203l7809k8792k6167l4238m2232m0767l6324l9535m7280m6587l3825
10949B177647k0517j7113k0034k3000l0792m4048l9961O1M3761L2534l1969p3761
10937A952808m6619l163j1120m7508m5745j2223q110l2217k1321K6857L4325k3448
10925A762516o3054k4650K9190J6321l4398l9284L212K1609p956l5289k5189j580
10913A601448M228n607j6005k0189j4277j71P419Q6q886r888j6708l4004l3234
10900A454212K578L7749L1136j87j1722l329p649k4312k1718L857K2278J7773
10888A500666lk2847m0792l0539P314K4113j0292m5956k3416K4171K1097k2262
$$ plain form
10876 1381254 1353245 1365170 1389943 1381337 1359876 1369694 1388243 1364477 1321439 1326877 1370122 1366653
10864 1366653 1298236 1253000 1290152 1347499 1337730 1274811 1240526 1262705 1291085 1282324 1255419 1253394
10852 1253394 1281298 1300421 1278683 1234396 1215885 1236422 1255238 1241155 1223992 1244737 1281172
10841 1281172 1278770 1243023 1235697 1274055 1299481 1268345 1216891 1203336 1229803 1255887 1256586 1236839
10829 1236839 1214498 1210914 1234242 1259245 1252563 1223959 1213832 1226023 1224736 1207026 1214030 1249192
10817 1249192 1257166 1220740 1204560 1248239 1287041 1251487 1185717 1179450 1226235 1245185 1217379 1200950
10805 1200950 1217445 1220548 1190206 1171396 1194093 1225768 1231655 1222856 1218421 1213649 1211281 1233104
10793 1233104 1273546 1288720 1259674 1224422 1220198 1234065 1238499 1237428 1245172 1251072 1236788 1207413
$$ packed form
10876A381254k8009J1925K4773q606k1461R818J8549k3766m3038N438M3245l469
10864A366653o8417m5236L7152N7347r769o2919l4285K2179K8380q761k6905k025
10852A253394K7904J9123k1738m4287j8511K0537J8816j4083j7163K0745L6435
10841A281172k402l5747p326L8358K5426l1136n1454j3555K6467K6084O99j9747
10829A236839k2341l584K3328K5003o682k8604j0127J2191j287j7710P004L5162
10817A249192P974l6426j6180M3679L8802l5554o5770o267M6785J8950k7806j6429
10805A200950J6495L103l0342j8810K2697L1675N887q799m435m772k368K1823
10793A233104M0442J5174k9046l5252m224J3867M434j071P744N900j4284k9375
$$ plain form
10781 1207413 1182638 1175745 1193200 1229807 1256610 1246154 1217111 1215169 1242400 1253683 1235530 1230528
10769 1230528 1258636 1275155 1245980 1207645 1203398 1211734 1196842 1183703 1214062 1262730 1272630 1250756
10757 1250756 1253157 1286394 1300460 1278500 1258695 1258641 1250022 1225543 1222211 1251256 1267429 1241960
10745 1241960 1211385 1215949 1238859 1248468 1255426 1279041 1295313 1274184 1241290 1244356 1274707 1280640
10733 1280640 1251730 1231461 1243391 1262139 1270468 1289324 1325458 1339290 1303619 1256875 1253242 1286067
10721 1286067 1308512 1311494 1325739 1352189 1351605 1317102 1299574 1330280 1366667 1358361 1328415 1334025
10709 1334025 1371157 1381973 1350689 1326959 1342494 1365074 1361818 1355804 1380749 1418802 1428980 1413011
10697 1413011 1407875 1425721 1441742 1437544 1423327 1416586 1422483 1433790 1434601 1414221 1392042 1408048
$$ packed form
10781A207413k4775o893J7455L6607K6803j0456k9043j942K7231J1283j8153n002
10769A230528K8108J6519k9175l8335m247Q336j4892j3139L0359M8668R900k1874
10757A250756K401L3237J4066k1960j9805n4q619k4479l332K9045J6173k5469
10745A241960l0575M564K2910R609O958K3615J6272k1129l2894L066L0351N933
10733A280640k8910k0269J1930J8748Q329J8856L6134J3832l5671m6744l633L2825
10721A286067K2445K982J4245K6450n84l4503j7528L0706L6387q306k9946N610
10709A334025L7132J0816l1284k3730J5535K2580l256o014K4945L8053J0178j5969
10697A413011n136J7846J6021m198j4217o741N897J1307Q11k0380k2179J6006
$$ plain form
10685 1408048 1465823 1510214 1495913 1455565 1455765 1501673 1536792 1531038 1513968 1514815 1522361 1520677 1520397
10672 1520397 1534378 1557481 1585868 1622016 1649114 1640360 1608027 1599588 1625701 1638994 1612193 1589620
10660 1589620 1621296 1685911 1725217 1723626 1706822 1688937 1672385 1679011 1725794 1779991 1791540 1766435
10648 1766435 1757528 1782521 1803051 1794262 1785290 1809201 1850656 1870029 1857288 1840222 1849992 1888962
10636 1888962 1926536 1930122 1909686 1915147 1967888 2018291 2011145 1973840 1982760 2048026 2098590 2093856
10624 2093856 2080179 2104905 2139567 2138924 2125131 2151396 2214883 2267979 2295578 2320741 2346270 2351976
10612 2351976 2347929 2371682 2425261 2467513 2480352 2492868 2524668 2554611 2567749 2586780 2628312
10601 2628312 2670117 2695738 2732741 2805397 2881906 2916224 2918478 2933297 2965585 2984014 2990788 3026985
$$ packed form
10685A408048N7775M4391j4301m0348K00M5908L5119n754j7070Q47P546j684k80
10672A520397J3981K3103K8387L6148K7098q754l2333q439K6113J3293k6801k2573
10660A589620L1676O4615L9306j591j6804j7885j6552O626M6783N4197J1549k5105
10648A766435q907K4993K0530q789q972K3911M1455J9373j2741j7066R770L8970
10636A888962L7574L586k0436N461N2741N0403p146l7305Q920O5266N0564m734
10624B093856j3677K4726L4662o43j3793K6265O3487N3096K7599K5163K5529N706
10612B351976m047K3753N3579M2252J2839J2516L1800K9943J3138J9031M1532
10601B628312M1805K5621L7003P2656P6509L4318K254J4819L2288J8429O774L6197
$$ plain form
10589 3026985 3100460 3165837 3196229 3223459 3278610 3339633 3377165 3413373 3485511 3575552 3630786
10578 3630786 3646593 3677212 3757822 3858568 3931295 3970731 4011292 4082756 4183303 4284771 4357778
10567 4357778 4400727 4442115 4503574 4572178 4629088 4688320 4771895 4859748 4913671 4949607 5028321
10556 5028321 5159984 5278063 5338452 5387746 5487561 5619882 5726322 5806212 5909214 6048070
10546 6048070 6182038 6281340 6354228 6416609 6487504 6604880 6784606 6967943 7078141 7134381
10536 7134381 7236613 7421518 7611306 7737486 7837861 7978873 8150082 8305029 8455265
10527 8455265 8643219 8851227 9019525 9146429 9296469 9502710 9724927 9921086 10107612
10518 10107612 10324866 10580592 10851486 11116938 11374193 11635616 11918064 12221719 12522927
$$ packed form
10589C026985P3475O5377L0392K7230N5151O1023L7532L6208P2138R0041N5234
10578C630786J5807L0619Q0610J00746P2727L9436M0561P1464J00547J01468P3007
10567D357778M2949M1388O1459O8604N6910N9232Q3575Q7853N3923L5936P8714
10556E028321J31663J18079O0389M9294R9815J32321J06440P9890J03002J38856
10546F048070J33968R9302P2888O2381P0895J17376J79726J83337J10198N6240
10536G134381J02232J84905J89788J26180J00375J41012J71209J54947J50236
10527H455265J87954K08008J68298J26904J50040K06241K22217J96159J86526
10518A0107612K17254K55726K70894K65452K57255K61423K82448L03655L01208
$$ plain form
10509 12522927 12806566 13097260 13432757 13813609 14208785 14604389 15012650 15436944 15867088
10500 15867088 16311704 16795457 17314919 17833451 18333529 18844337 19404520 20021238 20672023
10491 20672023 21322426 21941846 22532408 23140025 23800638 24480310 25115275 25708172 26324097
10482 26324097 26984504 27636092 28247340 28859421 29500005 30121717 30686834 31245572 31851991
10473 31851991 32455296 32964352 33383372 33788713 34196431 34556805 34871552 35203571 35552045
10464 35552045 35825869 35982883 36101462 36257194 36408705 36473689 36451644 36391912 36287910 36089817
10454 36089817 35800134 35477840 35152879 34802324 34412450 34005741 33597183 33171094 32711810
10445 32711810 32219750 31690833 31115682 30505628 29887108 29264910 28620579 27949675 27270798
$$ packed form
10509A2522927K83639K90694L35497L80852L95176L95604M08261M24294M30144
10500A5867088M44616M83753N19462N18532N00078N10808N60183O16718O50785
10491B0672023O50403O19420N90562O07617O60613O79672O34965N92897O15925
10482B6324097O60407O51588O11248O12081O40584O21712N65117N58738O06419
10473C1851991O03305N09056M19020M05341M07718L60374L14747L32019L48474
10464C5552045K73824J57014J18579J55732J51511O4984k2045n9732j04002j98093
10454C6089817k89683l22294l24961l50555l89874m06709m08558m26089m59284
10445C2711810m92060n28917n75151o10054o18520o22198o44331o70904o78877
$$ plain form
10436 27270798 26597454 25931925 25284143 24659631 24030934 23365156 22682864 22039820 21440308
10427 21440308 20824972 20167446 19523910 18946530 18401748 17832081 17257139 16740206 16275827
10418 16275827 15791484 15266067 14770662 14363949 14009622 13639967 13253670 12896839 12577535
10409 12577535 12260713 11939310 11649048 11399883 11145746 10852297 10555273 10310803 10113319
10400 10113319 9910604 9688164 9483924 9313577 9138125 8931503 8729853 8571211 8427702
10391 8427702 8254080 8072777 7939053 7835247 7683930 7478071 7311385 7239869 7190690 7070235
10381 7070235 6900090 6767688 6686174 6593472 6468969 6357386 6275474 6183227 6065001 5958576
10371 5958576 5876274 5773710 5635258 5518091 5459289 5403500 5288191 5149260 5066335 5037884
$$ packed form
10436B7270798o73344o65529o47782o24512o28697o65778o82292o43044n99512
10427B1440308o15336o57526o43536n77380n44782n69667n74942n16933m64379
10418A6275827m84343n25417m95405m06713l54327l69655l86297l56831l19304
10409A2577535l16822l21403k90262k49165k54137k93449k97024k44470j97484
10400A0113319k02715k22440k04240j70347j75452k06622k01650j58642j43509
10391H427702j73622j81303j33724j03806j51317k05859j66686p1516m9179j20455
10381G070235j70145j32402q1514r2702j24503j11583q1912r2247j18226j06425
10371E958576q2302j02564j38452j17167n8802n5789j15309j38931q2925k8451
$$ plain form
10361 5037884 4990910 4897094 4799164 4723426 4643169 4544177 4459727 4413133 4377371 4321278 4254458
10350 4254458 4197172 4140211 4064968 3977989 3899653 3837851 3790103 3749105 3692661 3598992 3491242
10339 3491242 3431801 3442624 3462592 3421824 3332470 3260687 3227412 3191938 3131263 3077594 3057950
10328 3057950 3043853 2994120 2916375 2848702 2799667 2748137 2696353 2677868 2699221 2711651 2669840
10317 2669840 2594915 2544030 2531111 2519177 2488454 2463132 2455515 2432910 2374192 2318070 2306532
10306 2306532 2310654 2272897 2206214 2180752 2209441 2219810 2162971 2084438 2047707 2043926 2028095 2000111
10294 2000111 1989393 1987737 1960378 1911346 1880178 1876331 1867914 1837920 1804850 1780698 1751629 1712609
10282 1712609 1684260 1679713 1682595 1670629 1639014 1594548 1550278 1528930 1544129 1573367 1576744 1547221
$$ packed form
10361E037884m6974r3816r7930p5738q0257r8992q4450m6594l5762n6093o6820
10350D254458n7286n6961p5243q6979p8336o1802m7748m0998n6444r3669j07750
10339C491242n9441J0823J9968m0768q9354p1783l3275l5474o0675n3669j9644
10328C057950j4097m9733p7745o7673m9035n1530n1784j8485K1353J2430m1811
10317B669840p4925n0885j2919j1934l0723k5322p617k2605n8718n6122j1538
10306B306532M122l7757o6683k5462K8689J0369n6839p8533l6731l781j5831k7984
10294B000111j0718j656k7359m9032l1168l847q417k9994l3070k4152k9069l9020
10282A712609k8349m547K882j1966l1615m4466m4270k1348J5199K9238L377k9523
$$ plain form
10270 1547221 1514608 1497175 1482985 1466119 1463528 1478555 1480036 1440752 1375001 1319816 1296443 1301425
10258 1301425 1314931 1309231 1273167 1235533 1235010 1260154 1257328 1211662 1174846 1185942 1209402 1192261
10246 1192261 1146233 1122761 1130598 1131943 1109521 1086005 1076486 1066471 1044536 1021220 1006622 997065
10234 997065 989797 985889 975649 946945 911141 894296 897793 894837 874627 863035 883117 914942
10222 914942 916244 876671 834001 831643 867045 892232 870413 822137 798688 815417 837762 835588
10210 835588 818363 804213 789216 768478 753458 742692 712153 666345 656091 700593 736416
10199 736416 706386 659273 679526 744401 749600 674321 616245 639200 685194 681890 648802 636496
10187 636496 634536 611250 588310 601733 630225 632151 618905 623646 629497 600724 559005 553206
$$ packed form
10270A547221l2613j7433j4190j6866k591J5027J481l9284o5751n5185k3373M982
10258A301425J3506n700l6064l7634n23K5144k826m5666l6816J1096K3460j7141
10246A192261m6028k3472P837J345k2422k3516r519j0015k1935k3316j4598r557
10234I97065p268l908j0240k8704l5804j6845L497k956k0210j1592K0082L1825
10222I14942J302l9573m2670k358L5402K5187k1819m8276k3449J6729K2345k174
10210H35588j7225j4150j4997k0738j5020j0766l0539m5808j0254M4502L5823
10199G36416l0030m7113K0253O4875N199p5279n8076K2955M5994l304l3088j2306
10187F36496j960k3286k2940J3423K8492J926j3246M741N851k8773m1719n799
$$ plain form
10175 553206 571659 562301 529218 527718 563041 576807 548198 528801 549289 564801 534412 494199
10163 494199 499567 536646 543565 497518 438334 416806 447346 500976 527725 500716 449075 426745
10151 426745 442929 455293 440807 429295 443558 451548 417569 366722 352094 379198 407715 414406
10139 414406 411608 411105 409512 406979 406334 396018 365319 332792 327495 345140 356017 353601 358118
10126 358118 370576 364579 334637 313567 323195 341391 341339 334232 344220 363554 365370 347647 331674
10113 331674 323165 308064 289011 293622 332674 374312 380798 356849 337954 336506 326959 292311
10101 292311 259835 267070 304936 325851 310895 296707 317521 347092 331525 269144 220325 231918
10089 231918 283424 322648 328138 313970 293495 269918 255125 264194 285254 283333 248986 220341
$$ packed form
10175E53206J8453r358l3083j500L5323J3766k8609j9397K0488J5512l0389m0213
10163D94199N368L7079O919m6047n9184k1528L0540N3630K6749k7009n1641k2330
10151D26745J6184J2364j4486j1512J4263P990l3979n0847j4628K7104K8517O691
10139D14406k798n03j593k533o45j0316l0699l2527n297J7645J0877k416M517
10126C58118J2458n997k9942k1070R628J8196n2p107R988J9334J816j7723j5973
10113C31674q509j5101j9053M611L9052M1638O486k3949j8895j448r547l4648
10101B92311l2476P235L7866K0915j4956j4188K0814K9571j5567o2381m8819J1593
10089B31918N1506L9224N490j4168k0475k3577j4793R069K1060j921l4347k8645
$$ plain form
10077 220341 234347 271786 280489 248861 222629 238393 271948 277384 255215 245851 263332 275934
10065 275934 261378 244151 254627 278326 278286 253345 238622 249425 257940 236159 196915 175287
10053 175287 183942 204143 214378 213042 212725 221725 235130 242281 240530 237739 239022 237128 223188
10040 223188 202071 187268 184582 192448 212752 243561 263903 250415 214661 197665 213474 224356
10028 224356 195706 152472 145317 173371 184790 157745 135576 159638 204763 217774 196980 188917
10016 188917 212137 229919 210771 177421 169831 185809 191740 179831 178465 202852 227387 223218
10004 223218 202197 200597 226762 247693 232629 193573 169098 174601 186726 182632 176954 199282
9992 199282 242320 261859 237183 203704 204356 230838 243510 234524 232830 250389 264346 259591 250517
$$ packed form
10077B20341J4006L7439Q703l1628k6232J5764L3555N436k2169r364J7481J2602
10065B75934j4556j7227J0476K3699m0k4941j4723J0803Q515k1781l9244k1628
10053A75287Q655K0201J0235j336l17R000J3405P151j751k791J283j894j3940
10040B23188k1117j4803k686P866K0304L0809K0342j3488l5754j6996J5809J0882
10028B24356k8650m3234p155K8054J1419k7045k2169K4062M5125J3011k0794q063
10016A88917K3220J7782j9148l3350p590J5978N931j1909j366K4387K4535m169
10004B23218k1021j600K6165K0931j5064l9056k4475N503J2125m094n678K2328
9992A99282M3038J9539k4676l3479O52K6482J2672q986j694J7559J3957m755r074
$$ plain form
9979 250517 247424 239191 228145 242613 285961 310434 281732 239545 245751 293391 321150 307166
9967 307166 289617 292754 293629 279654 282231 319849 352152 333619 286030 274345 321564 382634
9955 382634 400996 366789 318395 300745 321441 344176 333910 305156 301646 327864 339098 314149
9943 314149 293754 314142 342442 326810 282839 271939 305813 331897 315953 284087 270778 273814
9931 273814 277796 279383 270852 239791 205015 209913 255469 285213 269586 256685 290090 321335
9919 321335 275758 180479 141802 191130 237134 202524 135623 130494 187181 221841 193463 149066
9907 149066 139243 150545 145557 125588 119492 134326 148867 145802 127236 104616 90952 96985 119357
9894 119357 137819 137696 128506 126617 128230 117456 94829 77737 75462 82933 95934 111222 114484
$$ packed form
9979B50517l093q233j1046J4468M3348K4473k8702m2187O206M7640K7759j3984
9967C07166j7549L137Q75j3975K577L7618L2303j8533m7589j1685M7219O1070
9955C82634J8362l4207m8394j7650K0696K2735j0266k8754l510K6218J1234k4949
9943C14149k0395K0388K8300j5632m3971j0900L3874K6084j5944l1866j3309L036
9931B73814L982J587q531l1061l4776M898M5556K9744j5627j2901L3405L1245
9919C21335m5577r5279l8677M9328M6004l4610o6901n129N6687L4660k8378m4397
9907A49066r823J1302m988j9969o096J4834J4541l065j8566k2620j3664O033K2372
9894A19357J8462j23r190j889J613j0774k2627j7092k275P471J3001J5288L262
$$ plain form
9881 114484 94442 70527 77098 111606 127882 96079 42578 11061 8870 16151 25492 40932
9869 40932 52241 44587 29193 34239 65265 99699 119994 127000 120232 93005 54872 34786 48571
9856 48571 77843 91641 79442 57011 47662 60164 78597 76777 50123 24821 24109 38598 48030
9843 48030 56217 75471 89057 68480 26439 10824 37003 64273 54920 22974 5373 13270
9831 13270 31495 42544 34899 10292 -6617 6223 25698 6085 -43104 -53797 -2507 39279
9819 39279 7070 -53716 -53838 5677 44388 30774 14814 27677 32853 4612 -17607 2708
9807 2708 31986 19301 -21248 -34189 -7331 17164 9501 -11575 -13505 7209 24731 13809
9795 13809 -21280 -44000 -22326 26751 48358 16341 -33173 -51363 -35949 -16567 -4239 9295
$$ packed form
9881A14484k0042k3915O571L4508J6276l1803n3501l1517k191P281R341J5440
9869D0932J1309p654j5394N046L1026L4434K0295P006o768k7227l8133k0086J3785
9856D8571K9272J3798j2199k2431r349J2502J8433j820k6654k5302p12J4489R432
9843D8030Q187J9254J3586k0577m2041j5615K6179K7270r353l1946j7601P897
9831A3270J8225J1049p645k4607j6909J2840J9475j9613m9189j0693N1290M1786
9819C9279l2209o0786j22N9515L8711j3614j5960J2863N176k8241k2219K0315
9807B708K9278j2685m0549j2941K6858K4495p663k1076j930K0714J7522j0922
9795A3809l5089k2720K1674M9077K1607l2017m9514j8190J5414J9382J2328J3534
$$ plain form
9783 9295 16442 -306 -28688 -33229 -10449 -1808 -34160 -76825 -82619 -51201 -22661 -18001 -16518
9770 -16518 4596 33472 40061 16329 -14269 -23354 -4544 22885 29870 1740 -43601 -65890
9758 -65890 -44244 -6879 -2319 -38996 -73931 -69611 -39669 -21827 -26589 -36773 -41234 -39491 -24659
9745 -24659 4876 24008 7939 -22419 -23592 -409 -5081 -51459 -82741 -55993 -11323 -10087
9733 -10087 -39748 -38386 4282 32181 9978 -30694 -46987 -41501 -39685 -43952 -38686 -22345 -10128
9720 -10128 -12297 -24556 -34595 -31720 -18258 -13394 -32199 -59069 -61061 -33924 -13140 -25539 -49848
9707 -49848 -46503 -13561 12756 9708 -6077 -11419 -12583 -29476 -55462 -58944 -29733 -870 -6996
9694 -6996 -36251 -48505 -33722 -20432 -23712 -21400 785 14588 -9929 -53008 -70351 -54339
$$ packed form
9783I295P147j6748k8382m541K2780Q641l2352m2665n794L1418K8540M660J483
9770a6518K1114K8876O589k3732l0598r085J8810K7429O985k8130m5341k2289
9758f5890K1646L7365M560l6677l4935M320K9942J7842m762j0184m461J743J4832
9745b4659K9535J9132j6069l0358j173K3183m672m6378l1282K6748M4670J236
9733a0087k9661J362M2668K7899k2203m0672j6293N486J816m267N266J6341J2217
9720a0128k169j2259j0039K875J3462M864j8805k6870j992K7137K0784j2399k4309
9707d9848L345L2942K6317l048j5785n342j164j6893k5986l482K9211K8863o126
9694f996k9255j2254J4783J3290l280K312K2185J3803k4517m3079j7343J6012
$$ plain form
9682 -54339 -33558 -21904 -8279 6270 2226 -22128 -43544 -49626 -49241 -43429 -23854 -6651 -23289
9669 -23289 -62397 -67886 -21470 18969 2091 -36395 -27438 25095 51940 22700 -16787 -19490
9657 -19490 933 3905 -19262 -45830 -57765 -53488 -36843 -15019 -2485 -11689 -38062 -60579
9645 -60579 -60171 -39002 -20936 -27069 -49455 -59021 -43331 -22424 -18800 -28500 -36264 -42290 -53194
9632 -53194 -60170 -50411 -31033 -18447 -13401 -10338 -18829 -45270 -65051 -50921 -22241 -21979 -45505
9619 -45505 -43354 -5334 13615 -20780 -60779 -44349 11456 34288 -6669 -74307 -121783 -132171
9607 -132171 -105986 -54524 -10607 -7978 -40296 -69249 -77908 -85138 -102084 -110484 -97965 -81163
9595 -81163 -73714 -61115 -32232 -9459 -16789 -37548 -38417 -22679 -22107 -40899 -47450 -27580 -8197
$$ packed form
9682e4339K0781J1654J3625J4549m044k4354k1416o082L85N812J9575J7203j6638
9669b3289l9108n489M6416M0439j6878l8486Q957N2533K6845k9240l9487k703
9657a9490K0423K972k3167k6568j1935M277J6645K1824J2534r204k6373k2517
9645f0579M08K1169J8066o133k2386r566J5690K0907L624r700p764o026j0904
9632e3194o976R759J9378J2586N046L063q491k6441j9781J4130K8680K62k3526
9619d5505K151L8020J8949l4395l9999J6430N5805K2832m0957o7638m7476j0388
9607a32171K6185N1462M3917K629l2318k8953q659p230j6946q400J2519J6802
9595h1163P449J2599K8883K2773p330k0759q69J5738N72j8792o551J9870J9383
$$ plain form
9582 -8197 -12762 -26366 -27880 -28338 -45726 -61793 -43358 -225 18249 -9140 -46755 -55974 -45981
9569 -45981 -46933 -57766 -53710 -32722 -19189 -22714 -26199 -22343 -31734 -66882 -99975 -91370 -42716
9556 -42716 -335 -3974 -45910 -85381 -94925 -84699 -80684 -85273 -71243 -22247 31497 38355 -11950
9543 -11950 -71213 -89025 -68609 -50047 -52616 -59246 -54549 -50343 -62979 -84523 -93502 -85963 -79880
9530 -79880 -89338 -106572 -113079 -100416 -75364 -50772 -38314 -46165 -72846 -100582 -104455 -76796 -38938
9517 -38938 -21171 -32602 -56531 -71802 -69643 -51967 -26165 -5334 -2850 -19371 -40619 -53010
9505 -53010 -56737 -59947 -66081 -72631 -78603 -86917 -98703 -107713 -103930 -87355 -76146 -88173 -109494
9492 -109494 -99765 -46641 2347 -7563 -61956 -90527 -59623 -12200 -2379 -29180 -58032 -71971
$$ packed form
9582h197m565j3604j514m58j7388j6067J8435M3133J8474k7389l7615r219R993
9569d5981r52j0833M056K0988J3533l525l485L856r391l5148l3093Q605M8654
9556d2716M2381l639m1936l9471r544J0226M015m589J4030M8996N3744O858n0305
9543a1950n9263j7812K0416J8562k569o630M697M206j2636k1544q979P539O083
9530g9880r458j7234o507J2663K5052K4592J2458p851k6681k7736l873K7659L7858
9517c8938J7767j1431k3929j5271K159J7676K5802K0831K484j6521k1248j2391
9505e3010l727l210o134o550n972q314j1786r010L783J6575J1209j2027k1321
9492a09494R729N3124M8988r910n4393k8571L0904M7423R821k6801k8852j3939
$$ plain form
9480 -71971 -70409 -49142 -19883 -21974 -69256 -107677 -79387 -14649 2096 -44371 -79240 -55319
9468 -55319 -21129 -33742 -65157 -54285 -11448 -1588 -39287 -68526 -52060 -21606 -18537 -32730
9456 -32730 -33451 -27865 -47516 -89754 -113030 -95875 -69526 -74014 -100303 -101958 -61934 -21548 -28844
9443 -28844 -75062 -105348 -87552 -46079 -23170 -29129 -42821 -44185 -30944 -14652 -13514 -37928
9431 -37928 -70328 -73689 -37983 -3894 -15179 -57096 -73678 -44858 -10926 -9411 -22249 -11209
9419 -11209 19006 29096 8136 -9324 2973 23276 16061 -14319 -31629 -22138 -12422 -27656
9407 -27656 -56950 -74293 -75151 -71747 -64012 -40548 -6721 11979 1121 -24183 -37645 -26025 6443
9394 6443 41319 50922 19897 -30853 -60247 -54626 -39637 -37510 -39214 -33486 -33394 -48238 -55679 -36222
$$ packed form
9480g1971J562K1267K9259k091m7282l8421K8290O4738J6745m6467l4869K3921
9468e5319L4190j2613l1415J0872M2837R860l7699k9239J6466L0454L069j4193
9456c2730p21N586j9651m2238k3276J7155K6349m488k6289j655M0024M0386p296
9443b8844m6218l0286J7796M1473K2909n959j3692j364J3241J6292J138k4414
9431c7928l2400l361L5706L4089j1285m1917j6582K8820L3932J515j2838J1040
9419a1209L0215J0090k0960j7460J2297K0303p215l0380j7310R491R716j5234
9407b7656k9294j7343q58L404P735K3464L3827J8700j0858k5304j3462J1620L2468
9394F443L4876R603l1025n0750k9394N621J4989K127j704N728R2j4844p441J9457
$$ plain form
9380 -36222 -14946 -28382 -62892 -70930 -43654 -19654 -17961 -13076 7589 10899 -27043 -72609 -79816
9367 -79816 -56703 -46471 -60929 -74232 -73082 -71121 -73198 -64335 -43012 -31918 -41078 -48479 -36705
9354 -36705 -25160 -39050 -61006 -47283 5885 43229 16514 -48756 -80271 -49423 -5454 -7320
9342 -7320 -48166 -75205 -68405 -59831 -73058 -85592 -72873 -55988 -69738 -100866 -99086 -50012 -2129
9329 -2129 -7976 -60818 -105319 -99484 -53846 -14840 -17098 -50555 -73889 -61987 -32712 -18421 -22238
9316 -22238 -22441 -14348 -19721 -47498 -71427 -64162 -36277 -21311 -31776 -49173 -53145 -43834 -35728
9303 -35728 -41471 -61336 -80227 -78672 -56134 -38009 -47107 -72622 -82015 -61655 -29907 -9991 -7388
9290 -7388 -17518 -37069 -58331 -67562 -61289 -53679 -57318 -67164 -73247 -75660 -74025 -58410 -31229 -22668
$$ packed form
9380c6222K1276j3436l4510q038K7276K4000J693M885K0665L310l7942m5566p207
9367g9816K3113J0232j4458j3303J150J961k077Q863K1323J1094r160p401J1774
9354c6705J1545j3890k1956J3723N3168L7344k6715o5270l1515L0848M3969j866
9342g320m0846k7039O800Q574j3227j2534J2719J6885j3750l1128J780M9074M7883
9329b129n847n2842m4501N835M5638L9006k258l3457k3334J1902K9275J4291l817
9316b2238k03Q093n373k7777k3929P265K7885J4966j0465j7397l972R311Q106
9303c5728n743j9865j8891J555K2538J8125r098k5515r393K0360L1748J9916K603
9290g388j0130j9551k1262r231O273P610l639r846o083k413J635J5615K7181Q561
$$ plain form
9276 -22668 -53599 -90726 -76705 -10642 38992 19180 -42287 -80945 -77166 -60422 -52148 -45057
9264 -45057 -33416 -25244 -20148 -7231 7510 640 -31709 -61954 -67561 -55868 -41453 -24669 -8254
9251 -8254 -9102 -30510 -43580 -23220 11013 16960 -15289 -54756 -70796 -60969 -40578 -24281 -18300
9238 -18300 -17444 -12350 -7094 -16457 -34553 -28754 11631 44088 26452 -16198 -24783 2810 9919
9225 9919 -24362 -49661 -28458 -135 -17886 -63103 -75647 -44959 -15927 -14011 -17842 -9389 -3474
9212 -3474 -13532 -26155 -27980 -28112 -35248 -38366 -30767 -30557 -52387 -75505 -68092 -35480 -16956 -34440
9198 -34440 -67041 -81241 -67817 -41493 -19482 -10862 -16485 -27209 -27371 -10507 10114 14333 -2632
9185 -2632 -26727 -42116 -45261 -43181 -44229 -50460 -54280 -45357 -27473 -23334 -49709 -89395 -104432
$$ packed form
9276b2668l0931l7127J4021O6063M9634j9812o1467l8658L779J6744Q274P091
9264d5057J1641Q172N096J2917J4741o870l2349l0245n607J1693J4415J6784J6415
9251h254q48k1408j3070K0360L4233N947l2249l9467j6040R827K0391J6297N981
9238a8300Q56N094N256r363j8096N799M0385L2457j7636m2650q585K7593P109
9225I919l4281k5299K1203K8323j7751m5217j2544L0688K9032J916l831Q453N915
9212c474j0058j2623j825j32p136l118P599K10k1830k3118P413L2612J8524j7484
9198c4440l2601j4200J3424K6324K2011Q620n623j0724j62J6864K0621M219j6965
9185b632k4095j5389l145K080j048o231l820Q923J7884M139k6375l9686j5037
$$ plain form
9172 -104432 -81087 -45594 -28845 -33303 -45378 -60647 -77859 -83800 -68176 -44213 -31521 -27262
9160 -27262 -18817 -14268 -27532 -40525 -22392 10451 1760 -58745 -104002 -78597 -20739 -8018
9148 -8018 -45891 -66614 -34546 4010 -6737 -53141 -76070 -50135 -7813 7952 -10007 -37256
9136 -37256 -50973 -48619 -39115 -27377 -13875 -4203 -7936 -25945 -47316 -61146 -62729 -48137 -17522
9123 -17522 12220 16306 -6233 -26328 -23022 -11536 -17683 -40336 -58440 -62265 -57599 -49855 -42973
9110 -42973 -43030 -45801 -35723 -15372 -14301 -42598 -60017 -28126 27160 49254 31659 15073 14491
9097 14491 7321 -6968 1231 28009 26442 -16123 -48346 -32236 1826 10405 -2612 -16643 -33969
9084 -33969 -46506 -16715 53671 86405 27016 -57548 -60379 13417 61546 37734 -1625 -8871
$$ packed form
9172a04432K3345L5493J6749m458j2075j5269j7212n941J5624K3963J2692M259
9160b7262Q445M549j3264j2993J8133L2843q691o0505m5257K5405N7858J2721
9148h018l7873k0723L2068L8556j0747m6404k2929K5935M2322J5765j7959k7249
9136c7256j3717K354R504J1738J3502R672l733j8009k1371j3830j583J4592L0615
9123a7522K9742M086k2539k0095L306J1486o147k2653j8104l825M666P744O882
9110d2973n7k771J0078K0351J071k8297j7419L1891N5286K2094j7595j6586n82
9097A4491p170j4289Q199K6778j567m2565l2223J6110L4062Q579j3017j4031j7326
9084c3969j2537K9791P0386L2734n9389q4564k831P3796M8129k3812l9359p246
$$ plain form
9072 -8871 -9751 -28686 -32805 2110 33519 13384 -38390 -72013 -81053 -86901 -82178 -46176 1426
9059 1426 17232 -173 -8032 15236 42591 43466 22862 4010 -2693 -513 6355 14046 17112 13387
9045 13387 6569 2554 6698 20988 38423 46268 41821 37110 39965 41148 32241 24313 30650 39755
9031 39755 29065 3839 -2899 22664 48814 34605 -17990 -64060 -65466 -28186 11691 28418
9019 28418 25461 20289 23439 35426 52180 63624 55309 25437 -3545 -5500 17818 40600 48652
9006 48652 53330 65099 71965 56355 21941 -8186 -14761 1598 21743 24864 11802 6436 20308
8993 20308 27258 1130 -29535 -7903 64277 116144 105519 75705 77422 85538 53449 11253
8981 11253 29215 95906 118169 57322 -11964 -12241 33505 57401 52156 58641 80708 81265 55242
$$ packed form
9072h871q80j8935m119L4915L1409k0135n1774l3623r040n848M723L6002M7602
9059A426J5806j7405p859K3268K7355Q75k0604j8852o703K180O868P691L066l725
9045A3387o818m015M144J4290J7435P845m447m711K855J183q907p928O337R105
9031C9755j0690k5226o738K5563K6150j4209n2595m6070j406L7280L9877J6727
9019B8418k957n172L150J1987J6754J1444q315k9872k8982j955K3318K2782Q052
9006D8652M678J1769O866j5610l4414l0127o575J6359K0145L121j3062n366J3872
8993B0308O950k6128l0665K1632P2180N1867j0625k9814J717Q116l2089m2196
8981A1253J7962O6691K2263o0847o9286k77M5746K3896n245O485K2067N57k6023
$$ plain form
8968 55242 43659 64549 80894 59186 21532 10792 29233 43359 36647 26520 30804 44715
8956 44715 57858 71537 86242 89475 73926 55421 51724 52543 36885 15291 20611 51783 65699
8943 65699 43391 26030 53509 99740 110830 83624 58642 52385 50511 57795 92972 132121
8931 132121 122742 69057 38761 59739 75526 41811 3055 17339 59536 68844 52532 63923
8919 63923 100825 108479 77654 59507 74354 80852 55808 34867 43455 50017 27930 10015 33352
8906 33352 71919 75968 47923 27539 24663 20240 19476 47033 89870 98932 61595 28282 44033
8893 44033 86123 97989 65966 32698 38868 75103 98619 85492 55302 43740 59257 76338
8881 76338 70943 50165 39319 49073 67073 77777 78455 74909 71130 67904 67786 75872 91894 103081
$$ packed form
8968E5242j1583K0890J6345k1708l7654j0740J8441J4126o712j0127M284J3911
8956D4715J3143J3679J4705L233j5549j8505l697Q19j5658k1594N320L1172J3916
8943F5699k2308j7361K7479M6231J1090k7206k4982o257j874P284L5177L9149
8931A32121r379n3685l0296K0978J5787l3715l8756J4284M2197R308j6312J1391
8919F3923L6902P654l0825j8147J4847O498k5044k0941Q588O562k2087j7915K3337
8906C3352L8567M049k8045k0384k876m423p64K7557M2837R062l7337l3313J5751
8893D4033M2090J1866l2023l3268O170L6235K3516j3127l0190j1562J5517J7081
8881G6338n395k0778j0846R754J8000J0704O78l546l779l226j18Q086J6022J1187
$$ plain form
8867 103081 94261 70798 59456 71980 79833 50301 1417 -13295 21004 59545 66144 62930
8855 62930 83702 112723 110977 80459 57495 54444 52362 46066 52708 73973 89696 93210 95974
8842 95974 94084 70891 39659 39799 76510 106348 101924 89786 99451 114305 105214 80136 65742
8829 65742 66035 71610 84368 100128 93009 54231 22440 35197 71514 84570 71299 63212 65951
8816 65951 59578 46576 45732 46698 27315 10541 41578 106683 140691 124042 103251 99922 76610
8803 76610 23247 -1874 33693 73570 65272 50521 87877 141484 137304 90888 79628 108727
8791 108727 109222 68216 55124 96758 125416 92926 51325 65178 112725 135536 131054 130229 126187
8778 126187 94852 59510 67256 113395 147051 145313 131163 123420 118098 117696 131890 146511 135315
$$ packed form
8867A03081q820k3463j1342J2524P853k9532m8884j4712L4299L8541O599l214
8855F2930K0772K9021j746l0518k2964l051k082o296O642K1265J5723L514K764
8842I5974j890k3193l1232J40L6711K9838m424j2138R665J4854r091k5078j4394
8829F5742K93N575J2758J5760p119l8778l1791J2757L6317J3056j3271q087K739
8816F5951o373j3002q44R66j9383j6774L1037O5105L4008j6649k0791l329k3312
8803G6610n3363k5121L5567L9877q298j4751L7356N3607m180m6416j1260K9099
8791A08727M95m1006j3092M1634K8658l2490m1601J3853M7547K2811m482q25m042
8778A26187l1335l5342P746M6139L3656j738j4150p743n322m02J4194J4621j1196
$$ plain form
8765 135315 107157 99927 120829 133877 118338 100555 109911 135661 148179 138750 119759 104367
8753 104367 100522 108698 115658 107308 93177 96974 118178 129592 120646 112426 116480 112478 89669
8740 89669 79672 115427 178447 221125 228220 222602 218704 206398 182214 163682 162727 168833 170305
8727 170305 173852 189275 207260 208331 191043 178468 191057 217917 224976 196648 160059 154538
8715 154538 182545 210532 217500 216227 218646 211089 184905 164716 175360 199786 205367 199061 215125
8702 215125 252268 268784 249212 232251 251585 286083 298328 293100 300067 316787 311817 281605
8690 281605 263775 282700 313701 321094 309594 312229 337656 357408 348842 327679 323977 339738
8678 339738 350130 343371 338120 352973 375430 378479 360929 351142 367774 394874 407330 408565 424690
$$ packed form
8765A35315k8158p230K0902J3048j5539j7783R356K5750J2518r429j8991j5392
8753A04367l845Q176O960q350j4131L797K1204J1414q946q220M054m002k2809
8740H9669r997L5755O3020M2678P095n618l898j2306k4184j8532r55O106J472
8727A70305L547J5423J7985J071j7288j2575J2589K6860P059k8328l6589n521
8715A54538K8007K7987O968j273K419p557k6184k0189J0644K4426N581o306J6064
8702B15125L7143J6516j9572j6961J9334L4498J2245n228O967J6720m970l0212
8690B81605j7830J8925L1001P393j1500K635K5427J9752q566k1163l702J5761
8678C39738J0392o759n251J4853K2457L049j7550r787J6632K7100J2456J235J6125
$$ plain form
8665 424690 463205 497017 499746 483712 484458 510610 530936 519742 495178 492905 514911 531562
8653 531562 530831 534121 555001 572027 561945 537919 531073 548852 575589 603044 634112 662011
8641 662011 671714 662448 648646 639746 637310 647007 670079 686450 674387 649216 653421 699965 752636
8628 752636 775768 779117 795084 829766 858355 861580 849632 849340 873686 905153 914898 903299 906710
8615 906710 946995 992718 1002813 994363 1019729 1078903 1111957 1093189 1073508 1098116 1137860 1148597
8603 1148597 1150329 1186832 1241485 1262552 1254568 1274578 1339876 1404552 1435697 1454836 1489885 1537388
8591 1537388 1587593 1639075 1674367 1671986 1659817 1699924 1792736 1855249 1838289 1812561 1877557 2020800
8579 2020800 2135917 2164418 2152353 2165716 2211943 2262989 2307135 2349214 2388453 2421526 2452154
$$ packed form
8665D24690L8515L3812K729j6034P46K6152K0326j1194k4564k273K2006J6651
8653E31562p31L290K0880J7026j0082k4026o846J7779K6737K7455L1068K7899
8641F62011R703r266j3802q900k436R697K3072J6371j2063k5171M205M6544N2671
8628G52636K3132L349J5967L4682K8589L225j1948k92K4346L1467R745j1599L411
8615I06710M0285M5723J0095q450K5366N9174L3054j8768j9681K4608L9744J0737
8603A148597J732L6503N4653K1067p984K0010O5298O4676L1145J9139L5049M7503
8591A537388N0205N1482L5292k381j2169M0107R2812O2513j6960k5728O4996J43243
8579B020800J15117K8501j2065J3363M6227N1046M4146M2079L9239L3073L0628
$$ plain form
8568 2452154 2482679 2509418 2534529 2565437 2594096 2596344 2565671 2531494 2525640 2538826 2527520 2463340
8556 2463340 2364162 2274073 2219322 2188162 2152406 2102628 2054194 2018311 1980057 1916657 1830921
8545 1830921 1751707 1700335 1667528 1626735 1563783 1491266 1435697 1408006 1387348 1345299 1288520
8534 1288520 1255955 1259318 1252305 1191766 1110897 1082848 1112670 1121250 1056911 970064 936831 951088
8522 951088 948495 911340 882395 880519 873137 847457 840733 864874 862680 794547 721116 727091 789808
8509 789808 806493 747842 695714 706065 722828 681837 626591 639134 700356 712977 650322 589735
8497 589735 585674 595074 564061 517341 508617 532476 543738 532178 521867 517109 503734 492506
8485 492506 508025 536346 533057 489603 448077 439428 445892 439381 422542 412692 412610 416562 423155 425452
$$ packed form
8568B452154L0525K6739K5111L0908K8659K248l0673l4177n854J3186j1306o4180
8556B463340r9178r0089n4751l1160l5756m9778m8434l5883l8254o3400q5736
8545A830921p9214n1372l2807m0793o2952p2517n5569k7691k0658m2049n6779
8534A288520l2565L363p013o0539q0869k8049K9822Q580o4339q6847l3233J4257
8522I51088k593l7155k8945j876p382k5680o724K4141k194o8133p3431N975O2717
8509G89808J6685n8651n2128J0351J6763m0991n5246J2543O1222J2621o2655o0587
8497E89735m061R400l1013m6720q724K3859J1262j1560j0311m758j3375j1228
8485D92506J5519K8321l289m3454m1526q649O464o511j6839r850q2L952O593K297
$$ plain form
8471 425452 409674 380619 366891 381157 395345 379597 349635 345890 372541 387814 359703 307520
8459 307520 275757 281078 300340 306369 299902 298862 305243 299286 270863 240853 236018 251255 256160
8446 256160 237418 214935 212527 230605 254065 270741 273879 261308 242006 231209 230480 225313 210767
8433 210767 203914 217689 236393 235148 215239 200873 203373 207112 195599 177340 174513 190568 202381
8420 202381 191791 175393 184482 214779 222676 187527 150804 160513 196039 194894 148895 119203
8408 119203 143039 179743 179434 158092 160438 182365 182701 154891 135619 144928 161135 159896 144080
8395 144080 128693 123418 135151 164345 194431 203690 189728 167990 151017 144107 150631 162398
8383 162398 158182 134121 118558 129363 138062 114049 83801 96364 142610 165404 146087 120718
$$ packed form
8471D25452j5778k9055j3728J4266J4188j5748k9962l745K6651J5273k8111n2183
8459C07520l1763N321J9262O029o467j040O381n957k8423l0010m835J5237M905
8446B56160j8742k2483k408J8078K3460J6676L138j2571j9302j0797p29n167j4546
8433B10767o853J3775J8704j245j9909j4366K500L739j1513j8259k827J6055J1813
8420B02381j0590j6398R089L0297P897l5149l6723R709L5526j145m5999k9692
8408A19203K3836L6704l09k1342K346K1927L36k7810j9272R309J6207j239j5816
8395A44080j5387n275J1733K9194L0086R259j3962k1738j6973o910O524J1767
8383A62398m216k4061j5563J0805Q699k4013l0248J2563M6246K2794j9317k5369
$$ plain form
8371 120718 107829 87009 63395 81355 141805 173241 132651 78833 88433 144371 171473 149918
8359 149918 124743 120679 115538 96011 80823 81420 86484 92182 107067 122416 117526 99819 100860
8346 100860 125579 143901 142162 143742 163117 175337 153678 111125 81567 77634 85738 89539 83579
8333 83579 73094 69279 77345 88533 94414 102799 120890 131198 112636 80880 71960 83984 76892
8320 76892 42075 27869 69004 127813 142349 108258 74073 70495 83586 92610 97114 101123 99795
$$ packed form
8371A20718j2889k0820k3614J7960O0450L1436m0590n3818R600N5938K7102k1555
8359A49918k5175m064n141j9527j5188N97N064N698J4885J5349m890j7707J041
8346A00860K4719J8322j739J580J9375J2220k1659m2553k9558l933Q104L801n960
8333H3579j0485l815Q066J1188N881Q385J8091J0308j8562l1756q920J2024p092
8320G6892l4817j4206M1135N8809J4536l4091l4185l578J3091R024M504M009j328
$$ [...]
##END NTUPLES=NMR SPECTRUM
##END=
