##TITLE=1H ikalashn
K-481-2
12.11.2024
##JCAMPDX= 6.0         $$ Bruker NMR JCAMP-DX V2.0
##DATA TYPE= NMR SPECTRUM
##DATA CLASS= NTUPLES
##ORIGIN= UXNMR, Bruker Analytische Messtechnik GmbH
##OWNER= root
$$ TOPSPIN		Version 1.3
$$ 2024-11-12 15:00:05.015 +0400  Irina@DPX200
$$ Compression mode = diff/dup
##.OBSERVE FREQUENCY= 200.131300845
##.OBSERVE NUCLEUS= ^1H
##.ACQUISITION MODE= SIMULTANEOUS
##.ACQUISITION SCHEME= undefined
##.AVERAGES= 32
##.DIGITISER RES= 18
##SPECTROMETER/DATA SYSTEM= spect
##.PULSE SEQUENCE= zg
##.SOLVENT NAME= CDCl3
##.SHIFT REFERENCE= INTERNAL, CDCl3, 1, 17.49637
##AUDIT TRAIL= $$ (NUMBER, WHEN, WHO, WHERE, WHAT)
$$ ##TITLE= Audit trail, TOPSPIN		Version 1.3
$$ ##JCAMPDX= 5.01
$$ ##ORIGIN= Bruker BioSpin GmbH
$$ ##OWNER= Irina
$$ $$ F:/spectra/data/iren/nmr/1H/4/pdata/1/auditp.txt
$$ ##AUDIT TRAIL=  $$ (NUMBER, WHEN, WHO, WHERE, VERSION, WHAT)
(   1,<2024-11-12 14:59:12.296 +0400>,<Irina>,<DPX200>,<TOPSPIN 1.3>,
      <created by zg
	started at 2024-11-12 14:56:59.796 +0400,
	POWCHK disabled, PULCHK disabled
       configuration hash MD5:
       BE 6D 3F 07 2A EA 11 49 91 17 2B D3 AF B3 58 0D
       data hash MD5: 16K
       34 B8 67 69 6E 59 E3 74 63 4B 7B 86 07 79 22 55>)
(   2,<2024-11-12 14:59:44.828 +0400>,<Irina>,<DPX200>,<TOPSPIN 1.3>,
      <Start of raw data processing
       efp BC_mod = 2 LB = 0.02 FT_mod = 6 PKNL = 1 PHC0 = 121.5516 PHC1 = 7.1591 SI = 32K 
       data hash MD5: 32K
       A5 DA CA B0 F2 94 7E 2E 40 D8 5A 26 E5 38 DB 1B>)
(   3,<2024-11-12 14:59:56.781 +0400>,<Irina>,<DPX200>,<TOPSPIN 1.3>,
      <pk fgphup PHC0 = 3.429492 PHC1 = -14.4 
       data hash MD5: 32K
       50 49 C3 9D 5A B8 84 B7 49 FD 3D 63 91 5D 54 94>)
$$ ##END=
$$ 
$$ $$ hash MD5
$$ $$ 6C 3B 1E 49 E8 34 84 45 44 6F AD 8C AB BD CD C5
##$RELAX= 
##$RELAX= 
##$RELAX= 
##$RELAX= 
##$RELAX= 
##$RELAX= 
##$RELAX= 
##$RELAX= 
##$RELAX= 
$$ Bruker specific parameters
$$ --------------------------
##$DU= <F:/spectra>
##$EXPNO= 4
##$NAME= <1H>
##$PROCNO= 1
##$TYPE= <nmr>
##$USER= <iren>
##$AMP= (0..31)
100 100 100 100 100 100 100 100 100 100 100 100 100 100 100 100 100 100 
100 100 100 100 100 100 100 100 100 100 100 100 100 100 
##$ANAVPT= -1
##$AQSEQ= 0
##$AQ_mod= 1
##$AUNM= <au_zg>
##$AUTOPOS= <>
##$BF1= 200.13
##$BF2= 200.13
##$BF3= 200.13
##$BF4= 200.13
##$BF5= 200.13
##$BF6= 200.13
##$BF7= 200.13
##$BF8= 200.13
##$BYTORDA= 1
##$CFDGTYP= 0
##$CFRGTYP= 5
##$CHEMSTR= <none>
##$CNST= (0..63)
1 1 145 1 1 1 1 1 1 1 1 1 1 1 1 1 1 1 1 1 1 1 1 1 1 1 1 1 1 1 1 1 1 1 
1 1 1 1 1 1 1 1 1 1 1 1 1 1 1 1 1 1 1 1 1 1 1 1 1 1 1 1 1 1 
##$CPDPRG= <>
##$CPDPRG1= <>
##$CPDPRG2= <>
##$CPDPRG3= <>
##$CPDPRG4= <mlev>
##$CPDPRG5= <mlev>
##$CPDPRG6= <mlev>
##$CPDPRG7= <mlev>
##$CPDPRG8= <mlev>
##$CPDPRGB= <>
##$CPDPRGT= <>
##$D= (0..63)
0 2 0 0 0 0 0 0 0 0.06 0 0.03 0 0 0 0 0.0002 0 0 0 0 0 0 0 0 0 0 0 0 0 
0 0 0 0 0 0 0 0 0 0 0 0 0 0 0 0 0 0 0 0 0 0 0 0 0 0 0 0 0 0 0 0 0 0 
##$DATE= 1731409147
##$DBL= (0..7)
120 120 120 120 120 120 120 120 
$$ [...]
##$SW_h= 4401.40845070422
##$TD= 16384
##$TD0= 1
##$TE= 300
##$TE2= 300
##$TE3= 300
##$TEG= 300
##$TL= (0..7)
0 120 120 120 120 120 120 120 
##$TP= (0..7)
150 150 150 150 150 150 150 150 
##$TP07= 0
##$TPNAME0= <>
##$TPNAME1= <>
##$TPNAME2= <>
##$TPNAME3= <>
##$TPNAME4= <>
##$TPNAME5= <>
##$TPNAME6= <>
##$TPNAME7= <>
##$TPOAL= (0..7)
0.5 0.5 0.5 0.5 0.5 0.5 0.5 0.5 
##$TPOFFS= (0..7)
0 0 0 0 0 0 0 0 
##$TUNHIN= 0
##$TUNHOUT= 0
##$TUNXOUT= 0
##$USERA1= <user>
##$USERA2= <user>
##$USERA3= <user>
##$USERA4= <user>
##$USERA5= <user>
##$V9= 5
##$VALIST= <valist>
##$VCLIST= <CCCCCCCCCCCCCCC>
##$VD= 0
##$VDLIST= <DDDDDDDDDDDDDDD>
##$VPLIST= <PPPPPPPPPPPPPPP>
##$VTLIST= <TTTTTTTTTTTTTTT>
##$WBST= 1024
##$WBSW= 25
##$XGAIN= (0..3)
0 0 0 0 
##$XL= 0
##$YL= 0
##$YMAX_a= 2640784
##$YMIN_a= -1740809
##$ZGOPTNS= <>
##$ZL1= 120
##$ZL2= 120
##$ZL3= 120
##$ZL4= 120
##$ABSF1= 0
##$ABSF2= 0
##$ABSG= 0
##$ABSL= 0
##$ALPHA= 0
##$AQORDER= 0
##$ASSFAC= 0
##$ASSFACI= 0
##$ASSFACX= 0
##$ASSWID= 0
##$AUNMP= <proc_1d>
##$AXLEFT= 0
##$AXRIGHT= 0
##$AXTYPE= 0
##$AXUNIT= <>
##$AZFE= 0.1
##$AZFW= 0.1
##$BCFW= 0
##$BC_mod= 2
##$BYTORDP= 0
##$COROFFS= 0
##$CY= 7568.61572265625
##$DATMOD= 1
##$DC= 0
##$DFILT= <>
##$DTYPP= 0
##$F1P= 17.9538593292236
##$F2P= -4.03888763876832
##$FCOR= 0.5
##$FTSIZE= 32768
##$FT_mod= 6
##$GAMMA= 0
##$GB= 0
##$INTBC= 0
##$INTSCL= 1.367314e-010
##$ISEN= 128
##$LB= 0.02
##$LEV0= 0
##$LPBIN= 0
##$MAXI= 945.577
##$MC2= 0
##$MEAN= 0
##$ME_mod= 0
##$MI= -402.1523
##$NCOEF= 0
##$NC_proc= -6
##$NLEV= 6
##$NOISF1= 8.587773
##$NOISF2= 6.764455
##$NSP= 0
##$NTH_PI= 0
##$NZP= 0
##$OFFSET= 17.49637
##$PC= 1
##$PHC0= 124.9811
##$PHC1= -7.2409
##$PH_mod= 1
##$PKNL= yes
##$PPARMOD= 0
##$PPDIAG= 0
##$PPIPTYP= 0
##$PPMPNUM= 100
##$PPRESOL= 1
##$PSCAL= 0
##$PSIGN= 0
##$REVERSE= no
##$SF= 200.13
##$SI= 32768
##$SIGF1= 16.12182
##$SIGF2= -4.496377
##$SINO= 3.521527
##$SIOLD= 32768
##$SREGLST= <1H.CDCl3>
##$SSB= 0
##$STSI= 32768
##$STSR= 0
##$SW_p= 4401.40845070422
##$SYMM= 0
##$S_DEV= 0
##$TDeff= 16384
##$TDoff= 0
##$TI= <>
##$TILT= no
##$TM1= 0
##$TM2= 0
##$TOPLEV= 0
##$USERP1= <user>
##$USERP2= <user>
##$USERP3= <user>
##$USERP4= <user>
##$USERP5= <user>
##$WDW= 1
##$XDIM= 32768
##$YMAX_p= 302951438
##$YMIN_p= -5689008
$$ End of Bruker specific parameters
$$ ---------------------------------
##NTUPLES= NMR SPECTRUM
##VAR_NAME=  FREQUENCY,     SPECTRUM/REAL,   SPECTRUM/IMAG
##SYMBOL=    X,             R,               I
##VAR_TYPE=  INDEPENDENT,   DEPENDENT,       DEPENDENT
##VAR_FORM=  AFFN,          ASDF,            ASDF
##VAR_DIM=   32768,         32768,           32768
##UNITS=     HZ,            ARBITRARY UNITS, ARBITRARY UNITS
##FACTOR=    0.134324425510551, 1,           1
##FIRST=     4401.40845070422, -3990622,     -2674827
##LAST=      0,             -4039247,        -2734123
##MIN=       0,             -5689008,        0
##MAX=       4401.40845070422, 302951438,    0
$$ Real data points
##PAGE= N=1
##DATA TABLE= (X++(R..R)), XYDATA
$$ [...]
22463 3168201 3133902 2944988 2953253 3182858 3337309 3228827 2980614 2804159 2761927 2805364
22453 2805364 2899261 3012811 3080892 3066373 3001187 2909538 2779161 2668855 2712732 2908020
22443 2908020 3044635 3009585 3004641 3216343 3412501 3227103 2797126 2681616 3058482 3437390
22433 3437390 3378746 3089306 2988384 3044915 2972276 2814500 2837561 2984786 2960653 2806273
22423 2806273 2865502 3143436 3231983 3005351 2864357 3053295 3232103 3077350 2868729 3009663
22413 3009663 3294186 3212564 2818273 2696898 3057629 3405316 3294667 2970471 2960001 3308301
22403 3308301 3563479 3422934 3092812 2960860 3110914 3291199 3292520 3199573 3201013 3269182
22393 3269182 3207257 2994130 2859628 2936871 3052413 3007830 2875603 2820529 2808210 2742102
22383 2742102 2736845 2944119 3200942 3195136 2955276 2831870 2965397 3111753 3067967 2945431
22373 2945431 2907299 2932804 2972198 3055111 3113568 2988880 2765528 2788448 3152649 3485181
22363 3485181 3474481 3310675 3309004 3395905 3335050 3204586 3214884 3241738 3024493 2726076 2785428
22352 2785428 3206548 3480904 3311521 2983361 2873209 2976841 3098548 3169067 3172634 3045297
22342 3045297 2845978 2782510 2898173 2982612 2940255 2942816 3036137 2961149 2652807 2547498 2968468
22331 2968468 3496660 3486426 3041670 2880196 3241685 3557865 3378859 3042234 3064709 3328718
22321 3328718 3367663 3179505 3194373 3508061 3696158 3508255 3286124 3427121 3758319 3795703
22311 3795703 3456942 3151094 3191478 3448877 3648418 3719419 3706969 3571061 3290765 3033656
22301 3033656 2998875 3145556 3259018 3250034 3218411 3245328 3298442 3347022 3411387 3478533 3500659
22290 3500659 3478714 3423548 3277759 3048191 2954575 3187585 3531994 3553836 3235737 3073114
22280 3073114 3358861 3714585 3629533 3194602 2921469 2998590 3141660 3126064 3055553 3054625 3065525
22269 3065525 3077503 3243424 3579103 3783841 3587031 3134598 2823260 2827730 2974472 3046562
22259 3046562 3035283 3052572 3120810 3146863 3078721 3000614 3019583 3099024 3101467 3008177 2980942
22248 2980942 3137736 3366466 3458173 3347435 3127712 2920421 2839293 2972809 3243857 3381636
22238 3381636 3219330 2947110 2876038 3029340 3195277 3305938 3467322 3637978 3616289 3408478
22228 3408478 3285011 3353978 3382711 3203630 3006144 3004995 3068449 2949219 2708505 2620459
22218 2620459 2750090 2890092 2882114 2788013 2750393 2840620 3033268 3218389 3275941 3224087 3218711
22207 3218711 3322709 3391959 3302126 3156326 3118787 3162436 3151349 3075816 3033047 3049759 3074783
22196 3074783 3073719 3015002 2878375 2784881 2933179 3255268 3376840 3155366 2991089 3251508
22186 3251508 3624734 3520309 2977585 2629905 2773485 3033775 3066445 3032276 3134732 3187504
22176 3187504 2998347 2794035 2863138 3066907 3112243 3079066 3241905 3525766 3598407 3441757
22166 3441757 3378525 3496613 3475345 3124608 2740057 2698653 2947496 3143637 3149527 3130620
22156 3130620 3215687 3309376 3300264 3270528 3355666 3477256 3394119 3054062 2741742 2757381 3044018
22145 3044018 3286811 3318967 3237540 3147130 3036160 2957190 3071473 3379089 3619162 3602863
22135 3602863 3458568 3377336 3321947 3205775 3143952 3230428 3255244 3023253 2822321 3107214
22125 3107214 3734375 4023148 3703899 3305460 3344266 3595183 3571040 3348749 3374475 3655879
22115 3655879 3755248 3561323 3464090 3621905 3627377 3213785 2807495 2912588 3291255 3327528
22105 3327528 3027746 3017743 3515289 3938924 3778254 3320809 3137579 3262451 3352723 3363312
22095 3363312 3508639 3706098 3638288 3364274 3309063 3538826 3587507 3226954 2904055 3055336
22085 3055336 3398019 3364538 2972498 2758302 2965754 3283915 3390910 3325986 3229622 3080843
22075 3080843 2868967 2771783 2954858 3311087 3545321 3474535 3192373 2983236 3070854 3385640
22065 3385640 3614817 3564729 3401241 3402925 3557782 3592558 3365760 3035991 2838577 2862695
22055 2862695 3046916 3240408 3288486 3208933 3223941 3434286 3566990 3329360 2937855 2912895
22045 2912895 3317528 3614004 3424813 3043886 2939891 3088709 3147020 3058573 3085018 3313176
22035 3313176 3496141 3426593 3213729 3113065 3231137 3442196 3504557 3277201 2922357 2838410
22025 2838410 3232885 3775008 3856944 3280206 2559641 2410345 2954687 3576765 3641855 3239108
22015 3239108 2994848 3175277 3330364 3033929 2621924 2734385 3310351 3637714 3430561
22006 3430561 3219124 3424381 3644947 3327606 2705553 2480817 2802324 3144379 3133791 2966876
21996 2966876 2946893 3045584 3072869 2994426 2940803 3050099 3330577 3569156 3470207 3050281
21986 3050281 2738145 2844091 3114495 3134741 2983306 3048893 3318771 3365241 3044168 2707625
21976 2707625 2643447 2765823 2963383 3285455 3632307 3718619 3540048 3445945 3547326 3506673
21966 3506673 3164859 2900101 3020348 3240139 3178724 2991519 3031133 3201736 3173682 3005649
21956 3005649 3014108 3174526 3183418 3038246 3047930 3280891 3465850 3462439 3413519 3403396 3357786
21945 3357786 3311117 3392224 3519503 3491602 3396919 3518483 3794050 3821796 3500070 3213478
21935 3213478 3240557 3410811 3514446 3603520 3678126 3539642 3235039 3190299 3554860 3852564
21925 3852564 3698833 3434381 3527680 3739486 3538558 3078954 3008032 3396493 3639745 3493447
21915 3493447 3430280 3721474 3896483 3556002 3124803 3218501 3673077 3832786 3565179 3359676
21905 3359676 3497357 3712879 3736714 3665392 3651015 3636932 3581384 3606479 3738523 3791885 3699590
21894 3699590 3684550 3886955 4075179 3986557 3753653 3709662 3910788 4122124 4169900 4051521
21884 4051521 3799904 3511700 3425345 3678329 4040333 4180191 4142926 4226420 4423278 4408417
21874 4408417 4148458 4066388 4387868 4728577 4656157 4353806 4330184 4656183 4905077 4796994
21864 4796994 4535219 4457250 4622316 4821676 4828519 4599107 4341788 4358400 4694291 5020326
21854 5020326 5023635 4823283 4783947 4991984 5178529 5141570 4971996 4827245 4732347 4674323
21844 4674323 4678651 4719332 4740558 4812420 5052299 5340217 5363117 5052031 4737788 4721402 4904474
21833 4904474 5029465 5088668 5247145 5479521 5554572 5373477 5116442 5007438 5062536 5125605
21823 5125605 5086208 5010474 5048197 5214373 5321663 5207374 4975109 4871702 4948243 5023913
21813 5023913 4993434 4949071 4941471 4871486 4746141 4785503 5066100 5278642 5114796 4735007
21803 4735007 4541471 4592667 4596710 4455773 4420679 4600085 4685086 4408202 4021389 3992542
21793 3992542 4335438 4574332 4397932 4048010 3917296 3998769 3988140 3817326 3767147 3999180
21783 3999180 4259835 4229511 3980652 3861722 4021075 4268481 4370250 4283294 4114344 4023495
21773 4023495 4142862 4417890 4575526 4441888 4219457 4207797 4335119 4291191 4070770 3978737
21763 3978737 4072537 4052119 3817277 3670943 3779147 3894545 3870932 3967072 4286266 4398372
21753 4398372 4002500 3547290 3607674 3969808 3994597 3675710 3617491 4019603 4384846 4323054
21743 4323054 4041957 3892444 3934907 4103701 4351161 4503757 4395711 4222580 4314746 4517151
21733 4517151 4335218 3794461 3542299 3878597 4289596 4261420 3992292 3903978 3961156 3943433
21723 3943433 3960526 4187202 4415281 4357596 4133120 4010733 3936501 3752460 3618223 3749577
21713 3749577 3968998 3979471 3872818 3909749 4017349 3986862 3945823 4105953 4251348 4063284
21703 4063284 3786627 3929627 4391644 4560231 4267366 3978565 3973931 4016462 3967585 4060911
21693 4060911 4335545 4421156 4183380 4023224 4208363 4426436 4357154 4191717 4183524 4151764
21683 4151764 3899463 3717450 3941450 4309469 4302494 3928650 3664193 3745765 3978284 4144785
21673 4144785 4181218 4026995 3708335 3504009 3641547 3894861 3870904 3625333 3569619 3805064
21663 3805064 4008762 4007441 3992618 4061521 4005571 3747587 3576866 3685748 3809638 3631928
21653 3631928 3288249 3148351 3283782 3473405 3610581 3776485 3956116 3987204 3825030 3627669
21643 3627669 3531614 3525340 3575631 3690369 3805451 3802260 3726012 3799477 4080506 4273468 4085075
21632 4085075 3657169 3399744 3439995 3518736 3466958 3469517 3691267 3918894 3857012 3605311
21622 3605311 3508275 3610219 3614966 3398053 3200256 3207911 3273977 3242688 3265972 3536989 3906408
21611 3906408 4044886 3878744 3625042 3483876 3516295 3725195 4001608 4067946 3765481 3372482
21601 3372482 3330600 3628303 3780241 3522927 3201642 3243372 3512560 3527243 3190889 2934224
21591 2934224 3089719 3454432 3641000 3616396 3629297 3735743 3720656 3504447 3321772 3370300
21581 3370300 3532007 3619567 3664077 3715497 3592903 3201576 2933845 3265724 3968801 4253485
21571 4253485 3836912 3352703 3422588 3800774 3867074 3589901 3446044 3587458 3675582 3528651
21561 3528651 3412697 3570222 3853659 3990255 3936853 3832133 3797751 3884944 4057479 4173134
21551 4173134 4120838 3980239 3906006 3900650 3869277 3820471 3810064 3784892 3720240 3786656 4082732
21540 4082732 4336237 4243052 3989745 3996317 4217806 4224459 3969466 3886850 4121783 4273766
21530 4273766 4119916 3996470 4149901 4279246 4127382 4000683 4208575 4443507 4277716
21521 4277716 3904937 3797676 3933769 3984133 4014600 4322154 4730818 4755111 4418006 4228955
21511 4228955 4335346 4376265 4257945 4362592 4778298 5004774 4764656 4510226 4695326 5045065
21501 5045065 5043073 4745785 4569363 4553623 4418005 4203475 4281855 4712568 5082038 5098456
21491 5098456 4957763 4952959 5029050 4951573 4723017 4583597 4655522 4786530 4787480 4700800 4726392
21480 4726392 4906788 5014895 4839058 4495293 4308307 4405344 4597316 4683668 4684208 4689133 4671615
21469 4671615 4598688 4575333 4683603 4777499 4657872 4413174 4353610 4565664 4744460 4592142
21459 4592142 4234927 4065568 4228379 4456852 4464086 4317159 4283786 4415164 4482699 4319806
21449 4319806 4032074 3820102 3768651 3874508 4088776 4236125 4117356 3845455 3832898 4214975
21439 4214975 4541425 4373069 3953900 3844701 4051692 4078195 3809781 3719224 4047300 4392329
21429 4392329 4409353 4363663 4570045 4753097 4497129 3994664 3768565 3860456 3879475 3744491
21419 3744491 3781345 4071074 4258585 4125663 3886090 3768000 3725121 3720974 3880600 4142299
21409 4142299 4150948 3783643 3448227 3529519 3819892 3881123 3752419 3842542 4206557 4407387
21399 4407387 4172223 3784786 3648393 3767069 3888864 3927784 3956911 3925539 3710566 3427982
21389 3427982 3382174 3629987 3864234 3862765 3802311 3925577 4131818 4197226 4219568 4436637
21379 4436637 4676240 4479810 3873749 3521381 3825717 4296086 4224930 3703989 3456835 3787102
21369 3787102 4229748 4299619 4104559 4011628 4061067 4003374 3734895 3426143 3268098 3277808
21359 3277808 3364568 3475042 3623513 3806338 3943069 3961496 3916507 3908719 3882739 3691761
21349 3691761 3423518 3413249 3763743 4101093 4067390 3833657 3789822 3917480 3890646 3683628
21339 3683628 3607860 3766399 3940108 4048714 4249020 4488849 4451762 4104087 3831293 3832982
21329 3832982 3845939 3707242 3701898 4004126 4222788 3950383 3430411 3224232 3464242 3849669
21319 3849669 4140483 4244234 4060790 3689289 3567766 3934946 4351624 4253257 3792592 3585569
21309 3585569 3771316 3938782 3914175 3960135 4148836 4182582 3975730 3822714 3814762 3669479
21299 3669479 3355396 3294113 3639579 3924243 3808054 3649090 3851172 4116403 3937974 3494572
21289 3494572 3400328 3741993 4006422 3926435 3796859 3860955 3917506 3758080 3594636 3750961
21279 3750961 4143443 4350278 4144040 3768729 3643412 3858783 4057864 3881418 3457574
21270 3457574 3263418 3498438 3849198 3969743 3917096 3925709 4014787 4076144 4130099 4211685 4202300
21259 4202300 4065271 4031048 4218781 4321788 4083890 3832181 3996110 4311373 4190164 3786082
21249 3786082 3868068 4522299 4852433 4336253 3672693 3699472 4143779 4199444 3854751 3780347
21239 3780347 4153985 4472327 4477155 4446120 4474765 4248236 3764477 3587976 4011946 4528550
21229 4528550 4565329 4299319 4259938 4467166 4498757 4230049 3992926 4027634 4182050 4200588
21219 4200588 4031949 3815886 3757023 3984898 4364691 4525558 4277428 3904104 3814096 4004803
21209 4004803 4145108 4097156 4029170 4050420 4090417 4168774 4428683 4802490 4963601 4757869
21199 4757869 4423266 4240906 4208859 4201720 4211938 4264986 4303072 4314119 4387375 4511391 4536161
21188 4536161 4463431 4505131 4687783 4712861 4452636 4255744 4417144 4642936 4483626 4079376
21178 4079376 3969053 4278889 4624905 4778924 4886974 4981574 4838994 4491209 4366831 4658245
21168 4658245 4977451 4940926 4716609 4646851 4664548 4499583 4232543 4200935 4457675 4704142
21158 4704142 4721508 4559524 4339477 4161152 4170612 4425742 4695107 4670986 4411436 4305686
21148 4305686 4540190 4851161 4919240 4797800 4779992 4962458 5127317 5054294 4821009 4709177
21138 4709177 4839515 5017363 5022845 4940205 4999010 5148738 5103457 4870831 4868205 5288869 5686300
21127 5686300 5549096 5058415 4844547 5111744 5455874 5526038 5411763 5296800 5155095 4966614
21117 4966614 4891121 5003916 5108748 5027599 4885060 4908473 5095917 5259583 5285651 5208745
21107 5208745 5123181 5123844 5237055 5335349 5233634 4931379 4640523 4534227 4603924 4776454
21097 4776454 4988323 5123394 5091372 4998291 5006751 5022239 4831321 4576647 4670062 5095701
21087 5095701 5277926 4928960 4563357 4736920 5170847 5197449 4805289 4589722 4775064 4963295
21077 4963295 4909592 4896732 5121737 5271802 5053795 4728434 4725923 5008772 5198751 5157640
21067 5157640 5076769 5077012 5051127 4912127 4754180 4713366 4808575 4949764 5024627 4988618 4921823
21056 4921823 4949596 5069697 5148619 5131052 5115116 5143363 5091402 4904246 4772907 4868610 5034515
21045 5034515 4997507 4803144 4743520 4867937 4892501 4683399 4522000 4702540 5101495 5378571
21035 5378571 5429747 5377595 5244334 4957340 4642278 4574580 4778512 4973172 5015398 5088145
21025 5088145 5286984 5350311 5090926 4819328 4937764 5284937 5342290 5026043 4783867 4863454
21015 4863454 4990000 4925111 4850944 4925898 4908804 4604299 4311122 4378499 4606118 4583914
21005 4583914 4415261 4548803 4994338 5275256 5176112 5008647 5042830 5149319 5138243 5025374
20995 5025374 4831581 4541780 4391873 4720875 5339470 5543666 5057022 4492936 4503118 4902252
20985 4902252 5104312 5039794 5055754 5165937 5052155 4729060 4598867 4803552 5040613 5099670
20975 5099670 5109367 5154381 5115436 5034500 5174546 5501277 5551906 5125753 4712063 4831999
20965 4831999 5254125 5336316 4979285 4728566 4928779 5255362 5250751 4959108 4760606 4797391
20955 4797391 4871270 4835462 4798639 4886545 5015152 5026423 4924532 4840574 4837263 4889097 5006375
20944 5006375 5213079 5408682 5428362 5276738 5132981 5071940 4970968 4784356 4696860 4840754
20934 4840754 5049872 5108045 5080793 5145280 5225317 5109839 4868459 4807391 4994528 5151953
20924 5151953 5093580 4970688 4968666 5034905 5060818 5091820 5172577 5185748 5047365 4903968 4928474
20913 4928474 5040674 5035269 4900687 4810957 4852145 4942180 5004756 5060327 5129312 5167563 5134199
20902 5134199 5059098 5018603 5059271 5136387 5142409 5041321 4935554 4909920 4874229 4730007 4638625
20891 4638625 4854740 5264802 5410207 5107190 4738801 4716265 4935812 5061147 5088094 5236434
20881 5236434 5441441 5403208 5117849 4938745 5039653 5180077 5122471 4965944 4908560 4944710
20871 4944710 4981766 5045254 5174787 5272305 5234612 5124203 5058007 5025473 4951674 4852837 4805524
20860 4805524 4834155 4927398 5085193 5259856 5340898 5292187 5218677 5214595 5243279 5246352 5247765
20849 5247765 5248162 5155553 4960006 4843727 4941469 5101967 5089828 4942014 4900021 5036028 5184319
20838 5184319 5233507 5240166 5222703 5099084 4918703 4912796 5159677 5395015 5350166 5142667 5114725
20827 5114725 5353361 5579318 5507950 5160712 4802031 4676597 4806151 4961085 4876437 4591764
20817 4591764 4483355 4793313 5226593 5280375 4937716 4698414 4853959 5102755 5084600 4943708
20807 4943708 5019760 5243333 5276246 5113231 5067561 5184860 5162338 4934889 4854119 5084585
20797 5084585 5273441 5126418 4921432 5047400 5331124 5297848 4930734 4684218 4794657 5026950
20787 5026950 5128037 5125416 5102309 5036521 4963612 4986668 5029189 4880581 4580697 4447653 4612423
20776 4612423 4841783 4946602 5022627 5124436 5075833 4849248 4774109 5045757 5336056 5257890
20766 5257890 4952718 4822133 4914391 5016796 5140830 5394753 5523528 5180559 4638547 4598778
20756 4598778 5167121 5616603 5407805 4898918 4702649 4823045 4877469 4801563 4817819 4931284
20746 4931284 4960384 4947591 5081302 5282475 5302468 5184849 5189250 5270704 5113017 4743620
20736 4743620 4616980 4911349 5209031 5140009 4915209 4868761 4863060 4633136 4440762 4782864
20726 4782864 5522374 5907620 5570065 4996134 4795501 4938318 5023456 4943834 4880384 4858256
20716 4858256 4751321 4647612 4790155 5121035 5251962 5002686 4667471 4587342 4709038 4773892
20706 4773892 4748281 4806763 4981240 5086673 5008229 4869254 4853898 4983460 5132742 5199687
20696 5199687 5202038 5222069 5278577 5279945 5155660 5019168 5072014 5289780 5364704 5117881 4830470
20685 4830470 4904372 5244840 5313843 4892393 4462710 4581738 5106646 5397662 5198375 4917771
20675 4917771 4973421 5229157 5300803 5142973 5023963 5068059 5151084 5200619 5280222 5351644 5257653
20664 5257653 5024185 4897632 4962981 5005442 4910182 4897267 5117096 5306388 5187020 4961994
20654 4961994 4996693 5197358 5205325 5087298 5233582 5564641 5512706 4983756 4667836 5013773
20644 5013773 5491190 5405504 4967200 4897857 5297735 5620711 5615459 5569424 5624398 5533554 5224664
20633 5224664 5015864 5087174 5234995 5319533 5467128 5651663 5592388 5306760 5242960 5547895
20623 5547895 5716940 5383247 4981608 5105931 5580658 5763029 5523815 5322441 5431763
20614 5431763 5661108 5809494 5867114 5757271 5375677 4948119 4895421 5244799 5572569 5618457
20604 5618457 5566784 5625300 5727944 5789258 5866632 5908953 5717926 5344798 5160686 5319514
20594 5319514 5509648 5479762 5435227 5594444 5712402 5472770 5092752 5059338 5402067 5687740
20584 5687740 5678050 5553883 5485074 5407286 5312191 5372244 5613649 5769264 5648514 5424239
20574 5424239 5360921 5440863 5462732 5385791 5371952 5537891 5826034 6103801 6270633 6274075 6126496
20563 6126496 5933928 5841298 5895790 5970777 5872051 5569893 5308740 5386780 5782648 6113429
20553 6113429 6068743 5788975 5660017 5808757 6008064 6057313 6013277 5985342 5934506 5809529
20543 5809529 5704856 5716124 5757120 5685511 5532673 5458591 5533754 5694078 5851555 5920910
20533 5920910 5807911 5530725 5305282 5338683 5558958 5714952 5719832 5700892 5715844 5664645
20523 5664645 5549127 5567299 5797517 6002537 5960933 5833094 5935677 6240962 6391085 6209476
20513 6209476 5918021 5774958 5757030 5741711 5774536 5927864 6043284 5901420 5620349 5598151
20503 5598151 5962493 6307718 6180264 5704819 5470960 5775456 6224537 6261006 5927109 5809651
20493 5809651 6213643 6711323 6725892 6335584 6137193 6367315 6580295 6353842 5949450 5931969
20483 5931969 6331064 6597928 6391282 6018846 5943452 6141861 6218503 6015579 5818156 5928871
20473 5928871 6254992 6440154 6307585 6033728 5884860 5903162 5937734 5924028 5986585 6216406
20463 6216406 6466308 6499189 6310800 6175204 6323961 6651764 6806888 6570201 6108372 5813841
20453 5813841 5883000 6114059 6194248 6112527 6114451 6269644 6349568 6236998 6170912 6348402 6527089
20442 6527089 6370672 6027505 5936958 6118147 6137868 5864519 5749979 6111617 6562541 6540894
20432 6540894 6123797 5886283 6092579 6440314 6580645 6530757 6504705 6597733 6734083 6775742
20422 6775742 6643291 6438857 6412635 6658650 6899773 6777354 6336672 6006651 6067766 6345672
20412 6345672 6504209 6463861 6410561 6496290 6659460 6732893 6668593 6613657 6722088 6913171
20402 6913171 6937852 6726610 6516274 6522337 6641583 6646582 6537281 6485070 6527329 6556262 6555716
20391 6555716 6613635 6723931 6791054 6810361 6844515 6861712 6808711 6787209 6913743 7057643 6993435
20380 6993435 6777081 6674169 6738587 6784503 6764435 6813896 6902506 6838403 6680850 6721134 6941911
20369 6941911 6957293 6679588 6565536 6901581 7289754 7238551 6893427 6726226 6793552 6806008
20359 6806008 6735174 6822820 7062287 7162145 7046828 6977243 7100565 7220618 7124519 6896291
20349 6896291 6805511 7015152 7412978 7650379 7449107 6979849 6757739 7001409 7332630 7336704
20339 7336704 7128513 7033436 7020745 6919454 6925271 7297452 7715595 7612102 7111030 6933993
20329 6933993 7285502 7548456 7312840 7010497 7143620 7481383 7523829 7314670 7253527 7403634
20319 7403634 7500880 7460384 7425017 7439602 7447987 7486991 7558613 7464942 7103345 6771068 6827661
20308 6827661 7186498 7481184 7595079 7657060 7649085 7452018 7218835 7251428 7484681 7521087
20298 7521087 7263646 7108377 7339270 7676620 7676102 7357409 7172622 7427805 7929830 8221129
20288 8221129 8077314 7723917 7540320 7597111 7629924 7494921 7415083 7610713 7907035 7981539
20278 7981539 7851435 7796892 7879957 7873228 7659433 7400632 7282805 7343878 7557054 7829227
20268 7829227 7929037 7699985 7349376 7236424 7371803 7445431 7360098 7365937 7594468 7838879
20258 7838879 7922223 7921719 7882771 7689221 7412590 7405509 7775574 8102443 7987188 7597310 7356268
20247 7356268 7368388 7483844 7655561 7839115 7782731 7368499 6989443 7116503 7601335 7878688
20237 7878688 7780378 7648684 7677960 7696726 7667041 7830068 8168191 8254794 7931569 7672155
20227 7672155 7901053 8333829 8427181 8192049 8075163 8208604 8278495 8100755 7881065 7848542
20217 7848542 7985443 8189424 8398862 8490621 8348747 8119024 8108252 8326448 8420272 8201809
20207 8201809 7942650 7930869 8015761 7892041 7631629 7575143 7787998 7979809 7969114 7915985
20197 7915985 8021855 8245284 8412100 8427965 8309520 8156909 8130218 8286920 8430477 8326872
20187 8326872 8083970 8047499 8263130 8366055 8156485 7953321 8116309 8495478 8686455 8623151
20177 8623151 8542853 8503367 8344711 8086349 7969891 8075679 8231237 8337279 8462662 8572703
20167 8572703 8502676 8289272 8207753 8369591 8583033 8711778 8840694 8963223 8881879 8620148
20157 8620148 8552928 8839904 9074654 8857511 8427772 8308252 8541114 8738520 8753745 8804115
20147 8804115 8951747 8951023 8711819 8506025 8549971 8703040 8761533 8779663 8878541 8939047 8754884
20136 8754884 8429730 8381431 8855955 9529102 9745042 9239888 8529896 8370158 8839056 9259484
20126 9259484 9129580 8763251 8735801 9045544 9263894 9266516 9272797 9287617 9105888 8875337
20116 8875337 9033182 9545047 9800589 9508976 9144498 9175336 9376835 9348811 9244074 9413081
20106 9413081 9661851 9518036 9082368 8963825 9349716 9724016 9657204 9387306 9366102 9584974
20096 9584974 9664513 9434382 9145781 9133892 9426228 9724890 9754548 9596243 9579203 9804475
20086 9804475 9955451 9745408 9380446 9299015 9545600 9738273 9660648 9538739 9621485 9791316
20076 9791316 9790132 9628975 9551267 9681656 9882096 9924554 9718248 9410908 9306823 9593243
20066 9593243 10088813 10362161 10183309 9784017 9591983 9769096 10096531 10277153 10255206 10206105
20056 10206105 10254943 10293691 10155348 9919211 9867232 10086335 10317661 10341408 10300095 10399713
20046 10399713 10482645 10260967 9880849 9821613 10189556 10531949 10495115 10282508 10244594 10362835
20036 10362835 10430059 10457130 10555324 10612993 10448760 10174398 10077169 10206949 10367852 10451992
20026 10451992 10489915 10431158 10199558 9957495 9990193 10282399 10505190 10489836 10432077 10534934
20016 10534934 10724595 10850267 10916074 10957863 10910192 10771220 10709825 10822929 10948458 10907746
20006 10907746 10786826 10777512 10870413 10924935 10939844 11015731 11110174 11072262 10910153 10810858 10879518
19995 10879518 11038089 11190237 11311889 11368565 11320717 11234876 11224072 11261313 11224451 11135483
19985 11135483 11152828 11297788 11414122 11451545 11534709 11656208 11587348 11269602 11020532 11097941
19975 11097941 11293257 11272146 11134491 11252979 11642115 11894506 11775289 11524156 11469027 11624227
19965 11624227 11784879 11794255 11625702 11393245 11326284 11526463 11748405 11688673 11478044 11523749
19955 11523749 11835605 11970987 11781287 11687459 11937759 12133008 11934271 11745754 12075186
19946 12075186 12588386 12551170 12018901 11778621 12113040 12425479 12263945 11967835 11973715 12130037
19936 12130037 12132463 12106692 12267899 12420992 12314785 12168407 12323137 12618744 12644708 12434222
19926 12434222 12371337 12508882 12521504 12333023 12272322 12507792 12770492 12796292 12686681 12661310
19916 12661310 12746639 12879657 13069974 13284603 13374688 13281737 13153535 13116113 13090006 12977020
19906 12977020 12877462 12942847 13111852 13180812 13103941 13053569 13150164 13265048 13192903 12968638
19896 12968638 12874080 13077545 13392673 13534195 13517881 13583984 13762184 13810670 13645946 13510418
19886 13510418 13565874 13638408 13573696 13518386 13576329 13532328 13289760 13240495 13699803 14251251
19876 14251251 14258379 13849965 13726461 14067987 14364723 14365399 14410726 14636028 14631619 14257711 14073020
19865 14073020 14449617 14878287 14751241 14331646 14278079 14583175 14698039 14488049 14367843
19856 14367843 14560362 14824465 14923088 14879049 14772030 14687160 14803577 15145538 15366250 15198551
19846 15198551 14952539 15068300 15355535 15295546 14980295 15021329 15501629 15786757 15558988 15298322
19836 15298322 15423870 15643353 15585362 15472493 15629521 15808759 15617042 15281823 15361419 15861166
19826 15861166 16216235 16112309 15840137 15801441 16041399 16339943 16499804 16485900 16436713 16521197
19816 16521197 16689134 16697771 16509472 16439471 16694285 17000380 16991939 16769735 16724405 16947673
19806 16947673 17186088 17284835 17313010 17308562 17256036 17282689 17529006 17841471 17929624 17812809
19796 17812809 17772737 17882141 17948875 17929807 18001218 18169969 18223278 18162556 18284825 18686697
19786 18686697 19061812 19161845 19111080 19096341 19104022 19144160 19342749 19585292 19490390 19042725
19776 19042725 18824247 19210080 19734208 19765231 19467473 19460235 19759449 19802169 19476040 19349266
19766 19349266 19710545 20086297 20038069 19835474 19893248 20037847 19891626 19635733 19750174 20152425
19756 20152425 20243883 19846159 19499267 19639965 19983114 20035717 19850623 19858067 20158608 20420648
19746 20420648 20433022 20364084 20402351 20473070 20465669 20478753 20621460 20756930 20701501 20574355 20668968
19735 20668968 20996476 21235129 21195243 21080329 21153511 21356033 21449933 21394511 21356076 21409490
19725 21409490 21446681 21383867 21289903 21279648 21392403 21578402 21712740 21664271 21469739 21370292
19715 21370292 21503115 21629939 21421702 20985235 20786345 20981713 21178521 21047112 20841518
19706 20841518 20990120 21402169 21582431 21340444 20989884 20838286 20846300 20871813 20915999 20976878
19696 20976878 20934489 20771857 20702230 20885792 21184061 21371363 21432891 21469505 21466393 21381715
19686 21381715 21338537 21471264 21651997 21626895 21398028 21225097 21245861 21330473 21340683 21310105
19676 21310105 21316297 21372486 21487275 21631282 21628367 21344680 21034784 21160946 21711447 22055460
19666 22055460 21767103 21285257 21337239 21906557 22279266 22071973 21685141 21614019 21796730 21917928
19656 21917928 21973188 22150188 22381859 22422581 22279119 22214354 22343032 22524134 22654880 22779759
19646 22779759 22876557 22830218 22702298 22742492 23000009 23189684 23124692 23032041 23191798 23472703
19636 23472703 23540900 23395800 23342181 23474974 23564388 23502502 23498827 23681420 23825225 23718953
19626 23718953 23563781 23708248 24116183 24397928 24335018 24112654 24009398 24076599 24192545 24266162
19616 24266162 24286568 24258495 24175178 24046288 23939322 23976655 24215806 24513418 24640011 24601655
19606 24601655 24676234 24987392 25236346 25103318 24759615 24653297 24869289 25070544 25058384 24990983
19596 24990983 24983352 24905067 24729801 24699545 24920298 25132120 25121145 25032562 25010115 24879762
19586 24879762 24545640 24366661 24680640 25194841 25345635 25100208 24892624 24884770 24848180 24739517
19576 24739517 24801226 25015160 25024339 24760605 24625165 24825862 25030069 24953733 24829622 24941971
19566 24941971 25108618 25038727 24873828 24927252 25131216 25189634 25101090 25087469 25122949 24973322
19556 24973322 24660542 24492551 24620642 24887253 25108131 25212192 25130686 24864137 24655332
19547 24655332 24777510 25119326 25276159 25104013 24907533 25006808 25355015 25658420 25684760 25421098
19537 25421098 25107282 25097036 25477433 25871155 25866800 25580117 25464995 25616318 25676005 25476486
19527 25476486 25329407 25512127 25863773 26106078 26216523 26251530 26135252 25893420 25791985
19518 25791985 25956189 26138831 26158158 26242914 26573432 26806469 26554017 26100531 26066569 26468095
19508 26468095 26715180 26554607 26394735 26545452 26728353 26642561 26519888 26704433 27036662
19499 27036662 27110175 26916084 26785639 26825934 26852939 26835333 26968432 27254614 27405251 27297740
19489 27297740 27201740 27361599 27622009 27699133 27616107 27603656 27706184 27772009 27771188 27837708 27987794
19478 27987794 28060161 28000713 27974586 28091769 28223070 28222957 28163230 28186643 28272552 28329099 28402357
19467 28402357 28586388 28794509 28832289 28677622 28503371 28432012 28442955 28514681 28669561 28856221
19457 28856221 28965493 29003026 29088206 29243937 29342006 29300903 29194496 29125557 29127785 29216734 29392954
19446 29392954 29577824 29689776 29767382 29846730 29783568 29468384 29174430 29317161 29811839 30079842
19436 30079842 29845279 29512598 29514336 29689187 29648662 29411666 29263081 29256321 29293788 29471357
19426 29471357 29866513 30161170 29993047 29585959 29510039 29850310 30133164 30094175 29985077 30023188
19416 30023188 30053157 29935946 29827071 29858933 29925334 29966150 30099693 30303865 30352126 30244621
19406 30244621 30288263 30540972 30631160 30405691 30277305 30544953 30828739 30681977 30377051 30474839
19396 30474839 30874508 30962739 30609424 30351249 30525449 30813167 30825154 30661406 30632226 30764493
19386 30764493 30856836 30826665 30786158 30864789 31060834 31213542 31142679 30913543 30854805 31125915
19376 31125915 31413143 31354171 31135992 31253416 31707867 31934809 31633884 31193767 31067913
19367 31067913 31159435 31153707 31105951 31270499 31559614 31627280 31431905 31312934 31463841 31662987
19357 31662987 31649105 31508382 31499294 31636805 31673306 31491653 31333741 31515564 31990981 32366100
19347 32366100 32366888 32123485 31915648 31832759 31844883 32001776 32284586 32418912 32205158 31956301
19337 31956301 32169507 32741010 32995537 32655253 32295089 32526486 33135462 33449953 33278961
19328 33278961 33019927 32988992 33108712 33226800 33340082 33455295 33536992 33647053 33891385 34197562
19318 34197562 34361458 34326899 34224150 34151559 34122374 34184936 34364635 34527274 34545125 34549047
19308 34549047 34737762 34987903 34991711 34775003 34698471 34883523 35029415 34931303 34791931 34814447
19298 34814447 34849076 34726109 34633625 34818112 35121500 35179579 34968530 34824978 34969345 35283398
19288 35283398 35540096 35623852 35535217 35376089 35327630 35486355 35736640 35900332 35950886 35967185
19278 35967185 35981482 36011457 36115450 36254278 36249842 36077347 36020244 36272038 36559879 36503681
19268 36503681 36213621 36129033 36338781 36506434 36462612 36391038 36349987 36111783 35666767 35415247
19258 35415247 35576208 35810402 35757501 35582810 35611177 35738866 35655306 35412565 35297702 35289271
19248 35289271 35123994 34838352 34776917 35042350 35337506 35400450 35257100 35025789 34815947 34830550
19238 34830550 35195525 35646010 35756341 35535986 35408237 35534860 35605992 35430146 35262988
19229 35262988 35325916 35435948 35394173 35332961 35357365 35245899 34898077 34699447 34965017 35335108
19219 35335108 35270640 34919184 34886533 35261293 35490649 35256317 34905131 34868354 35109604 35317469
19209 35317469 35291496 35011006 34636188 34511896 34834144 35266200 35266888 34851089 34582926 34723301
19199 34723301 34897341 34805113 34721844 34942980 35204150 35114772 34820756 34736684 34856945 34839786
19189 34839786 34639465 34562468 34730244 34923269 34994300 35067068 35240883 35388064 35356570 35187204
19179 35187204 35045068 35036815 35116501 35127761 35006364 34954548 35217381 35624635 35666769 35211901
19169 35211901 34798446 34903159 35258932 35332973 35180986 35257979 35567827 35654705 35413658 35262611
19159 35262611 35409308 35548292 35463804 35370513 35412330 35357638 35113811 35054138 35421382 35804236
19149 35804236 35677174 35187011 34937427 35165420 35562387 35807142 35874916 35846867 35754554 35651591
19139 35651591 35617834 35673894 35811402 36025594 36200088 36122655 35793627 35543338 35623657 35856217
19129 35856217 35937480 35912962 36031800 36268833 36358422 36246521 36146207 36136149 36047113 35816828
19119 35816828 35657639 35749337 35984307 36137158 36130461 36041038 35969618 35980741 36083272 36221484
19109 36221484 36331945 36396363 36400216 36322996 36241291 36310705 36521917 36625361 36472933 36279120
19099 36279120 36317124 36503917 36567119 36502018 36531673 36683298 36762169 36735026 36779958 36918562
19089 36918562 36951497 36842346 36829744 37030326 37225313 37189009 36981659 36788065 36701520 36775758
19079 36775758 37031545 37284656 37235415 36886697 36618974 36681341 36864332 36872566 36762514 36760176
19069 36760176 36863248 36912109 36905236 36962143 37067899 37107959 37098494 37165469 37329315 37474873 37495573
19058 37495573 37358083 37115890 36958249 37094984 37455306 37672841 37543518 37315088 37307805 37443475
19048 37443475 37441077 37319772 37344383 37538618 37633676 37535779 37499705 37722726 38038300 38162792
19038 38162792 38047941 37839764 37641414 37480323 37424382 37568459 37889907 38193925 38256147 38049023
19028 38049023 37814548 37835561 38103182 38307040 38222791 38003237 37973576 38220968 38518215 38610376
19018 38610376 38470221 38297194 38318901 38539468 38685939 38549143 38364961 38573093 39119066
19009 39119066 39386545 39074429 38732824 38979233 39515224 39554472 39071782 38882038 39383154
19000 39383154 39945118 39877247 39409959 39233543 39476444 39697325 39668253 39612108 39706214 39825914
18990 39825914 39861561 39929358 40128682 40340801 40417811 40402916 40419774 40453797 40392785 40247324
18980 40247324 40193928 40356196 40629751 40817876 40903932 41048383 41287587 41419815 41323055 41210278
18970 41210278 41334370 41561697 41550193 41311098 41240518 41536308 41932914 42148294 42262420 42449459
18960 42449459 42632256 42672421 42675946 42819601 43039621 43173596 43273879 43495270 43778664 43931895
18950 43931895 43947798 43968300 44004390 43977583 43977907 44159505 44396304 44384806 44139942 44049641 44311496
18939 44311496 44618661 44594282 44294546 44050228 43984523 43948547 43848107 43773494 43787272 43781826
18929 43781826 43629820 43372035 43178861 43167619 43301263 43437650 43443276 43280379 43026692 42817220
18919 42817220 42741132 42787275 42903761 43084321 43325479 43504204 43433427 43124942 42870461 42903825
18909 42903825 43074352 43061503 42855342 42760817 42916774 43102846 43112424 43036592 43030648 43055970 43041480
18898 43041480 43068396 43178660 43213941 43084497 42994801 43132850 43327519 43321400 43208197 43243681
18888 43243681 43363721 43299284 43097408 43091177 43337362 43503769 43400991 43252113 43312055 43544796
18878 43544796 43804294 44033637 44160058 44091222 43950731 44016762 44273401 44331806 43993270 43595286
18868 43595286 43556145 43832520 44094282 44210557 44266250 44280146 44232627 44260225 44502228 44805538
18858 44805538 44880753 44748437 44747610 45035407 45318423 45231219 44855632 44683221 45033387 45622059
18848 45622059 45850730 45537026 45168404 45273504 45718267 45930990 45739166 45567221 45731379
18839 45731379 45972155 45926186 45710633 45696967 45926872 46112492 46111230 46083041 46198763 46424190
18829 46424190 46600268 46609144 46495739 46477763 46707478 46989141 46969527 46688141 46614493 46972414
18819 46972414 47400390 47552486 47637205 47956434 48283203 48244463 48050762 48208734 48651556 48828717
18809 48828717 48636180 48568886 48849512 49084228 49015814 48993929 49344038 49787336 49905363 49775617
18799 49775617 49715629 49726288 49640653 49576764 49774581 50120661 50259160 50112940 49939352 49912053
18789 49912053 49968601 50046731 50166016 50262337 50209353 50044650 49958857 50022930 50107435 50097257 50018394
18778 50018394 49931351 49865903 49896128 50114750 50454231 50652745 50504574 50108788 49800817 49829329
18768 49829329 50121927 50386048 50431341 50334231 50254696 50202193 50119130 50105217 50320106 50658572
18758 50658572 50790246 50621573 50470664 50615117 50877970 50891555 50626738 50399682 50416500 50565524
18748 50565524 50678215 50776406 50958705 51168489 51223994 51096154 51053234 51387993 51977370 52298079
18738 52298079 52047806 51605562 51605247 52127106 52645750 52780808 52712697 52740926 52812805 52722141
18728 52722141 52490080 52303448 52284172 52498293 52950513 53402109 53490906 53235281 53091942 53283528
18718 53283528 53466084 53384285 53399255 53863083 54366271 54269468 53745145 53574273 53997564 54482267
18708 54482267 54653196 54746272 54984391 55158785 55097467 55006927 55053377 55067740 54960010 54997587
18698 54997587 55351945 55744103 55867224 55831622 55872841 55938452 55914669 55980269 56344338 56825521
18688 56825521 57062456 57018908 56961266 57031944 57136022 57192600 57250504 57368671 57540119 57712281
18678 57712281 57815062 57850235 57960411 58240154 58493328 58449060 58232078 58267312 58653200 59035232
18668 59035232 59205650 59346478 59501033 59374086 58980399 58904067 59434360 59989074 59997597 59851602
18658 59851602 60224003 60854372 60930401 60465870 60307244 60755362 61156766 61081315 60993347 61344016
18648 61344016 61776443 61786800 61585262 61689454 62069030 62298997 62313205 62437942 62774169 63017715
18638 63017715 62914958 62593288 62409972 62630803 63205527 63759687 63939261 63851098 63956658
18629 63956658 64417077 64818578 64751293 64398642 64271937 64547201 64956019 65216590 65312160 65405019
18619 65405019 65658591 66076627 66416635 66415645 66197154 66212407 66625526 67048442 67118622 67027971
18609 67027971 67141758 67377063 67409189 67311714 67478218 67946229 68286740 68243813 68077000 68137014
18599 68137014 68432963 68773510 69063947 69288214 69396288 69385435 69383881 69534562 69849900 70210114
18589 70210114 70438261 70411809 70215439 70137427 70374853 70794009 71128872 71329043 71516620 71695313
18579 71695313 71762364 71756820 71821512 71946323 72028550 72154767 72495193 72922608 73113679 73086109
18569 73086109 73228798 73666891 74021700 74035668 74027106 74364222 74812484 74870178 74580533 74513623
18559 74513623 74938482 75454225 75589400 75440727 75474075 75858768 76269864 76366165 76263563 76376705
18549 76376705 76851099 77369138 77608069 77673109 77845409 78072917 78085601 77965422 78140456 78695926
18539 78695926 79147689 79153741 79035203 79225666 79567363 79643540 79554285 79775486 80330959 80699428
18529 80699428 80625566 80500545 80750288 81272065 81711622 81957925 82117174 82270923 82492273
18520 82492273 82861936 83256539 83368818 83163585 83051517 83334520 83734686 83822131 83695730
18511 83695730 83813354 84271159 84720821 84987866 85295639 85771463 86171572 86308506 86392535
18502 86392535 86679511 87061599 87306864 87480566 87788590 88152229 88308455 88281005 88393528
18493 88393528 88781293 89208784 89459339 89619436 89840279 90072541 90233736 90443425 90850946
18484 90850946 91335215 91613970 91626503 91613310 91800686 92161474 92530773 92844219 93191890 93671991
18474 93671991 94227116 94648206 94791604 94788632 94933791 95325685 95752662 96016518 96208452 96509832
18464 96509832 96871952 97127016 97323427 97674792 98191709 98634872 98874415 99050694 99310803
18455 99310803 99615560 99900113 100212601 100577881 100906410 101152349 101400685 101707730 102031075
18446 102031075 102393920 102898432 103470280 103840654 103941991 104076354 104493657 105040015 105449517
18437 105449517 105739812 106042607 106282706 106373611 106539531 107046035 107729890 108191976 108378577
18428 108378577 108582021 108932527 109304297 109683751 110184474 110695595 110979764 111155584 111587132
18419 111587132 112216982 112559790 112528658 112686282 113372661 114134844 114448997 114532502 114915755
18410 114915755 115577532 116090030 116378697 116743495 117254410 117689452 118023511 118455520 118949983
18401 118949983 119246857 119371905 119667079 120222109 120712144 120933686 121112005 121516196 122103417
18392 122103417 122702447 123255419 123737428 124108490 124457576 124922339 125392597 125619822 125701688
18383 125701688 126059582 126778108 127388815 127558086 127588242 127910677 128449006 128890282 129281846
18374 129281846 129872776 130552481 130958696 131085067 131312583 131805984 132288251 132513533 132634697
18365 132634697 132963208 133586856 134328812 134924660 135202139 135252951 135436483 136027276 136848842
18356 136848842 137452106 137674563 137819824 138239133 138920659 139564371 139937489 140110378 140411667
18347 140411667 141106486 142032160 142683571 142828747 142869040 143307886 144015951 144422443 144373790
18338 144373790 144338433 144699349 145303626 145868196 146393711 146932079 147327807 147501334 147694073
18329 147694073 148123681 148643331 149029398 149350406 149738299 150054510 150158107 150288495 150764689
18320 150764689 151457420 151980076 152283422 152622360 153022627 153263517 153375170 153660251 154156784
18311 154156784 154545978 154705420 154903038 155290794 155660297 155916583 156346968 157112750 157863964
18302 157863964 158229560 158378873 158706951 159227610 159699361 160130012 160677446 161190772 161374354
18293 161374354 161391433 161790499 162720114 163656047 164092841 164148979 164271454 164644738 165145899
18284 165145899 165642803 166049330 166247643 166249420 166347805 166830590 167565015 168118839 168317962 168452554
18274 168452554 168853326 169470663 170020601 170402071 170765171 171211000 171637251 171943647 172224216
18265 172224216 172623777 173105542 173527956 173905492 174394434 174994836 175475717 175707760 175899057
18256 175899057 176331125 176974199 177555260 177942162 178258787 178634750 179035438 179378540 179674598
18247 179674598 180005826 180453028 181032626 181611990 181955724 182016378 182104903 182542216 183190780
18238 183190780 183629304 183789386 184042025 184551437 184970232 185038137 185092469 185569731 186278192
18229 186278192 186673310 186713093 186883368 187374774 187815813 187994038 188294807 189066987 189970390
18220 189970390 190432472 190509899 190772553 191409398 191983249 192181439 192335000 192901720 193747013
18211 193747013 194316854 194399444 194351097 194555716 194982327 195399495 195767575 196193228 196638341
18202 196638341 196939214 197101368 197352055 197844553 198477269 199071139 199569613 199977249 200262426
18193 200262426 200459024 200733304 201180219 201647952 201944827 202142379 202466298 202935579 203343932
18184 203343932 203597582 203830557 204141640 204452782 204710654 205006864 205388551 205757734 206081793
18175 206081793 206486153 206981807 207333402 207423920 207542355 208016707 208714040 209241252 209548268
18166 209548268 209948099 210536423 210992509 211089983 211074680 211322867 211851417 212388889 212779372
18157 212779372 213099934 213460882 213870652 214270130 214592800 214823193 215043620 215346066 215676460
18148 215676460 215906874 216096206 216469392 217032869 217442383 217445393 217262786 217297591 217623658 218023311
18138 218023311 218385616 218746699 219026423 219089126 219062295 219246767 219664514 220024857 220201321
18129 220201321 220386429 220663745 220821145 220808421 221002386 221669433 222440519 222735015 222557270
18120 222557270 222461266 222784627 223318824 223764599 224131977 224549958 224965833 225234233 225368264
18111 225368264 225560241 226004488 226728236 227527133 228104690 228391533 228655201 229130129 229652874
18102 229652874 229933877 230095840 230546445 231295684 231853451 231977038 232089931 232655217 233483731
18093 233483731 234052855 234263393 234450173 234788095 235128369 235385073 235685484 236103988 236570041
18084 236570041 237069755 237642725 238162155 238428159 238517596 238734649 239167184 239608599 239973527
18075 239973527 240432563 241027412 241530178 241864878 242306849 243020773 243728310 244125704 244348836
18066 244348836 244705987 245195815 245630164 246021012 246490606 246985186 247433000 247980924 248672107
18057 248672107 249118687 249024105 248867361 249419190 250590242 251448829 251523187 251398873 251735115
18048 251735115 252355991 252789248 253138777 253783851 254584029 255080306 255314231 255783644 256615617
18039 256615617 257387006 257830856 258175445 258645729 259125228 259524054 260050203 260834953 261622476
18030 261622476 262132940 262490033 262999041 263683881 264322230 264817566 265290180 265875035 266618035
18021 266618035 267493755 268370062 269057174 269549172 270104549 270917936 271823758 272509355 272921502
18012 272921502 273272598 273737802 274337840 275022512 275660967 276051898 276183113 276383455 276935674
18003 276935674 277617948 277969048 277983544 278152462 278736440 279387294 279674199 279656694 279691265 279930123
17993 279930123 280289162 280718737 281212748 281667421 281995314 282299319 282711695 283159259 283519629
17984 283519629 283897248 284459338 285074386 285439864 285562578 285787181 286299172 286911787 287432039
17975 287432039 287918565 288424593 288793678 288951220 289159575 289693134 290410902 290939633 291184378
17966 291184378 291371847 291647013 291931476 292186522 292510807 292896003 293157938 293246439 293390066
17957 293390066 293750939 294127495 294231932 294136669 294180635 294475273 294769930 294848929 294826107 294933379
17947 294933379 295195590 295468583 295689723 295927568 296225435 296530248 296774559 296946477 297089070
17938 297089070 297277205 297541387 297767651 297785049 297653523 297719535 298191377 298780168 299040627
17929 299040627 299004473 299124977 299567079 299957912 300001752 299945944 300147644 300513228 300747732 300900304
17919 300900304 301213372 301605890 301801870 301882631 302183579 302645691 302823977 302635072 302533053
17910 302533053 302746987 302906387 302733465 302564524 302740158 302951438 302756476 302380815 302344988
17901 302344988 302525497 302314936 301666256 301245185 301405865 301671713 301513486 301094169 300859968
17892 300859968 300812475 300638776 300304012 300055661 299937463 299696094 299201441 298681517 298448961
17883 298448961 298540333 298707460 298715481 298594395 298553486 298642674 298630685 298356854 298069183 298141970
17873 298141970 298512195 298734666 298630862 298508151 298599926 298668410 298422029 298020780 297838262
17864 297838262 297925907 298042434 298075371 298108456 298148917 298093993 297956722 297886413 297963583 298147234
17854 298147234 298385693 298612662 298691208 298539440 298276003 298103997 298104410 298234411 298399723 298426195
17844 298426195 298167050 297804060 297788082 298222089 298562102 298291538 297676275 297402412 297602049
17835 297602049 297747721 297488342 297070359 296833972 296751239 296628045 296388687 295997089 295427745
17826 295427745 294859330 294569532 294499575 294267877 293767051 293367002 293314579 293323575 293062033 292693227
17816 292693227 292543561 292497197 292165841 291529940 290986065 290771048 290690503 290475482 290144614
17807 290144614 289914618 289905186 290014408 290025879 289814832 289460656 289128448 288872440 288659274 288532986
17797 288532986 288557342 288607607 288476025 288218680 288110262 288186814 288165019 287940169 287799297 287927919
17787 287927919 288051680 287847734 287420838 287082511 286922368 286875052 286930789 286991722 286827205 286480083
17777 286480083 286358092 286557312 286523392 285886908 285195509 285135045 285385681 285098597 284301016
17768 284301016 283860706 284044671 284116688 283614419 283074416 283017410 283026730 282475502 281568343 280963367
17758 280963367 280763255 280560534 280230158 280035064 280053932 280046473 279860546 279554067 279145786 278606786
17748 278606786 278064535 277694769 277447544 277160891 276880099 276775373 276803528 276749631 276574872
17739 276574872 276437415 276364578 276163951 275705573 275107123 274607060 274375711 274421340 274553030
17730 274553030 274480612 274077376 273504060 272996536 272631871 272382312 272235438 272120381 271868336
17721 271868336 271409032 270882632 270429516 270021013 269609925 269243157 268890666 268405197 267812659
17712 267812659 267360273 267077349 266618314 265813727 265020490 264556820 264138469 263349645 262379029
17703 262379029 261729601 261403734 260974338 260339764 259789770 259373666 258833873 258193227 257784750
17694 257784750 257604212 257237244 256573174 255998367 255689548 255309544 254664970 254081997 253780299
17685 253780299 253413386 252665288 251849551 251431158 251309070 251064285 250638275 250269245 249962687
17676 249962687 249519581 248972075 248540117 248213206 247771790 247196783 246699554 246340125 245934677
17667 245934677 245386874 244853696 244510321 244318754 244084071 243650894 243042442 242448669 242029154
17658 242029154 241728168 241396408 241048785 240777183 240449948 239851058 239150707 238794049 238780169
17649 238780169 238541806 237802257 237047658 236761005 236667392 236251785 235614225 235198099 234976877
17640 234976877 234576577 234006455 233595052 233322551 232888102 232370160 232131202 232074917 231702307
17631 231702307 230966776 230365875 230066602 229672778 229059612 228676079 228687164 228552905 227921112
17622 227921112 227270873 227105066 227092994 226682746 226084175 225880725 225987512 225801379 225242726
17613 225242726 224866433 224924771 225034654 224910028 224794156 224927929 225103759 225040623 224812879
17604 224812879 224623531 224475702 224359540 224490137 225023822 225702932 226106141 226189233 226314055
17595 226314055 226756426 227414035 228044232 228613835 229313368 230304254 231545569 232873384 234211099
17586 234211099 235667681 237409093 239446568 241593327 243640478 245520296 247225314 248560540
17578 248560540 249060861 248269514 246140985 243110612 239720981 236241737 232713801 229252176
17570 229252176 226114147 223460551 221214550 219214192 217382965 215698028 214116326 212613267
17562 212613267 211206274 209884214 208610199 207440094 206508513 205810447 205112065 204194351
17554 204194351 203117848 202151529 201484441 201061164 200640245 199981996 199067115 198159859 197545845
17545 197545845 197183142 196757090 196111653 195429187 194898931 194431398 193869002 193288308 192862139
17536 192862139 192540202 192112871 191547002 191031284 190669410 190309993 189754159 189034838 188403912
17527 188403912 188036736 187792010 187355455 186662955 186032070 185710225 185450689 184845973 183995087
17518 183995087 183424112 183313964 183262824 182945689 182528749 182194073 181745331 181051366 180444081
17509 180444081 180224496 180140092 179835193 179469930 179339736 179206306 178668339 177966014 177687479
17500 177687479 177787497 177640077 177048128 176459840 176130788 175825857 175480042 175375115 175423679
17491 175423679 175055481 174175756 173504459 173499428 173618541 173215429 172560521 172290313 172317419 172050344
17481 172050344 171410323 170889121 170723408 170657296 170471788 170189521 169777996 169153398 168482633
17472 168482633 168049695 167835796 167614455 167383477 167275813 167129736 166645975 165956991 165531667
17463 165531667 165458493 165313488 164851602 164356143 164113978 163959433 163589372 163016289 162458513
17454 162458513 162014958 161671132 161444602 161323237 161183257 160920424 160577435 160259308 160012486
17445 160012486 159820897 159613372 159272099 158758478 158209403 157776043 157432671 157112025 156913353
17436 156913353 156915368 156882311 156502963 155900336 155534196 155550777 155595879 155375055 155041145 154857167
17426 154857167 154786346 154632648 154356641 154047401 153755049 153514594 153380618 153311248 153174498
17417 153174498 152965611 152833997 152799700 152655570 152281317 151856061 151605968 151504077 151367804
17408 151367804 151118106 150807929 150501619 150234766 150017514 149823940 149641553 149503566 149373879
17399 149373879 149099221 148642573 148218191 147948316 147579172 146912318 146319792 146290198 146573665
17390 146573665 146443160 145825591 145426039 145551345 145600155 145087557 144422940 144139771 144017803
17381 144017803 143620956 143151375 143033536 143078239 142827708 142410454 142279046 142339821 142128120
17372 142128120 141685647 141475989 141515561 141368819 140985180 140769662 140783101 140633251 140258730
17363 140258730 140072344 140165041 140093400 139675644 139308541 139240618 139197661 139010997 138949849 139091887
17353 139091887 139017906 138541272 138136300 138187987 138366289 138216742 137854209 137584001 137344847
17344 137344847 137052025 136985333 137238279 137253098 136580015 135705411 135405357 135597990 135595396 135238345
17334 135238345 134959114 134855773 134557436 134028244 133704256 133700778 133605616 133249971 133013188 133100816
17324 133100816 133127152 132751167 132230660 131988386 132018564 132054690 132001312 131891683 131680717 131348619
17314 131348619 131002831 130696246 130371612 130107482 130115694 130343693 130409610 130121743 129738257 129512455
17304 129512455 129329713 129038921 128783984 128690785 128546738 128152256 127718630 127533333 127462672
17295 127462672 127195779 126795795 126574454 126540986 126411299 126106514 125827697 125647697 125417457
17286 125417457 125095707 124805493 124531173 124129585 123706860 123598362 123830522 123953008 123619288
17277 123619288 123057714 122723990 122694770 122665976 122419698 122033536 121672243 121389084 121159525
17268 121159525 120971725 120825312 120685678 120475207 120141433 119765441 119543148 119554364 119595393
17259 119595393 119398317 118999903 118692061 118583275 118456279 118159571 117873469 117781930 117704136
17250 117704136 117348096 116800607 116434630 116365508 116329432 116145048 115972457 115976948 116007214 115813719
17240 115813719 115400829 114953867 114564113 114244553 114088664 114147666 114216294 114019521 113606484
17231 113606484 113290121 113172106 113019364 112695787 112409495 112351470 112353754 112157595 111823226 111587520
17221 111587520 111452738 111227835 110909062 110709429 110714899 110782517 110786541 110712241 110517967 110197623
17211 110197623 109982972 110129734 110431643 110337513 109724084 109174114 109214677 109607208 109744622
17202 109744622 109494306 109226583 109158967 109123892 108970949 108798955 108710789 108639500 108511878 108364134
17192 108364134 108235158 108129304 108096927 108155910 108147414 107894957 107489635 107166852 106926316 106584506
17182 106584506 106207765 106112727 106329599 106438213 106136337 105662220 105425235 105477678 105583020
17173 105583020 105567802 105372328 104991378 104613298 104566339 104838645 104915220 104451771 103856915 103745311
17163 103745311 104010679 104010788 103593972 103288054 103360331 103350826 102868772 102300205 102226567 102510464
17153 102510464 102532757 102155189 101859438 101930292 102047473 101855537 101493509 101275531 101170512
17144 101170512 100961669 100730940 100766706 101014887 101029185 100602282 100111830 99990638 100104748
17135 100104748 100007282 99667557 99505804 99670774 99736050 99330013 98699091 98321274 98235866 98145547
17125 98145547 97981916 97906867 97849779 97554769 97116571 96954162 97107447 97056482 96496134 95842099
17115 95842099 95616457 95714731 95711731 95578093 95574935 95637752 95436340 94999988 94745689 94826198
17105 94826198 94924265 94798399 94584935 94401441 94079536 93530018 93017076 92796127 92757626 92682808
17095 92682808 92586526 92540074 92413316 92103303 91802077 91707733 91654991 91385601 91027367 90905961
17085 90905961 90975971 90864531 90468818 90095969 89954270 89898221 89790381 89743056 89819441 89816951
17075 89816951 89580102 89277120 89118461 89001054 88697949 88263107 87976926 87950451 88013057 87971802
17065 87971802 87796128 87553242 87322796 87190978 87203994 87298343 87347353 87278393 87101180 86858606
17055 86858606 86605432 86392825 86219793 86041774 85858766 85726059 85651198 85579815 85515331 85516795
17045 85516795 85521696 85340059 84934290 84543108 84384555 84381986 84337038 84215894 84078173 83885207
17035 83885207 83615191 83429268 83455652 83528003 83432329 83296088 83370449 83502651 83262737 82625639
17025 82625639 82084059 81966429 82069113 82139208 82274609 82549769 82650392 82305275 81809654
17016 81809654 81658605 81814069 81790613 81406820 81010668 80925747 81063956 81188653 81236900 81236404
17006 81236404 81150994 80965198 80761307 80608899 80510071 80494492 80596581 80701661 80619414 80368811
16996 80368811 80171267 80087438 79919044 79604717 79431577 79607609 79845768 79702995 79222537
16987 79222537 78890182 78956716 79137805 79076835 78807344 78572998 78422652 78256337 78150790 78310380
16977 78310380 78656167 78762542 78384609 77852711 77688440 77924241 78103094 77957296 77745503
16968 77745503 77764777 77850873 77675972 77333028 77213890 77364201 77389127 77082797 76753528 76726515
16958 76726515 76854770 76801707 76563269 76388654 76343523 76284610 76179579 76126562 76091067 75938435
16948 75938435 75732954 75695084 75818499 75838447 75663123 75520927 75541788 75513693 75278197 75074433
16938 75074433 75171486 75373234 75273269 74893348 74656990 74729632 74799611 74630023 74442675 74514205
16928 74514205 74689607 74628425 74363832 74252979 74409957 74535124 74391117 74164064 74171528 74386608
16918 74386608 74472426 74241117 73893529 73762276 73927191 74161887 74223690 74112268 74002449 73979406
16908 73979406 73953913 73858373 73781583 73792185 73751155 73504573 73207339 73195339 73499354 73754444
16898 73754444 73706027 73537750 73499200 73465454 73182555 72778011 72627966 72756826 72779713 72519600
16888 72519600 72290080 72370947 72536001 72402152 72028814 71818222 71902941 71972190 71748129 71362759
16878 71362759 71131220 71113761 71067087 70798007 70448240 70362257 70671476 71073878 71120003 70714401
16868 70714401 70213121 69985268 70021033 70068826 70011585 69929999 69879071 69812975 69727832 69696392 69719694
16857 69719694 69686400 69537895 69365325 69275331 69235559 69128510 68928632 68758879 68740353 68805646
16847 68805646 68745581 68515492 68399078 68662246 69064884 69027134 68413983 67834057 67879854 68344476
16837 68344476 68591260 68492967 68464069 68616678 68521579 67995554 67543038 67632727 67978845 68024094
16827 68024094 67820644 67864288 68207719 68345943 68027916 67635755 67564362 67669417 67621740 67469696
16817 67469696 67478163 67611453 67581882 67355707 67220549 67276697 67215137 66814933 66400214 66464390
16807 66464390 66934182 67186818 66881829 66428321 66388139 66682024 66763777 66463321 66204602 66309525
16797 66309525 66508478 66392638 66050052 65907259 66083140 66244419 66096333 65749843 65535585
16788 65535585 65611779 65817490 65846417 65569737 65214964 65129244 65312433 65362471 65024774 64595895
16778 64595895 64538354 64852095 65136499 65175672 65107021 65036664 64869900 64596029 64396190 64334517
16768 64334517 64230315 63985932 63787629 63821562 64009795 64172497 64234682 64135565 63780913 63271732
16758 63271732 62953253 63017733 63236841 63283682 63137193 62972792 62854742 62765331 62749863 62790864
16748 62790864 62720036 62496693 62366285 62471280 62545564 62339051 62097704 62178136 62396069 62303399
16738 62303399 61984339 61945584 62221995 62273234 61910242 61635315 61762730 61855553 61502920 61104645
16728 61104645 61271732 61819211 62016598 61650724 61216305 61116372 61237259 61333758 61339560 61231531
16718 61231531 61010019 60872980 61020320 61255367 61193387 60889677 60785670 60965239 61011812 60773428
16708 60773428 60679571 60975219 61203373 60925674 60486272 60467939 60743487 60746941 60468886 60434313
16698 60434313 60734116 60837639 60509314 60210138 60300551 60462172 60318589 60114680 60268884
16689 60268884 60626820 60720464 60535127 60457090 60576048 60584092 60355797 60127364 60038015 59950022
16679 59950022 59832819 59888267 60117872 60166995 59845855 59470127 59402059 59538083 59568869 59505833
16669 59505833 59569296 59702202 59608131 59257558 58995018 59069327 59328112 59469087 59381231 59148526
16659 59148526 58902121 58775082 58860764 59103021 59307705 59329078 59180895 58948804 58696526 58483758
16649 58483758 58364121 58320031 58283479 58237286 58202315 58134746 57975464 57810454 57813125 57976254
16639 57976254 58067027 57930808 57692386 57561985 57576869 57632711 57636636 57523659 57261240 56964152
16629 56964152 56870238 57055304 57289651 57322188 57177610 57012206 56834931 56602670 56454199 56545898
16619 56545898 56716965 56640154 56309674 56059643 56045383 56035788 55844032 55648945 55686764 55882616
16609 55882616 56027242 56103716 56165107 56067993 55663301 55163840 54974250 55151072 55348393 55352554
16599 55352554 55352533 55538806 55719586 55587049 55203390 54945682 55003771 55164988 55138910 54923926
16589 54923926 54759750 54808811 54982263 55062252 54936994 54702931 54553994 54586459 54722212 54811998
16579 54811998 54777039 54639393 54465870 54330111 54293368 54350203 54395815 54315529 54123806 53954711
16569 53954711 53890717 53871355 53825546 53823617 53986424 54257533 54394576 54245586 53942341 53730056
16559 53730056 53667704 53616992 53507257 53461124 53592988 53795307 53846777 53697056 53525568 53497267
16549 53497267 53558138 53546764 53462561 53510732 53821446 54186250 54208244 53772850 53260432 53146100
16539 53146100 53430118 53657031 53533397 53298644 53330496 53581482 53677443 53480156 53230367 53116918
16529 53116918 53037800 52916682 52944774 53261557 53616062 53645926 53365901 53084488 52938533 52851804
16519 52851804 52892112 53232536 53680293 53707750 53206187 52813720 53102482 53724765 53862129 53381479
16509 53381479 52977179 53115657 53409494 53302127 52903730 52715958 52819972 52847952 52661802
16500 52661802 52552563 52687887 52799214 52628097 52355615 52304439 52430209 52428482 52236332 52095542
16490 52095542 52121566 52126314 51969267 51820119 51887987 52069434 52091834 51914032 51752391 51731832
16480 51731832 51738641 51660885 51565519 51539828 51535653 51506487 51544250 51698956 51781698 51574018 51176466
16469 51176466 50909961 50883064 50911889 50896352 50975195 51180866 51240702 50972559 50659772 50709683
16459 50709683 51052546 51222877 51018552 50737836 50685926 50755001 50665321 50403869 50210959 50240405
16449 50240405 50411158 50551643 50569969 50499184 50432406 50390815 50272839 50028393 49842230 49948878
16439 49948878 50252180 50382875 50223594 50088661 50195745 50256703 49922354 49419665 49310708
16430 49310708 49675394 49979807 49844455 49546401 49549072 49831548 49980749 49807118 49574304 49604146
16420 49604146 49852417 49980647 49791134 49482525 49403140 49600965 49781675 49755120 49702784 49836362
16410 49836362 50010145 49955766 49732847 49585488 49477886 49222476 49005139 49224878 49743642
16401 49743642 49911528 49558748 49331761 49664750 50039525 49838062 49387783 49402899 49768798
16392 49768798 49766744 49329663 49134150 49413176 49615542 49470454 49488163 49978271 50374850 50132431
16382 50132431 49645929 49591356 49857463 49892258 49741987 49902549 50305338 50307070 49750476 49282510
16372 49282510 49402218 49802139 49945593 49808092 49696826 49685588 49601162 49390687 49207208 49192878
16362 49192878 49330872 49461724 49408547 49184225 49041909 49153158 49308293 49192375 48888594
16353 48888594 48758140 48843946 48821763 48603376 48510951 48679170 48760337 48505907 48209449 48211417
16343 48211417 48345063 48303735 48234833 48460702 48826791 48872384 48562573 48341080 48455693 48688487
16333 48688487 48810043 48888251 49031705 49157151 49147930 49022000 48870767 48799363 48900182 49095417
16323 49095417 49111107 48859224 48682477 48867859 49105848 48925331 48517523 48489143 48832998 48898325
16313 48898325 48515790 48329934 48673512 48936447 48623499 48286807 48605018 49120664 48885586
16304 48885586 48036838 47655579 48098241 48517217 48261330 47811343 47883672 48352516 48620813
16295 48620813 48530781 48346668 48215801 48169617 48356635 48764072 48948520 48558551 47953291 47782344
16285 47782344 48057746 48184896 47905935 47654639 47826837 48181449 48244439 47971623 47687292
16276 47687292 47561571 47471290 47316525 47200288 47236777 47340366 47303580 47044565 46711572 46520998
16266 46520998 46524048 46593522 46632953 46684166 46770901 46771419 46587534 46342733 46226032 46191401 46022379
16255 46022379 45686660 45403438 45322659 45362659 45437448 45599802 45813321 45816580 45457831 45019183
16245 45019183 44926674 45185188 45362986 45147938 44677117 44266306 44058962 44057073 44261772 44569430
16235 44569430 44688534 44431876 44034173 43906772 44070139 44124131 43873257 43659248 43827152
16226 43827152 44125731 44035818 43579679 43324732 43509285 43648727 43282014 42706445 42535634
16217 42535634 42782817 42916674 42743809 42654019 42871866 43016724 42725273 42291985 42249659 42559330
16207 42559330 42689292 42407526 42051650 41986922 42178415 42393615 42506173 42465248 42234691 41921742
16197 41921742 41748714 41746797 41681635 41434927 41241809 41345494 41607271 41706701 41589946 41461326
16187 41461326 41430943 41433102 41423453 41397988 41278884 41052625 40953018 41181910 41490488 41431482 41052319
16176 41052319 40886601 41131245 41323530 41104806 40823705 40943608 41238798 41147763 40688835
16167 40688835 40402456 40477611 40568295 40498778 40508198 40648791 40574714 40209487 40038234 40339307
16157 40339307 40644444 40464833 40113710 40196867 40606207 40711255 40382429 40105511 40106857 40086885
16147 40086885 39932161 39980709 40314485 40439257 40072679 39699790 39835685 40177737 40097785 39678893
16137 39678893 39579733 39967161 40261208 40045946 39651311 39572633 39747799 39757467 39486312 39234544
16127 39234544 39261609 39490033 39674880 39705133 39683843 39756288 39891931 39891250 39664602 39419721
16117 39419721 39415964 39576492 39565426 39278835 39013944 39035394 39198934 39201652 39040641 38969145
16107 38969145 39063813 39096207 38878176 38540602 38365605 38443869 38599644 38623731 38506808 38417620
16097 38417620 38468562 38556354 38498747 38306108 38192005 38262095 38326459 38153310 37819870 37631598
16087 37631598 37714733 37874512 37892901 37791751 37712402 37682729 37640502 37592073 37590293 37594596 37504217
16076 37504217 37331022 37203754 37176650 37161350 37093022 37035095 37041158 37035482 36948753 36867726 36889115
16065 36889115 36900689 36721439 36446929 36405988 36690517 36963175 36901641 36643861 36552811 36663710
16055 36663710 36664438 36409069 36147224 36145809 36320266 36392210 36249788 35998198 35773867 35659296
16045 35659296 35693504 35829360 35948442 36018166 36123958 36230467 36083256 35575737 35081452 35096859
16035 35096859 35567318 35897692 35708391 35268295 35028850 35027256 35002435 34880677 34827103 34916232
16025 34916232 35049190 35163597 35264742 35268412 35080888 34847952 34848049 35080000 35227743 35127545
16015 35127545 34991707 35021334 35075275 34947454 34734541 34645508 34630441 34523558 34425004 34565929
16005 34565929 34832734 34814802 34398109 33976946 33943517 34233912 34518944 34605616 34495202 34259638
15995 34259638 34039775 34002317 34139456 34247593 34213738 34148679 34136356 34084776 33968790 33951310
15985 33951310 34054607 33992876 33618697 33270246 33308957 33538048 33521179 33315262 33370970 33757363
15975 33757363 34027070 33925133 33725821 33703515 33723309 33587437 33405994 33359367 33397362 33425538
15965 33425538 33522822 33730510 33862254 33754938 33503605 33267037 33072147 32963425 33044825 33185930
15955 33185930 33038877 32600556 32379369 32666288 33019931 32911913 32541891 32480043 32760630
15946 32760630 32924360 32802726 32650168 32568101 32404942 32235139 32351077 32706129 32899748
15937 32899748 32793855 32628483 32479032 32185948 31905670 32055856 32517061 32600090 32131184
15928 32131184 31847987 32238891 32684364 32418528 31764353 31590515 31940263 32116244 31932542
15919 31932542 31918117 32228084 32280811 31774679 31287475 31394559 31767437 31705744 31196610 30869407
15909 30869407 31064965 31476700 31713985 31781872 31865305 31940242 31818975 31458808 31041376 30765290
15899 30765290 30684456 30757713 30929384 31093077 31094453 30909276 30743474 30779069 30875186 30757813
15889 30757813 30486570 30414954 30615210 30708409 30460799 30190586 30267560 30511971 30501902 30268073
15879 30268073 30217735 30464104 30689751 30670917 30528057 30421907 30365370 30375186 30469448 30488243
15869 30488243 30259437 29954812 29910627 30083682 30107510 29924885 29875855 30043503 30041937 29688411
15859 29688411 29383399 29486122 29744324 29740865 29547635 29497846 29585505 29548470 29367926 29260334
15849 29260334 29289781 29356268 29461759 29644125 29747146 29589278 29280053 29070628 28993344 28947014
15839 28947014 29003116 29268760 29540924 29481048 29107130 28770522 28660614 28653716 28634298 28640910
15829 28640910 28686161 28723286 28787585 28907276 28930618 28737724 28538375 28602782 28774570 28669748
15819 28669748 28317062 28126961 28206952 28224127 28050613 28012153 28284277 28536369 28470484 28287190
15809 28287190 28279408 28336075 28229465 28094525 28214619 28531382 28733381 28682179 28447113 28090634
15799 28090634 27728813 27625496 27879642 28156567 28077602 27764618 27641764 27785724 27862874 27697210
15789 27697210 27517240 27561683 27747873 27845723 27761239 27554952 27349037 27279535 27399550 27592065
15779 27592065 27688598 27657172 27556261 27378441 27123807 26961929 27082816 27394382 27594656 27561539
15769 27561539 27455078 27405030 27324876 27117593 26880218 26793098 26911822 27132689 27285330 27247752
15759 27247752 27058269 26896365 26862943 26850585 26765233 26761853 27024869 27386668 27466694 27202555
15749 27202555 26934640 26885271 26859682 26619590 26284628 26132414 26181797 26229775 26212096 26279704
15739 26279704 26508130 26720393 26686778 26421946 26186499 26173339 26261941 26187242 25934607 25787770
15729 25787770 25906307 26064333 25995643 25811537 25800371 25945579 25975354 25820035 25660809 25549109
15719 25549109 25365383 25179082 25231544 25474058 25552879 25397256 25372517 25626677 25748280 25419099
15709 25419099 25002319 25035411 25425482 25621947 25410376 25086038 24945779 25015044 25212039 25418135
15699 25418135 25438142 25214316 25009475 25072251 25232061 25165055 24935486 24877354 25035513 25152131
15689 25152131 25144531 25150299 25141125 24969719 24784291 24877038 25095462 24973770 24541131 24379730
15679 24379730 24683481 24902769 24652144 24344518 24453235 24703353 24601751 24334689 24435544
15670 24435544 24830304 24945519 24661784 24462699 24613665 24833912 24897236 24964836 25117830 25092894
15660 25092894 24778877 24541764 24707928 25058129 25200851 25184555 25330030 25618986 25699197 25491482
15650 25491482 25378138 25639798 26006702 26015769 25655361 25373310 25462134 25711474 25786600 25721239
15640 25721239 25793721 26045855 26238976 26263880 26247883 26189439 25874502 25347533 25074000 25295668
15630 25295668 25550483 25283146 24695736 24452868 24667602 24791188 24538584 24294545 24394211
15621 24394211 24559144 24391867 24006814 23779092 23766849 23756606 23654866 23494092 23249191 22971325
15611 22971325 22908301 23155525 23371893 23205362 22837774 22710785 22843676 22868880 22676846 22542305
15601 22542305 22579160 22549984 22351567 22252588 22424281 22597750 22477929 22231346 22235331 22495136
15591 22495136 22632560 22419620 22061265 21896697 21992830 22132058 22130345 22053221 22071500 22175570
15581 22175570 22176285 22007079 21838985 21792861 21745873 21611236 21583153 21798259 21952449 21683408
15571 21683408 21222522 21150085 21502971 21700789 21484867 21312639 21525417 21730933 21499138
15562 21499138 21168275 21320922 21793045 21914031 21571620 21314857 21401427 21451811 21210835 21009905
15552 21009905 21162044 21409138 21364875 21144152 21135559 21372493 21520486 21383307 21109253 20942948
15542 20942948 21001475 21247734 21496156 21496580 21187248 20830418 20752346 20976034 21225900 21262626
15532 21262626 21111027 20976107 21005906 21135759 21167861 21042169 20960205 21111012 21354396 21402663
15522 21402663 21265829 21199821 21206424 20999184 20597267 20487608 20891824 21294925 21155193 20753813
15512 20753813 20767436 21184800 21303173 20816494 20275279 20263883 20636084 20872178 20812489 20689814
15502 20689814 20687004 20797724 20978685 21157558 21177977 20958509 20641416 20423112 20326742 20283040
15492 20283040 20305308 20402041 20437427 20302833 20152866 20232001 20485182 20579668 20366269 20114075
15482 20114075 20165956 20489480 20724762 20641400 20394324 20267472 20284895 20239522 20081217 20044723
15472 20044723 20272205 20518772 20472211 20225993 20127688 20231919 20271702 20176347 20191999 20368710
15462 20368710 20371896 20054854 19810804 19990998 20310355 20281276 19984538 19890324 20064391 20119627
15452 20119627 19933171 19841677 20021847 20202599 20182295 20153319 20252757 20230051 19906968 19598076
15442 19598076 19654533 19864323 19771857 19421976 19287876 19504520 19666547 19482579 19203509 19194802
15432 19194802 19401125 19503062 19410346 19319121 19355972 19413580 19362029 19247476 19205436 19269459
15422 19269459 19349534 19371395 19359348 19349965 19278644 19048707 18734949 18606140 18825524 19174121
15412 19174121 19229798 18864019 18429373 18358171 18664425 18968927 18969672 18736669 18532106 18498052
15402 18498052 18601978 18758733 18868178 18812509 18582632 18376825 18398688 18555129 18551778 18333153
15392 18333153 18202434 18380436 18661564 18709705 18524003 18356259 18288743 18195877 18072603 18078228
15382 18078228 18226240 18328013 18312282 18322568 18411882 18427177 18318535 18267742 18336053 18280047
15372 18280047 17963652 17688474 17794783 18123723 18228073 18005593 17769412 17738218 17806162 17837733
15362 17837733 17866301 17916848 17900464 17800589 17754727 17828900 17873785 17734523 17500984 17431717 17653268
15351 17653268 17981356 18055409 17708209 17219994 17077613 17406803 17810105 17892072 17729508 17613876
15341 17613876 17577390 17511760 17542653 17828462 18104458 17951099 17505843 17356608 17638516 17804379
15331 17804379 17495813 17093490 17084964 17365118 17547803 17565767 17545012 17431912 17182216 17027315
15321 17027315 17123450 17211103 17047712 16879947 17013813 17227283 17164586 17017906 17161273 17353449
15311 17353449 17078349 16544361 16485574 16948501 17165887 16811586 16496208 16689264 16995773
15302 16995773 16969951 16864671 16986837 17018514 16678339 16434408 16749421 17131460 16848519 16206284
15292 16206284 16111006 16578040 16752880 16406812 16302677 16823117 17271066 17025809 16534702
15283 16534702 16514756 16825429 16846522 16517246 16282152 16290666 16320596 16328867 16460963 16597535
15273 16597535 16465938 16191956 16207454 16547464 16723870 16434744 15988223 15827358 15949571
15264 15949571 16021311 15870214 15664323 15685438 16017742 16417701 16526545 16305550 16141490 16327093
15254 16327093 16589552 16463417 16030550 15843641 16086058 16297364 16111702 15805372 15796001 15975774
15244 15975774 15954743 15715780 15584343 15675134 15787402 15805491 15823514 15863026 15810877 15686781
15234 15686781 15667561 15775836 15820020 15719689 15622566 15607130 15542308 15372014 15273344 15355774
15224 15355774 15444024 15378913 15323233 15494977 15746304 15727619 15425625 15229981 15406841 15744170
15214 15744170 15834613 15565259 15213054 15124443 15375071 15714303 15815190 15597342 15291225 15165224
15204 15165224 15254668 15419006 15564254 15664018 15625849 15346384 14935979 14711318 14865211 15239015
15194 15239015 15497874 15467552 15259379 15134822 15269827 15565966 15682700 15376559 14835744
15185 14835744 14530732 14670179 14963713 15028334 14867853 14781955 14920395 15136265 15232912 15163586
15175 15163586 14996964 14852734 14867908 15062583 15233177 15148610 14873818 14721166 14840208 15049977
15165 15049977 15155885 15217096 15337468 15375286 15117909 14683936 14492393 14768419 15245015 15450789
15155 15450789 15212499 14800249 14613647 14772633 15018625 15023111 14784661 14643216 14846625 15201283
15145 15201283 15294602 15021291 14709988 14698084 14949253 15177393 15213065 15121789 15040683 15028355
15135 15028355 15052621 15039777 14951423 14857094 14880290 15030321 15171331 15215113 15223685 15223638 15080852
15124 15080852 14755772 14545408 14772763 15273729 15524039 15329109 15050324 15017237 15075489 14977461
15114 14977461 14895936 15139268 15540353 15604077 15245318 14936367 15024527 15293484 15377808 15280343
15104 15280343 15234311 15299987 15368959 15404399 15424060 15364855 15200815 15100638 15239245 15522675
15094 15522675 15708471 15723960 15653031 15500040 15236103 15031411 15138565 15508871 15783544 15728721
15084 15728721 15467978 15254078 15241349 15500323 15965071 16301597 16161749 15712385 15576144
15075 15576144 16022664 16543919 16552628 16218635 16177455 16576967 16921088 16863304 16669002 16730863
15065 16730863 17016314 17253265 17399632 17632120 17996855 18334946 18526014 18614974 18686968 18747706
15055 18747706 18757609 18712361 18661767 18660057 18680055 18583436 18244730 17730553 17285169 17089868 17081069
15044 17081069 17037402 16803354 16414016 16058595 15930095 16035475 16141493 15998257 15637289
15035 15637289 15342888 15290555 15334059 15228015 14959407 14749874 14776425 14972763 15090149 14930203
15025 14930203 14562082 14299527 14363807 14581409 14580267 14308843 14131243 14293077 14534927 14459958
15015 14459958 14101276 13833367 13824399 13896904 13907885 13936685 14025865 14031043 13874483 13728833 13781248
15004 13781248 13967899 14094685 14094719 14017982 13880029 13692466 13572460 13642401 13828102 13901424
14994 13901424 13758406 13566335 13587462 13884116 14223675 14295298 14044030 13755374 13735444 13936380
14984 13936380 14024736 13827725 13546738 13456443 13556383 13659447 13699424 13761996 13862986 13887327
14974 13887327 13772598 13615158 13542143 13558768 13564810 13479305 13329312 13235880 13299374 13477040
14964 13477040 13608692 13594206 13499741 13451916 13485104 13541169 13555731 13486225 13323030 13142217
14954 13142217 13078129 13163325 13258205 13220244 13084408 13004352 13081330 13305676 13563938 13646091
14944 13646091 13405788 13019435 12891061 13126601 13313523 13082559 12690515 12679328 13079525
14935 13079525 13393725 13361601 13276134 13427017 13662407 13716624 13618028 13515380 13383044 13164308
14925 13164308 12979677 12942939 12967522 12970175 13042727 13199308 13216612 13006956 12884235 13110506
14915 13110506 13418733 13395204 13136211 13060209 13214269 13284011 13216111 13269484 13433010 13378398
14905 13378398 13112198 13091121 13460667 13735951 13573225 13345084 13498693 13772121 13611208
14896 13611208 13084918 12777235 12887222 13026851 12930678 12821584 12924871 13070780 13019726 12862939
14886 12862939 12837378 12946552 13008271 12960608 12913035 12947166 13024998 13082750 13110020 13127599 13146206
14875 13146206 13167543 13211698 13312509 13439938 13450054 13235290 12958065 12955875 13284790 13541782
14865 13541782 13367963 12978664 12877034 13120401 13264062 13072566 12862829 12952545 13149334
14856 13149334 13113592 12958946 13075996 13463330 13648470 13331942 12796354 12545155 12735848
14847 12735848 13097270 13273958 13142037 12868744 12738090 12867278 13079404 13133929 13059109 13099747
14837 13099747 13320511 13470998 13347557 13090230 12948764 12924490 12877781 12854007 12986181 13126373
14827 13126373 12955455 12541142 12400196 12780417 13212806 13124890 12664757 12479530 12781315
14818 12781315 13114175 13086086 12859115 12742077 12718743 12658528 12655117 12810339 12935263 12841044
14808 12841044 12731143 12886655 13095642 12882825 12302358 11999298 12331378 12863939 12996258
14799 12996258 12745524 12568839 12641044 12717140 12644044 12609894 12775094 12947442 12849431 12572078
14789 12572078 12501023 12775392 13063401 13026313 12812761 12811231 13008849 12996368 12677547 12517599
14779 12517599 12814229 13134560 12929659 12415602 12274498 12623849 12904507 12794962 12609294
14770 12609294 12650673 12763225 12770049 12825414 13020542 13101878 12915875 12713968 12681769 12596383
14760 12596383 12320554 12180777 12397968 12581521 12335687 11978779 12040122 12375406 12471206 12363155
14750 12363155 12488390 12791638 12794983 12517319 12499807 12836601 12979655 12687010 12410295 12488036
14740 12488036 12661454 12686743 12744285 12900073 12838557 12533401 12511543 12962342 13237094 12832116
14730 12832116 12274527 12320025 12761202 12835829 12473251 12280884 12459662 12566317 12360668 12159840
14720 12159840 12232762 12427464 12537973 12574390 12563858 12480877 12433861 12561914 12741766 12746147
14710 12746147 12638412 12633251 12665932 12536588 12370280 12431226 12579518 12478817 12268452 12385972
14700 12385972 12741924 12789062 12483222 12402995 12723695 12869144 12517151 12183913 12345998 12680130
14690 12680130 12728724 12680395 12838654 12885837 12446660 11951685 12093518 12677833 12858826 12418269
14680 12418269 12011360 12114562 12461054 12649582 12669930 12625103 12476222 12297801 12344968 12640247
14670 12640247 12851220 12758796 12520874 12336264 12194979 12105971 12210931 12480507 12621614 12495203
14660 12495203 12343064 12398790 12542940 12555850 12462994 12400179 12347762 12230992 12117003 12102494
14650 12102494 12146745 12191936 12301147 12505907 12664404 12648754 12547270 12520536 12578514 12644790
14640 12644790 12708614 12764991 12737895 12613267 12515188 12504019 12450341 12278730 12178345 12351239
14630 12351239 12663329 12782792 12619735 12424752 12454422 12683161 12852171 12734327 12387844
14621 12387844 12161422 12320699 12655983 12686553 12324902 12033290 12146496 12385894 12367185 12273359
14611 12273359 12541143 13054957 13210013 12787199 12261641 12123661 12317310 12515608 12582758
14602 12582758 12560272 12490747 12449920 12511919 12551175 12361379 12089486 12180834 12687767 13037978
14592 13037978 12818629 12415149 12426239 12749882 12807747 12502772 12329415 12531590 12753684 12680593
14582 12680593 12505119 12515556 12644174 12711981 12773100 12906567 12953330 12784863 12604718 12662649
14572 12662649 12859220 12945073 12932194 12981948 13054269 13020095 12970194 13033978 13041561 12805835 12610451
14561 12610451 12878171 13395777 13480348 13000635 12593249 12654383 12780983 12590830 12456495 12838708
14551 12838708 13388174 13430586 13042822 12895922 13172541 13393069 13315172 13272828 13478641 13647191
14541 13647191 13550974 13387905 13327427 13206046 12970095 12922527 13175024 13326354 13110625 12932646
14531 12932646 13243446 13737754 13774048 13369973 13142993 13336698 13528094 13375022 13109207
14522 13109207 13100606 13346956 13611845 13763309 13776331 13641970 13462303 13452371 13682441 13948196
14512 13948196 14014624 13874417 13681252 13547269 13492933 13504222 13560715 13644680 13735606 13776018
14502 13776018 13718103 13661814 13801165 14100586 14208088 13925471 13598627 13710653 14185955 14478821
14492 14478821 14332569 14058418 14014855 14194483 14425164 14616388 14675372 14524925 14349695 14474658
14482 14474658 14833567 14934988 14584173 14255016 14421094 14847370 14949135 14630369 14343187
14473 14343187 14419818 14712553 14868608 14701826 14331610 14127096 14387707 14910570 15088800
14464 15088800 14671402 14165445 14158533 14509453 14654584 14502368 14459609 14646261 14699034 14458434
14454 14458434 14293693 14510010 14875644 15025765 14991190 15012384 15083553 15011180 14783212 14591705
14444 14591705 14545982 14577051 14606182 14656717 14787330 14981525 15111438 15037186 14796339 14623807
14434 14623807 14661868 14739929 14631279 14435142 14434385 14634332 14777668 14806838 14917923 15091898
14424 15091898 15015549 14648840 14435834 14657710 14958566 14895256 14641030 14670314 14948293 14972520
14414 14972520 14594193 14291266 14479716 14926185 15078728 14780306 14426506 14457862 14836179
14405 14836179 15090811 14893322 14500050 14450756 14823791 15066024 14728332 14116695 13919386
14396 13919386 14333926 14886470 15065706 14842685 14558926 14538545 14825208 15125595 15055174 14611895
14386 14611895 14285804 14450735 14800112 14759632 14359461 14204762 14535948 14848661 14669992
14377 14669992 14247984 14113856 14303057 14440387 14390962 14370823 14472025 14502099 14365795 14268073
14367 14268073 14383310 14556500 14529666 14335673 14255193 14403506 14558193 14487644 14305597 14307143
14357 14307143 14498620 14549518 14299222 14045023 14105597 14320725 14316700 14123797 14110561 14340656
14347 14340656 14465073 14343527 14295095 14514594 14688630 14532577 14336004 14533251 14983603
14338 14983603 15160031 14925482 14651887 14601322 14633251 14580450 14522503 14558128 14608960 14594470
14328 14594470 14580056 14631366 14695566 14712327 14693412 14647986 14579195 14563706 14661017 14752561 14678028
14317 14678028 14525421 14546611 14770650 14958109 14974338 14937581 14939755 14901405 14788327 14699665
14307 14699665 14658358 14599091 14628059 14934835 15338887 15358786 14946071 14693343 14983666 15380420
14297 15380420 15316616 14986690 14960391 15206795 15207137 14907885 14815608 15099615 15321155 15241628
14287 15241628 15225695 15522154 15744730 15513258 15140467 15167102 15537503 15748707 15605825 15350686
14277 15350686 15189071 15145963 15286778 15631834 15897098 15748651 15314581 15050359 15092460 15155932
14267 15155932 15106974 15182046 15495918 15755037 15701861 15518358 15518206 15680664 15754115 15642701
14257 15642701 15452403 15297160 15263601 15425214 15695079 15809135 15658022 15491578 15575904 15790285
14247 15790285 15822566 15658087 15588259 15772927 16056640 16215732 16157651 15876200 15442989 15079188
14237 15079188 15027591 15284864 15600928 15772829 15812074 15825748 15875857 15953519 15968266 15808333
14227 15808333 15548943 15496373 15808245 16172699 16156140 15804058 15555140 15590632 15674437 15670760
14217 15670760 15752132 15948074 15964533 15712384 15574859 15805165 16057833 15938035 15657086 15635339
14207 15635339 15751531 15591359 15255226 15244043 15578979 15722065 15481540 15333350 15588760
14198 15588760 15839217 15619777 15158802 15005281 15230170 15466849 15542705 15614000 15756923 15823818
14188 15823818 15723494 15568209 15513638 15619782 15836068 15994938 15917173 15656997 15504911 15607019
14178 15607019 15769704 15810565 15853624 16025308 16126110 15955621 15729093 15750235 15871392 15770697
14168 15770697 15597045 15738331 16023675 15859162 15248627 14948131 15335330 15821307 15811668 15613628
14158 15613628 15792287 16138743 16023407 15482054 15179732 15385833 15689815 15763559 15762001 15841931
14148 15841931 15853746 15709890 15592124 15596042 15581155 15540325 15688384 15996450 16089699 15848968
14138 15848968 15659016 15761579 15830548 15581749 15345955 15516008 15813761 15744354 15504382 15700327
14128 15700327 16271142 16481802 16093671 15787183 16113997 16663980 16728895 16328708 16046894
14119 16046894 16125238 16259524 16195894 16061118 16055794 16151905 16194344 16117140 16000349 16010241 16258007
14108 16258007 16625757 16814106 16687724 16480230 16503168 16739109 16898694 16813466 16585356 16388798
14098 16388798 16314273 16398268 16627272 16875253 16966501 16856281 16700390 16731742 17059704 17524132
14088 17524132 17764869 17585261 17254718 17230898 17537037 17718523 17541564 17355307 17498152
14079 17498152 17742646 17747601 17700453 17936879 18189827 17936121 17395249 17392638 18119071 18790905
14069 18790905 18812763 18568347 18654530 18967803 19083989 19037845 19124146 19285100 19285784 19232211 19358808
14058 19358808 19527475 19482651 19395725 19589338 19899593 19913995 19711176 19726613 19954107 19955037
14048 19955037 19678966 19586613 19830650 19967789 19698983 19311914 19140887 19117173 19099136 19122119
14038 19122119 19066921 18638450 17984521 17756443 18153281 18473603 18113326 17471882 17265989
14029 17265989 17426105 17398276 17171508 17177870 17365653 17226115 16734686 16470303 16676865 16918395
14019 16918395 16861410 16741227 16781131 16755217 16491301 16294370 16440329 16644145 16483961 16074762
14009 16074762 15880153 16027972 16205713 16141404 15868269 15570134 15414460 15486921 15701391 15839871
13999 15839871 15808630 15724913 15643022 15427525 15086619 14959415 15263566 15673276 15720691 15466280
13989 15466280 15355959 15500975 15568604 15408439 15302639 15440093 15578017 15484380 15353568 15441903
13979 15441903 15569835 15408138 15098831 15110065 15471022 15637385 15304447 14937160 15131730
13970 15131730 15714807 15947604 15561423 15096913 15080596 15315778 15314478 15098603 15094930 15369376
13960 15369376 15490956 15232004 14936957 14970091 15161104 15119129 14856510 14740463 14936809 15235982
13950 15235982 15405004 15421784 15335589 15149581 14921152 14796641 14857319 15033933 15203167 15272903
13940 15272903 15191557 15008521 14905718 15006759 15163666 15118680 14884248 14744695 14835759 14965577
13930 14965577 14960545 14941566 15066176 15203747 15131822 14929068 14873534 14987946 14993890 14773559
13920 14773559 14588422 14687395 14926162 14996828 14886639 14845337 14960188 15048434 15002288 14961080
13910 14961080 15020252 15024013 14855837 14729034 14897363 15204031 15269937 15100875 15116419 15479221
13900 15479221 15779628 15617171 15188325 14982060 15099175 15223027 15152535 15013769 14969714 15029839
13890 15029839 15162280 15328634 15392906 15253152 15078282 15145902 15417958 15563181 15450787 15312201
13880 15312201 15320759 15341375 15261524 15256611 15489648 15797914 15935813 15927194 15919607 15873129 15676656
13869 15676656 15433206 15345601 15416722 15515959 15633799 15807800 15911410 15815591 15672463 15724869
13859 15724869 15904261 15949943 15865709 15874841 15941132 15774382 15389092 15214757 15473211 15835252
13849 15835252 15915678 15752160 15543111 15274144 14941397 14823267 15103511 15449206 15423728 15175810
13839 15175810 15226509 15621746 15816460 15492243 15019601 14901487 15125524 15323836 15303923 15155475
13829 15155475 15022197 15014751 15209901 15515995 15657615 15499839 15280375 15312654 15553003 15681704
13819 15681704 15546494 15302939 15152274 15157187 15303314 15529704 15681521 15622296 15421084 15269375
13809 15269375 15214956 15156914 15088773 15116020 15207638 15181608 15012370 14913048 15013891 15193511
13799 15193511 15332255 15464158 15538513 15349928 14942944 14766356 15072712 15429037 15270508
13790 15270508 14756380 14546400 14793783 14951120 14679304 14371157 14488383 14842869 14931208
13781 14931208 14677017 14431195 14411477 14515549 14602388 14642346 14619240 14521016 14402707 14301050
13771 14301050 14174268 14067516 14170618 14507318 14754396 14644712 14384740 14345557 14480073
13762 14480073 14440787 14199927 14103923 14273697 14389157 14217994 13990505 14033439 14299208 14480103
13752 14480103 14412298 14191017 14018073 14054582 14301662 14560546 14644872 14634187 14714501 14793936
13742 14793936 14595503 14178726 13991774 14247844 14604662 14684366 14579643 14566218 14618301 14558844
13732 14558844 14462739 14533833 14716637 14767306 14617236 14385567 14145943 13954152 13965110 14215037
13722 14215037 14420387 14323272 14113454 14150922 14383713 14447324 14274730 14170957 14283512 14429816
13712 14429816 14494334 14573441 14644269 14512791 14225990 14135776 14373799 14621334 14594664 14423723
13702 14423723 14344013 14342017 14343304 14443066 14674978 14814292 14697694 14523681 14564074 14770053
13692 14770053 14917516 14947750 14909389 14768775 14563737 14553081 14890271 15290176 15339600 15035759
13682 15035759 14725340 14619652 14672802 14834797 15086072 15268388 15205436 14989134 14875776 14915268
13672 14915268 14939101 14880697 14837139 14836759 14812139 14785608 14828467 14873136 14825127 14796764 14933567
13661 14933567 15087605 15021046 14870031 14974411 15254037 15252367 14897567 14700405 14971019 15320954
13651 15320954 15278586 14994860 14915242 15042440 15003369 14714714 14529452 14704098 15053629 15219819
13641 15219819 15085197 14845620 14757612 14838318 14827225 14534329 14185686 14197634 14583099 14884609
13631 14884609 14810414 14605834 14597122 14707426 14711883 14658905 14679996 14652778 14460948 14352495 14575382
13620 14575382 14847857 14717221 14329425 14271340 14667866 15015700 14983141 14806319 14748922 14725826
13610 14725826 14679902 14794149 15037720 15010955 14606593 14348066 14624467 15019999 14941368 14552902
13600 14552902 14451746 14653333 14618014 14227417 14010988 14270457 14618572 14649051 14532233 14600174
13590 14600174 14765997 14765326 14674841 14757254 14962842 14996541 14812569 14682215 14768083 14930375
13580 14930375 14994626 14962830 14899536 14815814 14737659 14721907 14741745 14710208 14671844 14797635 15094866
13569 15094866 15288640 15146804 14815637 14654569 14777744 14935493 14878880 14692130 14658931 14864548
13559 14864548 15063857 14992963 14731723 14631632 14862176 15163908 15175329 14914771 14738234 14827649
13549 14827649 14959455 14875503 14657572 14545122 14554165 14531718 14488713 14583756 14785249 14843030
13539 14843030 14669835 14497084 14531473 14673644 14729738 14716434 14765275 14851976 14823739 14641059
13529 14641059 14433739 14341145 14399049 14545060 14663265 14681405 14666153 14727322 14815956 14795068
13519 14795068 14742905 14916581 15296014 15478976 15256304 14979782 15035224 15239376 15180828 14919411
13509 14919411 14835155 14942781 14931855 14815124 14912798 15170460 15153044 14846502 14790042 15170482
13499 15170482 15454958 15271024 14996532 15021076 15062250 14803964 14620337 14925940 15293551 15079400
13489 15079400 14577880 14602834 15112793 15278194 14915258 14791916 15276421 15696877 15501430
13480 15501430 15169858 15344300 15765343 15809321 15565512 15591155 15912312 16042648 15860267 15756055
13470 15756055 15895374 15937994 15621633 15169419 14954300 15070406 15358954 15619689 15705661 15590404
13460 15590404 15404213 15295995 15282821 15330569 15468694 15674524 15781896 15696511 15568163 15553339
13450 15553339 15569564 15507656 15489919 15630813 15736120 15586284 15348708 15321532 15422217 15371061
13440 15371061 15249339 15355011 15573741 15490596 15170895 15191890 15703325 16069609 15789161 15247491
13430 15247491 15108065 15356350 15466118 15262681 15086442 15180645 15376958 15430171 15336416 15241418
13420 15241418 15240156 15326469 15429361 15493131 15561687 15694581 15775533 15603745 15262405 15136143
$$ [...]
##END NTUPLES=NMR SPECTRUM
##END=
