##TITLE=1H ikalashn
K-481-1
12.11.2024
##JCAMPDX= 6.0         $$ Bruker NMR JCAMP-DX V2.0
##DATA TYPE= NMR SPECTRUM
##DATA CLASS= NTUPLES
##ORIGIN= UXNMR, Bruker Analytische Messtechnik GmbH
##OWNER= root
$$ TOPSPIN		Version 1.3
$$ 2024-11-12 11:03:12.671 +0400  Irina@DPX200
$$ Compression mode = diff/dup
##.OBSERVE FREQUENCY= 200.131300845
##.OBSERVE NUCLEUS= ^1H
##.ACQUISITION MODE= SIMULTANEOUS
##.ACQUISITION SCHEME= undefined
##.AVERAGES= 64
##.DIGITISER RES= 18
##SPECTROMETER/DATA SYSTEM= spect
##.PULSE SEQUENCE= zg
##.SOLVENT NAME= CDCl3
##.SHIFT REFERENCE= INTERNAL, CDCl3, 1, 17.49637
##AUDIT TRAIL= $$ (NUMBER, WHEN, WHO, WHERE, WHAT)
$$ ##TITLE= Audit trail, TOPSPIN		Version 1.3
$$ ##JCAMPDX= 5.01
$$ ##ORIGIN= Bruker BioSpin GmbH
$$ ##OWNER= Irina
$$ $$ F:/spectra/data/iren/nmr/1H/4/pdata/1/auditp.txt
$$ ##AUDIT TRAIL=  $$ (NUMBER, WHEN, WHO, WHERE, VERSION, WHAT)
(   1,<2024-11-12 11:02:36.265 +0400>,<Irina>,<DPX200>,<TOPSPIN 1.3>,
      <created by zg
	started at 2024-11-12 10:58:23.375 +0400,
	POWCHK disabled, PULCHK disabled
       configuration hash MD5:
       BE 6D 3F 07 2A EA 11 49 91 17 2B D3 AF B3 58 0D
       data hash MD5: 16K
       26 5D DB 27 6F 63 F2 26 08 23 9C A0 04 27 66 C0>)
(   2,<2024-11-12 11:02:37.015 +0400>,<Irina>,<DPX200>,<TOPSPIN 1.3>,
      <Start of raw data processing
       efp BC_mod = 2 LB = 0.02 FT_mod = 6 PKNL = 1 PHC0 = 110.6478 PHC1 = 10.25597 SI = 32K 
       data hash MD5: 32K
       84 95 EC 28 72 5B 82 64 BB 85 C6 DA 7A CF CD 79>)
(   3,<2024-11-12 11:02:39.546 +0400>,<Irina>,<DPX200>,<TOPSPIN 1.3>,
      <apk 
       data hash MD5: 32K
       07 3B BE 20 4A 0D 27 5C BD 72 2B B0 97 36 2F 35>)
(   4,<2024-11-12 11:02:52.484 +0400>,<Irina>,<DPX200>,<TOPSPIN 1.3>,
      <pk fgphup PHC0 = 10.25564 PHC1 = -28 
       data hash MD5: 32K
       8D 78 40 56 08 04 B6 AF 14 47 80 8A 38 E5 10 A7>)
(   5,<2024-11-12 11:02:54.437 +0400>,<Irina>,<DPX200>,<TOPSPIN 1.3>,
      <abs n ABSG = 5 
       data hash MD5: 32K
       11 E9 B8 56 4B 3A F1 9D F8 F4 AE EE FF 05 A3 A8>)
$$ ##END=
$$ 
$$ $$ hash MD5
$$ $$ FD EE 55 0D D5 95 D6 75 E9 92 8B 3F 8D F0 41 91
##$RELAX= 
##$RELAX= 
##$RELAX= 
##$RELAX= 
##$RELAX= 
##$RELAX= 
##$RELAX= 
##$RELAX= 
##$RELAX= 
$$ Bruker specific parameters
$$ --------------------------
##$DU= <F:/spectra>
##$EXPNO= 4
##$NAME= <1H>
##$PROCNO= 1
##$TYPE= <nmr>
##$USER= <iren>
##$AMP= (0..31)
100 100 100 100 100 100 100 100 100 100 100 100 100 100 100 100 100 100 
100 100 100 100 100 100 100 100 100 100 100 100 100 100 
##$ANAVPT= -1
##$AQSEQ= 0
##$AQ_mod= 1
##$AUNM= <au_zg>
##$AUTOPOS= <>
##$BF1= 200.13
##$BF2= 200.13
##$BF3= 200.13
##$BF4= 200.13
##$BF5= 200.13
##$BF6= 200.13
##$BF7= 200.13
##$BF8= 200.13
##$BYTORDA= 1
##$CFDGTYP= 0
##$CFRGTYP= 5
##$CHEMSTR= <none>
##$CNST= (0..63)
1 1 145 1 1 1 1 1 1 1 1 1 1 1 1 1 1 1 1 1 1 1 1 1 1 1 1 1 1 1 1 1 1 1 
1 1 1 1 1 1 1 1 1 1 1 1 1 1 1 1 1 1 1 1 1 1 1 1 1 1 1 1 1 1 
##$CPDPRG= <>
##$CPDPRG1= <>
##$CPDPRG2= <>
##$CPDPRG3= <>
$$ [...]
##$SW_h= 4401.40845070422
##$TD= 16384
##$TD0= 1
##$TE= 300
##$TE2= 300
##$TE3= 300
##$TEG= 300
##$TL= (0..7)
0 120 120 120 120 120 120 120 
##$TP= (0..7)
150 150 150 150 150 150 150 150 
##$TP07= 0
##$TPNAME0= <>
##$TPNAME1= <>
##$TPNAME2= <>
##$TPNAME3= <>
##$TPNAME4= <>
##$TPNAME5= <>
##$TPNAME6= <>
##$TPNAME7= <>
##$TPOAL= (0..7)
0.5 0.5 0.5 0.5 0.5 0.5 0.5 0.5 
##$TPOFFS= (0..7)
0 0 0 0 0 0 0 0 
##$TUNHIN= 0
##$TUNHOUT= 0
##$TUNXOUT= 0
##$USERA1= <user>
##$USERA2= <user>
##$USERA3= <user>
##$USERA4= <user>
##$USERA5= <user>
##$V9= 5
##$VALIST= <valist>
##$VCLIST= <CCCCCCCCCCCCCCC>
##$VD= 0
##$VDLIST= <DDDDDDDDDDDDDDD>
##$VPLIST= <PPPPPPPPPPPPPPP>
##$VTLIST= <TTTTTTTTTTTTTTT>
##$WBST= 1024
##$WBSW= 25
##$XGAIN= (0..3)
0 0 0 0 
##$XL= 0
##$YL= 0
##$YMAX_a= 4503335
##$YMIN_a= -3551388
##$ZGOPTNS= <>
##$ZL1= 120
##$ZL2= 120
##$ZL3= 120
##$ZL4= 120
##$ABSF1= 17.49637
##$ABSF2= -4.496376
##$ABSG= 5
##$ABSL= 3
##$ALPHA= 0
##$AQORDER= 0
##$ASSFAC= 0
##$ASSFACI= 0
##$ASSFACX= 0
##$ASSWID= 0
##$AUNMP= <proc_1d>
##$AXLEFT= 0
##$AXRIGHT= 0
##$AXTYPE= 0
##$AXUNIT= <>
##$AZFE= 0.1
##$AZFW= 0.1
##$BCFW= 0
##$BC_mod= 2
##$BYTORDP= 0
##$COROFFS= 0
##$CY= 7568.61572265625
##$DATMOD= 1
##$DC= 0
##$DFILT= <>
##$DTYPP= 0
##$F1P= 17.9538593292236
##$F2P= -4.03888763876832
##$FCOR= 0.5
##$FTSIZE= 32768
##$FT_mod= 6
##$GAMMA= 0
##$GB= 0
##$INTBC= 0
##$INTSCL= 1.367314e-010
##$ISEN= 128
##$LB= 0.02
##$LEV0= 0
##$LPBIN= 0
##$MAXI= 945.577
##$MC2= 0
##$MEAN= 0
##$ME_mod= 0
##$MI= -402.1523
##$NCOEF= 0
##$NC_proc= -5
##$NLEV= 6
##$NOISF1= 8.587773
##$NOISF2= 6.764455
##$NSP= 0
##$NTH_PI= 0
##$NZP= 0
##$OFFSET= 17.49637
##$PC= 1
##$PHC0= 115.7653
##$PHC1= 12.99194
##$PH_mod= 1
##$PKNL= yes
##$PPARMOD= 0
##$PPDIAG= 0
##$PPIPTYP= 0
##$PPMPNUM= 100
##$PPRESOL= 1
##$PSCAL= 0
##$PSIGN= 0
##$REVERSE= no
##$SF= 200.13
##$SI= 32768
##$SIGF1= 16.12182
##$SIGF2= -4.496377
##$SINO= 3.521527
##$SIOLD= 32768
##$SREGLST= <1H.CDCl3>
##$SSB= 0
##$STSI= 32768
##$STSR= 0
##$SW_p= 4401.40845070422
##$SYMM= 0
##$S_DEV= 0
##$TDeff= 16384
##$TDoff= 0
##$TI= <>
##$TILT= no
##$TM1= 0
##$TM2= 0
##$TOPLEV= 0
##$USERP1= <user>
##$USERP2= <user>
##$USERP3= <user>
##$USERP4= <user>
##$USERP5= <user>
##$WDW= 1
##$XDIM= 32768
##$YMAX_p= 534005650
##$YMIN_p= -1610833
$$ End of Bruker specific parameters
$$ ---------------------------------
##NTUPLES= NMR SPECTRUM
##VAR_NAME=  FREQUENCY,     SPECTRUM/REAL,   SPECTRUM/IMAG
##SYMBOL=    X,             R,               I
##VAR_TYPE=  INDEPENDENT,   DEPENDENT,       DEPENDENT
##VAR_FORM=  AFFN,          ASDF,            ASDF
##VAR_DIM=   32768,         32768,           32768
##UNITS=     HZ,            ARBITRARY UNITS, ARBITRARY UNITS
##FACTOR=    0.134324425510551, 1,           1
##FIRST=     4401.40845070422, -629831,      -3052981
##LAST=      0,             329444,          -4092495
##MIN=       0,             -1610833,        0
##MAX=       4401.40845070422, 534005650,    0
$$ Real data points
##PAGE= N=1
##DATA TABLE= (X++(R..R)), XYDATA
$$ [...]
11187C7871124L07633K64352M976o0917Q3163J20609q524p8172n0781j16120k81460
$$ 37871124 38178757 38443109 38448085 38387168 38470331 38590940 38582416 38504244 38453463 38337343 38055883
11176C8055883l40170k53327j89746j84752j19181l5024r9833k45440k26077o7655
$$ 38055883 37715713 37462386 37272640 37087888 36968707 36933683 36833850 36588410 36362333 36294678
11166C6294678n9626k40522l10033j53717k3011m4802r89J83668J87646j50033
$$ 36294678 36235052 35994530 35684497 35530780 35507769 35462967 35461978 35645646 35833292 35683259
11156C5683259m21388k14931K12546K91105k7978k62000j37147J04288J58233
$$ 35683259 35261871 35046940 35259486 35550591 35522613 35260613 35123466 35227754 35385987
11147C5385987M8166l6325k5934J6313J2717o8943j81477k18250j36632j7175
$$ 35385987 35434153 35397828 35371894 35388207 35400924 35331981 35150504 34932254 34795622 34778447
11137C4778447N9329R6738Q2994l8266j96906j92498n267J07155R903o0550R4397
$$ 34778447 34837776 34934514 35017508 34979242 34782336 34589838 34584571 34691726 34701629 34641079 34735476
11126C4735476K37874P1147k04753j48317K11339L96991K06132m8308q6377k1564
$$ 34735476 34973350 35044497 34839744 34691427 34902766 35299757 35505889 35457581 35371204 35349640
11116C5349640l8380q1287m2870K9994Q1336J51255K09170J28737n4823j17347
$$ 35349640 35311260 35229973 35187103 35217097 35298433 35449688 35658858 35787595 35732772 35615425
11106C5615425K555Q4203p187r7231j2393J33214J51174O9160J8172R052l777
$$ 35615425 35617980 35702183 35694996 35597765 35585372 35718586 35869760 35938920 35957092 35966144 35962367
11095C5962367J026J5996n1942k00413k61814j51771j6333j429n6251r1489j32809
$$ 35962367 35963393 35979389 35927447 35727034 35465220 35313449 35297116 35295687 35239436 35147947 35015138
11084C5015138j80166j25876L5289J24773N9145j3584m093m3872j75414j75002
$$ 35015138 34834972 34709096 34744385 34869158 34928303 34914719 34910626 34866754 34691340 34516338
11074C4516338O8605K81667K07355K2340K3449J36620J07802j8977j8075P4810
$$ 34516338 34584943 34866610 35073965 35096305 35119754 35256374 35364176 35345199 35327124 35401934
11064C5401934M8228o4110n7077L0059j5068j40557q9173J08984J27958j14440
$$ 35401934 35450162 35386052 35328975 35359034 35343966 35203409 35114236 35223220 35351178 35236738
11054C5236738l03304k14986j5248N4341k41m0935r598P0987J34443Q4310o4920
$$ 35236738 34933434 34718448 34703200 34757541 34757300 34716365 34706767 34777754 34912197 34996507 34931587
11043C4931587j16529L1272J52881K6059j43203j0216L03073L58481J14524k4439
$$ 34931587 34815058 34846330 34999211 35025270 34882067 34871851 35174924 35533405 35647929 35623490
11033C5623490R9257J94723J16718J12215K87926L59660J83595M9808J63423K95297
$$ 35623490 35722747 35917470 36034188 36146403 36434329 36793989 36977584 37027392 37190815 37486112
11023C7486112K51996K31758L71025M00610J58004j638K24613N09412M11824J21249
$$ 37486112 37738108 37969866 38340891 38741501 38899505 38897867 39122480 39631892 40043716 40164965
11013D0164965J07608L11031L02712O3447l4541P2793P6340q9354j42459p515
$$ 40164965 40272573 40583604 40886316 40949763 40915222 40988015 41064355 40975001 40832542 40825027
11003D0825027N8382l0101m4657R3824J63485P2136K1386J08274J49272M2851
$$ 40825027 40883409 40853308 40808651 40902475 41065960 41138096 41159482 41267756 41417028 41459879
10993D1459879m5346J052O8141O7243O4312N7541n6946k07633j68351M9219J67271
$$ 41459879 41414533 41415585 41483726 41550969 41615281 41672822 41615876 41408243 41239892 41289111 41456382
10982D1456382J02162Q1867J85648J71320n7223k05243m8813K04200K65353J70305
$$ 41456382 41558544 41640411 41826059 41997379 41940156 41734913 41686100 41890300 42155653 42325958
10972D2325958R6233P6422J22156L10179N19366M37574R6691N74L71609O87051
$$ 42325958 42422191 42498613 42620769 42930948 43450314 43887888 43984579 43985153 44356762 45043813
10962D5043813M37187k6350M808M99343P68555N44582K84149L29333M14960K39012
$$ 45043813 45481000 45454650 45459458 45958801 46727356 47271938 47556087 47885420 48300380 48539392
10952D8539392r484j8615J29338J49952J4659r5789j34368k08313l40947m29806
$$ 48539392 48529908 48511293 48640631 48790583 48805242 48709453 48575085 48366772 48025825 47596019
10942D7596019m10276l23233k49566k56141l50202m30665l64048j66395k5224
$$ 47596019 47185743 46862510 46612944 46356803 46006601 45575936 45211888 45045493 45020269
10933D5020269p8467k45257l31356k40166m1616J07398R0216n7747j61393j02038
$$ 45020269 44941802 44696545 44365189 44125023 44083407 44190805 44281021 44223274 44061881 43959843
10923D3959843K0326K3869q3605j16949O19J34055J64412J52242J84518K05431
$$ 43959843 43980169 44004038 43920433 43803484 43804103 43938158 44102570 44254812 44439330 44644761
10913D4644761J29764K6111L9467J68437K52778J98967J17975J75434L46716M12819
$$ 44644761 44774525 44800636 44840103 45008540 45261318 45460285 45578260 45753694 46100410 46513229
10903D6513229K40581r025o5679Q7891K04956J57262J22340K67601M48787M31667
$$ 46513229 46753810 46744785 46679106 46766997 46971953 47129215 47251555 47519156 47967943 48399610
10893D8399610K62647J64898J70666J38306O8384R3431J74560J34324R772K5878
$$ 48399610 48662257 48827155 48997821 49136127 49204511 49297942 49472502 49606826 49616598 49642476
10883D9642476J55625Q8639k16734l40569j6369L95536L88929K2768k25511j62503
$$ 49642476 49798101 49886740 49670006 49329437 49313068 49708604 50097533 50120301 49894790 49732287
10873D9732287l8146n5838j05004m3227N0889K6653j14508k39019k28869q0539
$$ 49732287 49694141 49638303 49533299 49490072 49540961 49567614 49453106 49214087 48985218 48904679
10863D8904679P0926N8901j02366j91950p6833Q6407J00812M0240Q7317J86310
$$ 48904679 48975605 49034506 48932140 48740190 48663357 48749764 48850576 48890816 48978133 49164443
10853D9164443J47208J6731J5163J27651J11333o2169j40774m9212k5352j50122
$$ 49164443 49311651 49328382 49343545 49471196 49582529 49520360 49379586 49330374 49305022 49154900
10843D9154900j39721J47224L68797K10770o9497l0803K43470L04481Q6867k1340
$$ 49154900 49015179 49162403 49531200 49741970 49672473 49641670 49885140 50189621 50276488 50255148
10833E0255148J25750J78574j02953m25516m11260j55813l1005j34504k41855
$$ 50255148 50380898 50559472 50456519 50031003 49619743 49463930 49432925 49298421 49056566
10824D9056566j95529o5121L8261Q2250N9503n783o466J30177K77355K23402k4221
$$ 49056566 48861037 48795916 48834177 48916427 48975930 48970147 48963681 49093858 49371213 49594615 49570394
10813D9570394j99482j06577J20339J76800l5420k76285k45446L7059K14751K9462
$$ 49570394 49370912 49264335 49384674 49561474 49526054 49249769 49004323 49041382 49256133 49285595
10803D9285595l07466l51273k1809K69458J84903q9966j62378M590J29126R1995
$$ 49285595 48978129 48626856 48605047 48874505 49059408 48969442 48807064 48811654 48940780 49032775
10793D9032775O0766J56972K91587L59190L51078K56846Q8936L79J12684K42770
$$ 49032775 49093541 49250513 49542100 49901290 50252368 50509214 50598150 50598529 50711213 50953983
10783E0953983J26281r0460L504L75806M81212J09068k02622L8559N14049O02663
$$ 50953983 51080264 50989804 50993308 51369114 51850326 51959394 51756772 51795331 52309380 52912043
10773E2912043L07937J19276J84022K24479J63463K16055L60051L00243L9083
$$ 52912043 53219980 53339256 53523278 53747757 53911220 54127275 54487326 54787569 54826652
10764E4826652n7053J20497K52579J90982K00563L96447M69229K64285J36638
$$ 54826652 54769599 54890096 55142675 55333657 55534220 55930667 56399896 56664181 56800819
10755E6800819L60061O31953N94986M49458N52432P46938O54964L99060M25523
$$ 56800819 57160880 57792833 58387819 58837277 59389709 60136647 60791611 61190671 61616194
10746F1616194P21405Q01536M74634Q2831q7469j42237k14403k13948j12878r4179
$$ 61616194 62337599 63139135 63613769 63696600 63609131 63466894 63252491 63038543 62925665 62831486
10736F2831486k20922k79101j40424R562j656n2361J4568R8305M8227l1713N4308
$$ 62831486 62610564 62331463 62191039 62200601 62198945 62146584 62161152 62259457 62307684 62275971 62330279
10725F2330279K58069L56163K76566J53360J11894J71227L07422M51292M67028
$$ 62330279 62588348 62944511 63221077 63374437 63486331 63657558 63964980 64416272 64883300
10716F4883300K97379J12770J57874M31212O54417O13413M26090L83161N75629
$$ 64883300 65180679 65293449 65451323 65882535 66536952 67150365 67576455 67959616 68535245
10707F8535245P92124Q06341O59631N61192N78656N92113N50359N67922O89748
$$ 68535245 69327369 70133710 70793341 71354533 71933189 72525302 73075661 73643583 74333331
10698G4333331P64183O95134O36259P46437R22927J003839J067849J250758J415733
$$ 74333331 75097514 75792648 76428907 77175344 78098271 79102110 80169959 81420717 82836450
10689H2836450J355555J217136J322975J618049J738176J645835J711337K047645
$$ 82836450 84192005 85409141 86732116 88350165 90088341 91734176 93445513 95493158
10681I5493158K266382K128473J974176K169871K510872K574660K376881K244195
$$ 95493158 97759540 99888013 101862189 104032060 106542932 109117592 111494473 113738668
10673A13738668K228571K079247J704426J287592R87817Q28939Q37726J015244
$$ 113738668 115967239 118046486 119750912 121038504 122026321 122855260 123692986 124708230
10665A24708230J219780J327260J441901J712325K040512K234329K327821K440006
$$ 124708230 125928010 127255270 128697171 130409496 132450008 134684337 137012158 139452164
10657A39452164K431637K081934J550911J245922J196333R79726L88441k22817
$$ 139452164 141883801 143965735 145516646 146762568 147958901 148938627 149327068 149104251
10649A49104251m62914m55447n85661r09420j120652j027550p94871o86031p48098
$$ 149104251 148641337 148185890 147600229 146690809 145570157 144542607 143747736 143061705 142313607
10640A42313607q40785q81535r28203j001564r62597p06375m00317l09379l87959
$$ 142313607 141472822 140591287 139663084 138661520 137698923 136992548 136592231 136282852 135894893
10631A35894893l10478L5380L95056O05831Q47403J219517J466069J457553J552590
$$ 135894893 135584415 135619795 136014851 136620682 137468085 138687602 140153671 141611224 143163814
10622A43163814K011782K415228K266553J883434J947765K339969K272408J587604
$$ 143163814 145175596 147590824 149857377 151740811 153688576 156028545 158300953 159888557
10614A59888557J016070R37173P80725O4130p97191j278006j632500k310391l053694
$$ 159888557 160904627 161841800 162622525 162686655 161889464 160611458 158978958 156668567 153614873
10605A53614873l342627l323222l487106l715075l476449k846340k490301k601539
$$ 153614873 150272246 146949024 143461918 139746843 136270394 133424054 130933753 128332214
10597A28332214k614998k140143j517446j201650j141949j068858r57143q88856
$$ 128332214 125717216 123577073 122059627 120857977 119716028 118647170 117690027 116801171
10589A16801171p81456n47736l06816k12324k39801k89706l28960l29713k52554
$$ 116801171 116019715 115471979 115165163 114952839 114713038 114423332 114094372 113764659 113512105
10580A13512105j65734j89650k82242l01074k95929m59192p45198q64947p52989
$$ 113512105 113346371 113156721 112874479 112573405 112277476 111818284 111073086 110208139 109455150
10571A09455150p00868q78497j057448j014771q98945r28625r87584q31966n26387
$$ 109455150 108754282 107875785 106818337 105803566 104904621 103975996 102988412 102156446 101630059
10562A01630059l59410m11556m76533l82046j84195m8399o6994j74825j81345
$$ 101630059 101270649 100859093 100382560 100000514 99816319 99767920 99700926 99526101 99344756
10553I9344756L6487L31321M13393K35594O4789Q6121J66762J55266J64137L27805
$$ 99344756 99381243 99712564 100125957 100361551 100426340 100512461 100679223 100834489 100998626 101326431
10543A01326431M97572M68563L59143M47910P15379Q65727P90219P15000Q40130
$$ 101326431 101824003 102292566 102651709 103099619 103814998 104680725 105470944 106185944 107026074
10534A07026074J070125J180899J080589Q33263N50564L12271J06557j64648n46843
$$ 107026074 108096199 109277098 110357687 111190950 111741514 112053785 112160342 111995694 111448851
10525A11448851r29882j175236j295315j391819j472145j464817j374052j276806
$$ 111448851 110518969 109343733 108048418 106656599 105184454 103719637 102345585 101068779
10517A01068779j199965j131630j103093j114606j043154p99928n26116m32445
$$ 101068779 99868814 98737184 97634091 96519485 95476331 94676403 94150287 93717842
10509I3717842m80879m48267k94224k17858l10591l98550l23410j71301j03176
$$ 93717842 93236963 92788696 92494472 92276614 91966023 91567473 91244063 91072762 90969586
10500I0969586j24502j46659j45164j42919j40659j53048k15406k90291k82651
$$ 90969586 90845084 90698425 90553261 90410342 90269683 90116635 89901229 89610938 89328287
10491H9328287k06748k01980l10477l84465l05657j53316n4308j3783n443o8112
$$ 89328287 89121539 88919559 88609082 88224617 87918960 87765644 87711336 87697553 87692110 87623998
10481H7623998j72327j56088L2033J84977J38428N8822J67046L20867K22564l0697
$$ 87623998 87451671 87295583 87327616 87512593 87651021 87709843 87876889 88197756 88420320 88389623
10471H8389623k2035L12388N17284L06448K8871J47782N51163P56199O12084L92857
$$ 88389623 88367588 88679976 89197260 89503708 89532579 89680361 90231524 90987723 91599807 91992664
10461I1992664K79679J67626k115j15093j78093l82446p36150r67318r69680j008102
$$ 91992664 92272343 92439969 92437854 92322761 92144668 91762222 91026072 90058754 89089074 88080972
10451H8080972j239147j362121j095943p25475p27430j024355j106401q33018
$$ 88080972 86841825 85479704 84383761 83658286 82930856 81906501 80800100 79967082
10443G9967082n91336n99944n78669l10378p3002j95283n09554n93664l51695
$$ 79967082 79375746 78775802 78197133 77886755 77813753 77618470 77108916 76515252 76163557
10434G6163557m7655R0545L7409j32627k82864k65643j23519r1303k30075k78030
$$ 76163557 76115902 76206447 76243856 76111229 75828365 75562722 75439203 75347900 75117825 74839795
10424G4839795q1406R5235J10j33079L7289L24317K69534o9734j56286J77295
$$ 74839795 74758389 74853624 74853734 74720655 74757944 75082261 75351795 75282061 75125775 75303070
10414G5303070M70909L72104J22597P7425J75724J92791J74236K83072M52402
$$ 75303070 75773979 76146083 76268680 76346105 76521829 76714620 76888856 77171928 77624330
10405G7624330N00647M28186L46199K58236J33563N0544N3995N411k20474n10662
$$ 77624330 78124977 78553163 78899362 79157598 79291161 79341705 79395700 79401111 79180637 78669975
10395G8669975o72210p00535p16742p49903p46878p01852o41567n77943n57685
$$ 78669975 77997765 77297230 76580488 75830585 75083707 74381855 73740288 73162345 72604660
10386G2604660o15234o22522m09145j07047p6019l45762m79069k20035Q0889J4826
$$ 72604660 71989426 71366904 70957759 70850712 70774693 70428931 69949862 69729827 69810716 69825542
10376F9825542k48721k88760j19068o4071j47406j26560k4314r2413k79051k54420
$$ 69825542 69576821 69288061 69168993 69104922 68957516 68830956 68806642 68714229 68435178 68180758
10366F8180758P10J28551m876j11168M982J74852K47464L17973M17967L92904
$$ 68180758 68181468 68310019 68305143 68193975 68198957 68373809 68621273 68939246 69357213 69750117
10356F9750117K68103L25637O07000P48323N58557L54930M22201N32980L79993
$$ 69750117 70018220 70343857 70950857 71699180 72257737 72612667 73034868 73567848 73947841
10347G3947841J37334J48502L18456K93478Q3604L3713K41957M34848M21898L11754
$$ 73947841 74085175 74233677 74552133 74845611 74929215 74962928 75204885 75639733 76061631 76373385
10337G6373385K45917K21845K19835K54861K76559K27442J88546K62599L57311
$$ 76373385 76619302 76841147 77060982 77315843 77592402 77819844 78008390 78270989 78628300
10328G8628300L13551J95643J95218K89070K83613J88935K33441M60893O23358
$$ 78628300 78941851 79137494 79332712 79621782 79905395 80094330 80327771 80788664 81412022
10319H1412022N79479N22530O63726R14377J057267J070693J106985J249418J441613
$$ 81412022 81991501 82514031 83177757 84092134 85149401 86220094 87327079 88576497 90018110
10310I0018110J610845J752032J892009K009683K006518J812141J544163J425651
$$ 90018110 91628955 93380987 95272996 97282679 99289197 101101338 102645501 104071152
10302A04071152J427137J165259M00662m98257r34235q81161r08251j344461j843252
$$ 104071152 105498289 106663548 107064210 106565953 105631718 104750557 103842306 102497845 100654593
10293A00654593j972406j841018j808224j858177j686482j280835r96043j025904
$$ 100654593 98682187 96841169 95032945 93174768 91488286 90207451 89211408 88185504
10285H8185504j132204j007223o82592m49013m93883p17768q51150p10118l81157
$$ 88185504 87053300 86046077 85363485 84914472 84420589 83702821 82851671 82141553 81760396
10276H1760396j53057k11117m21768m97650l52348j87469k16636l99666n01903
$$ 81760396 81607339 81396222 80974454 80476804 80124456 79936987 79720351 79320685 78818782
10267G8818782l72598j14102L2587m6298k24316l13558k91631k52294j85903L645
$$ 78818782 78446184 78332082 78364669 78318371 78094055 77780497 77488866 77236572 77050669 77054314
10257G7054314K43691K85956P7746p3090R1872L75286L93612J44004j3927Q4591
$$ 77054314 77298005 77583961 77661707 77588617 77680489 78055775 78449387 78593391 78579464 78664055
10247G8664055K12332J80912J35285K42205L62555K90529J28859J32762K87799
$$ 78664055 78876387 79057299 79192584 79434789 79797344 80087873 80216732 80349494 80637293
10238H0637293L50278K76523K99563N24261P36342P46126O78828P38379Q80298
$$ 80637293 80987571 81264094 81563657 82087918 82824260 83570386 84249214 84987593 85867891
10229H5867891R51348J009584J229886J561609J764408J766710J688929J479748
$$ 85867891 86819239 87828823 89058709 90620318 92384726 94151436 95840365 97320113
10221I7320113Q78859r7982r49454j234841j125235j122670j379268j610493j594630
$$ 97320113 98198972 98100990 97151536 95916695 94791460 93668790 92289522 90679029 89084399
10212H9084399j414588j204048r72459p45687o15394n70142m98795m11391m22994
$$ 89084399 87669811 86465763 85493304 84747617 84132223 83562081 83063286 82651895 82228901
10203H2228901m81503l90650j70219q0790j77879j82199K9695J64334Q073j54667
$$ 82228901 81747398 81356748 81186529 81105739 80927860 80745661 80775356 80939690 80947763 80793096
10193H0793096J6286L31954L64300J30168J4061J12274J47393K9408J4312K10166
$$ 80793096 80809382 81141336 81505636 81635804 81649865 81762139 81909532 81938940 81953252 82163418
10183H2163418L63619L00360K06434K79868M20929M75045N07830O23543P45178
$$ 82163418 82527037 82827397 83033831 83313699 83734628 84209673 84717503 85341046 86086224
10174H6086224P85767Q34048R74986J118911J187212J258652J346699J267145
$$ 86086224 86871991 87706039 88681025 89799936 90987148 92245800 93592499 94859644
10166I4859644R53837O65184N94064M98014O7336n15717p97961p51815q21417
$$ 94859644 95813481 96478665 97072729 97570743 97638079 97122362 96324401 95572586 94751169
10157I4751169j250840j758245j976035j883923j676625j489191j404926j487367
$$ 94751169 93500329 91742084 89766049 87882126 86205501 84716310 83311384 81824017
10149H1824017j632631j590240j295968j010460r70436j072233j073954r51954
$$ 81824017 80191386 78601146 77305178 76294718 75324282 74252049 73178095 72226141
10141G2226141q51977q07410p28323o04831n18892m88309m71909m92016n78782
$$ 72226141 71374164 70566754 69838431 69233600 68714708 68226399 67754490 67262474 66683692
10132F6683692o30494n22439l38965k90352l88783m31768l52747l34387m54585
$$ 66683692 66053198 65530759 65191794 64901442 64512659 64080891 63728144 63393757 62939172
10123F2939172m78992k30554L6937n1099m00628n22124k22706J12775P3694k26382
$$ 62939172 62460180 62229626 62266563 62215464 61814836 61292712 61070006 61182781 61256475 61030093
10113F1030093l77021k46675n8673k859n1072j26602k00148k04687q7661K1561
$$ 61030093 60653072 60406397 60347724 60344865 60293793 60167191 59967043 59762356 59674695 59696256
10103E9696256p1675k91842l22667p0428J55090Q5266j14378j24086M0238J00560
$$ 59696256 59624581 59332739 59010072 58939644 59094734 59180000 59065622 58941536 58981774 59082334
10093E9082334j8569r4743K8450K33409L30081K79139J68358J10970J91836L83305
$$ 59082334 59063765 58969022 58997472 59230881 59560962 59840101 60008459 60119429 60311265 60694570
10083F0694570N10906M35760K52638J50019J06015o3297l46830m79205l22146
$$ 60694570 61205476 61641236 61893874 62043893 62149908 62086611 61739781 61260576 60938430
10074F0938430q6016m2928j90458l32971l51661k57830j02390K9190L2198q0465
$$ 60938430 60852414 60809486 60619028 60286057 59934396 59676566 59574176 59603366 59635564 59555099
10064E9555099j46052o7765L4361L064j26614k07632k02574j87807k05899k44848
$$ 59555099 59409047 59341282 59375643 59378707 59252093 59044461 58841887 58654080 58448181 58203333
10054E8203333l05646l70922l65919k64295j67643j66640j96728j55193q5230
$$ 58203333 57897687 57526765 57160846 56896551 56728908 56562268 56365540 56210347 56125117
10045E6125117j00537j82993j98557q4588Q6836J91781J27648j04710l14851k63452
$$ 56125117 56024580 55841587 55643030 55558442 55645278 55837059 55964707 55859997 55545146 55281694
10035E5281694J015J34864j2640j38767L4223K70063J85988q3618p3973K43816
$$ 55281694 55282709 55417573 55404933 55266166 55300389 55570452 55756440 55672822 55598849 55842665
10025E5842665M16132K56637R9912J73625K51736J63395J39733L33846M57032
$$ 55842665 56258797 56515434 56615346 56788971 57040707 57204102 57343835 57677681 58134713
10016E8134713K85430J18177K76571N07043M02603J24504J24977L62420M13916
$$ 58134713 58420143 58538320 58814891 59321934 59724537 59849041 59974018 60336438 60750354
10007F0750354K49725K50931M82398N97155N18862N66562P68331P21423L74892
$$ 60750354 61000079 61251010 61733408 62330563 62849425 63415987 64184318 64905741 65280633
9998F5280633K82335P05380J090521R31653N98868O98236J064127J117936R23289
$$ 65280633 65562968 66268348 67358869 68290522 68889390 69587626 70651753 71769689 72692978
9989G2692978J069568J604643J896594J661649J400994J566379J911711K029120
$$ 72692978 73762546 75367189 77263783 78925432 80326426 81892805 83804516 85833636
9981H5833636K032777K275256K718829L027240L088785L052712K927503K465719
$$ 85833636 87866413 90141669 92860498 95887738 98976523 102029235 104956738 107422457
9973A07422457J468582M8162j387304k352420k639780k559162k652146l059884
$$ 107422457 108891039 108939201 107551897 105199477 102559697 100000535 97348389 94288505
9965I4288505l380055l269948k908805k644189k468931k180661j840747j677659
$$ 94288505 90908450 87638502 84729697 82085508 79616577 77435916 75595169 73917510
9957G3917510j653995j524035j266033j081920r97480q48155o67284o82614q61856
$$ 73917510 72263515 70739480 69473447 68391527 67394047 66545892 65878608 65195994 64334138
9948F4334138q68414n96712l61310l74756m16066k60565q4114j21651k23491j34072
$$ 64334138 63465724 62869012 62507702 62132946 61716880 61456315 61372201 61250550 61027059 60892987
9938F0892987P100j30197m77007o10349l83054j25333j47328l58651m94648m67512
$$ 60892987 60900087 60769890 60292883 59682534 59299480 59174147 59026819 58668168 58173520 57706008
9928E7706008l60934k62476k22802k50258k66230j81130n0897j8151p5112o4654
$$ 57706008 57345074 57082598 56859796 56609538 56343308 56162178 56111281 56093130 56018018 55953364
9918E5953364L5517L7533j45126l08516k39638l6017M2613n5479j46107j07329
$$ 55953364 55988881 56026414 55881288 55572772 55333134 55297117 55339730 55284251 55138144 55030815
9908E5030815j9729M694j5988Q99O4356R7981L6980r1121j77708j34438L355R5921
$$ 55030815 55011086 55015780 54999792 55000691 55065047 55163028 55200008 55108887 54931179 54796741 54800096 54896017
9896E4896017M3896j03660k03526j65802l9984L1393m6296k05454k74708j88605
$$ 54896017 54939913 54836253 54632727 54466925 54426941 54458334 54412038 54206584 53931876 53743271
9886E3743271p9534q1413j15436j9429J51985J63103l6940k01245j36793K8957
$$ 53743271 53663737 53582324 53466888 53447459 53599444 53762547 53725607 53524362 53387569 53416526
9876E3416526Q1517M5083P4744J51807J29335K9142M8419K45989M26980M12916
$$ 53416526 53498043 53543126 53617870 53769677 53899012 53928154 53976573 54222562 54649542 55062458
9866E5062458K80769K47235M05246O46808P95986P71583O43095N41720N14491
$$ 55062458 55343227 55590462 55995708 56642516 57438502 58210085 58853180 59394900 59909391
9857E9909391N06465N00197N72628P36176Q28703O97907M27788K35326J94035
$$ 59909391 60415856 60916053 61488681 62224857 63053560 63751467 64179255 64414581 64608616
9848F4608616K13601K38742K80704K82558J63429L31m2290K1965K8358k6761L2158
$$ 64608616 64822217 65060959 65341663 65624221 65787650 65787981 65745691 65767656 65796014 65769253 65801411
9837F5801411J99338K14302R65j22252Q3462L51737K87203j0032p6194K29482
$$ 65801411 66000749 66215051 66216016 66093764 66177226 66528963 66816166 66806134 66729940 66959422
9827F6959422N50821N72548L80686J87726J1530k02464l80520m43385m66784n39757
$$ 66959422 67510243 68082791 68463477 68651203 68662733 68460269 68079749 67636364 67169580 66629823
9817F6629823n99030n74038n58530o39077o75226m94226k29063j84995l77949
$$ 66629823 66030793 65456755 64898225 64259148 63583922 63089696 62860633 62675638 62297689
9808F2297689m94946l71338k12595k06090k04283l4807J16709k3612l06144l15492
$$ 62297689 61802743 61431405 61218810 61012720 60808437 60773630 60890339 60866727 60560583 60245091
9798F0245091j6329J75094M7849r8349n402R5982o3255k30539l190M34778N01111
$$ 60245091 60228762 60403856 60451705 60353356 60347954 60443936 60380681 60150142 60146952 60581730 61082841
9787F1082841J14805j47103Q1874M41807M52996K08660J08474K20045L13181L29731
$$ 61082841 61197646 61050543 61132417 61574224 62027220 62235880 62344354 62564399 62877580 63207311
9777F3207311M04400N12828M86474L63096L83005O01361P90079P81040O61051
$$ 63207311 63611711 64124539 64611013 64974109 65357114 65958475 66748554 67529594 68190645
9768F8190645N60266M65510L24873J59933k432j68038k96015l13245k36373j51125
$$ 68190645 68750911 69216421 69541294 69701227 69698795 69530757 69234742 68921497 68685124 68533999
9758F8533999o8797N0958J51698J37501P2247J14498K44870K89015K39210K85177
$$ 68533999 68465202 68516160 68667858 68805359 68877606 68992104 69236974 69525989 69765199 70050376
9748G0050376M46948M64962K10265n9167p0217M9382r199k40869l39935j65475
$$ 70050376 70497324 70962286 71172551 71113384 71043167 71092549 71083350 70842481 70502546 70337071
9738G0337071O1398N9890j87483m67195n79555n06483l95420m03388n42963o93658
$$ 70337071 70398469 70458359 70270876 69803681 69224126 68717643 68322223 67918835 67375872 66682214
9728F6682214p50778p00888n67061l89628k67486k85136l70511l63973k56231
$$ 66682214 65931436 65230548 64663487 64273859 64006373 63721237 63350726 62986753 62730522
9719F2730522j95733k28608k33793j75185j80068k60334k13903K8652K09843J17402
$$ 62730522 62534789 62306181 62072388 61897203 61717135 61456801 61242898 61271550 61481393 61598795
9709F1598795p5759r8695r22J1581k4508O1346J94333J52321k1685o4291P3886
$$ 61598795 61523036 61424341 61423419 61435000 61410492 61471838 61666171 61818492 61796807 61732516 61806402
9698F1806402J85344K01127K80662M57192N24869L79146J96664J72397K94727
$$ 61806402 61991746 62192873 62473535 62930727 63455596 63834742 64031406 64203803 64498530
9689F4498530M41487M90937L23547m5249l37665k97291q8880q9333k94185l42208
$$ 64498530 64940017 65430954 65754501 65709252 65371587 65074296 64985416 64896083 64601898 64259690
9679F4259690j64783j13994k96924l16871L0775L11080J23203k05034j29080K17505
$$ 64259690 64094907 63980913 63683989 63367118 63397893 63708973 63832176 63627142 63498062 63715567
9669F3715567K54137p6126k08554J40991N54589N71708L16080K03852L40194M92389
$$ 63715567 63969704 63893578 63685024 63826015 64380604 64952312 65268392 65472244 65812438 66304827
9659F6304827M89330L93316L34882L55587M21366N01454O00305P13285P76154
$$ 66304827 66794157 67187473 67522355 67877942 68299308 68800762 69401067 70114352 70890506
9650G0890506P34921O81512P90846J048899J198258J092462R44723J006354J116179
$$ 70890506 71625427 72306939 73097785 74146684 75344942 76437404 77382127 78388481 79504660
9641G9504660Q58951J64605n20647p48097n72694m42925o79870j148396j430461
$$ 79504660 80363611 80528216 80007569 79259472 78686778 78243853 77563983 76415587 74985126
9632G4985126j304116j005674r24417j079660j119173q75988o27110o32790p27049
$$ 74985126 73681010 72675336 71750919 70671259 69552086 68676098 68048988 67416198 66689149
9623F6689149o48333n04915n36653o24666m83314k14002j86644m07544m92609
$$ 66689149 66040816 65535901 64999248 64374582 63891268 63677266 63490622 63083078 62590469
9614F2590469l12145j86091l16164m61522l66994j47634l9391o5875j43268k56126
$$ 62590469 62278324 62092233 61776069 61314547 60947553 60799919 60760528 60694653 60551385 60295259
9604F0295259l61374l50068k35472j59683j44117r1253n7173j80971l17280j73469
$$ 60295259 59933885 59583817 59348345 59188662 59044545 58953292 58896119 58715148 58397868 58224399
9594E8224399J12858N3440l65137n13679q5685L46658J96958k26809k56570R2293
$$ 58224399 58337257 58390697 58025560 57511881 57426196 57772854 57969812 57743003 57486433 57578726
9584E7578726K70633J34480N3754J85063K69683J74899J00646J72010K54607K46421
$$ 57578726 57849359 57983839 58037593 58222656 58492339 58667238 58767884 58939894 59194501 59440922
9574E9440922K08136J75227J38015J74668L13005L54248J52237p0063m4350P5995
$$ 59440922 59649058 59824285 59962300 60136968 60449973 60804221 60956458 60886395 60842045 60918040
9564F0918040j168j49383o8892Q0859q9533m38701m46071j08439L7175j47100
$$ 60918040 60916872 60767489 60698597 60779456 60689923 60251222 59805151 59696712 59733887 59586787
9554E9586787j97403N1668J49246j04307k44143L637J88011l8306k42283J6989
$$ 59586787 59389384 59441052 59590298 59485991 59241848 59245485 59433496 59395190 59152907 59169896
9544E9169896L43692J57436k90849l41288j7135J13399n3822r9886N9435M6468
$$ 59169896 59513588 59671024 59380175 59038887 59021752 59135151 59081329 58981443 59040878 59087346
9534E9087346k05489k70256K9401L03160K18104m6446j66537r2571O9896K50514
$$ 59087346 58881857 58611601 58641002 58944162 59162266 59115820 58949283 58856712 58926608 59177122
9524E9177122L45276K60991J20951J41047K69311K65994J41865J41027K73578
$$ 59177122 59522398 59783389 59904340 60045387 60314698 60580692 60722557 60863584 61137162
9515F1137162K87438J58096J56617L28566L68634J71928N0100J84287L04715J83028
$$ 61137162 61424600 61582696 61739313 62067879 62436513 62608441 62658541 62842828 63147543 63330571
9505F3330571L4408J16701K92560L27534K98868L55481L72712K27017J42113L43384
$$ 63330571 63364979 63481680 63774240 64101774 64400642 64756123 65128835 65355852 65497965 65841349
9495F5841349N95197N33940K88327K81109N10301N42050K33477l2374L9835K33578
$$ 65841349 66436546 66970486 67258813 67539922 68050223 68592273 68825750 68793376 68833211 69066789
9485F9066789K17615L7628m5816J0863L3595m6628j06057m6811O3616J05419O5484
$$ 69066789 69284404 69322032 69276216 69287079 69320674 69274046 69167989 69121178 69184794 69290213 69355697
9474F9355697L2047O1688J06366J02905R6547J89529L60424M47089L66384K41954
$$ 69355697 69387744 69449432 69555798 69658703 69755250 69944779 70305203 70752292 71118676 71360630
9464G1360630K21977K69580K59012K03451K33617L75578M93127M69553L50007
$$ 71360630 71582607 71852187 72111199 72314650 72548267 72923845 73416972 73886525 74236532
9455G4236532K82880L75669O00624P97254Q03336O39660N17999N93880P56099
$$ 74236532 74519412 74895081 75495705 76292959 77096295 77735955 78253954 78847834 79603933
9446G9603933P50615M95319J91506J10523L05020N41025N28813K41820m2937q6524
$$ 79603933 80354548 80849867 81041373 81151896 81456916 81997941 82526754 82768574 82725637 82639113
9436H2639113J4467J3072r7057j19016m1227o3776j84826j27899J61202L17886
$$ 82639113 82653580 82666652 82569595 82450579 82409352 82345576 82160750 82032851 82194053 82511939
9426H2511939J22421q3047R9014M80860N90972M15899L56498N47927P24467P52678
$$ 82511939 82634360 82551313 82650327 83131187 83722159 84138058 84494556 85042483 85766950 86519628
9416H6519628Q11172R66624J022239R22186R06174J095694J279880J282650J205171
$$ 86519628 87330800 88297424 89319663 90241849 91148023 92243717 93523597 94806247 96011418
9407I6011418J119548Q58940L43638j82761m94036o96031r49982j141350j116742
$$ 96011418 97130966 97989906 98333544 98150783 97656747 96960716 96010734 94869384 93752642
9398I3752642j025811j096407j229685j155071q87430p05556p20655p61001o84097
$$ 93752642 92726831 91630424 90400739 89245668 88358238 87652682 86932027 86171026 85486929
9389H5486929n49526m52671l90170l33697k93612k78635k79208k78284k27316
$$ 85486929 84937403 84484732 84094562 83760865 83467253 83188618 82909410 82631126 82403810
9380H2403810q8250M9926L7340p6140m4275J77396K76751N3129j96930q2718K76725
$$ 82403810 82315560 82365486 82402826 82326686 82282411 82459807 82736558 82789687 82592757 82510039 82786764
9369H2786764M40144L21765K44870L43030L72190K12326J18513K74181M58578
$$ 82786764 83226908 83548673 83793543 84136573 84508763 84721089 84839602 85113783 85572361
9360H5572361M17353K75700K85523L74741K80798K3074q8398Q0567K86239K59446
$$ 85572361 85989714 86265414 86550937 86925678 87206476 87229550 87141152 87221719 87507958 87767404
9350H7767404P3945K3795K12674M15972L89873K11294J74091L61511N10748M05074
$$ 87767404 87841349 87865144 88077818 88493790 88883663 89094957 89269048 89630559 90141307 90546381
9340I0546381K19779K70020N35354P03405O35921N00216M35159M00804M20134
$$ 90546381 90766160 91036180 91571534 92274939 92910860 93411076 93846235 94247039 94667173
9331I4667173O34000R70217J077153Q11873N27911O06205R15178J046139R27299
$$ 94667173 95301173 96271390 97348543 98160416 98688327 99294532 100209710 101255849 102183148
9322A02183148Q62019J029843J280590J426064J454047J418045J349322J312277
$$ 102183148 103045167 104075010 105355600 106781664 108235711 109653756 111003078 112315355
9314A12315355J335638J267748R24852M20645J12716J46487K75464K36042Q5489
$$ 112315355 113650993 114918741 115843593 116264238 116376954 116523441 116798905 117034947 117120436
9305A17120436K7955R9360K09259L49657N53724P32982P62509O98169P27916R02362
$$ 117120436 117148391 117247751 117457010 117806667 118360391 119093373 119855882 120554051 121281967 122184329
9295A22184329J065130J071503R44436P82491O37197N35606N14768N52051N39496
$$ 122184329 123249459 124320962 125265398 126047889 126685086 127220692 127735460 128287511 128827007
9286A28827007M22688L18236L92025O36387Q69485R69103J007027J106183J260612
$$ 128827007 129249695 129567931 129959956 130596343 131465828 132434931 133441958 134548141 135808753
9277A35808753J388532J498897J678051J921000K103829K161571K189806K309652
$$ 135808753 137197285 138696182 140374233 142295233 144399062 146560633 148750439 151060091
9269A51060091K512832K708851K860047K997416L156782L371018L675205M046745
$$ 151060091 153572923 156281774 159141821 162139237 165296019 168667037 172342242 176388987
9261A76388987M392259M670347M966862N357392N766505O085268O345418O577336
$$ 176388987 180781246 185451593 190418455 195775847 201542352 207627620 213973038 220550374
9253B20550374O521952N750735M195246K367883Q71612k09578j245173k441232
$$ 220550374 227072326 232823061 237018307 239386190 240257802 240048224 238803051 236361819
9245B36361819l523144m110782m230490m263968m424187m483036m124247l432700
$$ 236361819 232838675 228727893 224497403 220233435 215809248 211326212 207201965 203769265
9237B03769265k826369k511776k241249j728921j104219p17176o01925m30288
$$ 203769265 200942896 198431120 196189871 194460950 193356731 192639555 192037630 191607342
9229A91607342j3596M35887O60115P41000R52542J377326J856365K232611K480422
$$ 191607342 191593746 192029633 192689748 193430748 194383290 195760616 197616981 199849592 202330014
9220B02330014K654321K854999L198753L691516M177796M525000M790129N081950
$$ 202330014 204984335 207839334 211038087 214729603 218907399 223432399 228222528 233304478
9212B33304478N345956N439760N323745M968086M153804K664243P14241j078170
$$ 233304478 238650434 244090194 249413939 254382025 258535829 261200072 261914313 260836143
9204B60836143k264664k933291l426792l899907m274236m438819m326044l917881
$$ 260836143 258571479 255638188 252211396 248311489 244037253 239598434 235272390 231354509
9196B31354509l328433k774815k343493j907920j390566r29996o16510k56258
$$ 231354509 228026076 225251261 222907768 220999848 219609282 218679286 218062776 217806518
9188B17806518L41157R93956J394942J636660K104604K840661L427995L631588
$$ 217806518 218147675 219141631 220536573 222173233 224277837 227118498 230546493 234178081
9180B34178081L735854L967311L914395K940097J047876j041984k664363l739728
$$ 234178081 237913935 241881246 245795641 248735738 249783614 248741630 246077267 242337539
9172B42337539m517287n132435n578829n877383o042160n980008n617082n089481
$$ 242337539 237820252 232687817 227108988 221231605 215189445 209209437 203592355 198502874
9164A98502874m651191m390435m164894l841901l484211l232555l097714k979251
$$ 198502874 193851683 189461248 185296354 181454453 177970242 174737687 171639973 168660722
9156A68660722k849203k781986k777376k687529k415689k095826j941206j959188
$$ 168660722 165811519 163029533 160252157 157564628 155148939 153053113 151111907 149152719
9148A49152719j963128j853986j724289j653257j573984j426505j284636j209425
$$ 149152719 147189591 145335605 143611316 141958059 140384075 138957570 137672934 136463509
9140A36463509j110075q99396o79998o03071o16615n44209l80016l08520m11046
$$ 136463509 135353434 134454038 133774040 133170969 132554354 132010145 131630129 131321609 130910563
9131A30910563n24074m51069k01115M0001J06620m257j34694j16925L4429J34442
$$ 130910563 130386489 129935420 129734305 129774306 129880926 129876669 129741975 129625050 129659479 129793921
9121A29793921R0295M7023J55727L19045L54071L08966L75828N41749N95371M77484
$$ 129793921 129884216 129931239 130086966 130406011 130760082 131069048 131444876 131986625 132581996 133059480
9111A33059480L58117L41153L56005L72059M35316M48184K34545r4610j91852
$$ 133059480 133417597 133758750 134114755 134486814 134922130 135370314 135604859 135510249 135318397
9102A35318397k1867J1683l18264p01274q13352q29518j057767j386636j517579
$$ 135318397 135296530 135308213 134989949 134288675 133475323 132645805 131588038 130201402 128683823
9093A28683823j489709j526901j574465j456090j311683j377045j474700j270993
$$ 128683823 127194114 125667213 124092748 122636658 121324975 119947930 118473230 117202237
9085A17202237r35894r40440j227299j241206q58696o03555p43960q57753o21271
$$ 117202237 116266343 115325903 114098604 112857398 111998702 111395147 110651187 109793434 109172163
9076A09172163l88046n25518p30654n65682k38259k27621m48892m44161k15419
$$ 109172163 108784117 108258599 107527945 106962263 106724004 106496383 106047491 105603330 105387911
9067A05387911k00540m73147o03901l95501j91508k77287m41338l77640j71434
$$ 105387911 105187371 104714224 104110323 103714822 103523314 103246027 102804689 102427049 102255615
9058A02255615j07465k20717k96762k09302o4930m0382j68172k83743j98627M7599
$$ 102255615 102148150 101927433 101630671 101421369 101356439 101316057 101147885 100864142 100665515 100713114
9048A00713114J98384J22478M513M4240J30731N4688r6559o8980J13137J75529
$$ 100713114 100911498 101033976 101038489 101082729 101213460 101268148 101171589 101102609 101215746 101391275
9038A01391275M7493o2360o8666j29914k87231l33961j84980n9740j22301k21210
$$ 101391275 101438768 101376408 101307742 101177828 100890597 100556636 100371656 100311916 100189615 99968405
9028I9968405j88323j41722k51887m07506l76631j77218m4697r0251j86793j75644
$$ 99968405 99780082 99638360 99386473 98978967 98602336 98425118 98380421 98290170 98103377 97927733
9018I7927733n0297O6091O2389l1178o6987O689K9280j23750k65877j34935J40485
$$ 97927733 97877436 97943527 98005916 97974738 97907751 97914440 97943720 97819970 97554093 97419158 97559643
9007I7559643J60410j15829k53377n937L00976L01165J37090J38508K57610K40110
$$ 97559643 97720053 97604224 97350847 97344910 97645886 97947051 98084141 98222649 98480259 98720369
8997I8720369J47894K54511N15075N79406L39341R1549R8998K86345M34738M43518
$$ 98720369 98868263 99122774 99637849 100217255 100556596 100648145 100747143 101033488 101468226 101911744
8987A01911744L50006K74627L48614N32994N78206L62660J47387K05544L23348
$$ 101911744 102261750 102536377 102884991 103417985 103996191 104358851 104506238 104711782 105035130
8978A05035130P0978m71659p31288m73033j52441k28638n40281o73804o14303
$$ 105035130 105106108 104634449 103903161 103430128 103277687 103049049 102508768 101834964 101220661
8969A01220661o29509p18713o25270l46350k12924l70270n08243l03306Q0597
$$ 101220661 100591152 99872439 99247169 98900819 98687895 98317625 97809382 97506076 97586673
8960I7586673J87441j00054l84357k90508K5139J10700j37809l57048k75317q0535
$$ 97586673 97774114 97674060 97289703 96999195 97024334 97135034 96997225 96640177 96364860 96284325
8950I6284325n6183j25683n1571J05115Q7719q9380j58492o4655l1460j20444
$$ 96284325 96228142 96102459 96050888 96156003 96243722 96154342 95995850 95931195 95899735 95779291
8940I5779291j12470O2339J52114J5225j17748l6175J05251R7897O2269K03816
$$ 95779291 95666821 95729160 95881274 95896499 95778751 95742576 95847827 95945724 96007993 96211809
8930I6211809L98392L78336K13381K48474N73762Q52062P39781K99561o9600l5901
$$ 96211809 96610201 96988537 97201918 97450392 98024154 98876216 99615997 99915558 99845958 99810057
8920I9810057L32440O14046M87066J29412j391K09381M15361L95997L90389O12886
$$ 99810057 100142497 100756543 101243609 101373021 101371630 101581011 101996372 102392369 102782758 103395644
8910A03395644Q07650O71291M33451N38084R17161J091852R28148P78965Q53897
$$ 103395644 104203294 104874585 105308036 105846120 106763281 107855133 108783281 109562246 110416143
8901A10416143R47420Q98283Q52275Q90203Q10356N16581K74130L09476M30131
$$ 110416143 111363563 112261846 113114121 114004324 114814680 115331261 115605391 115914867 116344998
8892A16344998L19371K978k39938k83673k45733k74286m17518o13467p02432n72907
$$ 116344998 116664369 116667347 116427409 116143736 115898003 115623717 115206199 114592732 113890300 113317393
8882A13317393l61645l23028m35567l97094j21672P3183k5845j53325Q408L05948
$$ 113317393 112955748 112632720 112197153 111800059 111678387 111751570 111725725 111572400 111580808 111886756
8872A11886756L83240K60944K35248L34133L19184J90577K48963N86655Q96275
$$ 111886756 112269996 112530940 112766188 113100321 113419505 113610082 113859045 114445700 115341975
8863A15341975R17085P77020P48012Q89309J065792J148168J099320R99365J016492
$$ 115341975 116259060 117036080 117784092 118673401 119739193 120887361 121986681 122986046 124002538
8854A24002538J199402J323901J168039R06156R19317J194698J290499J017116
$$ 124002538 125201940 126525841 127693880 128600036 129519353 130714051 132004550 133021666
8846A33021666P56850Q66696J118051J072851P48917N03227M13858K16683j74082
$$ 133021666 133778516 134645212 135763263 136836114 137585031 138088258 138502116 138718799 138544717
8837A38544717m91906n46601n07726o26814r03696j164747j310356j353736j312511
$$ 138544717 138052811 137506210 136998484 136371670 135467974 134303227 132992871 131639135 130326624
8828A30326624j170429r22657o33972m55981n05493o60899o16313k84159J2551
$$ 130326624 129156195 128233538 127599566 127143585 126638092 125977193 125360880 125076721 125089272
8819A25089272j9342j69023l1074L20650M29784K39107K39437O55315J016344
$$ 125089272 125069930 124900907 124869833 125190483 125620267 125859374 126098811 126754126 127770470
8810A27770470Q99417O40736Q06578J282636J478831J264358J082329J168311
$$ 127770470 128669887 129310623 130117201 131399837 132878668 134143026 135225355 136393666
8802A36393666J259688J174946J121474J230687J275039J106468R59602J030701
$$ 136393666 137653354 138828300 139949774 141180461 142455500 143561968 144521570 145552271
8794A45552271J125488J040444R55538J090768J265820J195078R83812R19600
$$ 145552271 146677759 147718203 148673741 149764509 151030329 152225407 153209219 154128819
8786A54128819R59502Q49369O08785M66241M22888L20155K47312M03823O12104
$$ 154128819 155088321 155937690 156546475 157012716 157435604 157755759 158003071 158406894 159018998
8777A59018998M95364J58490J33150N35606Q43365P15327M86844N49827P51889
$$ 159018998 159514362 159672852 159806002 160341608 161184973 161900300 162387144 162936971 163688860
8768A63688860P99165P98109R30542R83455P42659N40960Q04669J261861J264382
$$ 163688860 164488025 165286134 166216676 167200131 167942790 168483750 169288419 170550280 171814662
8759A71814662Q22026O30214R88114J347660J183233P52659O28150Q76196J115047
$$ 171814662 172636688 173266902 174255016 175602676 176785909 177538568 178166718 179042914 180157961
8750A80157961J136613J081963J120821J266282J452132J581992J564412J452304
$$ 180157961 181294574 182376537 183497358 184763640 186215772 187797764 189362176 190814480
8742A90814480J445380J609690J729410J607229J372115J284822J355627J381510
$$ 190814480 192259860 193869550 195598960 197206189 198578304 199863126 201218753 202600263
8734B02600263J280144J157155J092048J075948J128173J265035J381208J375018
$$ 202600263 203880407 205037562 206129610 207205558 208333731 209598766 210979974 212354992
8726B12354992J366751J560723J898986K111638K140537K232097K521674K808958
$$ 212354992 213721743 215282466 217181452 219293090 221433627 223665724 226187398 228996356
8718B28996356K902294K927868L078511L267066L294009L206416L199980L260108
$$ 228996356 231898650 234826518 237905029 241172095 244466104 247672520 250872500 254132608
8710B54132608L201811L016143K859532K700019K314829J711313J206546R36366
$$ 254132608 257334419 260350562 263210094 265910113 268224942 269936255 271142801 272079167
8702B72079167O09561j8887p14670j103770j218126j349487j525405j539310j421407
$$ 272079167 272688728 272669841 271955171 270851401 269633275 268283788 266758383 265219073 263797666
8693B63797666j434854j576979j521481j175790q90341r24098j069811j052047
$$ 263797666 262362812 260785833 259264352 258088562 257198221 256274123 255204312 254152265
8685B54152265r55293r53813r27868p28954n79005p58554j050258r74183n31464
$$ 254152265 253196972 252243159 251315291 250586337 250007332 249248778 248198520 247224337 246692873
8676B46692873k36542l57796n75338n31117l18478k15043k54600l10904l58107
$$ 246692873 246456331 246098535 245523197 244992080 244673602 244458559 244203959 243893055 243534948
8667B43534948l97969l21176q8800R2649J6207k02952k64734p9651J58414K49501
$$ 243534948 243136979 242815803 242727003 242819652 242835859 242632907 242368173 242288522 242446936 242696437
8657B42696437J78753O3908M4166J94357M47632O36492O82996O89363P78820R38463
$$ 242696437 242875190 242939098 242983264 243177621 243625253 244261745 244944741 245634104 246412924 247351387
8647B47351387J095494J242108J388050J493001J551379J647949J830265K027658
$$ 247351387 248446881 249688989 251077039 252570040 254121419 255769368 257599633 259627291
8639B59627291K185373K348203K510301K547914K449231K440762K686994L011959
$$ 259627291 261812664 264160867 266671168 269219082 271668313 274109075 276796069 279808028
8631B79808028L151469L160375L303070L617368L876447L973806M079681M375156
$$ 279808028 282959497 286119872 289422942 293040310 296916757 300890563 304970244 309345400
8623C09345400M840119N340763N754765O006708O157950O446503P036365P742187
$$ 309345400 314185519 319526282 325281047 331287755 337445705 343892208 350928573 358670760
8615C58670760Q230499Q492071Q852905R475919J0127908J0541301J0754433J0948229
$$ 358670760 366901259 375393330 384246235 393722154 403850062 414391363 425145796 436094025
8607D36094025J1156150J1301239J1353536J1281126J0969488J0343157R468558
$$ 436094025 447250175 458551414 469904950 481186076 492155564 502498721 511967279
8600E11967279Q394773O957637M847634J838327k044685o411573j0504346j3530389
$$ 511967279 520362052 527319689 532167323 534005650 531960965 525549392 515045046 501514657
8592E01514657j5213256j5954039j6341753j6594661j6557873j6074412j5174691
$$ 501514657 486301401 470347362 454005609 437410948 420853075 404778663 389603972
8585C89603972j4006986j2774398j1685730j0802064r974185r082516q284868
$$ 389603972 375596986 362822588 351136858 340334794 330360609 321278093 312993225
8578C12993225p842824p717078p534644p022648o332146n835515n684216n669509
$$ 312993225 305150401 297433323 289898679 282876031 276543885 270708370 265024154 259354645
8570B59354645n498539n115896m712003m466311m367953m298856m195388m059709
$$ 259354645 253856106 248740210 244028207 239561896 235193943 230895087 226699699 222639990
8562B22639990l892952l716775l594802l522070l372755l099883k888545k903253
$$ 222639990 218747038 215030263 211435461 207913391 204540636 201440753 198552208 195648955
8554A95648955k971978k805981k490770k402129k591562k653964k362225k043396
$$ 195648955 192676977 189870996 187380226 184978097 182386535 179732571 177370346 175326950
8546A75326950k058241k242813k216600j992126j880152j945860j963803j847324
$$ 175326950 173268709 171025896 168809296 166817170 164937018 162991158 161027355 159180031
8538A59180031j751648j757174j771679j761981j797576j842752j768589j599454
$$ 159180031 157428383 155671209 153899530 152137549 150339973 148497221 146728632 145129178
8530A45129178j503455j509957j470693j335042j239763j278589j376612j430510
$$ 145129178 143625723 142115766 140645073 139310031 138070268 136791679 135415067 133984557
8522A33984557j408732j311705j194062j185070j305790j350358j180001j020785
$$ 133984557 132575825 131264120 130070058 128884988 127579198 126228840 125048839 124028054
8514A24028054j151182j390856j310908r30145p35298r29626j138027j037718
$$ 124028054 122876872 121486016 120175108 119244963 118509665 117580039 116442012 115404294
8506A15404294q31137q26529r43404r58114r13052r30823q93658o78118m91258
$$ 115404294 114573157 113746628 112803224 111845110 110932058 110001235 109107577 108429459 107938201
8497A07938201n90881q31549q67121o91739o07360p20792q34801q22726p78268
$$ 107938201 107347320 106515771 105648650 104956911 104349551 103628759 102793958 101971232 101192964
8488A01192964p69116p33270o66056o61775p18051p08440n94362m87395m76165
$$ 101192964 100423848 99690578 99024522 98362747 97644696 96936256 96341894 95854499 95378334
8479I5378334n47860o73532q04512q09696o11822l78149l72600n99355p78873
$$ 95378334 94830474 94156942 93352430 92542734 91930912 91552763 91180163 90580808 89801935
8470H9801935p07824m78788l13218l21165m52131n68012n61713m88899n21938
$$ 89801935 89094111 88615323 88302105 87980940 87528809 86960797 86399084 85910185 85388247
8461H5388247o75397p10876m87490k49830l02878n28933n63463l76752k91061
$$ 85388247 84712850 84001974 83514484 83264654 82961776 82432843 81869380 81492628 81201567
8452H1201567m18206m98571l93898l31130m70810n93996m71312k57600k37385
$$ 81201567 80783361 80284790 79890892 79559762 79088952 78494956 78023644 77766044 77528659
8443G7528659l86195m60562l77469k57751k01193k25809l31049m46469m29026
$$ 77528659 77142464 76681902 76304433 76046682 75845489 75619680 75288631 74842162 74413136
8434G4413136k71453j80491k82914m09153l62950k42247k51327l36610k96334
$$ 74413136 74141683 73961192 73678278 73269125 72906175 72663928 72412601 72075991 71779657
8425G1779657j64187j74951l61953m76394l58263j56811j01167k15708l41105
$$ 71779657 71615470 71440519 71078566 70602172 70243909 70087098 69985931 69770223 69429118
8416F9429118l37185k19580j43780k31060l77376l44392j12907K8565j04169k92787
$$ 69429118 69091933 68872353 68728573 68497513 68120137 67775745 67662838 67691403 67587234 67294447
8406F7294447k64464j37660j88895l32882k57971q998L9462j80023l08724j95712
$$ 67294447 67029983 66892323 66703428 66370546 66112575 66103577 66143039 65963016 65654292 65458580
8396F5458580j46857l22247l87319j11022J41682k0520l17774k28987J31729J97065
$$ 65458580 65311723 64989476 64602157 64491135 64632817 64612297 64294523 64065536 64197265 64394330
8386F4394330j04781k47080l240J94493N555k74103k45509k9788L4859l3621j8834
$$ 64394330 64289549 64042469 64039229 64233722 64239277 63965174 63719665 63689877 63724736 63691115 63672281
8375F3672281K6324p9933k17227j28568Q4765Q6745j15709j75102o590P4871p6498
$$ 63672281 63698605 63618672 63401445 63272877 63357642 63444387 63328678 63153576 63146986 63221857 63145359
8364F3145359j88426q3799j7032k15679m52612m26857k76414l10042m50005l88506
$$ 63145359 62956933 62873134 62856102 62640423 62187811 61760954 61484540 61174498 60724493 60335987
8354F0335987j65935j21321l00378l78927k31345j31222k49594l61261k59511
$$ 60335987 60170052 60048731 59748353 59369426 59138081 59006859 58757265 58396004 58136493
8345E8136493j06749j07291j32792J0774J77389R6540j54216k49722j16567P120
$$ 58136493 58029744 57922453 57789661 57800435 57977824 58074364 57920148 57670426 57553859 57560979
8335E7560979j2547n7008m7204o9459j35637j10159Q253O683j81180k93040j35306
$$ 57560979 57548432 57491424 57444220 57374761 57239124 57128965 57137218 57143901 56962721 56669681 56534375
8324E6534375O4324r066k35612k28954L9307J80163J1546j54107l9789J30699
$$ 56534375 56598699 56589633 56354021 56125067 56164374 56344537 56356083 56201976 56162187 56292886
8314E6292886K0364k27263k06340O9436J83245J8286o4044R9997J34054k19012
$$ 56292886 56313250 56085987 55879647 55949083 56132328 56150614 56086570 56186567 56320621 56101609
8304E6101609n42862l44625J02750J12701l59270o49992m10572p0002q5993k90128
$$ 56101609 55558747 55214122 55316872 55429573 55070303 54420311 54009739 53939737 53853744 53563616
8294E3563616l00736j43623p2464r4361o7924l9669j15240j80782r0876L2068
$$ 53563616 53262880 53119257 53046793 52952432 52884508 52844839 52729599 52548817 52457941 52490009
8284E2490009K865r2937q3370l8892q2780q2606Q2916J65513p8312l43743j65079
$$ 52490009 52492874 52399937 52316567 52277675 52194895 52112289 52195205 52360718 52282406 51938663 51773584
8273E1773584K69149L21075q0014l01192k1538K87164J82015n3807M4977L56438
$$ 51773584 52042733 52363808 52283794 51982602 51961064 52248228 52430243 52376436 52421413 52777851
8263E2777851M27055J79552q4668j73572j11972N4357K25713J98968m2738j85297
$$ 52777851 53204906 53384458 53299790 53126218 53014246 53068603 53294316 53493284 53450546 53265249
8253E3265249k8738J48756J3478k65366k84983n4119P7564J7451o179O9182N0178
$$ 53265249 53236511 53385267 53398745 53133379 52848396 52794277 52871841 52889292 52883113 52952295 53002473
8242E3002473q8591j16097L8252J54921J18763J04811K37465L63891L28146K31271
$$ 53002473 52913882 52797785 52836037 52990958 53109721 53214532 53451997 53815888 54144034 54375305
8232E4375305K53444L90202M99275M83247L45547J79952J35079K60210L89816
$$ 54375305 54628749 55018951 55518226 56001473 56347020 56526972 56662051 56922261 57312077
8223E7312077L35512J67736J18281K33267L49889M01196M80169N76640N26507
$$ 57312077 57647589 57815325 57933606 58166873 58516762 58917958 59398127 59974767 60501274
8214F0501274L02620J17652J38651K87695L96262L84289K50107O7661Q555J67256
$$ 60501274 60803894 60921546 61060197 61347892 61744154 62128443 62378550 62446211 62454766 62622022
8204F2622022L71060L84838K65504K38314K77690J75022M571Q1262L91019N31369
$$ 62622022 62993082 63377920 63643424 63881738 64159428 64334450 64339021 64420283 64811302 65342671
8194F5342671L57726K13445L18800M26503L65017M19531P77372J055135Q75963
$$ 65342671 65700397 65913842 66232642 66659145 67024162 67443693 68221065 69276200 70152163
8185G0152163N46966O07735R84012J174878J087537J079875J268240J388460J345887
$$ 70152163 70699129 71306864 72290876 73465754 74553291 75633166 76901406 78289866 79635753
8176G9635753J360420J508737J605850J611539J706171J894939J981118K006240
$$ 79635753 80996173 82504910 84110760 85722299 87428470 89323409 91304527 93310767
8168I3310767K252312K695497K935854K842040K797249L066660L356741L303185
$$ 93310767 95563079 98258576 101194430 104036470 106833719 109900379 113257120 116560305
8160A16560305L014073K778850K548669K087529J424707P93451K57621k89934
$$ 116560305 119574378 122353228 124901897 126989426 128414133 129207584 129465205 129175271
8152A29175271q59117j350363j715912j926369j901892j675694j474296j421689
$$ 129175271 128316154 126965791 125249879 123323510 121421618 119745924 118271628 116849939
8144A16849939j331310j030638p05655o16482o24863l74204J29315M95944N29973
$$ 116849939 115518629 114487991 113782336 113165854 112540991 112166787 112296102 112792046 113322019
8135A13322019M76901O06944Q55676J023512J099243J208499J385287J558462
$$ 113322019 113798920 114405864 115261540 116285052 117384295 118592794 119978081 121536543
8127A21536543J694231J832095K007409K208643K403847K586840K796683L061232
$$ 121536543 123230774 125062869 127070278 129278921 131682768 134269608 137066291 140127523
8119A40127523L309047L419833L419565L516325L825308M162217M286463M282746
$$ 140127523 143436570 146856403 150275968 153792293 157617601 161779818 166066281 170349027
8111A70349027M476049M960646N447506N675360N778568O060767O476902O534862
$$ 170349027 174825076 179785722 185233228 190908588 196687156 202747923 209224825 215759687
8103B15759687N780353M300623K660341J346496L64654n78112j611754k577436
$$ 215759687 221540040 225840663 228501004 229847500 230212154 229634042 228022288 225444852
8095B25444852l300788l768990l999830l954166l679714l350666l043706k658765
$$ 225444852 222144064 218375074 214375244 210421078 206741364 203390698 200346992 197688227
8087A97688227k183451j807939j599705j315736p98259l18522j84297k03940L8457
$$ 197688227 195504776 193696837 192097132 190781396 189983137 189664615 189480318 189276378 189314835
8078A89314835N03068P70520P64539Q85996J337773J801690J975815K014300K191586
$$ 189314835 189817903 190588423 191352962 192238958 193576731 195378421 197354236 199368536 201560122
8069B01560122K475302K680428K744714K613137K149940J425914Q11090N14540
$$ 201560122 204035424 206715852 209460566 212073703 214223643 215649557 216460647 216975187
8061B16975187L12886P659j76811p594K70240L17421L07979O27856J156409J432400
$$ 216975187 217288073 217295732 217118921 217111327 217381567 217698988 218006967 218634823 219791232 221223632
8051B21223632J431950J542951J759024J579181Q67102J47243k49441p10091j573672
$$ 221223632 222655582 224198533 225957557 227536738 228403840 228551083 228301642 227591551 226017879
8042B26017879k398779k608661k479389k766971l522110m011801l851787l517121
$$ 226017879 223619100 221010439 218531050 215764079 212241969 208230168 204378381 200861260
8034B00861260l502821l588005l336095k874272k654199k681952k529682k055707
$$ 200861260 197358439 193770434 190434339 187560067 184905868 182223916 179694234 177638527
8026A77638527j610051j441353j344311j092881q45093q16347q43226o63295m40921
$$ 177638527 176028476 174587123 173242812 172149931 171304838 170488491 169645265 168981970 168541049
8017A68541049n46584q69397q76530m74453k77197o97693j230471j146647o04006
$$ 168541049 167994465 167125068 166248538 165774085 165496888 164799195 163568724 162422077 161818071
8008A61818071m28407q74006j283848j136663p94282q32785j129311j155116q87992
$$ 161818071 161389664 160515658 159231810 158095147 157300865 156468080 155338769 154183653 153295661
7999A53295661q24756j147410j447701j403669j257004j368223j647787j761160
$$ 153295661 152470905 151323495 149875794 148472125 147215121 145846898 144199111 142437951
7991A42437951j688778j715372j925547k058896j938539j759742j778624j906982
$$ 142437951 140749173 139033801 137108254 135049358 133110819 131351077 129572453 127665471
7983A27665471j861546j632524j517162j640561j724865j516666j219131j199203
$$ 127665471 125803925 124171401 122654239 121013678 119288813 117772147 116553016 115353813
7975A15353813j385482j344505r86955p82859j061667j446039j343008p95818
$$ 115353813 113968331 112623826 111636871 110854012 109792345 108346306 107003298 106207480
7967A06207480m25302n75770r37140j094650j070066j102545j175932j081486
$$ 106207480 105782178 105206408 104269268 103174618 102104552 101002007 99826075 98744589
7959I8744589q43255p70873j030500j366100j392416j096614q86315j074347j440521
$$ 98744589 97901334 97130461 96099961 94733861 93341445 92244831 91358516 90284169 88843648
7950H8843648j495618j159328r02519j080556j404487j378719j065317r74306
$$ 88843648 87348030 86188702 85286183 84205627 82801140 81422421 80357104 79382798
7942G9382798j241944j417565j197997r01786r30699j142222j137444r02736p43089
$$ 79382798 78140854 76723289 75525292 74623506 73692807 72550585 71413141 70510405 69767316
7933F9767316p44827p36201o99535p93600r68261r62641p49346o13206o89941
$$ 69767316 69022489 68286288 67586753 66793153 65824892 64862251 64112905 63499699 62809758
7924F2809758p71168o99469o22694o71438o90906n34502l73212m36872o28907
$$ 62809758 62038590 61339121 60716427 60044989 59354083 58819581 58446369 58009497 57380590
7915E7380590o76384n38454m03226l68794l78744m14959n14213o19830o27996
$$ 57380590 56704206 56165752 55762526 55393732 55014988 54600029 54085816 53465986 52837990
7906E2837990n64719n31885n11692m19818l16794l45844m70771n06291m27002
$$ 52837990 52273271 51741386 51229694 50809876 50493082 50147238 49676467 49170176 48743174
7897D8743174m07970n03835n28518l64365j82429k02290l81794n01185m54326
$$ 48743174 48335204 47831369 47302851 46938486 46756057 46553767 46171973 45670788 45216462
7888D5216462l18459k09638j91350k74260m05495m91609m94215m59353m23228
$$ 45216462 44898003 44688365 44497015 44222755 43817260 43325651 42831436 42372083 41948855
7879D1948855l71678l23981l40921l96714l74262k61357k04703k67106k94589
$$ 41948855 41577177 41253196 40912275 40515561 40141299 39879942 39675239 39408133 39113544
7870C9113544j77907q5981k18749m40366m27741j53047N2377l9874k66013l41939
$$ 39113544 38935637 38849656 38630907 38190541 37762800 37609753 37662130 37622256 37356243 37014304
7860C7014304k39822j58095k24968l60175l96569k71265j04807q2916k23012l20934
$$ 37014304 36774482 36616387 36391419 36031244 35634675 35363410 35258603 35175687 34952675 34631741
7850C4631741k29394j03340j79332l65959l29311k4815J65058k1901l21810l35170
$$ 34631741 34402347 34299007 34119675 33753716 33424405 33399590 33564648 33542747 33220937 32885767
7840C2885767j10916k3979j90145l52518l34921k68494k88769l04617k19381j48558
$$ 32885767 32774851 32750872 32560727 32208209 31873288 31604794 31316025 31011408 30792027 30643469
7830C0643469k23201l39429l13947j87622j59739k62598l12418k06233q3803j11606
$$ 30643469 30420268 30080839 29766892 29579270 29419531 29156933 28844515 28638282 28554479 28442873
7820B8442873k33705k54376j13732K9480j090j83160l18681k59970q5304j9110
$$ 28442873 28209168 27954792 27841060 27870540 27869450 27686290 27367609 27107639 27022335 27003225
7810B7003225j62150l40751k99852n0112Q9974j10577m44174m80898j33073K02529
$$ 27003225 26841075 26500324 26200472 26150360 26240334 26129757 25685583 25204685 25071612 25274141
7800B5274141J66500r5550j93175p8611o7877k91464m64914l36393p5439L029
$$ 25274141 25440641 25345091 25151916 25073305 25005428 24713964 24249050 23912657 23837218 23840247
7790B3840247j11186k07702k29319k66093k78279j51548K990o1137l00755l74830
$$ 23840247 23729061 23521359 23292040 23025947 22747668 22596120 22599110 22537973 22237218 21862388
7780B1862388j53794P3998M8513j02060j43864j14945j67018k38243j71719k6140
$$ 21862388 21708594 21782592 21831105 21729045 21585181 21470236 21303218 21064975 20893256 20867116
7770B0867116P418q9223j81510k19772k23094j30826O7118J55991m0160l00420
$$ 20867116 20874534 20785311 20603801 20384029 20160935 20030109 20097227 20253218 20213058 19912638
7760A9912638k63593k643N6396j82284l17365j00501J67526J28257j01468j88435
$$ 19912638 19649045 19646402 19702798 19520514 19203149 19102648 19270174 19398431 19296963 19108528
7750A9108528r9974l6847n0696n0702m9684j08165j49805r9637p7083j80246k29336
$$ 19108528 19008554 18971707 18921011 18870309 18820625 18712460 18562655 18463018 18385935 18205689 17976353
7739A7976353m3350J72094R1901j76554k33817l4901O6063o0342j41835n8345
$$ 17976353 17933003 18105097 18196998 18020444 17786627 17751726 17817789 17757447 17615612 17557267
7729A7557267o7202k64866l15015l1634K08941M7532k43447k10646K1523J2437
$$ 17557267 17490065 17225199 16910184 16878550 17087491 17135023 16891576 16680930 16702453 16714890
7719A6714890j83376j20806J78447J73432k57184m94834j24696L65530L03132
$$ 16714890 16531514 16410708 16589155 16762587 16505403 16010569 15885873 16251403 16554535
7710A6554535j64587l47065n8905K05696J00991j28515j54896n5030o1445j53200
$$ 16554535 16389948 16042883 15983978 16189674 16290665 16162150 16007254 15952224 15890779 15737579
7700A5737579j64972r5904n7654m9206n718K8453j8089o9104j4106O5217l43j68530
$$ 15737579 15572607 15476703 15419049 15369843 15364125 15392578 15374489 15305385 15291279 15356496 15356153 15187623
7688A5187623k22226j14001l8691j06702j75516j12313j1738L9o339P4005J34520
$$ 15187623 14965397 14851396 14812705 14706003 14530487 14418174 14406436 14406475 14400136 14474141 14608661
7677A4608661R662k08505k54294p5640R0566O3359o2348j08559o2456l7344r1562
$$ 14608661 14618323 14409818 14155524 14079884 14170450 14233809 14171461 14062902 14000446 13963102 13871540
7666A3871540j66964j53274M909K04625K28022P362k08455j38289J13743J74703
$$ 13871540 13704576 13551302 13556211 13760836 13988858 13996220 13787765 13649476 13763219 13937922
7656A3937922m3221k06804r0745P2092p211j88461j36370J25960K49817R4898
$$ 13937922 13894701 13687897 13597152 13669244 13662033 13473572 13337202 13463162 13712979 13807877
7646A3807877r4294p8109P4175J45737N4164r9064j46647k878K18319K76097R8780
$$ 13807877 13713583 13635474 13709649 13855386 13909550 13810486 13663839 13660961 13879280 14155377 14254157
7635A4254157q7560p4286K2695m089o0686P7635K93733K39658o7290j97215L0473
$$ 14254157 14166597 14092311 14115006 14110917 14050231 14127866 14421599 14661257 14593967 14396752 14427225
7624A4427225K64002J93407L628k0605K5053o6516j68521n8636J16459N8228j42100
$$ 14427225 14691227 14884634 14888262 14867657 14892710 14826194 14657673 14599037 14715496 14773724 14631624
7613A4631624j34789Q1787J47288n3046k14867j42908m0767j11480k25610j93360
$$ 14631624 14496835 14578622 14725910 14672864 14457997 14315089 14274322 14162842 13937232 13743872
7603A3743872p3076O255P0229J25811J7538k78276m43196k22015J28140J52375
$$ 13743872 13670796 13677051 13747280 13873091 13890629 13612353 13169157 12947142 13075282 13227657
7593A3227657j35050k84651r9345J15359Q4992l3092M834R7000J7484j35745p2820
$$ 13227657 13092607 12807956 12708611 12823970 12908962 12875870 12880704 12977704 12995188 12859443 12786623
7582A2786623J87081L00967J15707j17508j38681j5134O4143Q9182J27056J17048
$$ 12786623 12973704 13274671 13390378 13272870 13134189 13119055 13183198 13272380 13399436 13516484
7572A3516484L467p8808r488N0886j03031l08698k16077J29408K75384K9547k40414
$$ 13516484 13519951 13441143 13431655 13482541 13379510 13070812 12854735 12984143 13259527 13289074 13048660
7561A3048660j68449P9026J09651j07606k82277k75459k14252k00528j81313j02148
$$ 13048660 12880211 12959237 13068888 12961282 12679005 12403546 12189294 11988766 11807453 11705305
7551A1705305P275R0263P7911q3063k98744l48664j80870k9854p0895j50309p8795
$$ 11705305 11712580 11802843 11880754 11797691 11498947 11150283 10969413 10939559 10868664 10718355 10639560
7540A0639560K6638j7440r8015l9063Q257j61832l28175j50261J66955J16403
$$ 10639560 10666198 10648758 10550743 10511680 10519937 10358105 10029930 9879669 10046624 10163027
7530A0163027k36845k94936O8456K53029p0596l98105k31732J23302J25683j26661
$$ 10163027 9926182 9631246 9699702 9952731 9882135 9484030 9252298 9375600 9501283 9374622
7520I374622j78275j1907M5892l4090k6187L6336n0690j81458q5130J34445J28799
$$ 9374622 9196347 9184440 9230332 9196242 9170055 9206391 9155701 8974243 8889113 9023558 9152357
7509I152357q6145j76708j07687j59278l16803k26658J32471L00868N8085k16392
$$ 9152357 9066212 8889504 8781817 8622539 8305736 8079078 8211549 8512417 8570502 8354110
7499H354110j59503M6341O4838n2363o0554K1034q896j66157k72631k07313M834
$$ 8354110 8194607 8240948 8305786 8253423 8192869 8213903 8205007 8038850 7766219 7558906 7563740
7488G563740K28512K51914j3996k98550k18311J36594K26406j38064m27241j57234
$$ 7563740 7792252 8044166 8030170 7731620 7513309 7649903 7876309 7738245 7311004 7153770
7478G153770L42001L89074n2824l69237k07248J13924J70424j8106j71816j69084
$$ 7153770 7495771 7884845 7832021 7462784 7255536 7369460 7539884 7521778 7349962 7180878
7468G180878q2693M111L9238j8572j22143j24472L5879J97064J40490j15019k92684
$$ 7180878 7098185 7102296 7141534 7122962 7000819 6876347 6912226 7109290 7249780 7134761 6842077
7457F842077j83443P7821J72276K3065j01697M507J60468Q0979j55505k23125
$$ 6842077 6658634 6736455 6908731 6931796 6830099 6834606 6995074 7076053 6920548 6697423
7447F697423p1277K2757n2936q1956L9339Q7441o1921j61867k4240J12167j6414
$$ 6697423 6626146 6648903 6595967 6514011 6553350 6640791 6578870 6417003 6392763 6504930 6488516
7436F488516k15707j50205Q1168J24162k6487n9412Q8699J53755L2538p1304m6793
$$ 6488516 6272809 6122604 6203772 6327934 6301447 6242035 6330734 6484489 6517027 6445723 6398930
7425F398930l9796j23406j42877j3946J05572O9776n2549j23171r1471L6205J85475
$$ 6398930 6359134 6235728 6092851 6078905 6184477 6254253 6201704 6078533 5987062 6023267 6208742
7414F208742J72216q9154l48502k77340L7669J88405N6349n2455L2168P1366j04059
$$ 6208742 6380958 6291804 5943302 5665962 5703631 5892036 5948385 5895930 5928098 5999464 5895405
7403E895405k40832q3574J64663J46254r7572k18689q3332J05853J49078N7882
$$ 5895405 5654573 5570999 5735662 5881916 5784344 5565655 5482323 5588176 5737254 5795136
7393E795136n3715r8310m8469L5567M5990l1427r5956j00745j08412j22986n0213
$$ 5795136 5741421 5643111 5594642 5630209 5676199 5644772 5548816 5448071 5339659 5216673 5166460
7382E166460Q8053J11670k0425r2138L0344J64600J12912k1644n1918l3001r9790
$$ 5166460 5254513 5366183 5345758 5253620 5283964 5448564 5561476 5539832 5487914 5454913 5355123
7371E355123j56889m0657J35106J15578q4969k09063j49024l6633K7936O9353
$$ 5355123 5198234 5157577 5292683 5408261 5323292 5114229 4965205 4928572 4956508 5025861
7361E025861P9134K0092k5251M4379J23096L2342j41211j37088L4922O3396j65011
$$ 5025861 5104995 5125087 5099836 5144215 5267311 5299653 5158442 5021354 5056276 5119672 4954661
7350D954661l42135j83609J41598K45395M4740j66071j28337O8368J36704k3259
$$ 4954661 4612526 4428917 4570515 4815910 4860650 4694579 4566242 4634610 4771314 4748055
7340D748055j87108j06089J29141J91697l324j58510n3370J08137M5349j22916
$$ 4748055 4560947 4454858 4583999 4775696 4772372 4613862 4560492 4668629 4713978 4591062
7330D591062q4266J26111J78836k304j39873p7883J6934Q307p427K8662m302j26491
$$ 4591062 4506796 4632907 4811743 4809439 4669566 4591683 4608617 4616924 4609497 4638159 4633857 4507366
7318D507366j38673L4197J56257M2394j38724j46520l8281j3169o0650k5753Q5036
$$ 4507366 4368693 4402890 4559147 4601541 4462817 4316297 4278016 4264847 4204197 4178444 4263480
7307D263480J10183j917j27887j51952q0796P330M8558N3984J00380J92484J77052
$$ 4263480 4373663 4371746 4243859 4091907 4011111 4018441 4066999 4120983 4221363 4413847 4590899
7296D590899m6230k74257k14920N0113J39686l1081j12820O7455J77376n2825
$$ 4590899 4544669 4270412 4055492 4105605 4245291 4214210 4101390 4168845 4346221 4293396
7286D293396l17041j91607J81517L28510J66581J5870N294m2178j58863j44460
$$ 4293396 3976355 3784748 3966265 4294775 4461356 4477226 4482520 4440342 4281479 4137019
7276D137019J5651P0570n8512j40886n3881K1067l5867o3635M6631J08891l6937
$$ 4137019 4152670 4223240 4164728 4023842 3969961 3991028 3955161 3891526 3938157 4047048 4010111
7265D010111k13163j65406M8896J74619J26571K1941n1472r3027q4431j0678N2403
$$ 4010111 3796948 3631542 3680438 3855057 3981628 4003569 3952097 3859070 3774639 3763961 3816364
7254C816364J6050q4584j38144j01987j5381P4298J19116P2837l4598r4925o3754
$$ 3816364 3832414 3747830 3609686 3507699 3492318 3566616 3685732 3758569 3723971 3629046 3565292
7243C565292j9199j1081L0814J37400J76073L7332j46805j47369M0382J85993
$$ 3565292 3546093 3535012 3565826 3703226 3879299 3916631 3769826 3622457 3662839 3848832
7233C848832J26003o4489k07393k05691q1835N8333Q8057j5985j08326l6444J32664
$$ 3848832 3974835 3910346 3702953 3497262 3415427 3473760 3561817 3545832 3437506 3401062 3533726
7222C533726J74118J7781j40720j10889L7124J00036L2619l2973j9868j801m1101
$$ 3533726 3707844 3725625 3584905 3474016 3511140 3611176 3643795 3610822 3590954 3589153 3548052
7211C548052o7715J659J11559J33868M6655m5363n9740k3814k955j3976m0407
$$ 3548052 3480337 3481996 3593555 3727423 3774078 3728715 3668975 3645161 3642206 3628230 3587823
7200C587823p8015j18973j20900m3945P5321J24403L2037j09948j05342R5572
$$ 3587823 3509808 3390835 3269935 3225990 3301311 3425714 3457751 3347803 3242461 3338033
7190C338033K57922J23181j91564k70349K4870K95369J50857j96547k34902P1959
$$ 3338033 3595955 3719136 3527572 3257223 3282093 3577462 3728319 3531772 3296870 3368829
7180C368829K53051Q3294j11130n2154M7822o9539k11395o8623K26984K96902
$$ 3368829 3621880 3705174 3594044 3541890 3589712 3520173 3308778 3240155 3467139 3764041
7170C764041R4412j01472j44876j07748j6149J29373J65169k8202k16493j04069
$$ 3764041 3858453 3756981 3612105 3504357 3488208 3617581 3782750 3754548 3538055 3433986
7160C433986J43910J09723j91342l14578r4962J39591J45107O6955M2133k5284
$$ 3433986 3577896 3687619 3496277 3181699 3086737 3226328 3371435 3438390 3480523 3455239
7150C455239j24192m5146J67414J47195j63439l01482j6267K65689J08842k35545
$$ 3455239 3331047 3285901 3453315 3600510 3437071 3135589 3119322 3385011 3493853 3258308
7140C258308k76223n6227M6120M220P4363K29207K05019J1187r7015p9624j00832
$$ 3258308 2982085 2925858 2971978 2976198 3050561 3279768 3484787 3495974 3398959 3319335 3218503
7129C218503j41299o1652L5478l9600j35578K5830K80223K03634j50790k71924
$$ 3218503 3077204 3015552 3051030 3011430 2875852 2901682 3181905 3385539 3234749 2962825
7119B962825q724K08221J03560m9521N433P9345k6837j20804m57J47659Q7187
$$ 2962825 2954101 3162322 3265882 3216361 3221794 3301139 3274302 3153498 3153041 3300700 3387887
7108C387887n7722p7227n6052j23519j18844R5885K52397N7072k48454k05188
$$ 3387887 3330165 3252938 3196886 3073367 2954523 3050408 3302805 3359877 3111423 2906235
7098B906235J05910J62709j45606l16052l4387L14586K42924r9632j86402P6681
$$ 2906235 3012145 3174854 3029248 2713196 2678809 2993395 3236319 3136687 2950285 3026966
7088C026966K43853L2174k65836k42072L7352J80440O5194m2255L0035Q9039o0779
$$ 3026966 3270819 3302993 3037157 2795085 2832437 3012877 3078071 3035816 3065851 3154890 3094111
7077C094111k46571j72078J15514K79573J60200o0850j53682q5334M1094J12891
$$ 3094111 2847540 2675462 2790976 3070549 3230749 3169899 3016217 2930883 2971977 3084868
7067C084868O2543n8156q4882L7361J19639J164j55606r7630R2562J23256k0113
$$ 3084868 3147411 3089255 3004373 3041734 3161373 3162537 3006931 2909301 3001863 3125119 3105006
7056C105006q2367j1090j7665j31373j18132N8473J20289l2733j27952n910J07412
$$ 3105006 3022639 3011549 2993884 2862511 2744379 2802852 2923141 2890408 2762456 2756546 2863958
7045B863958M0783j2611J01550J71053J1906j59384r3705O4721P2112O334L2936
$$ 2863958 2904741 2892130 2993680 3164733 3176639 3017255 2923550 2988271 3060383 3066717 3099653
7034C099653M5021p8404j42486K0936J60039K651k16506j26784J15734Q8291j53090
$$ 3099653 3144674 3066270 2923784 2944720 3104759 3107410 2890904 2764120 2879854 2968145 2815055
7023B815055j77631O7435J98530O9244n7196l5632j8573n8729j8786O9454K1139
$$ 2815055 2637424 2704859 2903389 2972633 2915437 2879805 2861232 2802503 2783717 2853171 2874310
7012B874310q8815j578K08545J97042k8684r1326P5635J05814j07494j94516M528
$$ 2874310 2785495 2783917 2992462 3189504 3160820 3069494 3145129 3250943 3143449 2948933 2953461
7001B953461J25441o3011k43403j30430M7663K7795r369J37564K30824K6820k09718
$$ 2953461 3078902 3015891 2772488 2642058 2689721 2717516 2708147 2845711 3076535 3103355 2893637
6990B893637j20300J32208J60779J477l9138L4369j2065j36792r7812O8999J14403
$$ 2893637 2773337 2905545 3066324 3067801 3028663 3063032 3050967 2914175 2816363 2885362 2999765
6979B999765M4176P1332J49760J3715l02722m18324j62641J74032K59219J08508
$$ 2999765 3043941 3115273 3265033 3278748 2976026 2557702 2395061 2569093 2828312 2936820
6969B936820m7166o6988K0222R4203N0830p6050j24918k1093J08847J34364R6516
$$ 2936820 2889654 2822666 2842888 2937091 2987921 2911871 2786953 2765860 2874707 3009071 3105587
6958C105587P0225K7199k4819K0813J29692Q1137j36446j95133L9635J99443N102
$$ 3105587 3175812 3203011 3178192 3199005 3328697 3409834 3273388 3078255 3117890 3317333 3322435
6947C322435k01005j2369K86963J60022k26978k28094J88119L58879K7140k56124
$$ 3322435 3121430 3109061 3396024 3556046 3329068 3100974 3289093 3647972 3675112 3418988
6937C418988p9267J88984R7006j41135q4896J76515K26767R035j67713j49826
$$ 3418988 3339721 3528705 3625711 3484576 3399680 3576195 3802962 3811997 3644284 3494458
6927C494458n8106K1015J16931J88002J31133k2984j14925n5841Q8771J79173
$$ 3494458 3436352 3457367 3574298 3762300 3893433 3870449 3755524 3699683 3788454 3967627
6917C967627J05888j04554k52511j55696R5901K29013J52092M3093M5174R3717
$$ 3967627 4073515 3968961 3716450 3560754 3656655 3885668 4037760 4080853 4126027 4219744
6907D219744R6578O2189o675j20103j66031k5164J54681J08336q8502q4611J47777
$$ 4219744 4316322 4378511 4371836 4251733 4085702 4060538 4215219 4323555 4235053 4150442 4298219
6896D298219K17259k3463j87599N229K48967J75549l8613k7691J30182J24136
$$ 4298219 4515478 4492015 4304416 4309645 4558612 4734161 4695548 4667857 4798039 4922175
6886D922175R103P2891K59817K49688M6251j1737J65442K82863J75019M3943P0930
$$ 4922175 4931278 5004169 5263986 5513674 5559925 5548188 5713630 5996493 6171512 6215455 6286385
6875F286385J44585J22233P3652J05904J69786J90179K13345K88661L41626K93577
$$ 6286385 6430970 6553203 6626855 6732759 6902545 7092724 7306069 7594730 7936356 8229933
6865H229933K15180K45626L99214N37582N43479M81574N31060P33766Q95069Q40770
$$ 8229933 8445113 8690739 9089953 9627535 10171014 10652588 11183648 11917414 12812483 13653253
6855A3653253O77437O00071N20106J87152l26619o32364n95585n13941n85434
$$ 13653253 14330690 14930761 15450867 15638019 15311400 14679036 14083451 13569510 12984076
6846A2984076o21685n05424m78018o49306o68135l05625M1311o3141l59109l21406
$$ 12984076 12362391 11856967 11378949 10729643 10061508 9755883 9797194 9734053 9374944 9053538
6836I053538l2205J5926k19627l41003k53482k21648k48331q3962J55287P9874
$$ 9053538 9021333 9037259 8817632 8476629 8223147 8001499 7753168 7669206 7824493 7904367
6826G904367k14268j92039J99036L70750N3276k89054k68837j28265j45960j30175
$$ 7904367 7690099 7498060 7697096 8067846 8121122 7832068 7563231 7434966 7289006 7158831
6816G158831R0591K43153J14016k9636M5802J00085n9775j21365J57071L87484
$$ 7158831 7249422 7492575 7606591 7576955 7622757 7722842 7663067 7541702 7698773 8086257
6806H086257J56671k17109j70374J87892L11718J30769M3882J45589J38350k3329
$$ 8086257 8242928 8025819 7855445 8043337 8355055 8485824 8529706 8675295 8813645 8790316
6796H790316l6761J57475K52753J34556N8714J50403J78659L03j47083k585L22024
$$ 8790316 8753555 8911030 9163783 9298339 9357053 9507456 9686115 9686418 9539335 9536750 9858774
6785I858774M83741L09567k7400j58164J15257N22286N49889J12581k38627k9492
$$ 9858774 10342515 10652082 10624682 10466518 10581775 11104061 11653950 11766531 11527904 11498412
6775A1498412M67315O36063L80331J40813J82751L38151M19471M45412M33489
$$ 11498412 11965727 12601790 12982121 13122934 13305685 13643836 14063307 14508719 14942208
6766A4942208L51783L01593M11564N61076N40753M41289N20346P37690Q21518
$$ 14942208 15293991 15595584 16007148 16568224 17108977 17550266 18070612 18808302 19629820
6757A9629820P57497P86058R25399R36681P88024P26280Q43745R75210J059719
$$ 19629820 20387317 21173375 22098774 23035455 23823479 24549759 25393504 26368714 27428433
6748B7428433J214555J437486J622741J843839K210848K529753K580776K619209
$$ 27428433 28642988 30080474 31703215 33547054 35757902 38287655 40868431 43487640
6740D3487640L029037L603034L850847L922379M423935N369518O213198O834552
$$ 43487640 46516677 50119711 53970558 57892937 62316872 67686390 73899588 80734140
6732H0734140P292003O559813L193697k020383n718417n644761l565095k948988
$$ 80734140 88026143 94585956 97779653 95759270 90040853 84396092 80830997 77882009
6724G7882009m574343o199409o124909n064811m300543l845949l203028k566432
$$ 77882009 73307666 67108257 60983348 55918537 51617994 47772045 44569017 42002585
6716D2002585k315267k189241j828964j504876j569425j705360j422499r02386
$$ 42002585 39687318 37498077 35669113 34164237 32594812 30889452 29466953 28564567
6708B8564567o91330q43988r66813r00946q24611q17135p87172p44163p62492
$$ 28564567 27873237 27029249 26062436 25161490 24336879 23519744 22732572 21988409 21225917
6699B1225917p64595o58455n77599o79765q25805p66210n47678m32929m86113
$$ 21225917 20461322 19802867 19225268 18545503 17719698 16953488 16405810 15972881 15486768
6690A5486768n20281m18444k62127j62319j57512k45382l56026l57719k36525
$$ 15486768 14966487 14548043 14285916 14123597 13966085 13720703 13364677 13006958 12770433
6681A2770433j72641k78171l83332k86991j05471j18563l24319m15316k26000
$$ 12770433 12597792 12319621 11936289 11649298 11543827 11425264 11100945 10685629 10459629
6672A0459629K2280J6156k46894m58887l67429p2959P9607q5204l44591l63919
$$ 10459629 10481909 10498065 10251171 9792284 9424855 9351896 9431503 9346299 9001708 8637789
6662H637789j43983O707o7010j76473j27028k225K4000m7356j22217j88066k48195
$$ 8637789 8493806 8500513 8433503 8257030 8130002 8127777 8151777 8104421 7982204 7794138 7545943
6651G545943k35961j42464p8470q1545m2406M8970J5249j77842k62602p9378J11370
$$ 7545943 7309982 7167518 7089048 7007503 6965097 7014067 7029316 6851474 6588872 6509494 6620864
6640F620864K7895j62265j38331J2166l0826k13379j72205J14947K40788J8309
$$ 6620864 6648759 6486494 6348163 6360329 6329503 6116124 5943919 6058866 6299654 6317963
6630F317963k32464k09947n0606j2567p3972r4086j03932j66487j53377N6215
$$ 6317963 6085499 5875552 5824946 5812379 5738407 5644321 5540389 5373902 5220525 5276740
6620E276740K84435K35041q5715l51630l20279r0763O7963L7028n6907l9197O5815
$$ 5276740 5561175 5796216 5710501 5358871 5038592 4947829 5015792 5052820 4995913 4956716 5022531
6609E022531N9939j21830k54230j18787J41791J93583o704j69161j25096k8243
$$ 5022531 5082470 4960640 4706410 4587623 4729414 4922997 4916293 4747132 4622036 4593793
6599D593793k1662j0434P4200O7314j42467l42133k76356m1208P2229J0517l8937
$$ 4593793 4572131 4561697 4635897 4703211 4560744 4218611 3942255 3901047 3973276 3983793 3944856
6588C944856j767N573o2726r5918l5607L2271M0082K9570L6462K1896l4686p9261
$$ 3944856 3943089 3948662 3885936 3790018 3754411 3786682 3826764 3856334 3892796 3914692 3880006 3800745
6576C800745n5991L1985J30810J46746L054k25455l12994j47178Q5285J36555
$$ 3800745 3744754 3776739 3907549 4054295 4057349 3831894 3518900 3371722 3457007 3593562
6566C593562L9046K71K6034o8235k62857k71431N384K46395J38033j68948k77434
$$ 3593562 3632608 3632879 3658913 3590678 3327821 3056390 3061774 3308169 3446202 3277254 2999820
6555B999820r2333J06629R2103n2027j20339m3210J00514J91386J40022l8495
$$ 2999820 2907487 3014116 3106219 3054192 2933853 2890643 2991157 3182543 3322565 3284070
6545C284070j81075j19616Q5024J70795J0903j93796j78814J4824J01630m0437
$$ 3284070 3102995 2983379 3068403 3239198 3250101 3056305 2877491 2892315 2993945 2953508
6535B953508k06000j66668J5070J04140L1207n0711k6965K6658L151n6162m1980
$$ 2953508 2747508 2580840 2595910 2700050 2731257 2680546 2653581 2680239 2683390 2627228 2585248
6524B585248L7437O6055j154o7527l0377P0591Q8548m9766k28970k49897o4056
$$ 2585248 2622685 2688740 2687586 2620059 2589682 2660273 2748821 2699055 2470085 2220188 2156132
6513B156132J47615J88512Q9491L0858N2601J1550j37160k12840q7510P8466O7308
$$ 2156132 2303747 2492259 2581750 2612608 2665209 2676759 2539599 2326759 2239249 2317715 2385023
6502B385023n3025m7511R3170J38736j155j40341j20747k3752J9882K6333M2935
$$ 2385023 2331998 2284487 2377657 2516393 2515238 2374897 2254150 2230398 2250280 2276613 2319548
6491B319548J9342o1824q3637K1366J24330R3166j967l9313n4726j05720q3006
$$ 2319548 2338890 2277066 2193429 2214795 2339125 2432291 2430324 2391011 2336285 2230565 2147559
6480B147559Q4502J71526o4279m09796l86286M9560L79238K35952j06700j84641
$$ 2147559 2232061 2403587 2339308 1929512 1543226 1592786 1972024 2207976 2101276 1916635
6470A916635J0457J33060L6747r8458j05106j2712Q2303J17378N8821l7475k5195
$$ 1916635 1927092 2060152 2096899 1998441 1893335 1880623 1962926 2080304 2139125 2101650 2076455
6459B076455J08610J36222p5419k61934j04920K24794K63148k7299j84674J2924
$$ 2076455 2185065 2321287 2245868 1983934 1879014 2103808 2366956 2339657 2154983 2167907
6449B167907K05771P1647j54916j28118J2518o2572k43397j62623J21368J63482
$$ 2167907 2373678 2445325 2290409 2162291 2174809 2112237 1868840 1706217 1827585 1991067
6439A991067j31977l21018j02490K37230K77074K9167j87292j96789n9575J06976
$$ 1991067 1859090 1538072 1435582 1672812 1949886 1979053 1791761 1594972 1535397 1642373
6429A642373J92806J19313l8966q9863J46L9547n9799j15702p526P6663k9687
$$ 1642373 1835179 1954492 1915526 1825663 1825809 1865356 1805557 1689855 1682329 1758992 1729305
6418A729305j31992J3035K35766J89908o5108j41926M1157J40311k9105k01724
$$ 1729305 1597313 1610348 1846114 2036022 1970914 1828988 1870145 2010456 1981351 1779627
6408A779627j19657P0824J02056j0115q2789p3744l8862L9805J50536J33186q7975
$$ 1779627 1659970 1730794 1832850 1822735 1739946 1666202 1627340 1667145 1817681 1950867 1862892
6397A862892k78050j64109J43021K67263Q1217j52324j74881m3849J8934p1443
$$ 1862892 1584842 1420733 1563754 1831017 1912234 1759910 1585029 1541180 1560114 1488671
6387A488671j90038j46619J12316L82568L50068k0045l42610k61088N4262J44438
$$ 1488671 1298633 1152014 1264330 1646898 1996966 1976921 1634311 1373223 1427485 1571923
6377A571923m4356r2122J79123L50503N0654l92793l78359P8387L66473J70014
$$ 1571923 1527567 1435445 1614568 1965071 2015725 1622932 1244573 1322960 1689433 1859447
6367A859447j45790j67937j7506k1880j34477o7943J56658K02727m1538k67639
$$ 1859447 1713657 1545720 1528214 1506334 1371857 1303914 1460572 1663299 1621761 1354122
6357A354122j96836M3327J54335Q6226K3051N7181Q7464K7428n5722n7791J2755
$$ 1354122 1157286 1200613 1354948 1441174 1464225 1521406 1608870 1636298 1580576 1522785 1535540
6346A535540O5214N3095J2687p597j0479k7927n9728o9923n0476m5585p9500j02386
$$ 1535540 1600754 1653849 1666536 1658939 1648460 1620533 1560805 1490882 1440406 1394821 1315321 1212935
6334A212935o4310m013J4997K0337P4063J25439O5237o8229j08292k6807Q362
$$ 1212935 1148625 1144612 1159609 1179946 1254009 1379448 1444685 1376456 1268164 1241357 1249719
6323A249719p2896r9673M3477J80253J14012l9611n4862J1590n0196j72856q5560
$$ 1249719 1176823 1077150 1120627 1300880 1414892 1375281 1320419 1332009 1281813 1108957 1023397
6312A023397J84414K77243O0564j45821p0003J19778J41257K4827m6328p5466
$$ 1023397 1207811 1485054 1545618 1399797 1329794 1449572 1590829 1615656 1569328 1493862
6302A493862j38956j35067L7626K02002J27051p7989j16539L1374J26711Q9525
$$ 1493862 1354906 1219839 1257465 1459467 1586518 1508529 1391990 1423364 1550075 1639600
6292A639600N0036J7441j20935k56272j24852J95771K75660j5070k50152r5836
$$ 1639600 1689636 1707077 1586142 1329870 1205018 1400789 1676449 1661379 1411227 1315391
6282A315391J66206J18130j10710r5971J43848J80233r2111k64639p5849J74026
$$ 1315391 1481597 1599727 1489017 1393046 1536894 1717127 1625016 1360377 1284528 1458554
6272A458554J06465j58891k16153K3641K47712J94997n6519k55171k43114m5558
$$ 1458554 1565019 1406128 1189975 1213616 1461328 1656325 1599806 1344635 1101521 1055963
6262A055963J64025J83979k633j51530m1218J92266K09985k8495j83868o0199
$$ 1055963 1219988 1403967 1401334 1249804 1208586 1400852 1610837 1582342 1398474 1338275
6252A338275Q2770l1490k08948r7838J80844J79252j27638k47404M1604L04934
$$ 1338275 1421045 1389555 1180607 1082769 1263613 1442865 1315227 1067823 1109427 1414361
6242A414361J39647j88803k07431Q759M5343j15448j28585M7994J00767k1327
$$ 1414361 1554008 1365205 1157774 1166533 1211876 1096428 967843 1015837 1116604 1095277
6232A095277j4736J55287J21400j91975l13532Q448L07128J11008k78560k67794
$$ 1095277 1080541 1235828 1357228 1165253 851721 860169 1167297 1278305 999745 731951
6222G31951Q6463K22059q733j82596m6019J56915J83973J28999J07708L0305j24499
$$ 731951 818414 1040473 1031740 849144 803125 960040 1144013 1273012 1380720 1411025 1286526
6211A286526j63011j2638R0609l3288k01818j50047P4829K13412J49947j3814
$$ 1286526 1123515 1110877 1201486 1168198 966380 816333 891162 1104574 1254521 1240707
6201A240707j32124j18227K4293J55923R3083j50331l20149k16299O9835K85712
$$ 1240707 1108583 990356 1014649 1170572 1263655 1113324 793175 576876 646711 932423
6191I32423K79661Q2007j48317k13965n7095J22802R1112p8327j05074M3412J00807
$$ 932423 1212084 1294091 1145774 931809 874714 997516 1088628 1010301 905227 948639 1049446
6180A049446k7457r5961K6560J02412l8415j60485l3449J45664J13909K4119J19760
$$ 1049446 1021989 926028 952588 1055000 1016585 856100 822651 968315 1082224 1106343 1226103
6169A226103J98214n7038l97033k91357J66974L11273n7019l42743j11080K48878
$$ 1226103 1424317 1367279 970246 678889 845863 1157136 1100117 757374 646294 895172
6159H95172J96922j28160k32792o0017N9414K0443P310O4561O0717K1652Q2686
$$ 895172 1092094 963934 731142 671125 730539 750982 758292 822853 883570 905222 987908
6148I87908J39321l4008l01197k41608J77875M29183J47321l13815l59288M1391
$$ 987908 1127229 1093221 792024 550416 728291 1157474 1304795 990980 631692 673083
6138F73083L71921K83753m6101k69805k76140j52064K0272J68349J85950N7899
$$ 673083 1045004 1328757 1282656 1012851 736711 584647 604919 773268 959218 1017117
6128A017117o2422n4321k0102r3346j50210J6271K61293J85835k21623m23341
$$ 1017117 954695 900374 880272 786926 636716 652987 914280 1100115 878492 455151
6118D55151q1858L66287L02566j45522l01045K8582L11581J69817r3758r3204
$$ 455151 373293 739580 1042146 896624 595579 624161 935742 1105559 1011801 918597
6108I18597L8000J1181p6828o834Q7844j6629j50150k3944J98597J33725j39074
$$ 918597 956597 967778 890950 884116 971960 955331 805181 781237 979834 1113559 974485
6097I74485j80130N8446J53012n4410j93284q764K25535J84178k7092j34809j12207
$$ 974485 794355 852801 1005813 951403 758119 749355 974890 1159068 1131976 997167 884960
6086H84960o5643J1338J17035J17709k5346j26490p0303j127l4163m1103O9977
$$ 884960 819317 830655 947690 1065399 1040053 913563 843260 842133 807970 766867 836844
6075H36844J35673L2298p7689l9506K4657o866n004R8849P9753j54657k49063
$$ 836844 972517 1004815 927126 887620 912277 905411 900407 999256 1079009 924352 675289
6064F75289M6727L32035J11193l49789l56419J43074M79180K69162j19615k33639
$$ 675289 722016 1054051 1165244 815455 459036 602110 1081290 1350452 1230837 997198
6054I97198j08710L326K7076j2586r8103j16237K7837J51034K0213j78114p4576
$$ 997198 888488 891814 918890 906304 808201 691964 719801 870835 891048 712934 638358
6043F38358J91992J24595k33891k68580J48668L50036q335l03633Q739M25036
$$ 638358 830350 954945 721054 452474 601142 951178 942843 639210 647949 1072985
6033A072985K24390k97079l15476J57332L41972j6069l25423j70403J35209J84984
$$ 1072985 1297375 1000296 684820 842152 1184124 1168055 842632 672229 807438 992422
6023I92422K9604j10669j70841j12986Q8335K29325P1948j94357j51827J47582
$$ 992422 1022026 911357 740516 627530 715865 945190 1017138 822781 670954 818536
6013H18536K12004q2454k84677j26329Q4949O0574k6587J5427K1963j22869j67344
$$ 818536 1030540 948086 663409 537080 622029 682603 656016 671443 693406 570537 403193
6002D03193M7837K21271P5106j55700j19596Q6349J49244N6169j3430n2141j05499
$$ 403193 451030 672301 747407 591707 472111 558460 707704 763873 750443 698302 592803
5991E92803m5396J61862K25150l6740k94182j73442J25529J54743n4804j12807
$$ 592803 547407 709269 934419 897679 603497 430055 555584 710327 655523 542716
5981E42716L9656J04411J0234j3992O6353L3631j15037j18897O3070J58088N2313
$$ 542716 582372 686783 697017 683025 749378 783009 667972 549075 612145 770233 822546
5970H22546m8591k2771q702p1822o0970P3605J45252M6431q1191j01919o0022
$$ 822546 773955 751184 742482 670660 609690 683295 828547 874978 793787 691868 631846
5959F31846k2464J2756J0229o2774r2976K5320J42873O6360o5372O877J62159
$$ 631846 609382 622138 632367 569593 476617 501937 644810 711170 645798 652675 814834
5948H14834P5320j63470j54151Q1631R5685j60311j79508J96907M01770M8289
$$ 814834 890154 726684 572533 654164 749849 589538 410030 606937 1008707 1056996
5938A056996l97489l41500M4205J95823L2004j03324q0535l5683P109R6127J12955
$$ 1056996 659507 318007 362212 558035 590039 486715 406180 370497 377606 473733 586688
5927E86688k6186j24579j8583J04085N0064j5866O5952P8773j27656k13492Q1234
$$ 586688 560502 435923 417340 521425 571489 555623 621575 700348 572692 359200 440434
5916D40434L34483P6408l27651k15215K25030K44349j67869k62146J55960L90860
$$ 440434 774917 851325 523674 308459 533489 777838 609969 347823 503783 894643
5906H94643O6315k74485j59538P0482N79j24602K3473J78925L146k26007q9120
$$ 894643 960958 686473 526935 597417 597996 473394 496867 675792 678938 452931 363811
5895C63811K10700J93936q8903k05345o8323N3827P9578J33004J55231m219k10090
$$ 363811 574511 768447 679544 474199 405876 459703 539281 672285 827516 823297 613207
5884F13207k08278o6845k3562k2604J37536L10106J61759k15929l61392j35166
$$ 613207 404929 338084 314522 291918 429454 739560 901319 685390 323998 188832
5874A88832J10870J19731M2555N7064P6566k541q9066r1624o9415o9589m0133
$$ 188832 299702 419433 461988 519052 595618 593077 504011 412387 342972 273383 233250
5863B33250J4604J4641o079P4120K05741J86092j0555j68654j51898m6462N5588
$$ 233250 247854 262495 256416 330536 536277 722369 711814 543160 391262 344800 400388
5852D00388J54688J83802L6733j75936j89848Q570J33549N1462l3039K9309Q2448
$$ 400388 555076 738878 775611 599675 409827 418397 551946 603408 570369 599678 682126
5841F82126o117q1283k631O7739m5791j88542j19841P8437J41308L7311m9925
$$ 682126 676009 594726 592095 659834 614043 425501 305660 384097 525405 562716 512791
5830E12791o2588j01760j68858j39472J1891J69012K40944K06579N5492j34391
$$ 512791 450203 348443 179585 40113 52004 221016 461960 668539 724031 589640
$$ [...]
##END NTUPLES=NMR SPECTRUM
##END=
