##TITLE=1H ikalashn
K-464-1-1
17.12.2024
##JCAMPDX= 6.0         $$ Bruker NMR JCAMP-DX V2.0
##DATA TYPE= NMR SPECTRUM
##DATA CLASS= NTUPLES
##ORIGIN= UXNMR, Bruker Analytische Messtechnik GmbH
##OWNER= root
$$ TOPSPIN		Version 1.3
$$ 2024-12-17 16:24:25.046 +0400  Irina@DPX200
$$ Compression mode = diff/dup
##.OBSERVE FREQUENCY= 200.131300845
##.OBSERVE NUCLEUS= ^1H
##.ACQUISITION MODE= SIMULTANEOUS
##.ACQUISITION SCHEME= undefined
##.AVERAGES= 32
##.DIGITISER RES= 18
##SPECTROMETER/DATA SYSTEM= spect
##.PULSE SEQUENCE= zg
##.SOLVENT NAME= CDCl3
##.SHIFT REFERENCE= INTERNAL, CDCl3, 1, 17.49637
##AUDIT TRAIL= $$ (NUMBER, WHEN, WHO, WHERE, WHAT)
$$ ##TITLE= Audit trail, TOPSPIN		Version 1.3
$$ ##JCAMPDX= 5.01
$$ ##ORIGIN= Bruker BioSpin GmbH
$$ ##OWNER= Irina
$$ $$ F:/spectra/data/iren/nmr/1H/4/pdata/1/auditp.txt
$$ ##AUDIT TRAIL=  $$ (NUMBER, WHEN, WHO, WHERE, VERSION, WHAT)
(   1,<2024-12-17 16:24:05.171 +0400>,<Irina>,<DPX200>,<TOPSPIN 1.3>,
      <created by zg
	started at 2024-12-17 16:21:52.750 +0400,
	POWCHK disabled, PULCHK disabled
       configuration hash MD5:
       BE 6D 3F 07 2A EA 11 49 91 17 2B D3 AF B3 58 0D
       data hash MD5: 16K
       3F 62 42 C9 98 81 63 C7 C6 F1 70 C1 D6 E6 C1 70>)
(   2,<2024-12-17 16:24:07.718 +0400>,<Irina>,<DPX200>,<TOPSPIN 1.3>,
      <Start of raw data processing
       efp BC_mod = 2 LB = 0.02 FT_mod = 6 PKNL = 1 PHC0 = 133.9762 PHC1 = -4.814351 SI = 32K 
       data hash MD5: 32K
       98 95 CD 41 DE E6 83 D4 AE 5F 3F 65 16 26 B7 4C>)
(   3,<2024-12-17 16:24:09.968 +0400>,<Irina>,<DPX200>,<TOPSPIN 1.3>,
      <apk 
       data hash MD5: 32K
       2B A2 B0 6B F4 30 71 7E 23 6D 88 E6 8B C8 BC 87>)
$$ ##END=
$$ 
$$ $$ hash MD5
$$ $$ 37 77 E3 F6 FF 26 CE B7 E0 51 48 E9 40 FA 32 50
##$RELAX= 
##$RELAX= 
##$RELAX= 
##$RELAX= 
##$RELAX= 
##$RELAX= 
##$RELAX= 
##$RELAX= 
##$RELAX= 
$$ Bruker specific parameters
$$ --------------------------
##$DU= <F:/spectra>
##$EXPNO= 4
##$NAME= <1H>
##$PROCNO= 1
##$TYPE= <nmr>
##$USER= <iren>
##$AMP= (0..31)
100 100 100 100 100 100 100 100 100 100 100 100 100 100 100 100 100 100 
100 100 100 100 100 100 100 100 100 100 100 100 100 100 
##$ANAVPT= -1
##$AQSEQ= 0
##$AQ_mod= 1
##$AUNM= <au_zg>
##$AUTOPOS= <>
##$BF1= 200.13
##$BF2= 200.13
##$BF3= 200.13
##$BF4= 200.13
##$BF5= 200.13
##$BF6= 200.13
##$BF7= 200.13
##$BF8= 200.13
##$BYTORDA= 1
##$CFDGTYP= 0
##$CFRGTYP= 5
##$CHEMSTR= <none>
##$CNST= (0..63)
1 1 145 1 1 1 1 1 1 1 1 1 1 1 1 1 1 1 1 1 1 1 1 1 1 1 1 1 1 1 1 1 1 1 
1 1 1 1 1 1 1 1 1 1 1 1 1 1 1 1 1 1 1 1 1 1 1 1 1 1 1 1 1 1 
##$CPDPRG= <>
##$CPDPRG1= <>
##$CPDPRG2= <>
##$CPDPRG3= <>
##$CPDPRG4= <mlev>
##$CPDPRG5= <mlev>
##$CPDPRG6= <mlev>
##$CPDPRG7= <mlev>
##$CPDPRG8= <mlev>
##$CPDPRGB= <>
##$CPDPRGT= <>
##$D= (0..63)
0 2 0 0 0 0 0 0 0 0.06 0 0.03 0 0 0 0 0.0002 0 0 0 0 0 0 0 0 0 0 0 0 0 
0 0 0 0 0 0 0 0 0 0 0 0 0 0 0 0 0 0 0 0 0 0 0 0 0 0 0 0 0 0 0 0 0 0 
##$DATE= 1734438239
##$DBL= (0..7)
120 120 120 120 120 120 120 120 
##$DBP= (0..7)
$$ [...]
##$SW_h= 4401.40845070422
##$TD= 16384
##$TD0= 1
##$TE= 300
##$TE2= 300
##$TE3= 300
##$TEG= 300
##$TL= (0..7)
0 120 120 120 120 120 120 120 
##$TP= (0..7)
150 150 150 150 150 150 150 150 
##$TP07= 0
##$TPNAME0= <>
##$TPNAME1= <>
##$TPNAME2= <>
##$TPNAME3= <>
##$TPNAME4= <>
##$TPNAME5= <>
##$TPNAME6= <>
##$TPNAME7= <>
##$TPOAL= (0..7)
0.5 0.5 0.5 0.5 0.5 0.5 0.5 0.5 
##$TPOFFS= (0..7)
0 0 0 0 0 0 0 0 
##$TUNHIN= 0
##$TUNHOUT= 0
##$TUNXOUT= 0
##$USERA1= <user>
##$USERA2= <user>
##$USERA3= <user>
##$USERA4= <user>
##$USERA5= <user>
##$V9= 5
##$VALIST= <valist>
##$VCLIST= <CCCCCCCCCCCCCCC>
##$VD= 0
##$VDLIST= <DDDDDDDDDDDDDDD>
##$VPLIST= <PPPPPPPPPPPPPPP>
##$VTLIST= <TTTTTTTTTTTTTTT>
##$WBST= 1024
##$WBSW= 25
##$XGAIN= (0..3)
0 0 0 0 
##$XL= 0
##$YL= 0
##$YMAX_a= 888486
##$YMIN_a= -1419819
##$ZGOPTNS= <>
##$ZL1= 120
##$ZL2= 120
##$ZL3= 120
##$ZL4= 120
##$ABSF1= 0
##$ABSF2= 0
##$ABSG= 0
##$ABSL= 0
##$ALPHA= 0
##$AQORDER= 0
##$ASSFAC= 0
##$ASSFACI= 0
##$ASSFACX= 0
##$ASSWID= 0
##$AUNMP= <proc_1d>
##$AXLEFT= 0
##$AXRIGHT= 0
##$AXTYPE= 0
##$AXUNIT= <>
##$AZFE= 0.1
##$AZFW= 0.1
##$BCFW= 0
##$BC_mod= 2
##$BYTORDP= 0
##$COROFFS= 0
##$CY= 7568.61572265625
##$DATMOD= 1
##$DC= 0
##$DFILT= <>
##$DTYPP= 0
##$F1P= 17.9538593292236
##$F2P= -4.03888763876832
##$FCOR= 0.5
##$FTSIZE= 32768
##$FT_mod= 6
##$GAMMA= 0
##$GB= 0
##$INTBC= 0
##$INTSCL= 5.656564e-011
##$ISEN= 128
##$LB= 0.02
##$LEV0= 0
##$LPBIN= 0
##$MAXI= 945.577
##$MC2= 0
##$MEAN= 0
##$ME_mod= 0
##$MI= -402.1523
##$NCOEF= 0
##$NC_proc= -6
##$NLEV= 6
##$NOISF1= 8.587773
##$NOISF2= 6.764455
##$NSP= 0
##$NTH_PI= 0
##$NZP= 0
##$OFFSET= 17.49637
##$PC= 1
##$PHC0= 262.321
##$PHC1= -6.001184
##$PH_mod= 1
##$PKNL= yes
##$PPARMOD= 0
##$PPDIAG= 0
##$PPIPTYP= 0
##$PPMPNUM= 100
##$PPRESOL= 1
##$PSCAL= 0
##$PSIGN= 0
##$REVERSE= no
##$SF= 200.13
##$SI= 32768
##$SIGF1= 16.12182
##$SIGF2= -4.496377
##$SINO= 3.521527
##$SIOLD= 32768
##$SREGLST= <1H.CDCl3>
##$SSB= 0
##$STSI= 32768
##$STSR= 0
##$SW_p= 4401.40845070422
##$SYMM= 0
##$S_DEV= 0
##$TDeff= 16384
##$TDoff= 0
##$TI= <>
##$TILT= no
##$TM1= 0
##$TM2= 0
##$TOPLEV= 0
##$USERP1= <user>
##$USERP2= <user>
##$USERP3= <user>
##$USERP4= <user>
##$USERP5= <user>
##$WDW= 1
##$XDIM= 32768
##$YMAX_p= 393278881
##$YMIN_p= -3119713
$$ End of Bruker specific parameters
$$ ---------------------------------
##NTUPLES= NMR SPECTRUM
##VAR_NAME=  FREQUENCY,     SPECTRUM/REAL,   SPECTRUM/IMAG
##SYMBOL=    X,             R,               I
##VAR_TYPE=  INDEPENDENT,   DEPENDENT,       DEPENDENT
##VAR_FORM=  AFFN,          ASDF,            ASDF
##VAR_DIM=   32768,         32768,           32768
##UNITS=     HZ,            ARBITRARY UNITS, ARBITRARY UNITS
##FACTOR=    0.134324425510551, 1,           1
##FIRST=     4401.40845070422, -564946,      1192831
##LAST=      0,             -1133743,        1653834
##MIN=       0,             -3119713,        0
##MAX=       4401.40845070422, 393278881,    0
$$ Real data points
##PAGE= N=1
##DATA TABLE= (X++(R..R)), XYDATA
$$ [...]
20941C35202J93648p6585l29424n4057L85951K04142m20455m98668J38351N18911
20931C97016J24707l19048j31045K50541J24979l34321n06292l12124j13028j2571
20921h31186J67530M61207P06575P27246L80710k68994p38374n40917O9011L07757
20911D40565l6717l36080j60094J21892J21891J00070L44463N02748J43219m68592
20901G73365p32970n11701q2155L45523O12680M87399J6998l37439l19001k29740
20891B2959k94594j95290K75632O51596M85759Q9367p2613j78466m88747n59254
20881b63651L4133O58618M27017k81245l34693K57338L29557m21113q11721q5611
20871d91371Q05676O58528k04000n92719k47693O6919n2928j69135P6239L58041
$$ y = [335202, 528850, 452265, 122841, 68784, 454735, 658877, 238422, -260246, -121895, 397016, 521723, 202675, 71630, 322171, 447150, 112829, -393463, -705587, -818615, -831186, -663656, -202449, 504126, 1231372, 1612082, 1343088, 604714, 63797, 132808, 440565, 403848, 67768, -92326, 29566, 151457, 251527, 595990, 1098738, 1241957, 773365, 40395, -471306, -553461, -207938, 404742, 892141, 909139, 571700, 252699, 22959, -271635, -466925, -191293, 460303, 946062, 1035429, 962816, 784350, 295603, -263651, -229518, 429100, 856117, 574872, 240179, 497517, 827074, 405961, -405760, -491371, 314305, 972833, 768833, 176114, -71579, -4660, -57588, -226723, -150484, 207557]
20861B07557K56672m6889l5394L50271N15119l2872q64003r49372M41R27664O76518
20850A005712m09295q71764j04147Q84491R24297J50022m66403m70131k10015
20841D32767j02490j71880k16723p8495J92734L10024Q1312k05618j12173K00540
20831C29998J13218m07865n95370n2854N50280M68829n3499l18247k17462o9646
20821b52618Q9226L12076K82444j60701m42194m3939M92660L04970l59597n20090
20811b97763q1564J05576j90733k07305L68912P66675M28387q5550j00151J33232
20801H39716P6136j30367n1721K18499K76404N5500k43816m80434m56653J4528
20791A17792N68469M56507l04754o88196j41535M75750K26516m04270l70774J95994
$$ y = [207557, 464229, 417340, 381946, 732217, 1247336, 1214464, 350461, -598911, -598470, 329194, 1005712, 596417, -275347, -379494, 504997, 1429294, 1579316, 1112913, 642782, 432767, 330277, 158397, -58326, -136821, 55913, 365937, 447249, 241631, 129458, 329998, 443216, 35351, -560019, -612873, -62593, 406236, 352737, 34490, -182972, -252618, -163392, 148684, 431128, 270427, -171767, -215706, 276954, 581924, 222327, -297763, -379327, -273751, -464484, -671789, -302877, 463798, 892185, 806635, 706484, 839716, 915852, 785485, 733764, 952263, 1228667, 1284167, 1040351, 559917, 103264, 117792, 686261, 1142768, 838014, 149818, 8283, 484033, 710549, 306279, -64495, 131499]
20781A31499L31031o4896j74607K00827L46101q444k32495o07J37883j67076l84567
20770A14649n3064L83655L12415q9181k37150l1150J82153J95251N0771j52248
20760F76101k49327j00682J12210N9210j41605k9266L41147L29254k03066m92868
20750C01108m9056N05188M01723j05624k88120j11256m0929j14127m7256O1081
20740E12732l6789r8277J86364M33851J29071l37393k01858L16043L16063k18767
20730A001040l97802l3350N7683l33480k76397N95756J143311M07838p94291j045623
20720C24685l22762K95723L41306K33577K06053N9301j60808j86780j43283l13370
20710C33642m29823m2580N35887N53924L6972k47854p3181k5535l28218l72203
$$ y = [131499, 462530, 397634, 223027, 423854, 769955, 761511, 529016, 528409, 666292, 499216, 114649, 61585, 445240, 757655, 668474, 431324, 400174, 582327, 777578, 828349, 676101, 426774, 326092, 438302, 497512, 355907, 326641, 667788, 997042, 793976, 301108, 252052, 757240, 1158963, 1053339, 765219, 653963, 613034, 498907, 451651, 512732, 475943, 377666, 564030, 997881, 1126952, 789559, 587701, 903744, 1219807, 1001040, 603238, 569888, 627571, 294091, 17694, 613450, 1756761, 2164599, 1370308, 324685, 1923, 297646, 638952, 872529, 1078582, 1137883, 977075, 790295, 647012, 333642, -96181, -138761, 397126, 951050, 988022, 740168, 666987, 641452, 313234, -58969]
20700e8969J90819P29385N31426j86774o63722n38291l2056M24116M67024P8771
20690I41729k55422r6784K18209K9717m60663l68739L20097M98636k41208p11425
20680a25853L6038J025721P81312l26391o65589R0018N81249J2512p26509o25979
20670E6529J3110L69684L57719L48570L33257Q9823k61274m47167m40234k68539
20660A51478J42766N81541N32176j2238k92272J13674N08770J18182o01102n99049
20650F43926J27144N38645J52011l53572l11276K7725J27910o21o4698n2097p5090
20639G60007n1419N0206M079k49095l34765j4173L37146K91003N7632N8648J39584
20628A048853r1058l79027j38770M15641M27818j45305k77718M62239J020253
$$ y = [-58969, 131850, 861235, 1392661, 1205887, 542165, 3874, -28182, 395934, 862958, 941729, 686307, 589523, 807732, 837449, 376786, 8047, 328144, 826780, 585572, -125853, -89815, 935906, 1717218, 1390827, 725238, 815256, 1396505, 1409017, 682508, 56529, 69639, 439323, 797042, 1145612, 1478869, 1568692, 1307418, 860251, 420017, 151478, 294244, 875785, 1407961, 1395723, 1103451, 1217125, 1725895, 1844077, 1242975, 643926, 771070, 1309715, 1461726, 1108154, 796878, 824603, 952513, 951892, 887194, 835097, 760007, 708588, 758794, 762873, 513778, 179013, 164840, 501986, 792989, 850621, 909269, 1048853, 957795, 578768, 439998, 855639, 1283457, 1138152, 860434, 1322673, 2342926]
20619B342926M32337n82861p10722r1181N5399m55283n33527K00992P09210L08887
20609A676177k20096j04795Q5406l48275p37988j35034Q42216P87989k26542p35419
20599H83639j79742L98736K01307k28646k42961j42444l01300l13122J81151O55446
20589I12064M88488p9297m75584o28245o14107j95337N53645Q70708L85199j19723
20579A097811P4541L71894p0690p11562m37046M49031O07886r9835l96349J81087
20569A066768M48855l83525j238371p36880P05057J449220Q19546k48740n94776
20560A287154j46501K42087p8696p32952p25145K24769J101187Q48767j28686
20551A891984n50603j44630J34726j73079l40975J10954M96376J88599k63776
$$ y = [2342926, 2775263, 2192402, 1481680, 1390499, 1445898, 990615, 457088, 658080, 1367290, 1676177, 1456081, 1351286, 1436692, 1088417, 350429, 215395, 1057611, 1845600, 1619058, 883639, 703897, 1102633, 1303940, 1075294, 832333, 689889, 388589, 75467, 256618, 912064, 1400552, 1321255, 845671, 217426, -396681, -592018, -38373, 832335, 1217534, 1097811, 1172352, 1544246, 1473556, 761994, 324948, 773979, 1381865, 1282030, 885681, 1066768, 1515623, 1132098, -106273, -843153, -138096, 1311124, 2130670, 1881930, 1287154, 1140653, 1382740, 1304044, 571092, -154053, 70716, 1171903, 2020670, 1891984, 1341381, 1196751, 1331477, 1158398, 817423, 928377, 1424753, 1613352, 1349576]
20542A349576j17497L04363K61024j66925m02529l68109k88197n4298L50078L86912
20532A254398j37389l52885L83337J094250M51502r74856j305671j31835Q88067
20523A168918N11384m65927o78250q5103M07608L84091J58521N7432R6416J28725
20513A683815o317k64094l01047K0511J94750k24974o86022l16042N48919O66505
20503A316004j49722o54358j62566M04862J74020k47017N928M70547K56024k66694
20493A147028o6735O93658P98324j14476r99250r21504j80102L46933K90240m0547
20483I53569j53196J05205L40510P6830m38074l90577L15857O56688J867p30810
20473G37869m07470M91488O22783o6918l81911N7965L18089q0858l70497k1965
$$ y = [1349576, 1232079, 1536442, 1797466, 1630541, 1228012, 859903, 571706, 517408, 867486, 1254398, 1117009, 764124, 1147461, 2241711, 2693213, 1718357, 412686, 280851, 1168918, 1680302, 1214375, 536125, 451022, 858630, 1242721, 1401242, 1458674, 1555090, 1683815, 1677498, 1413404, 1112357, 1132868, 1327618, 1102644, 416622, 100580, 649499, 1316004, 1166282, 511924, 349358, 754220, 928240, 681223, 687151, 1157698, 1413722, 1147028, 1080293, 1773951, 2572275, 2457799, 1458549, 537045, 356943, 703876, 994116, 953569, 800373, 905578, 1246088, 1322918, 884844, 494267, 810124, 1466812, 1468679, 737869, 330399, 821887, 1444670, 1377752, 995841, 1053806, 1371895, 1291037, 920540, 898575]
20463H98575K91220n6030n29096m11168J2357J25122O8158K29413K96859j53431
20453G71979n94110j79241P67639R95439J37873o92412m69757L42482N28237j57622
20443A450507o85383k17179O76065P42139j79599q17779k32118P52438O80870
20434B169961l63212q65820j82171N39720K25279n07978m83658J86224N07431
20425A225776K69890R8342J33970j11336n99607o16902m930M50461K30611j56616
20415I19659q5325K35402K68217N2377j1468Q0491m76k67379l65404j40491J44328
20404H29931K01382M2482j37202j82825l3241K64279M90394L39498k46902q38215
20394G29581q21424j17640N57907M54740k34465n56677o5132N66548N12014n8551
$$ y = [898575, 1189795, 1133765, 604669, 193501, 205858, 330980, 399138, 628551, 925410, 771979, 177869, -1372, 766267, 1761706, 1899579, 1207167, 737410, 1079892, 1608129, 1450507, 765124, 547945, 1224010, 1966149, 1786550, 968771, 736653, 1489091, 2169961, 1806749, 940929, 758758, 1298478, 1523757, 1015779, 532121, 718345, 1225776, 1495666, 1594008, 1727978, 1616642, 1017035, 400133, 395203, 845664, 1076275, 919659, 834334, 1069736, 1337953, 1390330, 1378862, 1459353, 1458877, 1191498, 826094, 685603, 829931, 1031313, 1073795, 936593, 753768, 720527, 984806, 1475200, 1814698, 1567796, 729581, -91843, -209483, 348424, 803164, 568699, 12022, -53110, 513438, 1025452, 966901]
20384I66901l21523j8803L13270K81158J43513K04330K36405j27039p12142q90221
20374G5849l23918N59655R32576M44721l19845m80945K5489L66738L7930l61594
20364I56656q3615N04901M18246l96000r19757n53462J29425L82369K50882J26887
20354H16532K1108j82951k59717P370L48860L77124J60441R915l8094j20851j81958
20343I57779j02749J7947P2217J94218M48214N26435J64975l52383n19112k77466
20333A130075P22N2869q5107k66083l10353q3615K48902L05121N8308n7789R7508
20322A090558N1499l88141n50055N4052O76191L36350n10169n29414L80291Q74478
20312A485640K91163l48560p8343M63141J74753o76132r12659k82803L02429K50926
$$ y = [966901, 645378, 626575, 939845, 1221003, 1364516, 1568846, 1805251, 1678212, 966070, 75849, -248069, 311586, 1244162, 1688883, 1369038, 888093, 913582, 1280320, 1318250, 956656, 873041, 1377942, 1796188, 1400188, 480431, -73031, 56394, 438763, 689645, 816532, 837640, 654689, 394972, 402342, 751202, 1128326, 1288767, 1298682, 1260588, 1139737, 957779, 855030, 872977, 945194, 1139412, 1587626, 2114061, 2279036, 1926653, 1407541, 1130075, 1130797, 1183666, 1098559, 832476, 522123, 438508, 687410, 992531, 1050839, 993050, 1090558, 1142057, 753916, 203861, 257913, 934104, 1270454, 760285, 230871, 611162, 1485640, 1776803, 1428243, 1349900, 1813041, 1987794, 1311662, 399003, 116200, 418629, 669555]
20302F69555j0361K7547J57650k9204l90749m48887r6550K92627L93524K94127
20292H59279K63863L16271J98345j50310l63670j28744K56635K22622j91529l18674
20282I64088J06085M62773J86232l16073k90574J53890K11738l34144p64221n21884
20272a42090J8778K33641J50332J75015K92007J45191k10068k53743J78169N34275
20262A121507L17915j50937j95259J80050K70046k27842o55159l12391M62948
20253H10878P15002K07919l13487k89817j00875k81332n45194k40372M94156P75928
20243A232806K47209l68987k88623K65211M91622J94483o8994L4586J28239j46445
20233A721107m50857k82742J49325K12754j07170j64036K38640M43821K7528m14692
$$ y = [669555, 659194, 686741, 844391, 815187, 424438, -24449, -120999, 171628, 565152, 859279, 1123142, 1439413, 1637758, 1487448, 1123778, 995034, 1251669, 1474291, 1282762, 964088, 1070173, 1532946, 1719178, 1403105, 1112531, 1266421, 1478159, 1144015, 379794, -142090, -123312, 110329, 260661, 435676, 727683, 872874, 662806, 409063, 587232, 1121507, 1439422, 1288485, 1093226, 1273276, 1543322, 1315480, 660321, 347930, 810878, 1525880, 1733799, 1420312, 1130495, 1029620, 748288, 203094, -37278, 456878, 1232806, 1480015, 1111028, 822405, 1087616, 1579238, 1773721, 1704727, 1739313, 1867552, 1721107, 1270250, 987508, 1136833, 1349587, 1242417, 1078381, 1317021, 1760842, 1788370, 1373678]
20223A373678k11017K29795Q4867m21441k95455N38372R70778M13438l03914l01521
20213B077580L8948o4323l92198k13632L00389K83700l43987o84748k81468K33112
20203I53373K42083P7522L13396P22646O16137m7388n31420l19630K27060L98425
20193B652204M4293l27157k96569o2386m6675k12768j56769J82698L76614J86372
20183B339857p5851j09884q9334k03352j81420K29487O66619N98574J22069k51575
20173C045190l82286m72010m49981p6208M24727N20685J74423j27325j50701j11650
20163B394864j05729J4753J73249J18609m6757l0342K4081j79080k94226K09840
20153B279262Q37297M97196o59878j147047l55980M63864K00071m26604k28957
$$ y = [1373678, 1162661, 1392456, 1477323, 1055882, 760427, 1298799, 2269577, 2683015, 2379101, 2077580, 2116528, 2052205, 1660007, 1446375, 1746764, 2030464, 1686477, 1001729, 720261, 953373, 1195456, 1272978, 1586374, 2309020, 2925157, 2877769, 2346349, 2026719, 2253779, 2652204, 2696497, 2369340, 2072771, 2010385, 1963710, 1750942, 1594173, 1776871, 2153485, 2339857, 2264006, 2154122, 2064788, 1861436, 1680016, 1909503, 2576122, 3174696, 3296765, 3045190, 2662904, 2190894, 1740913, 1664705, 2089432, 2610117, 2784540, 2657215, 2506514, 2394864, 2289135, 2303888, 2477137, 2595746, 2548989, 2518647, 2542728, 2363648, 2069422, 2279262, 3116559, 3613755, 2953877, 1806830, 1450850, 1914714, 2114785, 1688181, 1459224]
20144A459224M78895N98245J34675m2114J79122J63277j19287q9116J99022O4511
20134C026454n00525o80160j41460M84119O01293K94859j36060n01803n33488
20125A913229j41835J56878j34970n64691l34139L20152M51689K5589n9864L48791
20115A980829L66429k31908m63676J33926O06700K00787l82468k91989M9512r2921
20105A875221l73290j22931L15471K49756l7782J07898L54871m0231p13046o41092
20095I74845J02429M33554P3013q5629L80953O88519J91798n66794p18233k39049
20085A235406K50890L41794R2895j84515j78061Q2485J26113l20165p29931l97114
20075C19797M57492Q97635N48565o6136m36635n15446k53808L93156Q74702M34000
$$ y = [1459224, 1938119, 2536364, 2671039, 2628925, 2808047, 2971324, 2852037, 2762921, 2961943, 3026454, 2525929, 1845769, 1704309, 2188428, 2789721, 3084580, 2948520, 2446717, 1913229, 1771394, 1928272, 1793302, 1228611, 894472, 1214624, 1666313, 1691902, 1632038, 1980829, 2347258, 2115350, 1651674, 1785600, 2392300, 2593087, 2210619, 1918630, 1968142, 1875221, 1501931, 1379000, 1694471, 1944227, 1906445, 2014343, 2369214, 2328983, 1615937, 974845, 1077274, 1510828, 1583841, 1498212, 1879165, 2567684, 2759482, 2192688, 1474455, 1235406, 1486296, 1828090, 1920985, 1736470, 1558409, 1640894, 1767007, 1446842, 716911, 319797, 777289, 1674924, 2223489, 2157353, 1720718, 1205272, 951464, 1344620, 2219322, 2653322]
20065B653322o26993j019651k06972Q19283R64068L65664k28821n57459o41194
20056A521247k85546M12640P08058J90472m09786k32593L76395M30875j70700
20047B541062o19164m80557j16913R5386J69477J34224o0246k42581j77713K4479
20037A267454J33838K41463M45623L97825j44622o04179k75778M54265N42524
20028B458413j08017n00039j08794M30786M68922J84364r4024m46363p53266m78907
20018A053075K98794N54289j74710p86841j65888R55172R56478k13843r51391
20009A525135l89393M82616N03834l6849j93602R9750K03995j9926j10340P3563
19999B138783J49650l9692j55917R089J80942R3807j03407j70291j32312o3439
$$ y = [2653322, 2026329, 1006678, 799706, 1618989, 2583057, 2948721, 2719900, 2162441, 1521247, 1235701, 1648341, 2356399, 2546871, 2137085, 1904492, 2280887, 2711762, 2541062, 1921898, 1441341, 1324428, 1419814, 1589291, 1723515, 1663269, 1420688, 1242975, 1267454, 1401292, 1642755, 2088378, 2486203, 2341581, 1737402, 1461624, 1915889, 2458413, 2350396, 1850357, 1741563, 2172349, 2641271, 2825635, 2731611, 2285248, 1531982, 1053075, 1351869, 1906158, 1731448, 944607, 778719, 1733891, 2690369, 2476526, 1525135, 1135742, 1618358, 2122192, 2085343, 1891741, 1991491, 2195486, 2175560, 2065220, 2138783, 2288433, 2248741, 2092824, 2101913, 2282855, 2376662, 2273255, 2102964, 1970652, 1907213]
19989A907213J31925M11824M07264n9364n29204m47021L0771K72754J04564o0123
19979B170603J387L6353p1449l7866K15272K80045m2120k92693n6765L45961L82551
19968B931279J27271K150K5681p3711k31238j42884J55067L39361K93778R2858
19958C519612k64296o21650n28123O9724M33783R1831k14238L43629J083057P04715
19948D618044m77735q30195N46N51352O2290l07409L15723Q45732J22778r69571
19938C931555r06970L0593M46805J70084J20859L78405J96661l23839l26796J50135
19928C867492K78858J09506M10105Q63745L41822q16871q70074M24749J083474
19919E692806M7739r75514k69236J081522J000577k73217p93794o0510N41104
$$ y = [1907213, 2039138, 2450962, 2858226, 2798862, 2269658, 1822637, 1853408, 2126162, 2230726, 2170603, 2171990, 2208343, 2136894, 2099028, 2314300, 2594345, 2552225, 2259532, 2202767, 2548728, 2931279, 3058550, 3060700, 3086381, 3012670, 2781432, 2638548, 2793615, 3132976, 3426754, 3519612, 3255316, 2633666, 2105543, 2175267, 2609050, 2700881, 2486643, 2830272, 3913329, 4618044, 4140309, 3310114, 3310660, 3862012, 3924302, 3616893, 3932616, 4778348, 4901126, 3931555, 3024585, 3055178, 3501983, 3672067, 3792926, 4171331, 4367992, 4044153, 3717357, 3867492, 4146350, 4255856, 4665961, 5529706, 5871528, 5054657, 4184583, 4609332, 5692806, 5740545, 4765031, 4495795, 5577317, 6577894, 6304677, 5510883, 5450373, 5991477]
19910E991477K07410k84878k02000J07932J70920J64214L27584M89756M71767
19901G444182K78338j69548p99026r94566k89678O57333P39472J7707l69287L4207
19891F549134M35500K11976j96745k24424m7117j5675j2432J38041K74148K91036
19881G403442L02435J81393l00083o88222j84226R09290J194419J84494q32702
19872H170240p00708l1798O5693j76521O8046M93496K19838m37644l62639L99993
19862G707996O44966K1571m46727j28112L16488K44264p553l6854j23252m01148
19852G791639l23184K88032N89671o276p18650n27188K49774N51479K31310N003
19842H131610Q5142K5550k03203j19926K33247K34709j55861k11091K76352N28840
$$ y = [5991477, 6198887, 5914009, 5712009, 5819941, 5990861, 6155075, 6482659, 6972415, 7444182, 7722520, 7552972, 6753946, 5759380, 5469702, 6127035, 6866507, 6884214, 6514927, 6549134, 6984634, 7196610, 6999865, 6775441, 6728324, 6712649, 6700217, 6838258, 7112406, 7403442, 7705877, 7887270, 7587187, 6898965, 6714739, 7624029, 8818448, 9002942, 8170240, 7469532, 7437734, 7503427, 7326906, 7394952, 7888448, 8108286, 7670642, 7308003, 7707996, 8352962, 8374533, 7927806, 7799694, 8116182, 8360446, 8352893, 8316039, 8192787, 7791639, 7468455, 7756487, 8346158, 8339882, 7621232, 7094044, 7343818, 7895297, 8126607, 8131610, 8216752, 8242302, 8039099, 7919173, 8152420, 8387129, 8231268, 8020177, 8296529, 8825369]
19832H825369R6747l12218p619M99084L55784k14396l54196r464J41309k6222
19822H994178J3872K65634J09652m15141m17931K86673O14333k1580n13930K08376
19812I124136J201303Q18207n61005r68292L3030O63646q9207p66288P7641J327022
19802A0860193J016009m81736j024927k7957Q63044N26433j60409j78071M0047
19793A1432626j69187l01652K55464Q16424M13287m70676n72828J37773N00131
19784A2041362Q8739k49089M5084L85235K02404p5018J29600M77356K86955k86076
19774A3046552m39151O0963N32992L43257k60847n15538j29981L45612K13378
19765A3197237m27145p02559r4962P44019P52572r3919p09002l92723K56452L31386
$$ y = [8825369, 8922116, 8609898, 8602279, 9101363, 9457147, 9242751, 8888555, 8879091, 9020400, 8994178, 9008050, 9273684, 9383336, 8968195, 8550264, 8836937, 9451270, 9429690, 8915760, 9124136, 10325439, 11143646, 10582641, 9614349, 9647379, 10311025, 10221818, 9455530, 9533171, 10860193, 11876202, 11394466, 10369539, 10341582, 11204626, 11731059, 11570650, 11392579, 11432626, 11263439, 10961787, 11217251, 12033675, 12446962, 11976286, 11403458, 11541231, 12041362, 12130101, 11881012, 11926096, 12311331, 12513735, 12438717, 12568317, 13045673, 13332628, 13046552, 12607401, 12668364, 13201356, 13544613, 13283766, 12768228, 12638247, 12983859, 13197237, 12770092, 12067533, 11972571, 12716590, 13469162, 13375243, 12666241, 12273518, 12529970, 12861356]
19755A2861356o1502j50447J76195K56341j27368k87413K40289Q10286N51655
19746A4269392k85767o44303j84706L11557K08935j05614m9634J26866j41876
19737A3504850o19483n46777R0804M79571K69675O2782K89082M54592O6151m36612
19727A3614635m26289j83736l52708o92739l92798N07085J033406P19817J87053
19718A4013726K2542m2102l89564o92010m37252J88380N28214L14183j36859l97811
19708A2971447k83911R5178M10098M08691K31319J71946J43417j49632m80061
19699A3518492k13639O18580J080885N84104k74518o21821m25925j19088K43284
19690A4390354O84066P32171O8351o42132n12816K23003N77955L19559J07023
$$ y = [12861356, 12799854, 12649407, 12825602, 13081943, 12954575, 12667162, 12907451, 13717737, 14269392, 13983625, 13339322, 13154616, 13466173, 13675108, 13569494, 13519860, 13646726, 13504850, 12885367, 12338590, 12429394, 12908965, 13178640, 13241422, 13530504, 13985096, 14051247, 13614635, 13188346, 13004610, 12651902, 11959163, 11566365, 12073450, 13106856, 13826673, 14013726, 14036268, 13994166, 13604602, 12912592, 12475340, 12663720, 13191934, 13506117, 13369258, 12971447, 12687536, 12782714, 13192812, 13601503, 13832822, 14004768, 14148185, 13998553, 13518492, 13304853, 13923433, 15004318, 15588422, 15313904, 14692083, 14266158, 14147070, 14390354, 15074420, 15806591, 15874942, 15232810, 14719994, 14942997, 15520952, 15840511, 15947534]
19681A5947534K12265J83593j15119j82387J37949L06495P5301m9058K55190N35692
19671A7307455L92433J43326J34842Q7392k65095m97134j31076N17060P91545
19662A8480748O25736M04892K37093j3780k16602r7498K62634N32414N89630M96326
19652B1301593K42381q6265j38627K56778O89096O35100J53133k63476l23731
19643B2465982r3550K41972M45345L28868P7356J22479M40637M70943M6817k26639
19633B4320210L1961L39569K92439L26623P43171Q61378K10311l06806K01350
19624B7020206Q59499L47804o46144l56882R61194J229065M6199n21877N53848
19615B9492912J482944P67923k11943K97890J272125P23504o81926o12400R91650
$$ y = [15947534, 16159799, 16343392, 16228273, 16045886, 16183835, 16490330, 16565631, 16516573, 16771763, 17307455, 17699888, 17843214, 17978056, 18065448, 17800353, 17303219, 17172143, 17689203, 18480748, 19106484, 19511376, 19748469, 19734689, 19518087, 19420589, 19683223, 20215637, 20805267, 21301593, 21543974, 21457709, 21319082, 21575860, 22264956, 22900056, 23053189, 22789713, 22465982, 22372432, 22614404, 23059749, 23388617, 23465973, 23588452, 24029089, 24500032, 24546849, 24320210, 24352171, 24691740, 24984179, 25310802, 26053973, 26915351, 27125662, 26818856, 27020206, 27879705, 28227509, 27581365, 27224483, 28185677, 29414742, 29460941, 28939064, 29492912, 30975856, 31743779, 31531836, 31829726, 33101851, 33825355, 33143429, 32531029, 33522679]
19606C3522679J800240R02391M4691N16207J215483Q57481J04375J44924O64190
19597C9772661O92062L95108N66808J043558J005965M70321K67219O86798J147276
19588D6047776J194631J031709R94262J098921J190331J160078J032196J034659
19580E4784563J367469J728656J518669Q18954N80510J310599K158209K055841
19572F6323470J288744R96268J421406J736384J565895J546117K070213K496056
19564G9444553K193538J626202J651404K208786K482214K176432J887107K112199
19556I5782435K508445K466054K058012J947551K410507K907408K835983K362017
19548A15278412K104846K211961K308106K323330K662723L323786L585520L089926
$$ y = [33522679, 35322919, 36225310, 36270001, 36786208, 38001691, 38859172, 38963547, 39108471, 39772661, 40464723, 40859831, 41426639, 42470197, 43476162, 43946483, 44213702, 44900500, 46047776, 47242407, 48274116, 49268378, 50367299, 51557630, 52717708, 53749904, 54784563, 56152032, 57880688, 59399357, 60218311, 60798821, 62109420, 64267629, 66323470, 67612214, 68608482, 70029888, 71766272, 73332167, 74878284, 76948497, 79444553, 81638091, 83264293, 84915697, 87124483, 89606697, 91783129, 93670236, 95782435, 98290880, 100756934, 102814946, 104762497, 107173004, 110080412, 112916395, 115278412, 117383258, 119595219, 121903325, 124226655, 126889378, 130213164, 133798684, 136888610]
19540A36888610K583193K856821L495932L610980L406338L835458M806589N084843
19532A66568764M304536L779912M578833N844033O034383N105117M329096M358125
19524B04902799M596522M392211L808896L096976K289201J584315J403280J722930
19516B27797130J916902J588956J085453Q56653P66875M44882m2018l38039m25794
19507B33651000o47586j135125j576748j632311j374105j210758j425949j834234
19499B22814184j932378j440290o20276O3428N01164R21821J394496J690586J684438
19490B25077173J533922J346394J024142O08856L88328L96085J93408m77528j177977
19481B28912803j391455j357169j664528k192482k217342j656351j430210k218467
$$ y = [136888610, 139471803, 142328624, 145824556, 149435536, 152841874, 156677332, 161483921, 166568764, 170873300, 174653212, 179232045, 185076078, 191110461, 196215578, 200544674, 204902799, 209499321, 213891532, 217700428, 220797404, 223086605, 224670920, 226074200, 227797130, 229714032, 231302988, 232388441, 233245094, 234011969, 234456851, 234414833, 234076794, 233651000, 233003414, 231868289, 230291541, 228659230, 227285125, 226074367, 224648418, 222814184, 220881806, 219441516, 218821240, 218884668, 219385832, 220307653, 221702149, 223392735, 225077173, 226611095, 227957489, 228981631, 229590487, 229978815, 230374900, 230568308, 230090780, 228912803, 227521348, 226164179, 224499651, 222307169, 220089827, 218433476, 217003266, 214784799]
19473B14784799l450927m056682l833361l528083l777735m486805n156766n376896
19465A81117544n036647m455886m249150m648428n039468m673925l791844l374859
19457A45847337l673404l769814l021107k175441k294814l085594l270581k448143
19449A22108439j591370j567575k049424k248205k010750j722791j651450j829369
19441A07437505k163954k298108j838986j088138r53351j643622k123777j588807
19433I3738762q20930j059560k002911k209128j337264o26713r35759j585208
19425H3161289j640252j228688r38347q44692q45800j139410j631287j638395
19417G3254418r53177m46090p68210j237856j010111n61867p65754j168591p29136
$$ y = [214784799, 211333872, 207277190, 203443829, 199915746, 196138011, 191651206, 186494440, 181117544, 176080897, 171625011, 167375861, 162727433, 157687965, 153014040, 149222196, 145847337, 142173933, 138404119, 135383012, 133207571, 130912757, 127827163, 124556582, 122108439, 120517069, 118949494, 116900070, 114651865, 112641115, 110918324, 109266874, 107437505, 105273551, 102975443, 101136457, 100048319, 99094968, 97451346, 95327569, 93738762, 92917832, 91858272, 89855361, 87646233, 86308969, 85682256, 84746497, 83161289, 81521037, 80292349, 79354002, 78509310, 77663510, 76524100, 74892813, 73254418, 72301241, 71855151, 71086941, 69849085, 68838974, 68277107, 67511353, 66342762, 65613626]
19408F5613626J26324q6323j430284k187398j373779j04088J80557m37838r99494
19399E9301303j075507p91825l62320k37546q25991j547508j239449p5122K57960
19390E3403995q41028j600501n50176R14905N45542j170591j705321m08791O34472
19381D9222506m6069j263984j305823l81499J72821n7908m56692n70436m71854
19372D4841062l64790m36086p12914p82307k40689M15077K11287p27172j082018
19363D1121450k98339M92294K29537m94626n87386k16154k23001n18794l84997
19354C9119984O9673O3134m48023o98793m10783j14398j61343l30916m36859n00658
19344C6151018l55014J19447M51387J18461m87704n57319j98144k15941o11837
$$ y = [65613626, 65739950, 65653627, 64223343, 62035945, 60662166, 60558078, 60738635, 60300797, 59301303, 58225796, 57433971, 57071651, 56834105, 56008114, 54460606, 53221157, 53146035, 53403995, 52562967, 50962466, 50412290, 51327195, 51872737, 50702146, 48996825, 48588034, 49222506, 49176437, 47912453, 46606630, 46225131, 46397952, 46340044, 45883352, 45312916, 44841062, 44476272, 44040186, 43327272, 42544965, 42304276, 42719353, 42930640, 42203468, 41121450, 40823111, 41315405, 41544942, 41050316, 40462930, 40246776, 40023775, 39504981, 39119984, 39189657, 39252791, 38804768, 38105975, 37695192, 37580794, 37419451, 37088535, 36651676, 36151018, 35796004, 35915451, 36366838, 36485299, 35997595, 35440276, 35242132, 35026191, 34414354]
19335C4414354n27663J42452L84953k41907p77046m09192K07575P7243n36490
19326C2734279o40024j02537K78205N4664l79460n37017m39976l96726n37036
19317C0034372o37009l46113K77742N69115K6668q02977q98315k49667J09430
19308B8083246k32648m17528J56182P18042L58911n12527r14537p56184n33428
19299B5949529k43794K53011L95214k64524q71154l26455P63641P68351m06009
19290B6017810j107599n47098P6309l08293r50579o93650J47041M93220K26760
19281B3353921K5370O2736j0759j59896m9116J86073J29756j23054j68907j35124
19271B3111000m91844j067918j071353k43696O59813P90310J67545m83699n64636
$$ y = [34414354, 33886691, 34029143, 34414096, 34172189, 33395143, 32985951, 33193526, 33270769, 32734279, 32094255, 31991718, 32269923, 32324587, 31945127, 31408110, 30968134, 30571408, 30034372, 29397363, 29051250, 29328992, 29898107, 29924775, 29121798, 28223483, 27973816, 28083246, 27850598, 27433070, 27589252, 28307294, 28666205, 28153678, 27239141, 26482957, 25949529, 25705735, 25958746, 26353960, 26089436, 25218282, 24891827, 25655468, 26423819, 26017810, 24910211, 24363113, 24439422, 24131129, 23180550, 22486900, 22633941, 23127161, 23353921, 23379291, 23442027, 23431268, 23271372, 23222256, 23408329, 23538085, 23415031, 23246124, 23111000, 22619156, 21551238, 20479885, 20236189, 20896002, 21686312, 21853857, 21370158, 20805522]
19262B0805522j28381K54197J21279l19909m28906k6432L02759O0179m31339n66726
19252A9642243l36306j18468M5430L00105L87471n841m75213l28587K39956L12947
19242A9663737k96776o99651l49868J13934j2396l56492j98468K63921K66960
19233A8394901k24269m63418j11862K98712K31181j40605l23130j80442M6059
19224A7527127J23655J0554j81982k58435r4109J83082K81810Q3747k22384l83435
19214A7069630l24661j12453J44758K53516j7334o19612j047489p80897J7628
19205A4583086N35925K64309l12490l42047K03682M92947P9987m30553l52513
19196A4722333M451r7905n34316m65950K63573P88585N12526p6512k92850k33712
$$ y = [20805522, 20677141, 20931338, 21052617, 20732708, 20303802, 20277370, 20580129, 20640308, 20208969, 19642243, 19305937, 19187469, 19232899, 19533004, 19920475, 19914634, 19439421, 19110834, 19350790, 19663737, 19366961, 18667310, 18317442, 18431376, 18418980, 18062488, 17864020, 18127941, 18394901, 18170632, 17707214, 17595352, 17894064, 18125245, 17984640, 17661510, 17481068, 17527127, 17650782, 17661336, 17479354, 17220919, 17126810, 17309892, 17591702, 17675449, 17453065, 17069630, 16744969, 16632516, 16777274, 17030790, 17013456, 16393844, 15346355, 14565458, 14583086, 15119011, 15383320, 15070830, 14728783, 14932465, 15425412, 15505399, 15074846, 14722333, 14726784, 14628879, 14094563, 13628613, 13892186, 14680771, 15193297, 15116785, 14823935, 14590223]
19186A4590223l14968m38110l06312j19016k20070l80716j76048J74717J20024
19177A2929724k48252l44372j08488m831k9180K99162Q14925O44826l28782r66703
19167A2658029m84924L22753L04759l41392n75872k04970M3978j17592k08023
19158A1396746R81J27719l544o6908K7562q8766m44819m79203L1814M87321L54314
19147A1343217n4047j78691n5140k4099o5370J7002J16081O4968J9223Q7016l8579
19136A1231581m97617p17763j78021O00880O74029R5415k02205P6822J96816k71855
19126A1008082o95428m38474J18663K67013Q1945J25310M03936L66339j73138
19117A1064248p18438p48722k87759K33203M14474J90589j10614o6070L35869
$$ y = [14590223, 14275255, 13837145, 13530833, 13411817, 13191747, 12811031, 12634983, 12809700, 12929724, 12681472, 12337100, 12228612, 12223781, 12194601, 12493763, 13308688, 13953514, 13624732, 12658029, 12173105, 12495858, 12800617, 12459225, 11883353, 11678383, 11722361, 11604769, 11396746, 11397727, 11525446, 11521902, 11454994, 11482556, 11393790, 10948971, 10469768, 10501582, 10988903, 11343217, 11289170, 11110479, 11055339, 11031240, 10965870, 10982872, 11098953, 11163921, 11183144, 11270160, 11231581, 10733964, 10016201, 9838180, 10439060, 11113089, 11208504, 11006299, 11083121, 11279937, 11008082, 10312654, 9874180, 9992843, 10259856, 10341801, 10467111, 10871047, 11237386, 11064248, 10345810, 9597088, 9309329, 9542532, 9957006, 10147595, 10036981, 9970911, 10306780]
19108A0306780O17159L98720j16081m47860m26587k18350L3593K75158L72313
19099A0794845J97697j41906l82599l67712j14860K30669L85127J23240l14383
19090A0410118l24286K38905O66816K71931n82026q70573k43129N67556P15460
19081A0850772J73740m14522m89561o6147L37408K55059j33418j63137L71918
19072A0722112P99016M90038j85869m46467l08461l98395p10448n24023L07720
19063I745223R20886O51092r0692n69430o61091n68815k56858K51379N28230L00836
19053A0250760l8812l4168J09514k2167k35326m2874M16040M73432n9235n61317
19043A0255847m09658K58803P31300M97913k01579o00587k94731J83644M9772
$$ y = [10306780, 10923939, 11322659, 11206578, 10758718, 10332131, 10113781, 10147374, 10422532, 10794845, 10992542, 10850636, 10468037, 10100325, 9985465, 10216134, 10601261, 10724501, 10410118, 10085832, 10324737, 10991553, 11263484, 10681458, 9810885, 9567756, 10135312, 10850772, 11024512, 10609990, 10120429, 10054282, 10391690, 10646749, 10513331, 10350194, 10722112, 11521128, 12011166, 11825297, 11378830, 11070369, 10671974, 9961526, 9437503, 9745223, 10666109, 11317201, 11226509, 10657079, 9995988, 9427173, 9170315, 9421694, 9949924, 10250760, 10211948, 10177780, 10287294, 10265127, 10029801, 9986927, 10402967, 10876399, 10817164, 10255847, 9846189, 10104992, 10836292, 11334205, 11132626, 10532039, 10237308, 10420952, 10470724]
19034A0470724n34512n82913K35661R88623P67900j04513p14825p67602n12126
19025I246417o4879M36170N30601R4072j99328J04119L39920j67427p33211l35132
19015I251322N02061M15015m52761n88219L06589P46712k352o69653j91644M97964
19005I815034J97134m46375j58068O35602N02140n27016r94291l97185J78335
18996H805310L7163q3476M39328Q40788K16935q06633q13632K85380R71017J90814
18986A0082994j109014j199887N0454R41559L01868q30411p09948N44869J153437
18977I225921L46771o05132m87153J21790J26593k14451R285N56325M07984l84583
18967I103350o80665j01187M01514R5543n01557n65040q7399L83751N03226K56180
$$ y = [10470724, 9936212, 9353299, 9588960, 10577583, 11345483, 11240970, 10526145, 9758543, 9246417, 9181538, 9617708, 10148309, 10242381, 10043053, 10147172, 10487092, 10319665, 9586454, 9251322, 9753383, 10168398, 9715637, 9127418, 9434007, 10180719, 10178367, 9508714, 9317070, 9815034, 10012168, 9565793, 9407725, 10043327, 10545467, 10018451, 9024160, 8626975, 8805310, 8842473, 8758997, 9198325, 10039113, 10256048, 9449415, 8635783, 8921163, 9892180, 10082994, 8973980, 7774093, 7824547, 8766106, 9067974, 8237563, 7527615, 8072484, 9225921, 9572692, 8967560, 8480407, 8602197, 8728790, 8514339, 8523624, 9079949, 9487933, 9103350, 8422685, 8321498, 8723012, 8818555, 8316998, 7751958, 7664559, 8048310, 8551536, 8807716]
18957H807716j77601m30495k40861J37047K40733R7054P7076J36244r6186m77324
18947H073403m05348J62707N42844L67529K7650j31586k45302l11217j2780M80783
18937H548683M31623k62926o55668j49123N18364M37471n3362j4945N50980P57857
18927A0108954J82209o41395r68445n38126L12250Q30947M70638l32825n09046
18918H915161J36084N03173r4378o95865j72170Q37682Q23006k27269q57884m25297
18908H742243J83768K70390K58879M68689L59433k71328n56135M7335O29746J71414
18898A0304434p64650q73956j31840K99450j7816k58456J40319N68957L40987
18889I607429j85094k53648R1528K01753p2121k07194P7917L84342K99334k506
$$ y = [8807716, 8630115, 8199620, 7958759, 8095806, 8336539, 8433593, 8510669, 8646913, 8550727, 8073403, 7668055, 7830762, 8373606, 8741135, 8768785, 8637199, 8391897, 8080680, 8067900, 8548683, 8980306, 8717380, 8061712, 7912589, 8430953, 8868424, 8815062, 8800117, 9351097, 10108954, 10291163, 9649768, 8681323, 8143197, 8455447, 9286394, 9757032, 9424207, 8915161, 9051245, 9554418, 9460040, 8764175, 8592005, 9429687, 10252693, 10025424, 9167540, 8742243, 8926011, 9196401, 9455280, 9923969, 10283402, 10012074, 9455939, 9503274, 10133020, 10304434, 9539784, 8665828, 8533988, 8833438, 8815622, 8557166, 8697485, 9266442, 9607429, 9422335, 9168687, 9260215, 9461968, 9389847, 9182653, 9260570, 9644912, 9944246, 9941740]
18879I941740j37169j04937r5411J6417M39174Q41194N80228l10805r31000o14470
18869I624961K02766N90908K68070k64601m65035k14546K58975N32364K49177
18860A0783039l96292o60448j49657N35371N55916r694l80263k54368m9903j6328
18850I957373R3239L27788K82642j57753m64634k38954J68046K05007j14263l76048
18840I682443l74743k04680J6893K27871L73383M29687L45304J6181m08784l93692
18830I709863K86553Q93805N41209l96714o56235K899L97820j45251o87878l04610
18820I641461L38401J86624l42310j30046O05632O25200k01882o63354k14190
18811I845536K68843J16892j15571J22776L32337m6652n37619m14314J16969L80046
$$ y = [9941740, 9804571, 9699634, 9604223, 9620640, 10059814, 10901008, 11481236, 11170431, 10239431, 9624961, 9827727, 10418635, 10686705, 10422104, 9957069, 9742523, 10001498, 10533862, 10783039, 10386747, 9726299, 9576642, 10112013, 10667929, 10658235, 10277972, 10023604, 9973701, 9957373, 10050612, 10378400, 10661042, 10503289, 10038655, 9799701, 9967747, 10172754, 10058491, 9682443, 9307700, 9103020, 9119913, 9347784, 9721167, 10150854, 10496158, 10512339, 10103555, 9709863, 9996416, 10890221, 11431430, 11034716, 10378481, 10381380, 10779200, 10633949, 9946071, 9641461, 9979862, 10166486, 9824176, 9694130, 10299762, 10924962, 10723080, 10059726, 9845536, 10114379, 10231271, 10115700, 10238476, 10570813, 10524161, 9986542, 9572228, 9689197, 10069243]
18801A0069243L00164J77990q1823o07654q54104k66995N95174O52978n9164m28832
18791I496977l8592K38744j78910n13055P4791R59669Q94975p7683p03829m08522
18781I744565O671j94628n52621k94026L90184O85301L43853j65772m38168m08081
18771I117278n4330M96622P01581J56118o11447o51402L9123M56704R0496l63401
18761I377342j74261L38229M70302K15200q066j66190m01582m36859N344M80004
18751I699463L35675k19849l73059N5408M17205L05675N5583L4001J05673K6913
18741A0442688j57732l13667l93223l09056k4021K16332J63580K3706J45796L64654
18731A0159057K65997K845R0462M07537K81971k95125m86296L7857M86533J98723
$$ y = [10069243, 10369407, 10547397, 10465574, 9857920, 9003816, 8736821, 9331995, 9984973, 9925809, 9496977, 9458385, 9697129, 9518219, 9005164, 9079955, 10039624, 10934599, 10856916, 10153087, 9744565, 9751236, 9556608, 9003987, 8709961, 9100145, 9785446, 10129299, 9963527, 9525359, 9117278, 9062948, 9559570, 10261151, 10417269, 9805822, 9154420, 9193543, 9650247, 9740743, 9377342, 9203081, 9541310, 10011612, 10226812, 10218746, 10052556, 9650974, 9214115, 9219459, 9699463, 10035138, 9815289, 9442230, 9497638, 9914843, 10220518, 10276101, 10310102, 10415775, 10442688, 10284956, 9971289, 9578066, 9269010, 9244989, 9461321, 9624901, 9648607, 9794403, 10159057, 10425054, 10427899, 10518361, 10925898, 11207869, 10912744, 10426448, 10464305, 10950838, 11149561]
18721A1149561l29770l22023P6372K18035M7994j734J42352J87560R9466J05842
18711A1373655K14935K33405J27603l0156k66222m89398l61260J96279O60781
18702A1659622N41168Q2453j35610m9680n1150k62690l87483k02569J83623M97956
18692A1875640M93346J56059j19960R3501N58639N66048N9287j38401L55123P35825
18682A4635107K71928m60523n09148o2135L4895k26859j93732J18195J13548j25965
18672A3595311O0506N75987N86055K105k81208J19001N11192M02280K13127K96802
18662A6081158L05205L7767o4270J89634K78031n2567k44494O8764M00034L21148
18652A7320410J37874P4021k24176o94678m73419O06092J238042N14396m61553
$$ y = [11149561, 10819791, 10497768, 10574140, 10792175, 10840169, 10838435, 10980787, 11168347, 11267813, 11373655, 11588590, 11821995, 11949598, 11919442, 11653220, 11163822, 10802562, 10998841, 11659622, 12200790, 12283243, 12147633, 12097953, 12046803, 11784113, 11396630, 11194061, 11377684, 11875640, 12368986, 12525045, 12405085, 12498586, 13057225, 13623273, 13682560, 13544159, 13899282, 14635107, 14907035, 14446512, 13937364, 13875229, 13910124, 13683265, 13489533, 13607728, 13721276, 13595311, 13655817, 14231804, 14817859, 14819964, 14538756, 14657757, 15168949, 15571229, 15784356, 16081158, 16386363, 16424130, 16359860, 16549494, 16827525, 16774958, 16530464, 16599228, 16999262, 17320410, 17458284, 17532305, 17308129, 16613451, 16140032, 16746124, 17984166, 18498562, 18037009]
18643A8037009k29520O50727N69099l80761n49716M74862J170881N65201l14260
18634A9993522k34475L89861M34172j44184n08986l23560K5823K26874K75243
18625B0134290J41986j37468k06393K06639P32727P38329K15923j86962q2438
18616B1556633J60216L6970k95245k13713M34759R80884P57429M2321k56354J62699
18606B3366599O01496M22243l9005q0138K76922M52607L17665K93699M93117N08941
18596B6614146K06575L6501K63612M70707K34944j53493j21422L28984O62037
18587B8542591N65846K52406M1309K606P0788K28442M21177M53647J85996j73111
18577C0591697j74210L37002R22382J001422N36416L0280j04281J28719N49429
$$ y = [18037009, 17807489, 18458216, 19027315, 18646554, 18096838, 18571700, 19742581, 20307782, 19993522, 19759047, 20148908, 20583080, 20438896, 19929910, 19606350, 19632173, 19859047, 20134290, 20276276, 20138808, 19932415, 20139054, 20871781, 21610110, 21826033, 21639071, 21556633, 21716849, 21753819, 21458574, 21244861, 21679620, 22660504, 23417933, 23460254, 23203900, 23366599, 23968095, 24390338, 24351333, 24271195, 24548117, 25000724, 25318389, 25612088, 26105205, 26614146, 26820721, 26857222, 27120834, 27591541, 27826485, 27672992, 27551570, 27880554, 28542591, 29108437, 29360843, 29402152, 29404758, 29475546, 29703988, 30125165, 30578812, 30764808, 30591697, 30417487, 30754489, 31676871, 32678293, 33214709, 33244989, 33140708, 33269427, 33818856]
18568C3818856R35404R16729L02924l71827k88344M41382P65827K94729J59O14829
18558C7430668J262372P96161k16644k61585P41760J349717Q64777J90941J53893
18549D2312060L88642M13009N27171R43451J110285O95214L33172N95725J014430
18540D8333159R39586O40844P00783R57454R47421Q61487J127186J453812J244182
18531E7205914P06832O43993J199577J607240J274528N56152K97224Q73896J742948
18522F6108304J947019J251853O00470R08928J648717J591465Q73680R19577J997823
18513G7847836K517633J613853P63751J445643K659826K590113J583391J363509
18505I2385555K034362K148228J431236J141141J656392J909228J543902J551047
$$ y = [33818856, 34754260, 35670989, 35973913, 35602086, 35313742, 35755124, 36520951, 36815680, 36815839, 37430668, 38693040, 39489201, 39272557, 39010972, 39752732, 41102449, 41967226, 42158167, 42312060, 42700702, 43113711, 43640882, 44584333, 45694618, 46389832, 46723004, 47318729, 48333159, 49272745, 49913589, 50614372, 51571826, 52519247, 53380734, 54507920, 55961732, 57205914, 57912746, 58556739, 59756316, 61363556, 62638084, 63194236, 63491460, 64365356, 66108304, 68055323, 69307176, 69907646, 70816574, 72465291, 74056756, 74930436, 75850013, 77847836, 80365469, 81979322, 82743073, 84188716, 86848542, 89438655, 91022046, 92385555, 94419917, 96568145, 97999381, 99140522, 100796914, 102706142, 104250044, 105801091]
18497A05801091K226698K494578J964260J753501K396967K790731K276746J986826
18489A23691398K801040L615034L211859K467900K928285M233160M789785M303027
18481A52041488L871859L997901M145420M069165M092884M122062L659238K803728
18473A82803745K161790J820739J378649Q47270N69938M15440j1952n58156q03975
18464A88623488q75082j073626j124668q01493p74199j597976k378167j936589
18456A78061688q97175q64198j717420j704800m04259M84870o4084p84201l19278
18447A71791143O34911P03040M7051j81685L10779R38806J364950J538717J238718
18438A78386430N90181M27460J179860K021656K077723J790023K047846K659890
$$ y = [105801091, 108027789, 110522367, 112486627, 114240128, 116637095, 119427826, 121704572, 123691398, 126492438, 130107472, 133319331, 135787231, 138715516, 142948676, 147738461, 152041488, 155913347, 159911248, 164056668, 168125833, 172218717, 176340779, 180000017, 182803745, 184965535, 186786274, 188164923, 189012193, 189582131, 189997571, 189985619, 189427463, 188623488, 187748406, 186674780, 185550112, 184748619, 183974420, 182376444, 179998277, 178061688, 177164513, 176300315, 174582895, 172878095, 172473836, 172958706, 172894622, 172110421, 171791143, 172426054, 173129094, 173176145, 172994460, 173305239, 174244045, 175608995, 177147712, 178386430, 178976611, 179404071, 180583931, 182605587, 184683310, 186473333, 188521179, 191181069]
18430A91181069K899324K973890L597415M478727M623280L973201L437611L338465
18422B20502982L078119K400297J773142J362157P47055j17423o97070q75634
18414B28173625j181156j778732k193782k285742k537719l101919l513796l644333
18406B07936446l953931m488086m655181m356648m229395m349577l935161k907671
18398A75060796k385812k797604k921400j953466j122887j693392k595110k022016
18390A57569109n20559k08961j297414j809959r31937k09396o90960j124602k66000
18381A50509321Q66350O64720m69158r18020l67469J24489K7834k18967l30502
18372A49888598l50495L0284R94747J660761J024816k50210m62634O16366J373984
$$ y = [191181069, 194080393, 197054283, 200651698, 205130425, 209753705, 213726906, 217164517, 220502982, 223581101, 225981398, 227754540, 229116697, 229863752, 229746329, 229049259, 228173625, 226992469, 225213737, 223019955, 220734213, 218196494, 215094575, 211580779, 207936446, 203982515, 199494429, 194839248, 190482600, 186253205, 181903628, 177968467, 175060796, 172674984, 169877380, 166955980, 165002514, 163879627, 162186235, 159591125, 157569109, 157048550, 156839589, 155542175, 153732216, 152800279, 152590883, 151899923, 150775321, 150509321, 151375671, 152040391, 151571233, 150653213, 150285744, 150410233, 150438067, 150219100, 149888598, 149538103, 149568387, 150563134, 152223895, 153248711, 152998501, 152535867, 153152233, 154526217]
18363A54526217Q46227P6896L22209J225245J694991J558432J330150J133088
18355A62713455Q64181Q44404J335348J843673J777747J409902J365883J557101
18347A73711694J500975J358550J680378K296720K431132J932524J551696J878962
18339A88342631K674125L339130L511644L197176K813361K992323L836600M607707
18331B15314697M716994M625388M980115N329914M811497L793462L477933L925428
18323B50975428L953236L194017K689744K930427K875571J797171O69344N53615
18315B69638553P86821J61117r77078j312306p10716l17241p19873j306847j412240
18306B63830190j016290l04203N33041J063571J004580P88293J001033J449544
$$ y = [154526217, 155372444, 155449340, 155771549, 156996794, 158691785, 160250217, 161580367, 162713455, 163577636, 164422040, 165757388, 167601061, 169378808, 170788710, 172154593, 173711694, 175212669, 176571219, 178251597, 180548317, 182979449, 184911973, 186463669, 188342631, 191016756, 194355886, 197867530, 201064706, 203878067, 206870390, 210706990, 215314697, 220031691, 224657079, 229637194, 234967108, 239778605, 243572067, 247050000, 250975428, 254928664, 258122681, 260812425, 263742852, 266618423, 268415594, 269084938, 269638553, 270425374, 270586491, 269609413, 268297107, 267586391, 267269150, 266549277, 265242430, 263830190, 262813900, 262509697, 263042738, 264106309, 265110889, 265899182, 266900215, 268349759]
18298B68349759J573189J505757J799429K333738K514647K386135K494334K790968
18290B85747956K781823K653765L058363L818705M117213L985596M246749M884171
18282C15294341M974765M491814M537817N297055N468405M522683L834843M469393
18274C52891116N398520N280480M618580M557128M702247L964024K742817K365734
18266C86520646K782404K620840J354991k05474j491537k699784l747512m172634
18258C80961940m179345m474525n021029n219486n232014n676858o092659n408530
18250C39657494m056107l726147m597486m784761l355846j952035k148161k922091
18242C12114860k401468q29992M5776k78067p38783o84290n04865m32842j52112
$$ y = [268349759, 269922948, 271428705, 273228134, 275561872, 278076519, 280462654, 282956988, 285747956, 288529779, 291183544, 294241907, 298060612, 302177825, 306163421, 310410170, 315294341, 320269106, 324760920, 329298737, 334595792, 340064197, 344586880, 348421723, 352891116, 358289636, 363570116, 368188696, 372745824, 377448071, 381412095, 384154912, 386520646, 389303050, 391923890, 393278881, 393073407, 391581870, 388882086, 385134574, 380961940, 376782595, 372308070, 367287041, 362067555, 356835541, 351158683, 345066024, 339657494, 335601387, 331875240, 327277754, 322492993, 319137147, 317185112, 315036951, 312114860, 309713392, 308883400, 308929176, 308651109, 307912326, 307228036, 306723171, 306290329, 306138217]
18233C06138217L67680Q07820J244502J910456K342722J897262J036277Q86952
18225C16631888J442289J453673M05016o26787o45349k25811n25739j511838k086218
18216C14311124j698845j027053r52233j390299j514237j040061q25123j755272
18208C04108001l287122l938021l391237l073024l983668n005994m553101l099661
18200B73776173k487057l078052l386177k648109j965444k278821k785283k345038
18192B52802192j277012o87780q58742j274810j584898j665721j324506p07247
18184B43421476m17529n68593m38522K42200N67338n7595o50961j08310Q88013
18175B42877517Q95290Q6332n1555Q40842J544794J359528J038925J230061J392551
$$ y = [306138217, 306505897, 307313717, 308558219, 310468675, 312811397, 314708659, 315744936, 316631888, 318074177, 319527850, 319932866, 319306079, 318660730, 318434919, 317909180, 316397342, 314311124, 312612279, 311585226, 310632993, 309242694, 307728457, 306688396, 305863273, 304108001, 300820879, 296882858, 293491621, 290418597, 286434929, 281428935, 276875834, 273776173, 271289116, 268211064, 264824887, 262176778, 260211334, 257932513, 255147230, 252802192, 251525180, 250837400, 249978658, 248703848, 247118950, 245453229, 244128723, 243421476, 243003947, 242435354, 241996832, 242239032, 242806370, 242748775, 242097814, 241989504, 242877517, 243772807, 243859139, 243807584, 244648426, 246193220, 247552748, 248591673, 249821734, 251214285]
18166B51214285R01852J12298l41471m44865m60525m34833m70327p58109j016605
18157B48301700o96134j7135J16137m51069q26409o27873o68702j443764k126529
18148B41560222j979799j668783k048418k581051k254339j359624r81929j210134
18140B27476145j235984r23059q96016j184248j092852m70598P7351L33219P10888
18131B22794846J242606J408552J146117R99358J108924J093465J052933J502122
18123B32348923K084204J681369K75085o41982k19697M60340J86724m74653l15298
18114B35385015L83787L10590p57753j695502j769257j438340j342929j480677
18106B27594934j572698j500538j219198p93984n44295o33326o24310m7330P23251
$$ y = [251214285, 252116137, 252228435, 251886964, 251442099, 250981574, 250546741, 250076414, 249318305, 248301700, 247605566, 247588431, 247704568, 247253499, 246427090, 245799217, 245130515, 243686751, 241560222, 239580423, 237911640, 235863222, 233282171, 231027832, 229668208, 228686279, 227476145, 226240161, 225317102, 224421086, 223236838, 222143986, 221673388, 221750739, 222083958, 222794846, 224037452, 225446004, 226592121, 227591479, 228700403, 229793868, 230846801, 232348923, 234433127, 236114496, 236389581, 235747599, 235527902, 235988242, 236174966, 235700313, 235385015, 235768802, 236079392, 235321639, 233626137, 231856880, 230418540, 229075611, 227594934, 226022236, 224521698, 223302500, 222508516, 221964221, 221330895, 220706585, 220659255, 221382506]
18097B21382506Q61061L02130j71025q9407K08248L69048N65127R54908J240583
18088B25623179J155680R55025J048804J428118J729360J689914J397320J232349
18080B36259749J566207K331799L003436L246485L374105L798801M315018M456473
18072B62352073M296630M213690M073571L460551K592291K072028J752574R03963
18064B85717371l57291r73521o25668l04385o49360r67668p50966r32603k379192
18055B77776717m107432m537803l911047l798620m477985m545368l317231j962929
18047B47118302j652594j941986j824951j322621j063446j046367q27520m78314
18039B36960503m32788o25057n70749j73237K32817N43166R32203J266140J122929
$$ y = [221382506, 222243567, 222545697, 222374672, 222285265, 222493513, 222862561, 223427688, 224382596, 225623179, 226778859, 227733884, 228782688, 230210806, 231940166, 233630080, 235027400, 236259749, 237825956, 240157755, 243161191, 246407676, 249781781, 253580582, 257895600, 262352073, 266648703, 270862393, 274935964, 278396515, 280988806, 283060834, 284813408, 285717371, 285360080, 284386559, 283760891, 283456506, 282807146, 281839478, 281088512, 280155909, 277776717, 273669285, 269131482, 265220435, 261421815, 256943830, 252398462, 249081231, 247118302, 245465708, 243523722, 241698771, 240376150, 239312704, 238266337, 237438817, 236960503, 236527715, 235902658, 235331909, 235158672, 235391489, 235934655, 236866858, 238132998, 239255927]
18030B39255927N23035Q6008K37463O88810R56411J042021J281317J756641K213865
18021B48041498K468437K578376K623596K610729K664256K994847L453625L385238
18013B70820602K337068Q25766j04508j85249k26876p99385j204764m69775R81033
18004B71973912J590923O77738p20150j341243j228115j175936j347887j301387
17996B67127855j011727r07230r40180n27242M07632J139718J243691J281995
17988B67814512J879799K684274K908596K518279K101299J744071R07897m45770
17980B82112957j413453j262194m37475L7133k14524q13088j435356k099924k741950
17971B71732126l136727l344143l703824m213186m369221l875430l129450k720454
$$ y = [239255927, 239778962, 239864970, 240102433, 240791243, 241747654, 242789675, 244070992, 245827633, 248041498, 250509935, 253088311, 255711907, 258322636, 260986892, 263981739, 267435364, 270820602, 273157670, 273983436, 273878928, 273693679, 273466803, 272667418, 271462654, 270992879, 271973912, 273564835, 274242573, 273522423, 272181180, 270953065, 269777129, 268429242, 267127855, 266116128, 265208898, 264268718, 263741476, 264149108, 265288826, 266532517, 267814512, 269694311, 272378585, 275287181, 277805460, 279906759, 281650830, 282558727, 282112957, 280699504, 279437310, 278999835, 279036968, 278822444, 278009356, 276574000, 274474076, 271732126, 268595399, 265251256, 261547432, 257334246, 252965025, 249089595, 245960145, 243239691]
17963B43239691k720833k736821k430577j783371j081020p92984j137508j605214
17955B28951363j380379n14693j00352p60577j554156j194330N5084P34538L09512
17946B24546010j95484J10738P49179Q58221N34034M52974P65338J132888J473508
17937B30427406J940270K407636K630703K735593K966568L136223K932692K583723
17929B51760814K512774K436346J605525M2213j252163j603515j489373j662255
17921B52350366k079931k282986k375212k915759m005315n108114n759290n917066
17913B21906693n609709m819466l886211l466179l718327l931174l407762k442993
17905A90624872j906835k027338k197456j993763j722689j723440j753151j518202
$$ y = [243239691, 240518858, 237782037, 235351460, 233568089, 232487069, 231694085, 230556577, 228951363, 227570984, 227056291, 226955939, 226195362, 224641206, 223446876, 223501960, 224236498, 224546010, 224350526, 224461264, 225210443, 226068664, 226602698, 227055672, 227821010, 228953898, 230427406, 232367676, 234775312, 237406015, 240141608, 243108176, 246244399, 249177091, 251760814, 254273588, 256709934, 258315459, 258357672, 257105509, 255501994, 254012621, 252350366, 250270435, 247987449, 245612237, 242696478, 238691163, 233583049, 227823759, 221906693, 216296984, 211477518, 207591307, 204125128, 200406801, 196475627, 193067865, 190624872, 188718037, 186690699, 184493243, 182499480, 180776791, 179053351, 177300200, 175781998]
17897A75781998j324418j582798j969689j771755r76398l56294m11486q18739
17889A66570421j067204j095001j078167j050504r84755q99429p14616l48709
17881A59332036l6755r8849l18639j36483L94203N45417Q5188k78501r3111J5250
17871A59409756n76452j321339j351994r41800j049894j750715k233935k209219
17863A47974408k177905k304268k164098j802382j912421k572263k844250k201283
17855A29995538j444424j485075j949402j830256j034023m22681n56925j146088
17847A20126664j657215j831748j586897r63028l22590k07932p55113j410948
17839A11391193j452471q16529k65741n36081j367627j752481j274681o83221
$$ y = [175781998, 174457580, 172874782, 170905093, 169133338, 168156940, 167800646, 167389160, 166570421, 165503217, 164408216, 163330049, 162279545, 161294790, 160395361, 159680745, 159332036, 159295281, 159196432, 158877793, 158741310, 159135513, 159680930, 159766118, 159487617, 159394506, 159409756, 158833304, 157511965, 156159971, 155218171, 154168277, 152417562, 150183627, 147974408, 145796503, 143492235, 141328137, 139525755, 137613334, 135041071, 132196821, 129995538, 128551114, 127066039, 125116637, 123286381, 122252358, 121829677, 121272752, 120126664, 118469449, 116637701, 115050804, 114087776, 113765186, 113557254, 112802141, 111391193, 109938722, 109122193, 108856452, 108320371, 106952744, 105200263, 103925582, 103242361]
17831A03242361p26460r91645o64815J324L7650n98833r30956o09760m12839p48113
17821I7597914r12306m52056q2986m11020p84906m33869J42937N0729m73427o11258
17811I3629752m50238o48368j042758q99671k97464P842o2127O8227L61442K14004
17801I0880641k45592k41866J59742L0727o97455r09561j79518M28756J45525
17792H9371399k18287K70179J011047Q34952j36085p61520n51569j1320L81379
17783I0190175N87434N59719K20040j53420j41436K57504P14654J015527J026962
17774I4277159N92767l8059j16052O33937J360035J170124M97512M61857J124350
17765I9963630J470211J121679Q94585J311986J656531J187850M74390N94074
$$ y = [103242361, 102515901, 101524256, 100859441, 100860765, 100898415, 100299582, 99368626, 98758866, 98346027, 97597914, 96685608, 96233552, 96150566, 95739546, 94954640, 94520771, 94663708, 94714437, 94241010, 93629752, 93179514, 92531146, 91488388, 90588717, 90291253, 90299095, 90236968, 90305195, 90666637, 90880641, 90635049, 90393183, 90552925, 90583652, 89886197, 88976636, 88797118, 89225874, 89371399, 89153112, 89423291, 90434338, 91269290, 91133205, 90371685, 89820116, 89808796, 90190175, 90777609, 91337328, 91557368, 91403948, 91262512, 91520016, 92234670, 93250197, 94277159, 94869926, 94831867, 94715815, 95349752, 96709787, 97879911, 98377423, 98839280, 99963630, 101433841, 102555520, 103450105, 104762091, 106418622, 107606472, 108080862, 108674936]
17757A08674936J460289J919633J444155Q42515J035162J798244K201230J891998
17749A21268162J380463J193402J325971J599381K006497K423907K447626J956573
17741A35601982J506042J638229K042972K015667J604688J572425K163342K664850
17733A50810197K468928J937608J820759K280731K875364L150612K941661K414548
17725A70700408K049823K253228K826044L211001L321037L553298L910316L897658
17717A95722813L534592L559401M177962M536999M081929L519676L600048L811923
17709B26545343L327860K494683K181748K223162J807500J011861N88355M57927
17701B40638439j89709j341504k069206k097871k172256k647972k959133k799389
$$ y = [108674936, 110135225, 112054858, 113499013, 114341528, 115376690, 117174934, 119376164, 121268162, 122648625, 123842027, 125167998, 126767379, 128773876, 131197783, 133645409, 135601982, 137108024, 138746253, 140789225, 142804892, 144409580, 145982005, 148145347, 150810197, 153279125, 155216733, 157037492, 159318223, 162193587, 165344199, 168285860, 170700408, 172750231, 175003459, 177829503, 181040504, 184361541, 187914839, 191825155, 195722813, 199257405, 202816806, 206994768, 211531767, 215613696, 219133372, 222733420, 226545343, 229873203, 232367886, 234549634, 236772796, 238580296, 239592157, 240180512, 240638439, 240448730, 239107226, 237038020, 234940149, 232767893, 230119921, 227160788, 224361399]
17693B24361399k661351k816336k842204k561836k401541k416190k033037j232481
17685B05396423r00179j424412j958784j722605j093096p41492n88789l33128
17677A96633938j85382l54155n23148m59821m07495l76951M6166O84349O65161
17668A95722662k7252j58238P52299J407383Q58588K39112Q52553J839708J663145
17659B03149960Q80113J203057K420271K651794J528461P47965J198261J748237
17651B15528119J472814J029925R99270P06106k64682r94992q31027o74129j455295
17642B15516109k506943k737099k441175k629193l318998l781645l891028m015103
17634A90194925m039707l657768l254249l406314l801027l683680l122096k819478
$$ y = [224361399, 221700048, 218883712, 216041508, 213479672, 211078131, 208661941, 206628904, 205396423, 204496244, 203071832, 201113048, 199390443, 198297347, 197555855, 196967066, 196633938, 196448556, 196094401, 195571253, 195111432, 194703937, 194326986, 194373152, 195057501, 195722662, 195695410, 195537172, 196289471, 197696854, 198555442, 198794554, 199647107, 201486815, 203149960, 204030073, 205233130, 207653401, 210305195, 211833656, 212581621, 213779882, 215528119, 217000933, 218030858, 219030128, 219736234, 219471552, 218476560, 217645533, 216971404, 215516109, 213009166, 210272067, 207830892, 205201699, 201882701, 198101056, 194210028, 190194925, 186155218, 182497450, 179243201, 175836887, 172035860, 168352180, 165230084, 162410606]
17626A62410606k896609k867170k647093k566126k486865j970320j323132j405884
17618A44247407k222362k707028k244157j509029j361037j658555j716767j384583
17610A29443889j093269j153126j457389j706953j645700j242363q10951p46731
17602A19587407j031967j253700j190023j053399j032948r67198o97565m28172
17594A11932435m30023n84159n22145j50723J93776J38278k76194n80067l65416
17585A09355762J86385M34802Q5162l71894l60862j53464n41707j588091k373626
17576A04672467k268393j828047j887549k239481j999481j110375n61461q70192
17568I1907488j198814o36456K34107M3944j226686j951140j114577J20280J6816
$$ y = [162410606, 159513997, 156646827, 153999734, 151433608, 148946743, 146976423, 145653291, 144247407, 142025045, 139318017, 137073860, 135564831, 134203794, 132545239, 130828472, 129443889, 128350620, 127197494, 125740105, 124033152, 122387452, 121145089, 120334138, 119587407, 118555440, 117301740, 116111717, 115058318, 114025370, 113058172, 112360607, 111932435, 111502412, 110918253, 110396108, 110245385, 110439161, 110577439, 110301245, 109721178, 109355762, 109542147, 109976949, 110062111, 109690217, 109329355, 109175891, 108634184, 107046093, 104672467, 102404074, 100576027, 98688478, 96448997, 94449516, 93339141, 92777680, 91907488, 90708674, 90072218, 90306325, 90350269, 89123583, 87172443, 86057866, 86178146, 86194962]
17559H6194962j193486j625747n12558O69799L46478r74543j581134r40037j10151
17550H0273583j7026l91793n87590n67700o43032p93701p64343n59885m18171
17541G5530342m04844l71989k89820l31279n51756p02586n43260k31265j48935
17532G1954608l36952m26991k87999l27469p54548r56795l23724N52290M73354
17523F9565774n13168r80804k41724N61505K67790m77016l96760K32978R8444
17514F8117019q49466j251947n66985J35483K9699k40644O9197M22372Q176p25566
17504F5147338p10863J6698L59310j55846o99271l90334M50814P52723J20746
17495F4891315o47471o00998J08498M59233N0331k95816J51848P66067M60766
$$ y = [86194962, 85001476, 83375729, 82863171, 83532970, 83879448, 82904905, 81323771, 80383734, 80273583, 80256557, 79864764, 79277174, 78709474, 78066442, 77272741, 76508398, 75948513, 75530342, 75125498, 74753509, 74463689, 74132410, 73580654, 72878068, 72334808, 72103543, 71954608, 71617656, 71190665, 70902666, 70575197, 69820649, 68863854, 68540130, 69092420, 69565774, 69052606, 68071802, 67830078, 68391583, 68659373, 68182357, 67785597, 68018575, 68117019, 67267553, 66015606, 65448621, 65584104, 65613803, 65373159, 65442356, 65864728, 65872904, 65147338, 64436475, 64453173, 64812483, 64656637, 63957366, 63567032, 64017846, 64770569, 64891315, 64243844, 63642846, 63751344, 64210577, 64260908, 63965092, 64116940, 64883007, 65343773]
17486F5343773n46583r66278l43113M11692N43107L65149L09539J74095j46961
17477F5144420j81025K56158N99433N24694M82160O55888M57582j91664k44105
17468F7503541P80222J609821J028090j28956k78531M50583P62332N38540P32874
17459G2998516J276892J114351L24528K12253R85589J265662M57527k03235K66994
17450G8699077J132525J453360J522558J757925J611407P95636L08005Q99225
17442H8179718J646880J448508Q81349J032191J444641J040552L62467Q41127
17434I6877433K136346K366912J166930M15595J267224K356160K077176J110992
17426A09774768J165444K188057K547221J692238J028750J795524L252372L737934
$$ y = [65343773, 64797190, 63830912, 63487799, 63899491, 64442598, 64807747, 65117286, 65291381, 65144420, 64963395, 65219553, 65818986, 66343680, 66825840, 67481728, 67939310, 67747646, 67503541, 68283763, 69893584, 70921674, 70792718, 70514187, 70964770, 71727102, 72265642, 72998516, 74275408, 75389759, 75714287, 75926540, 76912129, 78177791, 78635318, 78432083, 78699077, 79831602, 81284962, 82807520, 84565445, 86176852, 86972488, 87280493, 88179718, 89826598, 91275106, 92156455, 93188646, 94633287, 95673839, 96036306, 96877433, 99013779, 101380691, 102547621, 102963216, 104230440, 106586600, 108663776, 109774768, 110940212, 113128269, 115675490, 117367728, 118396478, 120192002, 123444374, 127182308]
17418A27182308K916479K107311K461417L566956M204787L973775L536699L444515
17410A53394247L484422L339676L135024K914456K275510J160074M08445O77809
17402A70789663J246373R03627k09987p90265l99157q6631o42440j383790j363986
17393A68063407q54229p10882q91723o20369K35104R01506Q63916N47919O27496
17384A68162145J161079J689425J892881J871990J863134J890869J827168J760833
17376A82119524K043990K719630L129663K607321J526012J012945J424922J790834
17368A98374841J203274J38616k74529J45912N63190M10524p7493n69758j040402
17359A98874175j317118r99343j66924M37409L38976m2447j21136m6378l26104
$$ y = [127182308, 130098787, 132206098, 134667515, 138234471, 142439258, 146413033, 149949732, 153394247, 156878669, 160218345, 163353369, 166267825, 168543335, 169703409, 170111854, 170789663, 172036036, 172939663, 172729676, 171939411, 171540254, 171453623, 170811183, 169427393, 168063407, 167209178, 166498296, 165606573, 164986204, 165221308, 166122814, 166986730, 167534649, 168162145, 169323224, 171012649, 172905530, 174777520, 176640654, 178531523, 180358691, 182119524, 184163514, 186883144, 190012807, 192620128, 194146140, 195159085, 196584007, 198374841, 199578115, 199716731, 199442202, 199588114, 200151304, 200561828, 200484335, 199914577, 198874175, 197557057, 196557714, 196390790, 196828199, 197167175, 197124728, 197003592, 196957214, 196631110]
17350A96631110q79540j142480j037907j165992j842366k493885k410432j791996
17342A83866512j557818k142252k921575l040898k507231k089384k228671k503902
17334A64874781k339805j840542j524431j469308j258419p65428m27416n18605
17326A54730827o44480l53965J08319J76445j20008k03551J18958L84483K84369
17317A54481397J51198K83958K96350l04867j204587j617082j467018j531308
17309A49088041k219990k865715k687718k016334j908763k678651l474617l490206
17301A27746047l032728k956219l361293l469386k816492j990453j823515k227266
17293A06068695k379984j951397j503290j520809j683615j537543j360681j661062
$$ y = [196631110, 195751570, 194609090, 193571183, 192405191, 190562825, 188068940, 185658508, 183866512, 182308694, 180166442, 177244867, 174203969, 171696738, 169607354, 167378683, 164874781, 162534976, 160694434, 159170003, 157700695, 156442276, 155676848, 155249432, 154730827, 154086347, 153732382, 153840701, 154017146, 153897138, 153693587, 153812545, 154197028, 154481397, 154632595, 154916553, 155212903, 154908036, 153703449, 152086367, 150619349, 149088041, 146868051, 144002336, 141314618, 139298284, 137389521, 134710870, 131236253, 127746047, 124713319, 121757100, 118395807, 114926421, 112109929, 110119476, 108295961, 106068695, 103688711, 101737314, 100234024, 98713215, 97029600, 95492057, 94131376, 92470314]
17285I2470314k113223j864291r13348l11481o99423j420801j558039j172586
17277H2417122q92724q42658p72055q43515j361768j884963j584522n93884q6308
17268G3554725o84961j576122j683267j083802o39080o66287p15061n08796l95638
17259F5601711p04778j147873j186789p81944m38994n06134p23679o82617n09153
17250E8919750o48418r85482q02786P1863O90347J89391q86413j302018q93710
17241E4352524o13997q72913r69681m57243K3698j48385n47066n05053k25376
17232E0036508k93018o38586p83859o75891n25165k33682K53741M41913m7689
17223D7534272o69506o80330l33573l99434p87035p31742k16364m2209m19108
$$ y = [92470314, 90357091, 88492800, 87579452, 87267971, 86568548, 85147747, 83589708, 82417122, 81524398, 80681740, 79909685, 79066170, 77704402, 75819439, 74234917, 73641033, 73554725, 72869764, 71293642, 69610375, 68526573, 67887493, 67221206, 66506145, 65997349, 65601711, 64896933, 63749060, 62562271, 61780327, 61341333, 60835199, 60111520, 59428903, 58919750, 58271332, 57285850, 56483064, 56554927, 57245274, 57434665, 56548252, 55246234, 54352524, 53738527, 52865614, 51895933, 51438690, 51462388, 51314003, 50766937, 50261884, 50036508, 49743490, 49104904, 48321045, 47645154, 47119989, 46886307, 47140048, 47581961, 47534272, 46864766, 46184436, 45850863, 45451429, 44664394, 43932652, 43716288, 43674079, 43254971]
17214D3254971o21917k81993L9898r6120l66949m79168o58290r02835o90769J6892
17204C9213720L77878o6725n62760l32940J75283J21020l00916k88486J33922
17195C8469996J73141m01583r34211r04202n07729j53720L868k6994j46871j45183
17185C5426512K377l1020l82021n85222k55267J54199L675m05628k68928K98960
17175C3957637L35463l66898q23096m07273J65862L5175m74356n18943j16240
17166C1787331N0610j62633k78050j65573k00332m09023l09775J59273L24483
17157C0796311j80922p06283n18028M4395J15778k73280k54363L62291O31434
17148C0017333k8348p70026n47901K28892L17503m07050q07021l22705K39592
$$ y = [43254971, 42633054, 42351061, 42390959, 42294839, 41927890, 41448722, 40790432, 39887597, 39196828, 39213720, 39591598, 39524873, 38962113, 38629173, 38804456, 38925476, 38624560, 38336074, 38469996, 38643137, 38241554, 37307343, 36403141, 35895412, 35741692, 35745560, 35718566, 35571695, 35426512, 35428889, 35397869, 35015848, 34430626, 34175359, 34329558, 34333233, 33927605, 33658677, 33957637, 34293100, 33926202, 33103106, 32695833, 32861695, 32896870, 32422514, 31903571, 31787331, 31837941, 31675308, 31397258, 31231685, 31031353, 30622330, 30312555, 30471828, 30796311, 30615389, 29909106, 29391078, 29435473, 29551251, 29277971, 29023608, 29385899, 30017333, 29988985, 29218959, 28671058, 28899950, 29217453, 28810403, 28003382, 27680677, 27920269]
17139B7920269J33754k06010j12572J68224R6270j33207q9822n1078m58975q87123
17129B6379730o11498Q6727K83064r5787k60524J0511R8715j92822k83930J1076
17119B5425262J05924j78617k07380J78577J47717n99562r55998j08179Q79971
17110B4687715N22802p28213j098017j75037N76286J40789o46987n88881J12527
17101B2802984L96956m1711n34900n08745p4605L33315L83520l4780o70361r00101
17091B1151572l12078O05701Q13551K8846p19724l51928P00742R44202r0529j089769
17081B1680586p97205J97486M39749j80254m62509J9357K99575k07732p00933
17072B0288120m56937r2367l66217p23095k63971N52635N61031j75441n01298
$$ y = [27920269, 28054023, 27848013, 27735441, 27903665, 27999935, 27866728, 27776906, 27725828, 27266853, 26379730, 25768232, 25854959, 26138023, 26042236, 25781712, 25792223, 25890938, 25698116, 25414186, 25425262, 25531186, 25352569, 25145189, 25323766, 25471483, 24871921, 23915923, 23807744, 24687715, 25210517, 24482304, 23384287, 23209250, 23785536, 23926325, 23279338, 22690457, 22802984, 23199940, 23158229, 22623329, 22114584, 22039979, 22373294, 22756814, 22722034, 22051673, 21151572, 20839494, 21445195, 22258746, 22287592, 21567868, 21215940, 21916682, 22860884, 22770355, 21680586, 20883381, 21080867, 21520616, 21340362, 20877853, 20897210, 21196785, 20989053, 20288120, 19831183, 19738816, 19372599, 18649504, 18385533, 18938168, 19499199, 19323758, 18822460]
17063A8822460j06206R7524l08164n09424P6359P23003M87689l92379r16391o54497
17053A7319974n1127L21246L21517J61571N0982p1393m02880p86510o87624k9897
17043A6145859L78687p1150o83156l89318M80164N79358l15807r30367n50787
17034A4643483l5087j36821k14099M03111R70478N34614l27200l97879J55796
17025A5596396J44366n66138q49273k33213L67028J72444l50553m21377j15863
17016A3743817o202k04385l34434j70848J00375J55264j00962l87309l20154P5204
17006A2550366L47227K67710J13641L9804k59293p73648p46094J69974R45236
16997A2654923M74531o14647p86694J6305L56607k67727o54181m5991N77045K45834
$$ y = [18822460, 18716254, 18813778, 18505614, 17996190, 18072549, 18795552, 19283241, 18890862, 17974471, 17319974, 17268847, 17590093, 17911610, 18073181, 18124163, 18052770, 17649890, 16863380, 16175756, 16145859, 16524546, 16453396, 15770240, 15380922, 15861086, 16440444, 16124637, 15194270, 14643483, 14608396, 14471575, 14257476, 14660587, 15631065, 16165679, 15838479, 15440600, 15596396, 15740762, 15174624, 14325351, 14092138, 14459166, 14631610, 14281057, 13859680, 13743817, 13737615, 13533230, 13198796, 13027948, 13128323, 13283587, 13182625, 12795316, 12475162, 12550366, 12897593, 13165303, 13278944, 13318748, 13059455, 12285807, 11539713, 11709687, 12654923, 13129454, 12514807, 11728113, 11744418, 12101025, 11833298, 11179117, 11133126, 11710171, 11956005]
16987A1956005l69134k38730K49068J25378l89868l60934J75110L68771O6400
16978A1582066j41762j54041l64839n83631k55556K62726K5431p44152o63487
16969H962755N83504J432721O54838p96393j193928m07995L07475L15880J42952
16960A0001809K40698L55626K28827L8294o2790j92307l53667l48134j89583j02560
16950I616213m8447J86732L70837k2644q20781j029931j66944Q75306R03490k1100
16940I842731p48737n50514J64528N79993L68058j89200n49973l40169K43156
16931H819873N05694P3316n09620m68100P0837K78185q5866l65060j51707R2685
16921H260237n1518k10658M4258L77776L11893J03612J99118K96030j05805n73393
$$ y = [11956005, 11586871, 11348141, 11597209, 11722587, 11332719, 10971785, 11146895, 11515666, 11582066, 11440304, 11286263, 10921424, 10337793, 10082237, 10344963, 10370394, 9626242, 8962755, 9546259, 10978980, 11633818, 10837425, 9643497, 9235502, 9542977, 9858857, 10001809, 10242507, 10598133, 10826960, 10865254, 10802464, 10610157, 10256490, 9908356, 9718773, 9616213, 9567766, 9754498, 10125335, 10102691, 9281910, 8251979, 8085035, 8960341, 9863831, 9842731, 9093994, 8543480, 8708008, 9288001, 9656059, 9466859, 8916886, 8576717, 8819873, 9325567, 9398883, 8889263, 8421163, 8492000, 8770185, 8684319, 8319259, 8167552, 8260237, 8208719, 7998061, 8042319, 8420095, 8731988, 8835600, 9034718, 9330748, 9224943, 8651550]
16911H651550k62525N53084O58451k29987r16317m92855L59908N13313K2084k24807
16901H631899L7723K38669K4119k59130k02872P0771J36055j61954m89573l76475
16891G649232J71469N38076K48539k78467k26123M01846P14927K40533m14596
16882I045436n30875k14597P3790K69660M27051K97534j70429m37143j44734K13517
16872H829210Q8847j87849o3551J75450l9746l85413j33917M63660M71671j51348
16862I067014m73166j56955Q2925j64002l28741M1826M99393N04974K16820l99
16852I289689j45637k50793j41240J23377K03217J12835J93059K95069j07781
16843I571795p81275p76298J4907N13907K07869p103M83827P69115j9287j016283
$$ y = [8651550, 8389025, 8942109, 9600560, 9370573, 8454256, 7961401, 8321309, 8834622, 8856706, 8631899, 8669622, 8908291, 8932410, 8673280, 8470408, 8541179, 8677234, 8515280, 8025707, 7649232, 7820701, 8358777, 8607316, 8328849, 8102726, 8504572, 9219499, 9460032, 9045436, 8514561, 8299964, 8373754, 8643414, 9070465, 9367999, 9197570, 8760427, 8615693, 8829210, 8918057, 8730208, 8666657, 8842107, 8802361, 8416948, 8283031, 8746691, 9218362, 9067014, 8593848, 8436893, 8519818, 8355816, 8027075, 8068901, 8568294, 9073268, 9290088, 9289689, 9144052, 8893259, 8752019, 8875396, 9078613, 9191448, 9384507, 9679576, 9571795, 8790520, 8014222, 8029129, 8543036, 8750905, 8743802, 9227629, 9996744, 9977457, 8961174]
16833H961174q87848N8102M91827J73420n4407N0694k1264k41671q7695K19161
16823H661493m1271o13240m81676L38418O94753K14287j58949N1940M0874o42201
16813H064428j049677l86784N53484O03725o568k25325J12283K79487j5821l37420
16803G591812l82906k72785n4309L43829O61673M44504k62561p94674n85122K03744
16793F893205Q22926O64426q7504o03119l97860K9024l5165l80662k50782L01565
16783F956054M38811P959j56651K57975M35627o9265m38175o3253K52501k77260
16773G344323q39765l11417O77271O37316k88585n24253L30884Q66639J60888
16764H053301q59351r68551k97559K68921L70828J65070j87757m33335k58057
$$ y = [8961174, 8073326, 8131428, 8623255, 8796675, 8742268, 8792962, 8771698, 8530027, 8442332, 8661493, 8620222, 8006982, 7525306, 7863724, 8558477, 8772764, 8613815, 8665755, 8706629, 8064428, 7014751, 6627967, 7181451, 7785176, 7778608, 7553283, 7665566, 7945053, 7929232, 7591812, 7208906, 6936121, 6881812, 7225641, 7887314, 8331818, 8069257, 7274583, 6689461, 6893205, 7716131, 8380557, 8293053, 7689934, 7292074, 7321098, 7285933, 6905271, 6654489, 6956054, 7394865, 7402824, 7246173, 7504148, 7939775, 7870510, 7432335, 7369082, 7621583, 7344323, 6504558, 6193141, 6870412, 7507728, 7219143, 6694890, 7025774, 7892413, 8053301, 7193950, 6225399, 5927840, 6196761, 6567589, 6732659, 6544902, 6111567, 5853510]
16755E853510J42374J69308j76885j72285L88681P10133K74647k77325k28528
16746F683630P0886l6493l13939j47469K46797J55893l60884n10857j3907N20697
16736F294354N21459J08808k51830k55646R2309M28420K36067m83340r47100n21756
16726E221745K96600M93347R92k31502K85244Q38936N95903k16623p24620o07111
16716E952911l14381k34523j87638J09204M41100L17673k46838n51427p7555O79358
16706E887884P14152j42253r06290p02690J35194O20456L92084o1689k23971o3734
16696E649143J81406K81413R6681k67478m56146l10300j44535k27370k42490K05393
16686D765717P48927O11097j98817p40500l94820L22735N11132J1981n55432o06915
$$ y = [5853510, 5995884, 6165192, 5988307, 5816022, 6204703, 6914836, 7189483, 6912158, 6683630, 6754516, 6718023, 6404084, 6256615, 6503412, 6659305, 6298421, 5787564, 5773657, 6294354, 6815813, 6924621, 6672791, 6417145, 6509454, 6937874, 7173941, 6690601, 5743501, 5221745, 5518345, 6011692, 6012684, 5781182, 6066426, 6905362, 7501265, 7284642, 6560022, 5952911, 5638530, 5404007, 5216369, 5325573, 5766673, 6084346, 5837508, 5286081, 5208526, 5887884, 6602036, 6459783, 5553493, 4850803, 4985997, 5606453, 5998537, 5936848, 5712877, 5649143, 5830549, 6111962, 6208643, 5941165, 5485019, 5174719, 5030184, 4802814, 4560324, 4765717, 5514644, 6125741, 5926924, 5186424, 4791604, 5114339, 5625471, 5637452, 5082020, 4475105]
16676D475105j33262M26020O35240M34614J17177p9694k08438l16999k21917R9252
16666E227098K08306j86778n79256k71717N09893Q46591M29809j44690m11236
16657E628020n00337m49440j9103M96834K95870n78713r11751q4547P78403M26654
16647E081890n51248o37072K48594P11576J19982n28863k86320L93209N70830
16638E122578K21482j3995O4631Q5758j44402l58042k95721p5949J6271o5418
16628D557193q0839J15803K75878P2335l03891k73324K28199M67558n1605p38354
16618D268953p14332r3931L08860K99684L94516O48415M48111k77555o44473j21972
16608D516276N76466N60594N0928j51411K2094k8752m49814o99755m36970K5538
$$ y = [4475105, 4341843, 4767863, 5403103, 5837717, 5954894, 5875200, 5666762, 5349763, 5127846, 5227098, 5435404, 5248626, 4669370, 4397653, 4907546, 5754137, 6183946, 6039256, 5628020, 5127683, 4678243, 4659140, 5155974, 5451844, 4873131, 3961380, 3876833, 4655236, 5081890, 4530642, 3893570, 4142164, 4853740, 4973722, 4444859, 4158539, 4551748, 5122578, 5344060, 5330065, 5394696, 5480454, 5336052, 4978010, 4682289, 4606340, 4622611, 4557193, 4476354, 4592157, 4868035, 4940370, 4636479, 4363155, 4591354, 5058912, 5007307, 4268953, 3554621, 3460690, 3769550, 4069234, 4463750, 5112165, 5560276, 5282721, 4638248, 4516276, 5092742, 5653336, 5704264, 5552853, 5574947, 5546195, 5096381, 4396626, 3959656, 3985194]
16598C985194K70171K76004K03814O2562j76204l32417j31826L93065P26268L21846
16588E598477o15853j079275m17763O28499P24225k21473q60491l42842M80873
16579C894377M43736j89884l43973Q6179K61352m0831j34269K35285M28050J08147
16569D748169j39086J12576L40170J8390l85823j56314M49331N60840J0129m97920
16559E060462m45872o0534K21399K78445J84200O893j26181q6397K1805n5085
16549D999135l24371m77947k93668J01541M26004N08045L21341l5071l32536l72896
16539D519577k05099j7350J77504M88418P47960N41273j51824o84858m98034P6064
16529D993631K47616q3562k27358J31234L65188m0498m92090j50038N81695M94566
$$ y = [3985194, 4255365, 4531369, 4735183, 4797745, 4621541, 4289124, 4157298, 4550363, 5276631, 5598477, 4982624, 3903349, 3485586, 4114085, 4838310, 4616837, 3756346, 3413504, 3894377, 4338113, 4148229, 3804256, 3890435, 4151787, 4110956, 3976687, 4211972, 4640022, 4748169, 4609083, 4721659, 5061829, 5080219, 4694396, 4538082, 4987413, 5548253, 5558382, 5060462, 4614590, 4554056, 4775455, 5053900, 5238100, 5244993, 5118812, 5032415, 5054220, 4999135, 4674764, 4196817, 3903149, 4004690, 4430694, 4938739, 5260080, 5225009, 4892473, 4519577, 4314478, 4297128, 4474632, 4963050, 5711010, 6252283, 6100459, 5415601, 4917567, 4993631, 5241247, 5157685, 4930327, 5061561, 5426749, 5386251, 4894161, 4744123, 5325818, 5820384]
16519E820384m86278r78424j98475P80545O73506o3771j34377M06105L66219m01494
16509E783940o84445j7958M89735Q8132l24921J52898P52842L31453n97794o69904
16499E303978O5959L15631k38738n18920J0849N15448L28929j9610P1483K87394
16489F122403K32663K21626M50408L39288l84016q17158j94516O40737L51723
16480F963158p42197j017883L0590J075697R32863Q2228l28259j05406Q0696j16943
16470F854544l40063j80466K52831M67984J60492l52005l92923J87692O43964
16461G302050K84003m52089n39272J05402M93941J06621l51073j42556L88265
16452G195292N28285L24301K33489J83749j45636m65035k25519L35718M19433
$$ y = [5820384, 5334106, 4355682, 4157207, 4937752, 5611258, 5547487, 5413110, 5819215, 6185434, 5783940, 5099495, 5081537, 5571272, 5659404, 5334483, 5487381, 6240223, 6571676, 5973882, 5303978, 5369937, 5685568, 5446830, 4927910, 4938759, 5454207, 5783136, 5763526, 5835009, 6122403, 6355066, 6576692, 7027100, 7366388, 6982372, 6165214, 5970698, 6611435, 6963158, 6220961, 5203078, 5233668, 6309365, 7242228, 7324456, 6996197, 6890791, 6971487, 6854544, 6514481, 6334015, 6586846, 7054830, 7215322, 6863317, 6470394, 6658086, 7302050, 7586053, 7133964, 6594692, 6700094, 7194035, 7300656, 6949583, 6807027, 7195292, 7723577, 8047878, 8281367, 8465116, 8319480, 7854445, 7628926, 7964644, 8384077]
16443H384077o7164l47085j7831L76510L01261Q734m7286N2720K4223n1199J6468
16432H633428R2316K4516L5151L01629M69207J51681l25356l17642J21303K79703
16422I465936j24891n25406l48872K32117O27064N22321O2645l15323j27731O43434
16412A0111294J186936O12377p03086j247751l41312P92308P12203j71723l77398
16403A0573848K60308M86328j04113l80045K18348N57525j60136p54274J5479
16394A0713268J124130Q46861k24151j41312Q06578L63748j390459j209545K180799
16385A3069917M978947L166202j457912l540963j579144O76343L65163p52016
16377A4926537j44748J224717J031018k75089m66166N01520N60237p09346j216701
$$ y = [8384077, 8316913, 7969828, 7951997, 8328507, 8629768, 8638502, 8591216, 8643936, 8668159, 8616960, 8633428, 8725744, 8750260, 8785411, 9087040, 9556247, 9707928, 9382572, 9064930, 9186233, 9465936, 9341045, 8815639, 8466767, 8698884, 9325948, 9848269, 9910914, 9595591, 9467860, 10111294, 11298230, 11910607, 11207521, 9959770, 9618458, 10410766, 11122969, 10951246, 10573848, 10834156, 11320484, 11216371, 10836326, 11054674, 11612199, 11452063, 10697789, 10713268, 11837398, 12684259, 12460108, 12318796, 13125374, 13489122, 12098663, 10889118, 13069917, 18048864, 21215066, 19757154, 16216191, 14637047, 15313390, 15678553, 14926537, 14781789, 16006506, 17037524, 16762435, 16296269, 16797789, 17358026, 16648680, 15431979]
16368A5431979K09236J862693J704454J76995p85586m33003L93730Q63641R56330
16359B0380469Q68369N63087M3796m10020m28169J19792Q89134J198412P22878
16350B3947748K9500k3291N77834J024147Q83798N67812M31832K46284m3856J23142
16340B7764950R60323J633098J327226M88073J50112M47416O94453O38230O34713
16331C4738594P13984N06247J72915M05329J222115J687707J276638P19414Q83341
16322D2326284J450876J480690R09234O45255J186630J882753J873843J299470
16314E3055035J094712J693047K413648K381962J745415J470638J963024K510525
16306F8328006K397228J980166K055965K570222K763580K438104K192715K319423
$$ y = [15431979, 15641215, 17503908, 19208362, 19385357, 18599771, 18166768, 18560498, 19424139, 20380469, 21248838, 21811925, 21855721, 21445701, 21017532, 21137324, 22026458, 23224870, 23947748, 23977248, 23953957, 24531791, 25555938, 26439736, 27007548, 27439380, 27685664, 27641808, 27764950, 28725273, 30358371, 31685597, 32173670, 32323782, 32771198, 33465651, 34103881, 34738594, 35452578, 35958825, 36131740, 36537069, 37759184, 39446891, 40723529, 41442943, 42326284, 43777160, 45257850, 46167084, 46812339, 47998969, 49881722, 51755565, 53055035, 54149747, 55842794, 58256442, 60638404, 62383819, 63854457, 65817481, 68328006, 70725234, 72705400, 74761365, 77331587, 80095167, 82533271, 84725986, 87045409]
16298H7045409K356146K058622J998208K637515L445696L629930L340930L401923
16290A09914379L999331M360523L849110K874772K449838L040128M054230M485176
16282A39027487M000464L252545L005206L212948L341773L351713L655767M119129
16274A66967032L995223L183446K673711L146762L911426M018677L749673M006590
16266A95652540M743565N169449N225669N592936O249882O336116N732848N548130
16258B40251135O478893P745990Q368161Q588228R151332R860326R881387R137557
16250C09463009Q406228Q053499P434541N695909K724645p66077l816934n956912
16242C31237908p573413r357915j1222800j2208262j1808636j0843477j0393279
$$ y = [87045409, 89401555, 91460177, 93458385, 96095900, 99541596, 103171526, 106512456, 109914379, 113913710, 118274233, 122123343, 124998115, 127447953, 130488081, 134542311, 139027487, 143027951, 146280496, 149285702, 152498650, 155840423, 159192136, 162847903, 166967032, 170962255, 174145701, 176819412, 179966174, 183877600, 187896277, 191645950, 195652540, 200396105, 205565554, 210791223, 216384159, 222634041, 228970157, 234703005, 240251135, 246730028, 254476018, 262844179, 271432407, 280583739, 290444065, 300325452, 309463009, 317869237, 325922736, 333357277, 339053186, 341777831, 341011754, 337194820, 331237908, 323664495, 314306580, 303083780, 290875518, 279066882, 268223405, 257830126]
16235B57830126j0333843r752672q530492p535271p248192p129784o574967n724047
16227A95000858n019600m594769m404923m408131m351835l937007l423860l436129
16219A61424604l890334l879312l070129k414184k767708l525688l554565k931375
16211A35391309k636792k832961k718539k125546j961279k640568l213589k768117
16203A14493918j824915j468468j726257j798843j521951j527907j996510k256381
16195A00372686j892464j435343j506717j879346j917342j549641j238390j194471
16187H7758972j187579j102105j167852j493106j752809j604516j208837j047908
16179G7194260j265086j435421j109442m59368j80228o81702j519438j817654
$$ y = [257830126, 247496283, 237743611, 229213119, 221677848, 214429656, 207299872, 200724905, 195000858, 189981258, 185386489, 180981566, 176573435, 172221600, 168284593, 164860733, 161424604, 157534270, 153654958, 150584829, 148170645, 145402937, 141877249, 138322684, 135391309, 132754517, 129921556, 127203017, 125077471, 123116192, 120475624, 117262035, 114493918, 112669003, 111200535, 109474278, 107675435, 106153484, 104625577, 102629067, 100372686, 98480222, 97044879, 95538162, 93658816, 91741474, 90191833, 88953443, 87758972, 86571393, 85469288, 84301436, 82808330, 81055521, 79451005, 78242168, 77194260, 75929174, 74493753, 73384311, 72924943, 72744715, 72063013, 70543575, 68725921]
16171F8725921j252960m26983j65786o04228j142130j227645r44526p57067q68453
16162F1336143j033046r70013p50990o53016p48548q51245q55679q77575r50984
16153E3645047q53164m82473j99994m17710r37577j130641p93415l81323k93209
16144D8155541m03364n03230o97223j010419j073539o78350k68292l32320o23030
16135D2565774n74392k23511l7787m7863O0275J25816l00482r24684q57473l4542
16125C9751131M92492J08899m61724l97473k2106k3969k19271p1401J44107k18220
16115C9082465r15882j080689n74268q3128M0488M7860l2237m27334p70018l41118
16105C4946139N78838P27261k88355j194178q03218K97961O69590M728p22406
$$ y = [68725921, 67472961, 67045978, 66880192, 66275964, 65133834, 63906189, 62961663, 62204596, 61336143, 60303097, 59333084, 58582094, 57929078, 57180530, 56329285, 55473606, 54596031, 53645047, 52791883, 52309410, 52109416, 51691706, 50754129, 49623488, 48830073, 48448750, 48155541, 47752177, 47248947, 46551724, 45541305, 44467766, 43789416, 43521124, 43188804, 42565774, 41991382, 41767871, 41730084, 41682221, 41742496, 41868312, 41567830, 40643146, 39785673, 39751131, 40243623, 40352522, 39890798, 39493325, 39471219, 39447250, 39227979, 39156578, 39300685, 39082465, 38166583, 37085894, 36511626, 36428498, 36468986, 36516846, 36484609, 36057275, 35287257, 34946139, 35524977, 36252238, 35963883, 34769705, 33966487, 34264448, 34934038, 34938766, 34216360]
16096C4216360p44742k78017Q3583O1508k41962n20223n01340k77615k55016n48042
16086C0994494p10944l89676P3527J07408k56022m60222j95419K86972N40506
16077B9990624L32821j96959o11665n86363l34972l22561n22154m72448j62117
16068B7114206j35297m64871m79973K1059K25807l21598p68727l47656K00281
16059B5043231j41667p96968n20802L52516L87914m26069n75131L38313P90835
16050B4452172j54872j271604j099585o3156M79010K17898k12348m90639o79310
16041B1177566o59618m00423k50827k91362p1999M18888M32262k14539n62274
16032A9577674j15277J79131l42800o51855J78693J000745L04691j064060j090475
$$ y = [34216360, 33471618, 33193601, 33277184, 33338692, 33096730, 32576507, 32075167, 31797552, 31542536, 30994494, 30283550, 29893874, 29967401, 30074809, 29818787, 29358565, 29163146, 29450118, 29990624, 30323445, 30126486, 29514821, 28928458, 28593486, 28270925, 27748771, 27276323, 27114206, 26978909, 26514038, 26034065, 26055124, 26280931, 25959333, 25190606, 24842950, 25043231, 24901564, 24104596, 23583794, 23936310, 24324224, 23898155, 23323024, 23661337, 24452172, 24297300, 23025696, 21926111, 21862955, 22341965, 22559863, 22347515, 21856876, 21177566, 20517948, 20117525, 19866698, 19575336, 19503337, 19922225, 20354487, 20139948, 19577674, 19462397, 19641528, 19298728, 18646873, 18825566, 19826311, 20131002, 19066942, 17976467]
16023A7976467J28499O54800l758l68238J24605K54895m04436n24272M03406Q40205
16013A9082173j41914j082821n95210K86367O3565n74714j94200O13864K85522
16004A7742632p65919p46736L64306P28288k30379r46006m12335L50369L00736
15995A6384956j161J91369L21151l02006r98217p13780K31861O41434K25081k31447
15985A5749241k40983j40012k51260l63140k29342j0157L4529m3219j2967J30475
15975A4623165J09702k20113n21527l12317K86020N34086R4404l81138k13088
15966A3999194J83701m8887p08899p32364O6340N74333Q2985o00266l96923M48646
15956A2867860Q02395K20148o19796q75250m47866k996k32490r23205r38376L07322
$$ y = [17976467, 18104966, 18759766, 18756008, 18387770, 18512375, 18767270, 18362834, 17838562, 18241968, 19082173, 18940259, 17857438, 17262228, 17548595, 17612160, 17037446, 16843246, 17457110, 17742632, 16976713, 16229977, 16594283, 17322571, 17092192, 16146186, 15733851, 16084220, 16384956, 16383795, 16575164, 16896315, 16594309, 15596092, 14882312, 15114173, 15755607, 15980688, 15749241, 15508258, 15368246, 15116986, 14753846, 14524504, 14514347, 14548876, 14505657, 14492690, 14623165, 14732867, 14512754, 13991227, 13678910, 13964930, 14499016, 14593420, 14212282, 13999194, 14182895, 14134008, 13425109, 12692745, 12759085, 13333418, 13416403, 12816137, 12419214, 12867860, 13670255, 13890403, 13270607, 12395357, 11947491, 11944495, 11712005, 10788800, 9850424, 10157746]
15946A0157746J608179J254899m50556j369071n93622K78891j52600q07059j18127
15937I808680J062390P22682q85961j470065k78153Q40490M53294m56015m48958
15928I348384J26438J25957l93779n30993j30514K04224K35054K14677K00019
15919I399467N9484q6654p6576o7275j63762j03811J59820J01570m89328q29856
15909G903079k13796O88926O23870l79931j001792n27061K53158L31272j59488
15900G518237l74834j6092M01778L58358k3011k23729o2209M9291k55959o01604
15890F770226k96586N26689Q77723L08969l61255k83360J41872L0978m71862m89778
15880F753616O5308L90343J87654N5922K86405L15023k04203o71512m61074R9606
$$ y = [10157746, 11765925, 13020824, 12570268, 11201197, 10607575, 10886466, 10733866, 9926807, 9808680, 10871070, 11593752, 10707791, 9237726, 8959573, 9800063, 10253357, 9797342, 9348384, 9474822, 9600779, 9207000, 8676007, 8545493, 8749717, 8984771, 9199448, 9399467, 9458951, 9372297, 9295721, 9228446, 9064684, 8960873, 9120693, 9222263, 8732935, 7903079, 7689283, 8378209, 9002079, 8622148, 7620356, 7093295, 7346453, 7677725, 7518237, 7143403, 7127311, 7529089, 7887447, 7864436, 7640707, 7578498, 7627789, 7371830, 6770226, 6473640, 7000329, 7878052, 8187021, 7825766, 7542406, 7684278, 7715256, 7243394, 6753616, 6818924, 7209267, 7396921, 7452843, 7739248, 8054271, 7850068, 7178556, 6717482, 6817088]
15870F817088K71714m5928l62281l55407j17341J27243J87256j3249k71344k39431
15860E998320J02961L67596K78684j4349k38901k84202j23135J73962L12945Q5399
15850F659280k11477j67309J2268j59056m69099k61483L00365L18329k62191l96020
15840E363607K60681O19602J3578n54851j30511M84463J77432m15323o0970O94784
15830F452492L63625p26615p56674M86163J120716K69957n46474n2466P26524
15821G337248L72472n74234p37828j71257J25487O1539K15258L83848k4982n75784
15811F411767l44753L71663M27493j88442l04917L69881P03021O8438o18713m63145
15801F432293O3781J71930Q6668L42773N79016J68636m81129m25330K61972N42629
$$ y = [6817088, 7088802, 7042874, 6680593, 6325186, 6207845, 6335088, 6522344, 6509095, 6237751, 5998320, 6101281, 6468877, 6747561, 6733212, 6494311, 6210109, 6086974, 6260936, 6573881, 6659280, 6447803, 6280494, 6292762, 6133706, 5664607, 5403124, 5703489, 6021818, 5759627, 5363607, 5624288, 6243890, 6257468, 5702617, 5572106, 6056569, 6234001, 5818678, 5757708, 6452492, 6816117, 6089502, 5332828, 5818991, 6939707, 7209664, 6663190, 6610724, 7337248, 7709720, 7135486, 6397658, 6226401, 6351888, 6413427, 6628685, 7012533, 6987551, 6411767, 6067014, 6438677, 6866170, 6677728, 6372811, 6742692, 7445713, 7514151, 6895438, 6432293, 6496074, 6668004, 6754672, 7097445, 7676461, 7845097, 7363968, 6938638, 7200610, 7743239]
15791G743239L9752m28726k02572K49908K28757l6066J40622O48026O57131m1890
15781H998181n74319k16651M97447N27455j36469m61486Q5432P71019P19442J48703
15771A0358754j06750J26864K89514J12419k7877J41789L08340P6610m52570q37187
15761I989906p76459l31760J07215P3460m76136r45978p33607k7734M32991L39153
15751G651051M2324j62492l54625m92863k90275J64926L10027l5129l19964j49089
15741F363891J05451L1764j20368l5843o877l01843m35009P4633O73592M79738
15731F829129k86127o13688k86375n7382k46594l01510L4419K23508m05q9861
15721E205114K57431M35076j0767m93040l40767P3494M4702k25679r3583K61571
$$ y = [7743239, 7782991, 7354265, 7151693, 7401601, 7630358, 7594292, 7734914, 8382940, 9040071, 8998181, 8423862, 8207211, 8704658, 9232113, 9095644, 8634158, 8719590, 9490609, 10210051, 10358754, 10252004, 10378868, 10668382, 10780801, 10752924, 10894713, 11203053, 11279663, 10827093, 9989906, 9213447, 8881687, 8988902, 9062362, 8586226, 7640248, 6906641, 6878907, 7311898, 7651051, 7693375, 7530883, 7176258, 6683395, 6393120, 6558046, 6868073, 6832944, 6512980, 6363891, 6469342, 6501106, 6380738, 6344895, 6338018, 6036175, 5601166, 5675799, 6349391, 6829129, 6543002, 5929314, 5642939, 5585557, 5338963, 5037453, 5071872, 5295380, 5294975, 5205114, 5462545, 5897621, 5886854, 5393814, 5053047, 5126541, 5171243, 4945564, 4851981, 5113552]
15711E113552J19864m40882n83609j01417K61251P1124j47746J09622N00715M64466
15701E366940P7967k17129l05456l47442l57871k41879l0423J99264M10469M54584
$$ y = [5113552, 5233416, 4792534, 4208925, 4107508, 4368759, 4439883, 4292137, 4401759, 4902474, 5366940, 5444907, 5227778, 4922322, 4574880, 4217009, 3975130, 3944707, 4143971, 4554440, 5009024]
$$ [...]
##END NTUPLES=NMR SPECTRUM
##END=
