##TITLE=1H ikalashn
K-348-2_2
19.12.2024
##JCAMPDX= 6.0         $$ Bruker NMR JCAMP-DX V2.0
##DATA TYPE= NMR SPECTRUM
##DATA CLASS= NTUPLES
##ORIGIN= UXNMR, Bruker Analytische Messtechnik GmbH
##OWNER= root
$$ TOPSPIN		Version 1.3
$$ 2024-12-19 15:25:11.390 +0400  Irina@DPX200
$$ Compression mode = diff/dup
##.OBSERVE FREQUENCY= 200.131300845
##.OBSERVE NUCLEUS= ^1H
##.ACQUISITION MODE= SIMULTANEOUS
##.ACQUISITION SCHEME= undefined
##.AVERAGES= 80
##.DIGITISER RES= 18
##SPECTROMETER/DATA SYSTEM= spect
##.PULSE SEQUENCE= zg
##.SOLVENT NAME= DMSO
##.SHIFT REFERENCE= INTERNAL, DMSO, 1, 17.49637
##AUDIT TRAIL= $$ (NUMBER, WHEN, WHO, WHERE, WHAT)
$$ ##TITLE= Audit trail, TOPSPIN		Version 1.3
$$ ##JCAMPDX= 5.01
$$ ##ORIGIN= Bruker BioSpin GmbH
$$ ##OWNER= Irina
$$ $$ F:/spectra/data/iren/nmr/1H/4/pdata/1/auditp.txt
$$ ##AUDIT TRAIL=  $$ (NUMBER, WHEN, WHO, WHERE, VERSION, WHAT)
(   1,<2024-12-19 15:19:28.468 +0400>,<Irina>,<DPX200>,<TOPSPIN 1.3>,
      <acquisition in progress>)
(   2,<2024-12-19 15:24:45.500 +0400>,<Irina>,<DPX200>,<TOPSPIN 1.3>,
      <Start of raw data processing
       efp BC_mod = 2 LB = 0.05 FT_mod = 6 PKNL = 1 PHC0 = 81.83525 PHC1 = 17.7478 SI = 32K 
       data hash MD5: 32K
       D9 BA F0 C7 0D 50 65 1C 94 92 95 02 0C F0 BD C9>)
(   3,<2024-12-19 15:24:48.500 +0400>,<Irina>,<DPX200>,<TOPSPIN 1.3>,
      <apk 
       data hash MD5: 32K
       AE 28 86 E4 97 FE 9B 3A EA 6F D1 90 BA 31 C2 1E>)
(   4,<2024-12-19 15:24:55.984 +0400>,<Irina>,<DPX200>,<TOPSPIN 1.3>,
      <pk fgphup PHC0 = -0.6 PHC1 = 0 
       data hash MD5: 32K
       3F 40 E1 41 99 E4 DE 4D 7F 11 0B F4 7B 9C 01 94>)
(   5,<2024-12-19 15:24:57.968 +0400>,<Irina>,<DPX200>,<TOPSPIN 1.3>,
      <abs n ABSG = 5 
       data hash MD5: 32K
       6D 7B 7D 04 DB 61 5D 0A DF 65 66 D2 B8 73 D4 E6>)
$$ ##END=
$$ 
$$ $$ hash MD5
$$ $$ 81 35 7F 49 3F 24 33 0E 16 86 D6 11 22 4E 34 BB
##$RELAX= 
##$RELAX= 
##$RELAX= 
##$RELAX= 
##$RELAX= 
##$RELAX= 
##$RELAX= 
##$RELAX= 
##$RELAX= 
$$ Bruker specific parameters
$$ --------------------------
##$DU= <F:/spectra>
##$EXPNO= 4
##$NAME= <1H>
##$PROCNO= 1
##$TYPE= <nmr>
##$USER= <iren>
##$AMP= (0..31)
100 100 100 100 100 100 100 100 100 100 100 100 100 100 100 100 100 100 
100 100 100 100 100 100 100 100 100 100 100 100 100 100 
##$ANAVPT= -1
##$AQSEQ= 0
##$AQ_mod= 1
##$AUNM= <au_zg>
##$AUTOPOS= <>
##$BF1= 200.13
##$BF2= 200.13
##$BF3= 200.13
##$BF4= 200.13
##$BF5= 200.13
##$BF6= 200.13
##$BF7= 200.13
##$BF8= 200.13
##$BYTORDA= 1
##$CFDGTYP= 0
##$CFRGTYP= 5
##$CHEMSTR= <none>
##$CNST= (0..63)
1 1 145 1 1 1 1 1 1 1 1 1 1 1 1 1 1 1 1 1 1 1 1 1 1 1 1 1 1 1 1 1 1 1 
1 1 1 1 1 1 1 1 1 1 1 1 1 1 1 1 1 1 1 1 1 1 1 1 1 1 1 1 1 1 
##$CPDPRG= <>
##$CPDPRG1= <>
##$CPDPRG2= <>
##$CPDPRG3= <>
##$CPDPRG4= <mlev>
##$CPDPRG5= <mlev>
##$CPDPRG6= <mlev>
##$CPDPRG7= <mlev>
##$CPDPRG8= <mlev>
##$CPDPRGB= <>
##$CPDPRGT= <>
##$D= (0..63)
0 2 0 0 0 0 0 0 0 0.06 0 0.03 0 0 0 0 0.0002 0 0 0 0 0 0 0 0 0 0 0 0 0 
$$ [...]
##$SW_h= 4401.40845070422
##$TD= 16384
##$TD0= 1
##$TE= 300
##$TE2= 300
##$TE3= 300
##$TEG= 300
##$TL= (0..7)
0 120 120 120 120 120 120 120 
##$TP= (0..7)
150 150 150 150 150 150 150 150 
##$TP07= 0
##$TPNAME0= <>
##$TPNAME1= <>
##$TPNAME2= <>
##$TPNAME3= <>
##$TPNAME4= <>
##$TPNAME5= <>
##$TPNAME6= <>
##$TPNAME7= <>
##$TPOAL= (0..7)
0.5 0.5 0.5 0.5 0.5 0.5 0.5 0.5 
##$TPOFFS= (0..7)
0 0 0 0 0 0 0 0 
##$TUNHIN= 0
##$TUNHOUT= 0
##$TUNXOUT= 0
##$USERA1= <user>
##$USERA2= <user>
##$USERA3= <user>
##$USERA4= <user>
##$USERA5= <user>
##$V9= 5
##$VALIST= <valist>
##$VCLIST= <CCCCCCCCCCCCCCC>
##$VD= 0
##$VDLIST= <DDDDDDDDDDDDDDD>
##$VPLIST= <PPPPPPPPPPPPPPP>
##$VTLIST= <TTTTTTTTTTTTTTT>
##$WBST= 1024
##$WBSW= 25
##$XGAIN= (0..3)
0 0 0 0 
##$XL= 0
##$YL= 0
##$YMAX_a= 2738020
##$YMIN_a= -3145051
##$ZGOPTNS= <>
##$ZL1= 120
##$ZL2= 120
##$ZL3= 120
##$ZL4= 120
##$ABSF1= 17.49637
##$ABSF2= -4.496376
##$ABSG= 5
##$ABSL= 3
##$ALPHA= 0
##$AQORDER= 0
##$ASSFAC= 0
##$ASSFACI= 0
##$ASSFACX= 0
##$ASSWID= 0
##$AUNMP= <proc_1d>
##$AXLEFT= 0
##$AXRIGHT= 0
##$AXTYPE= 0
##$AXUNIT= <>
##$AZFE= 0.1
##$AZFW= 0.1
##$BCFW= 0
##$BC_mod= 2
##$BYTORDP= 0
##$COROFFS= 0
##$CY= 7568.61572265625
##$DATMOD= 1
##$DC= 0
##$DFILT= <>
##$DTYPP= 0
##$F1P= 17.9538593292236
##$F2P= -4.03888763876832
##$FCOR= 0.5
##$FTSIZE= 32768
##$FT_mod= 6
##$GAMMA= 0
##$GB= 0
##$INTBC= 0
##$INTSCL= 5.656564e-011
##$ISEN= 128
##$LB= 0.05
##$LEV0= 0
##$LPBIN= 0
##$MAXI= 945.577
##$MC2= 0
##$MEAN= 0
##$ME_mod= 0
##$MI= -402.1523
##$NCOEF= 0
##$NC_proc= -2
##$NLEV= 6
##$NOISF1= 8.587773
##$NOISF2= 6.764455
##$NSP= 0
##$NTH_PI= 0
##$NZP= 0
##$OFFSET= 17.49637
##$PC= 1
##$PHC0= 94.06392
##$PHC1= 1.32826
##$PH_mod= 1
##$PKNL= yes
##$PPARMOD= 0
##$PPDIAG= 0
##$PPIPTYP= 0
##$PPMPNUM= 100
##$PPRESOL= 1
##$PSCAL= 0
##$PSIGN= 0
##$REVERSE= no
##$SF= 200.13
##$SI= 32768
##$SIGF1= 16.12182
##$SIGF2= -4.496377
##$SINO= 3.521527
##$SIOLD= 32768
##$SREGLST= <1H.CDCl3>
##$SSB= 0
##$STSI= 32768
##$STSR= 0
##$SW_p= 4401.40845070422
##$SYMM= 0
##$S_DEV= 0
##$TDeff= 16384
##$TDoff= 0
##$TI= <>
##$TILT= no
##$TM1= 0
##$TM2= 0
##$TOPLEV= 0
##$USERP1= <user>
##$USERP2= <user>
##$USERP3= <user>
##$USERP4= <user>
##$USERP5= <user>
##$WDW= 1
##$XDIM= 32768
##$YMAX_p= 523081133
##$YMIN_p= -176327
$$ End of Bruker specific parameters
$$ ---------------------------------
##NTUPLES= NMR SPECTRUM
##VAR_NAME=  FREQUENCY,     SPECTRUM/REAL,   SPECTRUM/IMAG
##SYMBOL=    X,             R,               I
##VAR_TYPE=  INDEPENDENT,   DEPENDENT,       DEPENDENT
##VAR_FORM=  AFFN,          ASDF,            ASDF
##VAR_DIM=   32768,         32768,           32768
##UNITS=     HZ,            ARBITRARY UNITS, ARBITRARY UNITS
##FACTOR=    0.134324425510551, 1,           1
##FIRST=     4401.40845070422, -65556,       -348490
##LAST=      0,             -20820,          -380782
##MIN=       0,             -176327,         0
##MAX=       4401.40845070422, 523081133,    0
$$ Real data points
##PAGE= N=1
##DATA TABLE= (X++(R..R)), XYDATA
$$ [...]
13851C1149N687P52r469p441M117O966j784o379j192J57q408j1324K420J7058
13837B2309J2626k933o347L464N128p657j4077p18J4273Q414r845j4573k124O475
13823A4415J287l016M120R817J370r023l316J0461Q893q654j7281m574J1782J2850
13809B9131M198J70K03k489k682O460J4330N580j3020j9544r256R87J694K389
13795A8151Q971J0873J151q792p868l458o119q890M18J4950J5931J028j1727r387
13781A5232P68M920P37k961J696J2682J8424Q820j0639k0986j2543R86J355p574
13767A0917o792O999J5634P845l950m079L219L797k794m396K771Q300M265l323
13753C8413m484N13L117n54n098m593p50R02k58q9K245K478j054l739j749K514
$$ plain form
13851 31149 36836 37588 28119 20678 24795 31761 29977 23598 22406 22563 14155 2831 5251 22309
13837 22309 34935 32002 25655 29119 34247 26590 12513 11795 26068 34482 24637 10064 7940 14415
13823 14415 15702 12686 16806 26623 27993 18970 15654 26115 35008 26354 9073 4499 16281 29131
13809 29131 33329 33499 33702 31213 28531 34991 49321 54901 41881 22337 13081 14068 15762 18151
13795 18151 27122 37995 39146 30354 22486 19028 12909 4019 4437 19387 35318 36346 24619 15232
13781 15232 16000 20920 21657 18696 20392 33074 51498 60318 49679 28693 16150 17136 18491 10917
13767 10917 4125 11124 26758 34603 30653 26574 29793 33590 30796 26400 29171 37471 41736 38413
13753 38413 33929 34442 37559 37005 31907 27314 26564 27466 27208 27119 29364 31842 30788 27049 25300 27814
13737B7814N496P249P221K355n115o231N44L056n601j1943k022J2171Q261q930
13723C4325j1832N145J4434J31j4277l638J6505J3610j0075k1097o202J0634P468
13710C5131n605p429K626R233N650j067m343n284n981m013L229J1999J3567M256
13696E1969p580r678j913L161q78m307K240J0912Q527j857o400l235k912p255
13682C0794n918L037O779j200q985m694N187O770n30n122l32Q122R912J140j0469
13667C4491j1604Q30J2718J0059m74j602O523O207q092j9768j5795l347O813J4150
13653C1109J6356N322j2260j3124O891J8398J367k0553j6068M071P571n005n820
13640A8255Q573J2749n36r061k611J979l469l894N778P762l215o100P076J2684
$$ plain form
13737 27814 33310 40559 47780 50135 45020 38789 39333 42389 36788 24845 22823 34994 43255 34325
13723 34325 22493 27638 42072 42203 27926 24288 40793 54403 44328 23231 17029 27663 35131
13710 35131 29526 22097 24723 33956 39606 38539 34196 28912 22931 18918 22147 34146 47713 51969
13696 51969 44389 34711 32798 35959 35081 30774 33014 43926 52453 50596 44196 40961 38049 30794
13682 30794 24876 27913 34692 33492 24507 19813 25000 31770 31240 26118 25786 33908 43820 44960 34491
13667 34491 22887 23717 36435 46494 46020 44418 50941 57148 49056 29288 13493 10146 16959 31109
13653 31109 47465 52787 40527 27403 34294 52692 54059 33506 17438 21509 29080 24075 18255
13640 18255 26828 39577 39041 29980 27369 29348 25879 21985 27763 35525 32310 26210 33286 45970
13626D5970j469r550P354K2746P082j9335j7723N526J2104l732j1061R76Q360
13613D7248j251r115l109K115l491o374K587R706M628r90K142K731o606j0781
13599B9440O11R828m58j4223o079J5806K1353N479p558n071j102n818p589K215
13585C6834R267j032j5623r795J4154K5266O092k0389j9758O736K3519J0529j0033
13572E5767r828K254j832j9084j7461R747K7181J0541j4549j1663J1885K0361
13560F3319M676j0902j1046o204n726k850O219J1292N626k644m488j510J841M405
13546E2008L150m402j0161l270R703R998l974j1587j436J1529J0514O99m075l122
13532E5574l382m681l696k267p76N353J2902R106o045j2504l89J0222j15j6161
$$ plain form
13626 45970 44501 34951 42305 65051 72133 52798 35075 40601 52705 48973 37912 38888 47248
13613 47248 45997 36882 33773 35888 32397 26023 28610 38316 42944 41954 44096 46827 40221 29440
13599 29440 30051 39879 39421 25198 19119 34925 56278 61757 54199 49128 48026 42208 34619 36834
13585 36834 46101 45069 29446 19651 33805 59071 65163 44774 25016 31752 55271 65800 55767
13572 55767 45939 48193 46361 27277 9816 19563 46744 57285 42736 31073 42958 63319
13560 63319 67995 57093 46047 39843 34117 31267 37486 48778 54404 51760 47272 45762 47603 52008
13546 52008 55158 50756 40595 37325 47028 57026 53052 41465 40029 51558 62072 62771 58696 55574
13532 55574 52192 47511 43815 41548 40772 46125 59027 68133 62088 49584 49195 59417 59302 43141
13518D3141j0377J2255K0952N789j1307j2402l767L145O617N472k902j0118l712
13505D2786Q988P128q053j0689O576J5866j918k3228j6846Q612K1065J3509N102
13492F8898L205l110j4000j4492k787M566J695J756Q308M992j3034k2349n430
13479A8218J8334J9107K48r558J32J1409R923K457j588n384j2555j5723p753N952
13465C3219J4970J5574Q812l519j4049j1331L958J3225K327j6727j9776k720J4220
13452C8183J4349L269l652j353L566M478J212k078j835R81J921m9K06M932O258
13437G0388k923j4149j1998K543J1381N061n101o736l672l804l137M807J3823
13424E6483J3956Q403O697O797m51j2512j6745r906j525K214M135N284K458k220
$$ plain form
13518 43141 32764 45019 65971 71760 60453 48051 44284 47429 54046 59518 56616 46498 42786
13505 42786 51774 58902 50849 40160 46736 62602 60684 37456 20610 29222 50287 63796 68898
13492 68898 72103 68993 54993 40501 37714 42280 43975 45731 54039 59031 45997 23648 18218
13479 18218 36552 55659 55907 46349 46481 57890 67813 70270 68682 63298 50743 35020 27267 33219
13465 33219 48189 63763 72575 69056 55007 43676 47634 60859 63186 46459 26683 23963 38183
13452 38183 52532 55801 52149 50796 54362 58840 60052 57974 56139 57120 59041 58992 59198 64130 70388
13437 70388 67465 53316 41318 43861 55242 60303 55202 48466 44794 40990 37853 42660 56483
13424 56483 70439 78842 85539 92336 91885 79373 62628 52722 51197 53411 57546 62830 65288 63068
13410F3068k609p14l844q618l494J0047J5604O597l480k939J911J612n60J346
13396G3927L471J329n50O55j531q391q172L363R716j479j4878r987N203Q128l23
13381F0481l28R201Q694m831r783K729J2278K690j2593j4305n318K068P720J4076
13367G2779J2014k726j3058l337J2210Q408j0578j6308N6J5470J1225k406p702
13354G6047n652o595r281n380L106O308L023J638M826N194r72n427K2R493R638
13339H5988j334j0210o725L351Q660Q015O419J897r219j6952o343J5346K0461
13326I9354kj9195j2521N451N501r171j0880M196J0278k181r630L091J6217R708
13312I0216k902r70N681l345j8118j2917P144J1793k848p120J0047J9913K341
$$ plain form
13410 63068 60459 59745 55901 47283 43789 53836 69440 76037 72557 69618 71529 73141 72581 73927
13396 73927 77398 78727 78177 78832 77301 68910 60738 64101 73817 72338 57460 47473 52676 60804 60481
13381 60481 60153 69354 78048 73217 63434 66163 78441 81131 68538 54233 48915 50983 58703 72779
13367 72779 84793 82067 69009 65672 77882 86290 75712 59404 59460 74930 86155 83749 76047
13354 76047 70395 63800 54519 49139 52245 58553 61576 63214 68040 73234 72262 66835 66857 76350 85988
13339 85988 84654 74444 67719 71070 79730 87745 94164 96061 86842 69890 63547 78893 99354
13326 99354 99352 80157 67636 73087 78588 69417 58537 62733 73011 70830 61200 64291 80508 90216
13312 90216 87314 86344 92025 88680 70562 57645 64789 76582 73734 66614 76661 96574 98915
13299I8915j8469j2742P077R215n088p798O427J3272J666j0023q000l408o328
13286F4716n603P974J9607J2198n014j0655l145K470J531J676K516l493j0354
13273G4424k362J6465J9841k838k5296j7972J0328K4049Q642j3068j4363J988
13261G9838J2436N000q653j1715k899N731N975J453j054p09M8J183K850K113k091
13246H9506m542j252K772J439q41L320Q376J806j3326j8095n151Q903P747j745
13232G8917l560J591Q17o292n415Q628K0531J3890o320j8755j1145N806J2717
13219I1410N836p67J726L563m492j0794n20J3891O430j7925k3321K135K3592J1496
13205A02260j3113j4284K336N689m957k899J3860J7293l98j2072j975R828M669
$$ plain form
13299 98915 80446 67704 74781 83996 78908 71110 77537 90809 92475 82452 74452 71044 64716
13286 64716 59113 67087 86694 98892 93878 83223 80078 82548 84079 85755 88271 84778 74424
13273 74424 72062 88527 108368 105530 80234 62262 72590 96639 105281 92213 77850 79838
13261 79838 92274 97274 88621 76906 74007 79738 85713 87166 86112 85403 85451 86634 89484 91597 89506
13246 89506 84964 83712 86484 87923 87082 90402 98778 100584 87258 69163 64012 72915 80662 78917
13232 78917 75357 76948 77765 71473 66058 74686 95217 109107 102787 84032 72887 78693 91410
13219 91410 97246 96479 98205 101768 97276 86482 85962 99853 106283 88358 65037 67172 90764 102260
13205 102260 89147 74863 77199 82888 77931 75032 88892 106185 105787 93715 91740 101568 106237
13192A06237n289l271M016M217J592K528M51o768o428M047N421r911j8060j977
13178G6805J5811Q857q113n653Q667O206q877p028J1781J7038K559m069N800O045
13164A25829j2825k1536l701J2003P66j4055k167J8590J1785j3889j7667N612
13152H8745J8498L386j2490o259N663K186n307K410J3768M688j6677j7382Q518
13139H9747K6921J2602j4029j7851Q30J1623K191o681J266J0676J225j6797j6073
13126H5650O174K3377J6757k712j4375j2773m924L102P272L801m311p046j119
13113I8873M226J834k482j549J022K23J152Q606J3692N696q454j2399m965l32
13099A05143l898m762L779J1678Q138j448m625m39J805j171k152L774J0214P969
$$ plain form
13192 106237 100948 97677 101693 105910 107502 110030 110481 103713 97285 101332 106753 96842 78782 76805
13178 76805 92616 101473 93360 87707 96374 102580 93703 86675 98456 115494 118053 113984 119784 125829
13164 125829 113004 91468 87767 99770 100536 86481 84314 102904 114689 100800 83133 88745
13152 88745 107243 110629 98139 91880 97543 99729 94422 96832 110600 115288 98611 81229 89747
13139 89747 116668 129270 115241 97390 98220 109843 112034 105353 106619 117295 118520 101723 85650
13126 85650 91824 115201 131958 129246 114871 102098 97174 100276 107548 111349 107038 99992 98873
13113 98873 103099 104933 102451 100902 101924 102147 103299 111905 125597 131293 122839 110440 105475 105143
13099 105143 101245 96483 100262 111940 120078 118630 114005 113566 115371 114200 112048 115822 126036 134005
13085A34005j805q927p806l290r02J737P434R563N38j2336j2850M39J0432O831
13071A23063R33N057J0467J561j6123k0592m736J3812J7179P786j307n057o691
13058A25352o338l78Q235Q500l937j5436q195J3125K1212K024k1170j7371O840
13045A12463J6800K978o747L588J0565n815k2830j0526J6273J9759o80j1029J57
13032A24956Q969K851j132N397M513j0592j5537M997K5800J6815j1037k3523j1750
13019A20727L378O343K156k51l33r54k719l110K386J2328J2915n436k4703j5541
13005A07186J6761L0824P796j8649j3222R383J4213J909l083q58r580k1668j1811
12992A09201J3982K1726N405l734P343J1790o824k2533r934J3289J5337k141j3743
$$ plain form
13085 134005 132200 123273 115467 112177 111275 113012 120446 130009 130547 118211 105361 105800 116232 123063
13071 123063 123996 129053 139520 141081 124958 104366 99630 113442 130621 138407 137100 132043 125352
13058 125352 119014 118636 126871 135371 131434 115998 107803 120928 142140 144164 122994 105623 112463
13045 112463 129263 132241 125494 129082 139647 133832 111002 100476 116749 136508 135828 124799 124956
13032 124956 133925 136776 135644 141041 145554 134962 119425 124422 150222 167037 156000 132477 120727
13019 120727 124105 130448 132604 132353 132020 131066 128347 125237 127623 139951 152866 147430 122727 107186
13005 107186 123947 154771 162567 143918 130696 140079 154292 156201 153118 152260 142680 121012 109201
12992 109201 123183 144909 150314 146580 153923 165713 158889 136356 126422 139711 155048 152907 139164
12979A39164r871l10Q195J3954J0863j702r357k602M890k151j2798p304P933J0034
12965A48938j164k992R954J4943r73j7991j3836K305N705n554r666L640J6953
12952A50262J1648l468m313J2052K0407L389k0096j8818N429J8526K912j7135
12940A60795j2120R512J6215R08j1564m515P230L621q779p764R499K0058O519
12927A89615j7913k5129p740J2566J4020R56o894k642L262L191J972M318O058
12914A75640K929k309n931p146l303P359J5902R887n457r926J196Q133j625j2564
12900A72785p601L608L104m779m219L442O288O130J0632J1074l585j8666j1624
12887A66589P462Q721n829l859J8465K3381n596l0076j4797J5945J7052p659j6635
$$ plain form
12979 139164 129293 128983 137178 151132 161995 160293 150936 148334 153224 151073 138275 130971 138904 148938
12965 148938 147774 144782 154736 169679 168706 150715 136879 139184 144889 139335 129669 133309 150262
12952 150262 161910 158442 154129 166181 186588 189977 169881 151063 156492 175018 177930 160795
12940 160795 148675 158187 174402 175310 163746 159231 166461 170082 161303 153539 163038 183096 189615
12927 189615 171702 146573 138833 151399 165419 166375 159481 156839 160101 163292 165264 169582 175640
12914 175640 178569 176260 170329 163183 159880 167239 183141 193028 187571 177645 178841 186974 185349 172785
12900 172785 165184 168792 171896 167117 162898 166340 172628 178758 189390 200464 196879 178213 166589
12887 166589 174051 182772 176943 173084 191549 214930 209334 179258 164461 180406 197458 189799 173164
12874A73164J854J6432O045j1198j1417J853J0609Q471J344m791o709l392J260
12861A83525J994N03K076L971j668j2050j3358p03J2781J3118L189l782j976L018
12847A90638M327J290k341l545k384l89K178N614P695N452J149P67L864K546m450
12832B12411o176K879R348m18j5412j2621P206J7712N514j0187p674N406P130
12819B15118l739q432M80Q436K900q012q902J177R658P996K2n609m897P1M798
12804B11065O038L964J553J039J350P0l061o319q079o449O82J0527J2849J135
12790B26364j3416j0725R890K2768Q856j4725j5874O788K1254P568j5899k1376
12778B11473q378L319M018O29M83L852Q305R155J350r398p033J0698K0644N173
$$ plain form
12874 173164 175018 191450 197495 186297 174880 176733 187342 195813 197157 192366 185657 182265 183525
12861 183525 185519 186022 188098 192069 190401 178351 164993 164290 177071 190189 193378 189596 187620 190638
12847 190638 194965 196255 193914 190369 187985 187596 189774 195388 203083 208535 209684 210451 214315 216861 212411
12832 212411 206235 209114 218462 218044 202632 190011 197217 214929 220443 210256 202582 207988 215118
12819 215118 211379 202947 203427 211863 214763 206751 197849 199026 208684 216680 216702 211093 206196 206267 211065
12804 211065 217103 221067 222620 223659 225009 225079 222018 215699 207620 201171 201853 212380 225229 226364
12790 226364 212948 202223 212113 234881 243737 229012 213138 219926 241180 248748 232849 211473
12778 211473 203095 206414 210432 211061 211544 215396 223701 232856 234206 224808 217775 228473 249117 254290
12764B54290j6495j2793J1269J9763R15j5996q177P743Q090J53K846J0089L482
12751B65179j1051j1092K622O000o629j1432M028J7188O288j2377q586J3501K0508
12738B74147R44j7831j1957M595N273p299q675O231J5365N490p313l844R213J1690
12724B76029N22q435m662N051Q361J414q743j0233J691J4819J0423r823j9604
12711B56810k856J9984J9152j413j2007k742O274J366n729l181J566m50k996J118
12697B74896O200O168N268N500J25r344q291N674J2394O48j0025q4J5626J0154
12683C14909j2019k1822r054P999J3936J2802J2322J1931R078K723q611k0284
12671C13910j9116j870J2859Q908j734J191J1258P286p866j1346l21M418l400
$$ plain form
12764 254290 237795 225002 236271 256034 256949 240953 232776 240519 248609 248762 251608 261697 265179
12751 265179 254128 243036 245658 251658 245029 233597 237625 254813 261101 248724 240138 253639 274147
12738 274147 275091 257260 245303 249898 255171 247872 239197 245428 260793 266283 258970 255126 264339 276029
12724 276029 276551 268116 263454 268505 276866 278280 269537 259304 260995 275814 286237 276414 256810
12711 256810 253954 273938 293090 291677 279670 276928 283202 284568 278839 275658 277224 276774 273778 274896
12697 274896 281096 287264 292532 298032 298157 288813 280522 286196 298590 299238 289213 289129 304755 314909
12683 314909 302890 281068 272014 280013 293949 306751 319073 331004 340082 342805 334194 313910
12671 313910 294794 292924 305783 314691 312957 314148 325406 332692 324826 313480 313159 317577 314177
12658C14177n996M028J0679M813j210N28K80n602m701N513Q582q83n082M346R624
12643C39096J48n919N612J7729J1880m92k288k098j1855j6372R22K1227J6099
12630C73689m698r055M435Q550l279r680k921M82n053l853Q542J4552N704l558
12616C73857k746J55k41L436J1289J0740N67l706K669N169j779m192K990L985
12602D02193p238j1463L221J8536J5170J996l949m447o015j249J2039J4971k444
12589D31321j6295l929J5089Q256j5073j8220K115J2520N6r712j44J0195M084
12576D20263n109q02P335L609n164m005L596N286L178N831P266l128j5983j0850
12562D11323J0438K1224O816j3805j3621O211J8869P547j3057j5787M215K2936
$$ plain form
12658 314177 308181 312209 322888 327701 326491 327019 327299 321697 316996 322509 331091 330208 325126 329472 339096
12643 339096 339244 333325 338937 356666 368546 368054 365766 363668 351813 335441 336363 357590 373689
12630 373689 368991 359936 364371 372921 369642 359962 357041 357523 352470 348617 357159 371711 377415 373857
12616 373857 371111 371266 371025 374461 385750 396490 397057 393351 396020 401189 399410 395218 398208 402193
12602 402193 394955 383492 386713 405249 420419 422415 418466 414019 408004 406755 418794 433765 431321
12589 431321 415026 411097 426186 434442 419369 401149 403264 415784 415840 406128 405984 416179 420263
12576 420263 415154 414352 421687 425296 420132 416127 419723 425009 428187 434018 441284 438156 422173 411323
12562 411323 421761 442985 449801 435996 422375 428586 447455 455002 441945 426158 430373 453309
12550D53309J8024k910j3871n704M615J932n314j086J1996J6754P012n061p123
12537D72573n24N970O813J330p026r932q17J3570J6290J524j4353j2154M362J3733
12523D91359O831j767K604J2048Q619p275j5469l818J5281K1272R686o703j4567
12510E18101j0606M04J0394J2430O559O36J082M836M977J109k084l400m172j033
12496E39233R851K0871J7098k694j9366j5689K008J3687J1486M587R07k610q148
12483E71221p893L898J7021J5406k45j1339n667P180J0903M758R51M591Q001N066
12469F23852P5j168k90j425l972m942l438O60O980J1028P332o57k366M085P942
12454F43696L458l56L542O613R43l255N893J7566J2267n301j1593j696M357k841
$$ plain form
12550 453309 471333 468423 454552 448848 453463 455395 450081 448995 460991 477745 484757 479696 472573
12537 472573 472049 478019 484832 486162 479136 469204 468387 481957 498247 499771 485418 473264 477626 491359
12523 491359 498190 496423 499027 511075 519694 512419 496950 493132 508413 529685 539371 532668 518101
12510 518101 507495 507899 518293 530723 537282 537918 539000 543836 548813 549922 547838 544438 540266 539233
12496 539233 549084 569955 587053 584359 564993 549304 551312 564999 576485 581072 581979 579369 571221
12483 571221 563328 567226 584247 599653 599408 588069 582402 589582 600485 605243 606194 610785 618786 623852
12469 623852 623927 622759 622469 621044 617072 612130 608692 609352 616332 627360 634692 634035 631669 635754 643696
12454 643696 647154 646798 650340 656953 657896 654641 660534 678100 690367 685066 673473 671777 676134 673293
12440F73293o453N721J8749J5170K705j653M23k200n268K714J4477J1119n524
12427G23273j1502L541K0174J7903L160l855J732P643N333j099n211n812k854
12414G52426M732J3216J3604L036q166p934J787Q811Q706Q523J0811P181m767
12401H11966j0895j65J4957J4853L136J32Q376Q408o528j6074m581J3364J5654
12388H52603M688j491J877N223M640M580N254L307J689M769P597L439k282O85
12374H96578J0034J4261R766K247m011o000J592J5654J9381M900q467K04J8964
12361I75103K0065M423k113N570N259q697j1852O662K1514J2352k695L76J1230
12348A037197O829o570n233J0589J8461J1229L937N038O449L577L061P206Q991
$$ plain form
12440 673293 666840 672561 691310 706480 709185 707532 707955 705755 700487 703201 717678 728797 723273
12427 723273 711771 715312 735486 753389 756549 752694 754426 762069 767402 766303 761092 755280 752426
12414 752426 757158 770374 783978 787014 778848 770914 772701 781512 790218 798741 809552 816733 811966
12401 811966 801071 800906 815863 830716 833852 833984 842360 850768 844240 828166 823585 836949 852603
12388 852603 857291 855800 857677 862900 867540 872120 877374 880681 882370 887139 894736 898175 895893 896578
12374 896578 906612 920873 930639 932886 928875 922875 924467 940121 959502 964402 955935 956139 975103
12361 975103 995168 999591 997478 1003048 1008307 999610 987758 994420 1015934 1028286 1025591 1025967 1037197
12348 1037197 1044026 1037456 1032223 1042812 1061273 1072502 1076439 1081477 1087926 1091503 1094564 1101770 1110761
12335A110761N802K964K273R09J499Q569J5793J2287J399k688K919P599P586J0183
12321A187855J4959J0481l462q931M353K1444K2671R925O4J164P658J2698J3586
12308A294465Q864M24l941J173R745J1295N509K360P623J5335J6624J0721L876
12295A384073P31R80L540Q962J5185J5349N874m785l168J1620K4538K2495R334
12282A494728j031l57R276J9781K1452J0580k299p97J4881K4861J6860L474J033
12269A612442N505N361M506J1549J7905J1370K778J1065K7007K3532J585q138
12257A726467N375J7165J0924N301J6952K8764K0246L931L099J2891J3239N689
12245A870043P249J7450K0808J6259J6785K2520J9937P712L45M742J2982J9210
$$ plain form
12335 1110761 1116563 1119527 1121800 1122709 1124208 1132777 1148570 1160857 1162256 1159568 1162487 1170086 1177672 1187855
12321 1187855 1202814 1213295 1209833 1200902 1205255 1226699 1249370 1259295 1259359 1260523 1268181 1280879 1294465
12308 1294465 1303329 1303753 1299812 1300985 1310730 1322025 1327534 1329894 1337517 1352852 1369476 1380197 1384073
12295 1384073 1384804 1385784 1389324 1398286 1413471 1428820 1434694 1429909 1426741 1438361 1462899 1485394 1494728
12282 1494728 1493697 1493340 1502616 1522397 1543849 1554429 1552130 1551333 1566214 1591075 1607935 1611409 1612442
12269 1612442 1617947 1623308 1627814 1639363 1657268 1668638 1671416 1682481 1709488 1733020 1734605 1726467
12257 1726467 1731842 1749007 1759931 1765232 1782184 1810948 1831194 1835125 1838224 1851115 1864354 1870043
12245 1870043 1877292 1894742 1915550 1931809 1948594 1971114 1991051 1998763 1999108 2003850 2016832 2036042
12233B036042K4960K7375K0302Q231K590M448O440R020J6913K3216J8115J0680
12221B208332J8257L4496L4267J3589k284K253J3149J5656J6619K3248K4826J4522
12209B416930P859J7974L0579K6457J3604J2425K1148K2621J7241K0735L2012
12198B639585L1738J6162N961J3347K3990K3707K1978L1121L9057K6689M388L996
12186B881719L0983M9738L1306k578o333K6457N4267M5655J9408J1653K4703L3072
12174C200050K7253K2743K8397L3713L1894L1274L5843L5833K7477K2780K8751
12163C526008L4861L2687L0209L4101L6086L1236L1053M1245M5569L2627K0509
12152C896191K9412M5774M3412K8373K8882M6439N2690L6855K2343K8189M3486
$$ plain form
12233 2036042 2061002 2088377 2108679 2116910 2119500 2123948 2130388 2139408 2156321 2179537 2197652 2208332
12221 2208332 2226589 2261085 2295352 2308941 2306657 2308910 2322059 2337715 2354334 2377582 2402408 2416930
12209 2416930 2424789 2442763 2473342 2499799 2513403 2525828 2546976 2569597 2586838 2607573 2639585
12198 2639585 2671323 2687485 2693446 2706793 2730783 2754490 2776468 2807589 2846646 2873335 2877723 2881719
12186 2881719 2912702 2962440 2993746 2991168 2984835 3011292 3065559 3111214 3130622 3142275 3166978 3200050
12174 3200050 3227303 3250046 3278443 3312156 3344050 3375324 3411167 3447000 3474477 3497257 3526008
12163 3526008 3560869 3593556 3623765 3657866 3693952 3725188 3756241 3797486 3843055 3875682 3896191
12152 3896191 3925603 3971377 4014789 4043162 4072044 4118483 4171173 4208028 4230371 4258560 4302046
12141D302046N1003N0359M6356L8069L1538M0088N8702O1337L9837K2863L6093
12130D778291O3353P0980N5393M1105M1853M9485N5847O1355O3029N5439M4755
12119E380885M3962N3002N9602N9967O1981O7070O6222N7594N1808N4798N9955
12108F016846O2465O6774P3545P3936O5577O0620O7283P5622P3968O8512P1648
12097F776796P9599P9109P1578P1751Q2675R0482Q7594Q3552Q5919Q7359Q2275
12086G678689Q0439Q9151R5663Q7003P6710Q7069J09579J12200Q9450P4902R0934
12075H671789J14573J14803R9844R8110J09443J10283R9243R9984J16943J24662
12065I759677J11374J00176J10283J25933J25438J16973J19748J28181J23772
$$ plain form
12141 4302046 4353049 4403408 4449764 4487833 4519371 4559459 4618161 4679498 4719335 4742198 4778291
12130 4778291 4841644 4912624 4968017 5009122 5050975 5100460 5156307 5217662 5280691 5336130 5380885
12119 5380885 5424847 5477849 5537451 5597418 5659399 5726469 5792691 5850285 5902093 5956891 6016846
12108 6016846 6079311 6146085 6219630 6293566 6359143 6419763 6487046 6562668 6636636 6705148 6776796
12097 6776796 6856395 6935504 7007082 7078833 7161508 7251990 7339584 7423136 7509055 7596414 7678689
12086 7678689 7759128 7848279 7943942 8030945 8107655 8194724 8304303 8416503 8505953 8580855 8671789
12075 8671789 8786362 8901165 9001009 9099119 9208562 9318845 9418088 9518072 9635015 9759677
12065 9759677 9871051 9971227 10081510 10207443 10332881 10449854 10569602 10697783 10821555
12056A0821555J10966J11605J28229J40172J36480J28845J28708J32297J33429
12047A1972286J33700J34565J33833J34078J40653J48307J45094J33443J31116
12038A3207075J44527J57025J53412J42328J41889J53368J62843J62836J58861
12029A4584164J56358J52752J45031J37961J40143J52963J66028J66324J52956
12020A5954680J39444J38102J45974J51260J49398J45571J44596J46546J50015
12011A7265586J51934J47534J38458J35242J41432J43081J28767J12125J14405
12002A8478564J30240J35249J25324J19605J22120J13713R2185Q5289J04236J17263
11992A9623788R7782P0461P3453R5984R5942O8547N2441O6211Q1115O8705M0983
$$ plain form
12056 10821555 10932521 11044126 11172355 11312527 11449007 11577852 11706560 11838857 11972286
12047 11972286 12105986 12240551 12374384 12508462 12649115 12797422 12942516 13075959 13207075
12038 13207075 13351602 13508627 13662039 13804367 13946256 14099624 14262467 14425303 14584164
12029 14584164 14740522 14893274 15038305 15176266 15316409 15469372 15635400 15801724 15954680
12020 15954680 16094124 16232226 16378200 16529460 16678858 16824429 16969025 17115571 17265586
12011 17265586 17417520 17565054 17703512 17838754 17980186 18123267 18252034 18364159 18478564
12002 18478564 18608804 18744053 18869377 18988982 19111102 19224815 19317000 19402289 19506525 19623788
11992 19623788 19721570 19792031 19865484 19961468 20057410 20125957 20178398 20244609 20325724 20394429 20435412
11981B0435412K5677K7421L2106L1258K5154J5260O965P986J3621O604j7496l7931
11969B0572037l4467j5105n427j7981m2858o2055o4250n1913m1116m7597o7320
11958B0121948p9755p5541o8944p5267q9182r6703r6788r7645j00956j03730j08123
11947A9129314j15770j19321j13596j08487j15780j28777j31258j23117j19796
11938A8053412j27075j33416j30165j24512j27115j37545j47091j48928j42887
11929A6834678j35525j34917j40257j40631j31424j25173j34485j50715j55040
11920A5586511j46214j39410j40010j38869j34232j36260j45020j46000j35774
11911A4324722j30721j38972j44748j35600j25187j29460j37721j31302j18366
$$ plain form
11981 20435412 20461089 20488510 20520616 20551874 20577028 20592288 20599253 20607239 20620860 20627464 20609968 20572037
11969 20572037 20537570 20522465 20517038 20499057 20456199 20394144 20329894 20277981 20236865 20189268 20121948
11958 20121948 20042193 19966652 19897708 19822441 19733259 19636556 19539768 19442123 19341167 19237437 19129314
11947 19129314 19013544 18894223 18780627 18672140 18556360 18427583 18296325 18173208 18053412
11938 18053412 17926337 17792921 17662756 17538244 17411129 17273584 17126493 16977565 16834678
11929 16834678 16699153 16564236 16423979 16283348 16151924 16026751 15892266 15741551 15586511
11920 15586511 15440297 15300887 15160877 15022008 14887776 14751516 14606496 14460496 14324722
11911 14324722 14194001 14055029 13910281 13774681 13649494 13520034 13382313 13251011 13132645
11902A3132645j22728j43499j53226j37772j14634j06005j12693j22313j27822
11893A1991953j29093j26459j20492j12871j05303j02080j09495j23804j26894
11884A0935462j09429r1591r9091j21710j23622r8479q2232r7546j17427j08750
11874I885585q5289q3431j02323j07606q9125p5406q5095r9604r7694q7666q6322
11863H886024q9242q4015p6177p8824q7248q6251p6366p1832p5842p7873p4606
11852H007748p4128p7581p5549o7369o5824p4693p8821o8329n7765o4655p9844
11841G223190p9470o2129n2074o2035p3915o7727n2936n2684o6586p1326n7737
11830F524571m5042n0335o3068o4214n6114n4174n8157n4172m2205l8427m7377
$$ plain form
11902 13132645 13009917 12866418 12713192 12575420 12460786 12354781 12242088 12119775 11991953
11893 11991953 11862860 11736401 11615909 11503038 11397735 11295655 11186160 11062356 10935462
11884 10935462 10826033 10734442 10635351 10513641 10390019 10291540 10209308 10111762 9994335 9885585
11874 9885585 9800296 9716865 9614542 9506936 9417811 9342405 9257310 9157706 9060012 8972346 8886024
11863 8886024 8796782 8712767 8636590 8557766 8470518 8384267 8307901 8236069 8160227 8082354 8007748
11852 8007748 7933620 7856039 7780490 7713121 7647297 7572604 7493783 7425454 7367689 7303034 7223190
11841 7223190 7143720 7081591 7029517 6967482 6893567 6825840 6772904 6720220 6653634 6582308 6524571
11830 6524571 6479529 6429194 6366126 6301912 6245798 6191624 6133467 6079295 6037090 5998663 5951286
11819E951286n4472n2641n3558o1726o1009m3933l2075m3817o0706n5021l6394
11808E395934l6162n3441n6376l7900k8620m3077n3849m0034k5003l6060n5963
11797D929449n1423k9483k5304m4013n5059m3648l0350l2806m0471l9547l6256
11786D501089m0098m4426l9886l2498l3230l9392l9169k8960j7626j6920l0474
11775D138410m7563m9833l3090j7614k3262l9772m1779k9415k7148l9941m1889
11764C747104k0227q58j0130l5401m6953m0134l1292k7137k3049k0759k4286k7346
11752C439532k4868k5787l4495l4719j6206j162j3536l6189l5152j5935j3715
11741C187768l1558l5217j4770l727k1331m0133l4185k0232k2315k9603k2468
$$ plain form
11819 5951286 5896814 5844173 5790615 5728889 5667880 5623947 5591872 5548055 5487349 5432328 5395934
11808 5395934 5359772 5306331 5249955 5212055 5183435 5140358 5086509 5046475 5021472 4985412 4929449
11797 4929449 4878026 4848543 4823239 4779226 4724167 4680519 4650169 4617363 4576892 4537345 4501089
11786 4501089 4460991 4416565 4376679 4344181 4310951 4271559 4232390 4203430 4185804 4168884 4138410
11775 4138410 4090847 4041014 4007924 3990310 3967048 3927276 3885497 3856082 3828934 3788993 3747104
11764 3747104 3726877 3726019 3715889 3680488 3633535 3593401 3562109 3534972 3511923 3491164 3466878 3439532
11752 3439532 3414664 3388877 3354382 3319663 3303457 3302295 3288759 3252570 3217418 3201483 3187768
11741 3187768 3156210 3120993 3106223 3102496 3081165 3041032 3006847 2986615 2964300 2934697 2912229
11730B912229j2082j7852k7938j9881l925p289k6578l3808k3457j6743k1396k2761
11718B678519j6161j4254j8384j4960o038j1113k9716l4965j7647n066j7202l2833
11706B460180k4059j682K561j5399k9932k5644j3758r539j3970k0357k3756k1003
11694B263642j2103l406k115p972j5479k0753k1076j4187m656l315j2197j8849
11682B127534j5361j2600k1735l1553k3195k083O402o330k0151j6556l204Q28
11670A981996r028k1797k6708k1299j0319l308p400j7501k0116j1408l495o807
11658A822810j4710j4259n783j121n579j2039j3399j2273j4939k0584k0921j0728
11646A676475K889N169q826k4199k1676l526O506n702k4247k4373o155P284K361
$$ plain form
11730 2912229 2900147 2882295 2854357 2834476 2830551 2823262 2796684 2762876 2739419 2722676 2701280 2678519
11718 2678519 2662358 2648104 2629720 2614760 2608722 2597609 2567893 2532928 2515281 2510215 2493013 2460180
11706 2460180 2436121 2434439 2437000 2421601 2391669 2366025 2352267 2342728 2328758 2308401 2284645 2263642
11694 2263642 2251539 2248133 2246018 2238046 2222567 2201814 2180738 2166551 2161895 2158580 2146383 2127534
11682 2127534 2112173 2099573 2077838 2046285 2023090 2021007 2027409 2021079 2000928 1984372 1981168 1981996
11670 1981996 1972968 1951171 1924463 1903164 1892845 1889537 1882137 1864636 1844520 1833112 1829617 1822810
11658 1822810 1808100 1793841 1788058 1786937 1781358 1769319 1755920 1743647 1728708 1708124 1687203 1676475
11646 1676475 1679364 1684533 1675707 1651508 1629832 1626306 1632812 1627110 1602863 1578490 1572335 1579619 1581980
11633A581980r856j3742j0029q849j2268j4031j1439q244p580q872j0468j0541
11621A456061p456l607n217j2839j6708r440J051J925m492m928R24j924j6710
11608A376640k4027j0677O324L316j3203j6565k198N837n730j8408j2276L102
11596A292135N297p222j7159j6405j3078j3233j2653q346m473l614k600m8O97
11583A199298j312k467k065m386j0192j2891p370J898N649M90p766j0951q010
11570A139925o316j0631j2997k614J3183J1906j1732l1078k1263L948J0909m900
11558A078340j5205n083N771j792j5536j4040j050L723l184p418k441K394o82
11545A023797p393j0738j0110q326o492m009o24J743o65p403r586m13J0495O396
$$ plain form
11633 1581980 1572124 1558382 1548353 1539504 1527236 1513205 1501766 1493522 1485942 1477070 1466602 1456061
11621 1456061 1448605 1444998 1439781 1426942 1410234 1400794 1401845 1403770 1399278 1394350 1395274 1393350 1376640
11608 1376640 1352613 1341936 1348260 1351576 1338373 1321808 1319610 1325447 1319717 1301309 1289033 1292135
11596 1292135 1297432 1290210 1273051 1256646 1243568 1230335 1217682 1209336 1204863 1201249 1198649 1198601 1199298
11583 1199298 1197986 1195519 1193454 1189068 1178876 1165985 1158615 1160513 1166162 1166652 1158886 1147935 1139925
11570 1139925 1133609 1122978 1109981 1107367 1120550 1132456 1120724 1089646 1068383 1072331 1083240 1078340
11558 1078340 1063135 1058052 1063823 1062031 1046495 1032455 1031405 1035128 1031944 1024526 1022085 1024479 1023797
11545 1023797 1016404 1005666 995556 987230 980738 976729 976105 977848 977183 969780 960194 959781 970276 976672
11531I76672j0609j9127r931O78q41m309P65J762j3167k5264r824J9678K5769
11518I32252K254j8339j5382m817m377o101L75M149o176j7704j1860M996J0636
11505H69906p27j3179j2520j024R382R248j183j1373j0920l069p68p653j3456
11492H12664j0768l888K381Q707J2101O435l294m643k45n388j6961j1864J1438
11479G96675K0265k657k6609j8774M131O207p872o826P983N852j4519j9144J660
11466G46372J4549n48j7264q200J1517J2963j336r143n785k902l600k603j360
11453G32660l475l820J972O877M886K057K249l118j5859j8770k080J4281Q160
11440G26020r342j2318k048l77q423n544J0355J4922k336j9138j4900J84O077
$$ plain form
11531 976672 966063 946936 937005 937683 936842 932533 933298 935060 921893 896629 886805 906483 932252
11518 932252 934506 916167 900785 895968 891591 885490 885865 890014 883838 866134 854274 859270 869906
11505 869906 869179 856000 843480 842456 851838 861086 859903 848530 837610 834541 833773 826120 812664
11492 812664 801896 798008 800389 809096 821197 827632 824338 819695 819450 814062 797101 785237 796675
11479 796675 816940 814283 787674 768900 773031 779238 771366 764540 772523 778375 763856 744712 746372
11466 746372 760921 760373 743109 734909 746426 759389 758053 748910 743125 740223 736623 734020 732660
11453 732660 729185 725365 727337 734214 739100 741157 743406 740288 724429 705659 703579 717860 726020
11440 726020 716678 704360 702312 701935 693512 687968 698323 713245 710909 691771 676871 677055 683132
11427F83132K859J762J812m610j2185q574L800R413L643o91M812R362j91j6616
11413F77728k0163p339L289q77p541j253Q666K489j4186j5479K308J2186M23j0390
11399F29861r12J0224r07j8947j2949J0146J5395k830j4360n580K491k452k250
11386F06930J2805J8893k697k9639k9331n901J0868R240J996p10m70J609N760
11373E99353O231n68o310l704p76o317j1202l249Q192M572j0451j5113l405P485
11359E64738N399j470j884K875O159N465Q47n231n619K577Q082j849j9777k4646
11345E35666j0852M937Q320L402R41L891Q625R240k78j6599k2091n179J7023J6795
11331E53841l845j4763l177R354M665m764k405K958l447j2900p772O895J0837
$$ plain form
11427 683132 685991 687753 689565 684955 672770 664196 667996 677409 681052 680361 685173 694535 694344 677728
11413 677728 657565 650226 653515 652638 645097 643844 652510 654999 640813 625334 627642 639828 640251 629861
11399 629861 628949 639173 638266 619319 606370 616516 631911 629081 614721 609141 611632 609180 606930
11386 606930 619735 638628 635931 606292 576961 571060 581928 591168 593164 592454 591984 593593 599353
11373 599353 605584 605016 598706 595002 594226 587909 576707 573458 581650 586222 575771 560658 557253 564738
11359 564738 570137 568667 566783 569658 575817 581282 582129 576898 571279 573856 581938 580089 560312 535666
11345 535666 524814 529751 538071 541473 542414 546305 554930 564170 563892 547293 525202 520023 537046 553841
11331 553841 549996 535233 532056 541410 546075 541311 538906 541864 538417 525517 517745 524640 535477
11318E35477K92r288p875o0O842Q329J099j0541j3373l693L144l021o922O657
11304E07067K0856R270j7891k4265l005J3446N574o450j911O896J114j1076j1835
11291D87790m753l227l229O521J8241J4759j157j0641p522j661K051O012N145
11278E08329o642j7248q921R553J0591p940j5794J585J7918P964j1538r367J0470
11265D88960J7210K083j2106r098O91K805j132l761m875n694l886p83j581m084
11251D64749k96P170N982l592n139O464J2885R32j4223j2097J719P897N115N776
11237D83342Q336P11j1691r303P326J3693k28j3233p380M125J479q479o141O524
11223D69081R938j42o895k85R153Q979J487m983q672j0201n541O562J5297P546
$$ plain form
11318 535477 535769 526481 518606 518546 525388 533717 534816 524275 510902 507209 510353 507332 500410 507067
11304 507067 527923 537193 519302 495037 492032 505478 511052 504602 502691 509587 510701 499625 487790
11291 487790 483037 479810 476581 483102 501343 516102 514945 504304 496782 495121 497172 503184 508329
11278 508329 501687 484439 475518 485071 495662 487722 471928 473513 491431 499395 487857 478490 488960
11265 488960 506170 508253 496147 487049 487740 490545 489413 485652 480777 475083 471197 470414 468833 464749
11251 464749 464453 471623 477605 474013 468874 475338 488223 489155 474932 462835 464554 472451 477566 483342
11237 483342 491678 492389 480698 471395 478721 492414 492186 478953 471573 475698 477177 468698 462557 469081
11223 469081 479019 478877 471982 471697 480850 489829 491316 486333 477661 467460 461919 468481 483778 491324
11209D91324j2355k2489r317J2136J4855l897j6675l438J8849K0058L51j2918
11197D76484q460l750r038p864J0717K5854J4612j0283j8850p331L830O319R140
11184D81380J2232M954q352r978K52L108n551o811N682J1310j317j1157J170J8670
11170D95592J3063j0878k2777j0610P270J1405K354q056j1144n528K996O127L823
11157D73637N100J2011J2877J268r866o730K981K858n591p505j06N495M788L939
11143D95156M954L946K931O618Q873J24j2772j3026p83O365J833j753K596M457
11129E09519k759q476l700L923N414N346Q994Q929j355j2057r981J598Q912O482
11115E20789j135q797j1615m529Q303J2266J758q158k281J1429J3921L176o116
$$ plain form
11209 491324 478969 456480 447163 459299 474154 470257 453582 450144 468993 489051 489402 476484
11197 476484 468024 464274 455236 447372 458089 483943 498555 488272 469422 462091 465921 472240 481380
11184 481380 493612 498566 490214 480236 480488 483596 478045 471234 476916 488226 486909 475752 476922 495592
11170 495592 508655 497777 475000 464390 471660 483065 485419 477363 466219 460691 463687 469814 473637
11157 473637 478737 490748 503625 504893 495027 488297 491278 494136 488545 481040 480934 486429 491217 495156
11143 495156 500110 504056 506987 513605 522478 522602 509830 496804 496021 502386 504219 502466 505062 509519
11129 509519 506760 498284 494584 498507 503921 509267 518261 527190 525835 513778 503797 505395 514307 520789
11115 520789 519654 510857 499242 494713 503016 515282 517040 508882 506601 518030 531951 535127 529011
11102E29011o101k218J142M685M706m057j4709j2957J187J0939O788l44L270J4403
11088E35745J9056J0819m270j5920j7078p651M629J0358Q021L707R26k693o840
11075E38809n151M483J3081J1199K459p84N954J3398J0637q91q718m246O656J1147
11061E98033O564L805J0165J5974P496j0304j6412j542J8145K2035J1155L368
11049F68482P307J2902R006K27l42J0117K0590K1101J4266R106Q505Q379O865
11036G96511P417J1839J5955J5145J0864Q973J3319K1639K6461K2062J3622J4910
11024I78717K9613M0497L0355J0518R691L2032M8798M1300K8464L3464M4577L6717
11012A364743J7126J6561M0083O0027O0229N5519N9232O1386N2971M6213N3091
$$ plain form
11102 529011 522910 520692 521834 526519 531225 527168 512459 499502 500689 511628 518416 518072 521342 535745
11088 535745 554801 565620 561350 545430 528352 520701 525330 535688 543709 547416 548342 545649 538809
11075 538809 533658 538141 551222 562421 564880 564096 570050 583448 594085 593194 584476 580230 586886 598033
11061 598033 604597 608402 618567 634541 642037 631733 615321 613779 631924 653959 665114 668482
11049 668482 675789 688691 697697 697924 697582 707699 728289 749390 763656 772762 781267 789646 796511
11036 796511 803928 815767 831722 846867 857731 866704 880023 901662 928123 950185 963807 978717
11024 978717 1008330 1048827 1079182 1089700 1099391 1131423 1180221 1221521 1249985 1283449 1328026 1364743
11012 1364743 1381869 1398430 1438513 1498540 1558769 1614288 1673520 1734906 1787877 1834090 1887181
11001A887181O3890O4550N8457N4950N3000N2495O3550Q5592R5633Q0622O4274
10990B624194P3491R2458Q4132M9572K7950L6934N1699N2317N3931P0576Q2889
10979C300143P1012N4690O4837Q8683Q1892L4747r847j4993L815R785p25j778
10967C682261J5650L0425K6231J4249J0479R686k621k5058m4407n6876o7602p3657
10955C518760o6875n2916m8051n3802n3782m1611l2884m0206n4530o3453p0699
10944B939951q2644r1501q9313q4410q5315q2363o6624n3163n9436p2299o6951
10933B105932n0618n2429p2210p7727n8304m2500m9217n8407n0658m1801n0730
10922A501331o1627n0889k9774k5011l2738k8749j4745j5419l1830l6437k0152
$$ plain form
11001 1887181 1951071 2015621 2074078 2129028 2182028 2234523 2298073 2383665 2479298 2559920 2624194
10990 2624194 2697685 2790143 2874275 2923847 2951797 2988731 3040430 3092747 3146678 3217254 3300143
10979 3300143 3371155 3425845 3490682 3579365 3661257 3696004 3686157 3671164 3674979 3684764 3684039 3682261
10967 3682261 3697911 3728336 3754567 3768816 3779295 3788981 3786360 3761302 3716895 3660019 3592417 3518760
10955 3518760 3451885 3398969 3350918 3297116 3243334 3201723 3168839 3128633 3074103 3010650 2939951
10944 2939951 2857307 2765806 2676493 2592083 2506768 2424405 2357781 2304618 2245182 2172883 2105932
10933 2105932 2055314 2002885 1930675 1852948 1794644 1752144 1702927 1644520 1593862 1552061 1501331
10922 1501331 1439704 1388815 1359041 1334030 1301292 1272543 1257798 1242379 1210549 1174112 1153960
10911A153960q264j7303k8095k0056n598p178j9660k1349j0558n348j1467j4762
10899I84322p133O36j804q459r554p427q932j0772n534K306P11r362j2204j094
10885I05700R401M671p344q914o89L81j0403j7537j0248J177K206n710j1047q531
10871H43113q76P388J0924O959K238N543R790j209k1556k1802O511K8862J4787
10858H90672j3999j4970J0217K1202M399r223J612J6222J0548m868p692L12L921
10845I08353K623M852P397K159n841n857P99N919R007J2221J0372J316l525M091
10831I53886J1541L472j0382p272J2701K5181J6926J876k724J402L042J08q03
10818A008954L278P564O401J533J721J0665J7054P221j0764j1592J0348K6672
$$ plain form
10911 1153960 1145696 1128393 1100298 1080242 1074644 1067466 1047806 1026457 1015899 1010551 999084 984322
10899 984322 977189 977825 976021 967562 958008 950581 941649 930877 925343 927649 928360 918998 906794 905700
10885 905700 915101 919772 912428 903514 902825 903206 892803 875266 865018 866195 868401 862691 851644 843113
10871 843113 842237 849625 860549 867508 869746 875289 885079 883870 862314 840512 847023 875885 890672
10858 890672 876673 861703 871920 893122 897521 888298 889910 906132 916680 911812 904120 904432 908353
10845 908353 910976 915828 923225 925384 919543 913686 914485 920404 929411 941632 952004 953320 949795 953886
10831 953886 965427 968899 958517 951245 963946 989127 1006053 1007929 1005205 1006607 1009649 1009757 1008954
10818 1008954 1012232 1019796 1026197 1027730 1029451 1040116 1057170 1064391 1053627 1042035 1052383 1079055
10806A079055J3556j1946j6218K998J9390K0128J5645J1049j74j1592n256J4325
10794A130960J8588j50j2492J620J9161J1679p288m078K0523L2427J5986n966
10782A220970q170M995J2561O182l471j870J3638K9862K9649J1391o955q455L503
10769A303830J3121J2896P945N624R866J9877K6363J7400k216q793Q953K8284
10757A443150K1671j899r576O446K0723J6909R218J2750J9012J5878J0020J1848
10745A576150J5654J3082J1604J9797K6865J8640M630N504J8743K1681Q774Q72
10733A741996J1305K5136K3883J3260J1031J9185K4498K0897J6126J7200K1472
10722A945989K3729K3383K1929J9570J7082J6886J9883K3782K5438K3079J6834
$$ plain form
10806 1079055 1092611 1080665 1064447 1067445 1086835 1106963 1122608 1133657 1133483 1121891 1116635 1130960
10794 1130960 1149548 1149398 1136906 1138526 1157687 1169366 1162078 1158000 1178523 1210950 1226936 1220970
10782 1220970 1212800 1217795 1230356 1236538 1233067 1231197 1244835 1274697 1304346 1315737 1308782 1300327 1303830
10769 1303830 1316951 1329847 1337792 1343416 1353282 1373159 1399522 1416922 1414706 1405913 1414866 1443150
10757 1443150 1464821 1462922 1453346 1459792 1480515 1497424 1506642 1519392 1538404 1554282 1564302 1576150
10745 1576150 1591804 1604886 1616490 1636287 1663152 1681792 1686422 1691926 1710669 1732350 1741124 1741996
10733 1741996 1753301 1778437 1802320 1815580 1826611 1845796 1870294 1891191 1907317 1924517 1945989
10722 1945989 1969718 1993101 2015030 2034600 2051682 2068568 2088451 2112233 2137671 2160750 2177584
10711B177584R938Q229J4168K1859K3160J9048J8584K4635K8162K1990J3428J4449
10699B395234K3624K8713K6031K4861K9658L0721K0778J0630J5830L3149M3390
10688B682619L6708K3382J8096K4075L5169M3551M1876K8139J3543J5231L3963
10677B996352M9094M5222L3844L4946M5646M6031L3291K8037M1400N6483N4707
10666C465053M3904M3006N0557M9430L7885L3604M4611N6162N3834M3428L8498
10655C959972M1637M8344N6944O3301N8449M5479M5546O8192Q7702P4376M2313
10644D592255L4822O1242Q2785P2308N3785N9406P7152P4775N6670N6613P9867
10633E301680R2738P6449N6546O2982Q7123R8553Q7884P3214P2928Q7515J03707
$$ plain form
10711 2177584 2187522 2195751 2209919 2231778 2254938 2273986 2292570 2317205 2345367 2367357 2380785 2395234
10699 2395234 2418858 2447571 2473602 2498463 2528121 2558842 2579620 2590250 2606080 2639229 2682619
10688 2682619 2719327 2742709 2760805 2784880 2820049 2863600 2905476 2933615 2947158 2962389 2996352
10677 2996352 3045446 3090668 3124512 3159458 3205104 3251135 3284426 3312463 3353863 3410346 3465053
10666 3465053 3508957 3551963 3602520 3651950 3689835 3723439 3768050 3824212 3878046 3921474 3959972
10655 3959972 4001609 4049953 4106897 4170198 4228647 4274126 4319672 4387864 4475566 4549942 4592255
10644 4592255 4627077 4688319 4771104 4843412 4897197 4956603 5033755 5108530 5165200 5221813 5301680
10633 5301680 5394418 5470867 5527413 5590395 5677518 5776071 5863955 5937169 6010097 6097612 6201319
10622F201319J06977R4594Q1352Q4469R9990J06933R9085R5142J08000J23084
10612G200945J22950J16318J21619J34689J37225J29532J29102J39567J46705
10603H378652J46614J52501J67559J75331J67954J63002J77227J99938K09748
10594I938526K06456K07914K20979K33470K35255K33116K39960K57527K75213
10585A2048416K83371K84309K89262L04562L23238L33912L36190L41080L55671
10576A4900011L74092L86194L89958L92580M02684M22518M44620M57817M61447
10567A8631921M69903M94391N23860N37127N33083N33388N52344N80156O01961
10558B3458134O17240O31269O43202O55053O78349P16853P54256P75104P88195
$$ plain form
10622 6201319 6308296 6402890 6484242 6568711 6668701 6775634 6874719 6969861 7077861 7200945
10612 7200945 7323895 7440213 7561832 7696521 7833746 7963278 8092380 8231947 8378652
10603 8378652 8525266 8677767 8845326 9020657 9188611 9351613 9528840 9728778 9938526
10594 9938526 10144982 10352896 10573875 10807345 11042600 11275716 11515676 11773203 12048416
10585 12048416 12331787 12616096 12905358 13209920 13533158 13867070 14203260 14544340 14900011
10576 14900011 15274103 15660297 16050255 16442835 16845519 17268037 17712657 18170474 18631921
10567 18631921 19101824 19596215 20120075 20657202 21190285 21723673 22276017 22856173 23458134
10558 23458134 24075374 24706643 25349845 26004898 26683247 27400100 28154356 28929460 29717655
10549B9717655Q12022Q46049Q75898R00521R32577R73757J011089J039791J071211
10540C8180570J114568J167121J225564J291098J359723J423377J484931J556152
10532D8803104J636669J712102J778834J852447J943466K042943K143028K254032
10524F4166625K387088K535329K687695K847366L020175L197798L370209L542921
10516H7755206L724352L910957M107693M346889M651827M986572N279034N499035
10508A24261565N680939N862879O043654O220869O436354O748595P178087P707698
10500A76140640Q313179Q948706R510802R869717R959562R816412R526101R174457
10492B51259576Q865111Q736299Q902281R380782J0108675J1010538J1994634
$$ plain form
10549 29717655 30529677 31375726 32251624 33152145 34084722 35058479 36069568 37109359 38180570
10540 38180570 39295138 40462259 41687823 42978921 44338644 45762021 47246952 48803104
10532 48803104 50439773 52151875 53930709 55783156 57726622 59769565 61912593 64166625
10524 64166625 66553713 69089042 71776737 74624103 77644278 80842076 84212285 87755206
10516 87755206 91479558 95390515 99498208 103845097 108496924 113483496 118762530 124261565
10508 124261565 129942504 135805383 141849037 148069906 154506260 161254855 168432942 176140640
10500 176140640 184453819 193402525 202913327 212783044 222742606 232559018 242085119 251259576
10492 251259576 260124687 268860986 277763267 287144049 297252724 308263262 320257896
10485C20257896J2874569J3367450J3243097J2483260J1274662R867023Q480440
10478D01848397P333559O670208O676347P361738Q543980R931129J1186800J1946538
10470D71498696J1877796J0817886Q871088O354648L661261J181993p05767j700540
10462E11857061j702502q65875M89335J983920L194050L667227L072185J385732
10454E23081133j106546l996878o889434r376768j1047146j1662953j1321008
10447D67680400j0353778r083945p747837o618388o039883o245772p196947q655399
10439D05738451j0356109j2042593j3413108j4182549j4245043j3721597j2832913
10432C14944539j1775051j0716665r824956r223520q945013q957624r210331r619705
$$ plain form
10485 320257896 333132465 346499915 359743012 372226272 383500934 393367957 401848397
10478 401848397 409181956 415852164 422528511 429890249 438434229 448365358 459552158 471498696
10470 471498696 483376492 494194378 503065466 509420114 513081375 514263368 513557601 511857061
10462 511857061 510154559 509288684 509778019 511761939 514955989 518623216 521695401 523081133
10454 523081133 521974587 517977709 511088275 501711507 490664361 479001408 467680400
10447 467680400 457326622 448242677 440494840 433876452 427836569 421590797 414393850 405738451
10439 405738451 395382342 383339749 369926641 355744092 341499049 327777452 314944539
10432 314944539 303169488 292452823 282627867 273404347 264459334 255501710 246291379 236671674
10424B36671674j0044498j0328567j0378362j0183719r780164r220361q570749
10417A68165254p897436p242956o627163o063718n558377n100620m680947m312506
10409A20681531m013628l773104l556980l347600l150994k967014k782083k597820
10401I4492308k437821k312854k203225k090674j986477j909881j855733j803422
10393G7892221j745285j686903j628605j565467j499543j435602j370389j301648
10385F5658779j241517j203683j181150j154244j118252j085477j061180j036499
10377E6576777j007050r79199r52642r15501q65853q21921p98711p87377p70635
10368D8677888p47467p27445p09130o82691o51212o30776o25526o18216n93744
$$ plain form
10424 236671674 226627176 216298609 205920247 195736528 185956364 176736003 168165254
10417 168165254 160267818 153024862 146397699 140333981 134775604 129674984 124994037 120681531
10409 120681531 116667903 112894799 109337819 105990219 102839225 99872211 97090128 94492308
10401 94492308 92054487 89741633 87538408 85447734 83461257 81551376 79695643 77892221
10393 77892221 76146936 74460033 72831428 71265961 69766418 68330816 66960427 65658779
10385 65658779 64417262 63213579 62032429 60878185 59759933 58674456 57613276 56576777
10377 56576777 55569727 54590528 53637886 52722385 51856532 51034611 50235900 49448523 48677888
10368 48677888 47930421 47202976 46493846 45811155 45159943 44529167 43903641 43285425 42691681
10359D2691681n60894n39688n33475n25962n05308m79467m62402m53598m40675
10350C8190212m19607m01094l93670l89892l77359l57580l43581l40670l40403
10341C4826356l34644l25001l14687l01783k87165k79571k82810k85157k73516
10332C2142022k54205k46305k54567k62368k55686k42166k38178k44949k47914
10323B9895684k37577k21770k15009k21030k29943k31346k26406k24307k28574
10314B7859722k32366k29200k22877k21579k26501k32644k37056k38620k33689
10305B5785190k22599k16935k26320k39102k33977k13851k07258k26528k46164
10296B3752456k40410k22929k23572k39199k39779k19554k07314k18972k32214
$$ plain form
10359 42691681 42130787 41591099 41057624 40531662 40026354 39546887 39084485 38630887 38190212
10350 38190212 37770605 37369511 36975841 36585949 36208590 35851010 35507429 35166759 34826356
10341 34826356 34491712 34166711 33852024 33550241 33263076 32983505 32700695 32415538 32142022
10332 32142022 31887817 31641512 31386945 31124577 30868891 30626725 30388547 30143598 29895684
10323 29895684 29658107 29436337 29221328 29000298 28770355 28539009 28312603 28088296 27859722
10314 27859722 27627356 27398156 27175279 26953700 26727199 26494555 26257499 26018879 25785190
10305 25785190 25562591 25345656 25119336 24880234 24646257 24432406 24225148 23998620 23752456
10296 23752456 23512046 23289117 23065545 22826346 22586567 22367013 22159699 21940727 21708513
10287B1708513k24471k09128k10895k24392k24524k08303j99372k11561k29876
10278A9765991k32344k15602j93863j82705j86991j97763k00765j93326j88648
10269A7973984j95870k03701j96895j82065j78879j88444j91676j81310j73449
10260A6281695j79083j85042j77450j66863j71167j84677j85754j71055j61285
10251A4699319j69677j82352j79216j63008j54724j63615j74282j68545j51915
10242A3191985j47127j61833j75712j67410j43948j30167j35381j46701j52677
10233A1831029j54739j53412j43592j30399j30018j43681j49368j33904j15970
10224A0575946j18334j32197j32515j18394j11803j20078j26250j19001j08621
$$ plain form
10287 21708513 21484042 21274914 21064019 20839627 20615103 20406800 20207428 19995867 19765991
10278 19765991 19533647 19318045 19124182 18941477 18754486 18556723 18355958 18162632 17973984
10269 17973984 17778114 17574413 17377518 17195453 17016574 16828130 16636454 16455144 16281695
10260 16281695 16102612 15917570 15740120 15573257 15402090 15217413 15031659 14860604 14699319
10251 14699319 14529642 14347290 14168074 14005066 13850342 13686727 13512445 13343900 13191985
10242 13191985 13044858 12883025 12707313 12539903 12395955 12265788 12130407 11983706 11831029
10233 11831029 11676290 11522878 11379286 11248887 11118869 10975188 10825820 10691916 10575946
10224 10575946 10457612 10325415 10192900 10074506 9962703 9842625 9716375 9597374 9488753
10215I488753j06609j09145j08966j07828j08638j08058j04168j00759r8807r4387
10205H441388q8815q9074r4586r6009r0880q7192q7984q7063q3984q6565r2739
10194G456497q8525p2854o5047p5343q6792q2299p1874p3365q1388p8539o6709
10183F613762o2619o8230o9741o3792o1909o7983p1844o7906o2157n7891n1735
10172E907955m6805n2344o5652p1078o3042n4470n5149n7084n1130m4712n0017
10161E296472o2933o6913n5107l8673l2322l7388m2164l8282l3281m0668n7613
10150D791128o4036n0415l3958l4500m5520m6545l5709k9022l2534l7426m0104
10139D341359m4091m3846l1667j9763k7173m4118m1976k2560j9523m0421m9607
$$ plain form
10215 9488753 9382144 9272999 9164033 9056205 8947567 8839509 8735341 8634582 8535775 8441388
10205 8441388 8352573 8263499 8168913 8072904 7982024 7894832 7806848 7719785 7635801 7549236 7456497
10194 7456497 7367972 7295118 7230071 7154728 7067936 6985637 6913763 6840398 6759010 6680471 6613762
10183 6613762 6551143 6482913 6413172 6349380 6287471 6219488 6147644 6079738 6017581 5959690 5907955
10172 5907955 5861150 5808806 5743154 5672076 5609034 5554564 5499415 5442331 5391201 5346489 5296472
10161 5296472 5233539 5166626 5111519 5072846 5040524 5003136 4960972 4922690 4889409 4848741 4791128
10150 4791128 4727092 4676677 4642719 4608219 4562699 4516154 4480445 4451423 4418889 4381463 4341359
10139 4341359 4297268 4253422 4221755 4201992 4174819 4130701 4088725 4066165 4046642 4006221 3956614
10128C956614k8831j1550k6246m6195l6510j5817k1373m0412l4061j1653j7359
10117C666607m8261n2473j7561M247j8947m8039m0432j6726j7596l5049l5091
10106C340679k0084j8514l0394l1192k0609k1724l4438l3187j4411n999k0162
10095C089965l2976k5036j1364j2739k2720k3924j7776j6464j8871j5760j0778
10084B881557j6082k9806l5194k3995q146m143j3555k3443k2444j2889o680j0591
10072B674589j8761k1943j9954j8645j7798j2024l769l832j4551k3080j8836r334
10060B492062r135j8513k3783j7124o370l487j0138j7586j7421j0252m886q336
10048B345031j5990j5349l052O499k602k4406l4521k0459J184O188n712j3191
$$ plain form
10128 3956614 3927783 3916233 3889987 3843792 3807282 3791465 3770092 3729680 3695619 3683966 3666607
10117 3666607 3618346 3565873 3548312 3552559 3533612 3485573 3445141 3428415 3410819 3375770 3340679
10106 3340679 3320595 3302081 3271687 3240495 3219886 3198162 3163724 3130537 3116126 3110127 3089965
10095 3089965 3056989 3031953 3020589 3007850 2985130 2961206 2943430 2926966 2908095 2892335 2881557
10084 2881557 2865475 2835669 2800475 2776480 2768334 2764191 2750636 2727193 2704749 2691860 2685180 2674589
10072 2674589 2655828 2633885 2613931 2595286 2577488 2565464 2561695 2557863 2543312 2520232 2501396 2492062
10060 2492062 2482927 2464414 2440631 2423507 2417137 2413650 2403512 2385926 2368505 2358253 2353367 2345031
10048 2345031 2329041 2313692 2310640 2317139 2314537 2290131 2255610 2235151 2236335 2242523 2236811 2223620
10036B223620n201M417o61j5292k2179j6551q154l499j014k370j1897k1941j6253
10023B103025M239J5334J584j9569k1690o300L725Q33k66P729J1394P58j2153
10010B088643j1212L92P538N591K971O142J3076J9384K2301J9742J2642P482J0656
9997B205348K0415K8865L1414L0167K8677K7931K8236L1331L7759M3584M3193
9986B556920L7003L3567L9775N0653N5793N5381N9384O7796O5852M8570L5821
9975C106515M6182O6915P1936O2584O3498P8870Q3552O5844M9005N3450O3475
9964C811826N4783L5375L2094M8446O2738O2564N6891N5619N7660N9103N6111
9953D393210M1459J4234j0008j5541q926p238r130M7J7214K1470P539o241r782
$$ plain form
10036 2223620 2218419 2222836 2222175 2206883 2184704 2168153 2159999 2156500 2155486 2153116 2141219 2119278 2103025
10023 2103025 2107264 2122598 2124182 2104613 2082923 2076623 2080348 2081181 2080915 2088644 2100038 2100796 2088643
10010 2088643 2077431 2077823 2085361 2090952 2093923 2100065 2113141 2132525 2154826 2174568 2187210 2194692 2205348
9997 2205348 2225763 2254628 2286042 2316209 2344886 2372817 2401053 2432384 2470143 2513727 2556920
9986 2556920 2593923 2627490 2667265 2717918 2773711 2829092 2888476 2956272 3022124 3070694 3106515
9975 3106515 3152697 3219612 3291548 3354132 3417630 3496500 3580052 3645896 3694901 3748351 3811826
9964 3811826 3866609 3901984 3934078 3982524 4045262 4107826 4164717 4220336 4277996 4337099 4393210
9953 4393210 4434669 4448903 4438895 4423354 4414428 4407190 4398060 4398107 4415321 4436791 4444330 4438089 4428307
9940D428307j6742l8263o3484p8517q5104q7361p9185o0046m6063m8205n4265
9929C771072n0110m5003n5732p6449q6423q1925p9393q8427r9926j02096r3889
9918B911699q1077o9777o3960o1504n5996m9381n4598p4809r0154q1617o0319
9907B168507n3474o5592p4591o5671m7894l4824k9061l0567m0425m9853m4418
9896A632137k7301j9801k9225l5882k5236j3101j9643l4551l2443j3496k663j0996
9884A367799k2594k3106j8653j8580j8825j4029j1012j6269k0893j2981J514N254
9872A197625o031j9075k2573j8512j2941p548l781m465o934m795n36m326j4478
9859A071630j4327J50O129j3522l6867k9036M401K1764N750j3753r495K995k227
$$ plain form
9940 4428307 4411565 4373302 4309818 4231301 4146197 4058836 3979651 3919605 3873542 3825337 3771072
9929 3771072 3720962 3675959 3620227 3543778 3457355 3375430 3296037 3207610 3107684 3005588 2911699
9918 2911699 2830622 2760845 2696885 2635381 2579385 2530004 2475406 2400597 2310443 2228826 2168507
9907 2168507 2115033 2049441 1974850 1909179 1861285 1826461 1797400 1766833 1726408 1676555 1632137
9896 1632137 1604836 1585035 1555810 1519928 1494692 1481591 1461948 1427397 1394954 1381458 1378795 1367799
9884 1367799 1345205 1322099 1303446 1284866 1266041 1252012 1241000 1224731 1203838 1190857 1192371 1197625
9872 1197625 1191594 1172519 1149946 1131434 1118493 1110945 1107164 1102699 1095765 1090970 1090434 1086108 1071630
9859 1071630 1057303 1057453 1063582 1050060 1013193 984157 988558 1010322 1016072 1002319 992824 995819 993592
9846I93592j6526j5367l440n055j8350j6261O087J9850O994j3324j6220m968K243
9833I19255O72k064k048Q5M174O290N1j0056r946J390O372l588j2070l591J0862
9818I05788J2107K749j682p74o108j6538j8944j1593o946j0845j5752j5494j2131
9805H03837q234n085o772j3262j3651j088J0932N388r862j2313j440K9j5230k5433
9791G07816j4450L046N754l407p424k844k86n070j1522j2788p122J575M756k593
9777F55441j2084j0349K74L500m500q068O30O682j883j1969p044M555M056o682
9763F12559j0849n379j559k354j330m79o662j2309l159J4087J5891k048j6306
9750E80103j0855J226J710o829j2188j2898j2798q848O23O483J836n087m824l235
$$ plain form
9846 993592 977066 961699 958259 953204 934854 918593 924680 944530 951524 938200 921980 917012 919255
9833 919255 919927 917863 915815 915900 920074 926364 926415 916359 906413 907803 914175 910587 898517 894926 905788
9818 905788 917895 920644 918962 918188 912080 895542 876598 865005 858059 847214 831462 815968 803837
9805 803837 795603 790518 783746 770484 756833 755745 766677 772065 762203 749890 748450 748479 733249 707816
9791 707816 693366 696412 702166 698759 691335 688491 688205 683135 671613 658825 651703 653278 658034 655441
9777 655441 643357 633008 633282 636782 632282 624214 624844 631526 629643 617674 610630 615185 619241 612559
9763 612559 601710 596331 594772 592418 591088 590609 583947 571638 568479 582566 598457 596409 580103
9750 580103 569248 570474 572184 565355 553167 540269 527471 518623 519246 525729 527565 522478 517654 514419
9736E14419q747j2862k805J2524J1378o409j6070m544R982O641o726p820M515
9723D93476R173l901j8331j5921k045N255K057l80K457K192m271o663M39N526
9709D69063j305r608n056M200r73j6414j6761L776J7999N842j3884j1872O783
9696D31790J1122q387k6262j9166L775J6869J0631k386p666m305r01k138l223
9683C99753J581P942N564n576j1968n350L959K116p010q576l45N013N86o221p847
9668C73621o255m914k826n68j589l800r51M486K638n251m900O892J2663J338j0798
9653C59786l730J3576J5722l85j2697r412l687p276j0834k668Q844P362n784j3555
9639C35262p475L364P966O579M276m5j0355k1943k2214p112R061Q981l823p836
$$ plain form
9736 514419 505672 492810 490005 502529 513907 507498 491428 486884 496866 503507 496781 488961 493476
9723 493476 502649 498748 480417 464496 462451 467706 469763 469383 471840 474032 469761 463098 463537 469063
9709 469063 467758 458150 453094 457294 456321 439907 423146 426922 444921 450763 436879 425007 431790
9696 431790 442912 434525 408263 389097 392872 409741 420372 417986 410320 406015 405114 402976 399753
9683 399753 401334 409276 414840 409264 397296 391946 395905 398021 391011 382435 382090 387103 387689 381468 373621
9668 373621 367366 362452 359626 359058 357469 353669 352718 357204 359842 354591 349691 356583 369246 370584 359786
9653 359786 356056 369632 385354 384969 372272 362860 359173 351897 341063 338395 347239 354601 348817 335262
9639 335262 327787 331151 339117 345696 349972 349927 339572 317629 295415 288303 297364 306345 302522 294686
9625B94686N673J7499P413j3895j7400L161K2334J8226j214j4775j5224r243k668
9612B94573J663J65n807p800l448k714j0054j1868K569J7974J1752j0070j9176
9599B57759o879N126J335m552L926J6690J2725p030k0970j5932p7J1162J0506
9586B63789J273p130p054j062Q45l704m567M470J3360R909j402o957m905m924
9572B51941r584r716L27J3131J6268M288j5637k5331r907K0806L4204J2345k0431
9559B62704k5861k437J4983N463j3563j8243r780j519L972Q507N853o104j3583
9546B10392n252P961Q953R56n87N124N631j255n653n363p733j1894q310K071O912
9531B01953L879M152R673O732q790j8790q930Q131J1535K312l068j112l114j0944
$$ plain form
9625 294686 300359 317858 325271 311376 293976 297137 319471 337697 336483 321708 306484 297241 294573
9612 294573 296236 296401 290594 282794 279346 276632 266578 254710 257279 275253 287005 276935 257759
9599 257759 250880 256006 257341 252789 256715 273405 286130 279100 258130 242198 242121 253283 263789
9586 263789 265062 257932 250878 249816 250661 246957 242390 246860 260220 270129 268727 261770 256865 251941
9572 251941 242357 232641 232968 246099 262367 266655 251018 225687 215780 236586 270790 283135 262704
9559 262704 236843 234406 249389 254852 241289 223046 213266 211747 215719 224226 230079 223975 210392
9546 210392 205140 213101 222054 223010 222423 227547 233178 231923 226270 220907 213174 201280 192970 195041 201953
9531 201953 205832 209984 219657 226389 217599 198809 189879 198010 209545 211857 208789 207677 204563 193619
9517A93619j1260J210J1162L704j2759j7107m504Q093O542k035k460N310Q156
9504A87671J976k309J765M850j385q188l801N350M070o134r414k378J056n072
9490A68057q138L93R146N558l703m913Q49K634r91k104J236K830k79m641o892
9475A59042n524N41P641O979k908r556l327N805K310q861p766Q947K0117R802
9461A83242j0066j6941p506J848j75o331m173N247Q882M67r665q467J406O238
9447A44006J928k083n38L68j793Q32Q897Q712m220j1575l87J1437J898j6276j3730
9432A27476O839J4506J157p880j93L746q799j7005l022J4892J2127k562n351K733
9418A38664L846k061o08P269P528J44k290M30j969o116N73J2162Q558r339j6588
$$ plain form
9517 193619 182359 183569 194731 198435 185676 168569 164065 172158 178700 176665 174205 179515 187671
9504 187671 189647 187338 189103 193953 192568 184380 180579 185929 189999 183865 174451 172073 173129 168057
9490 168057 159919 160312 169458 175016 171313 166400 167249 169883 168892 166788 168024 170854 170575 165934 159042
9475 159042 153518 154059 161700 168679 165771 156215 152888 158693 161003 152142 144376 153323 173440 183242
9461 183242 173176 156235 148729 150577 150402 144071 139898 145145 154027 154494 144829 136362 137768 144006
9447 144006 145934 143851 143313 143681 141888 142720 151617 160329 156109 144534 144147 155584 157482 141206 127476
9432 127476 134315 148821 149978 142098 141905 145651 136852 119847 116825 131717 143844 141282 135931 138664
9418 138664 142510 140449 139841 147110 154638 154782 152492 152922 150953 144837 145410 157572 166130 156791 140203
9403A40203l533Q260J028j1743q778O232J2864L451j0928j6669r006O214J4665
9390A32260N713j1480j4509K793J9313J4385m912j5777r841J427N663J907l309
9377A23633l541K214P141L694m670o705r72J236m317o027L104J0338K500j1040
9363A16588j1278K019J1838R123L62o868j0305o944L810J1838O269o095p606L731
9349A16482J0557K494r348j0465k041O059R836R597L280q416j6520j3140l045
9336I5330K448Q86M5M145O558K95r148q948K168Q879M19j0490m285J2775J3623
9321A14700o821j8338q25K0439J1659j5114j9447M009J9194P493p292m245K453
9308A07865l749j0576l924K702n000j0941K616J6587L506k1257j9187Q496K2219
$$ plain form
9403 140203 136670 144930 145958 134215 125437 131669 144533 147984 137056 120387 111381 117595 132260
9390 132260 137973 126493 111984 114777 134090 148475 143563 127786 117945 119372 125035 126942 123633
9377 123633 120092 122306 129447 133141 128471 121766 120794 122030 117713 111686 114790 125128 127628 116588
9363 116588 105310 107329 119167 128290 128652 121784 111479 104535 108345 120183 126452 120357 112751 116482
9349 116482 127039 129533 120185 109720 107679 113738 123574 133171 136451 128035 111515 98375 95330
9336 95330 97778 98664 98709 102854 109412 109707 100559 91611 93779 102658 103077 92587 88302 101077 114700
9321 114700 107879 89541 88716 109155 120814 105700 86253 90262 109456 116949 109657 105412 107865
9308 107865 104116 93540 89616 92318 87318 76377 78993 95580 99086 77829 58642 67138 89357
9295H9357Q268l639M400R978m457j7507o502J2071J0801l689o739O56j265j0534
9281H1199n093J5923K5019P406j6360j9890m681P522L776r204j6067p956Q713
9268G0307J6400N349j2226j5560k473Q656N385l715n562j205J048J014L723P057
9254G8198M114l855p065j078O228M836m474j0725n439P314J4899J0082j090p378
9240H4567n827k732k568k564J27K382O55j794R42P674J0109L749n133o755o88
9225H2144K873k941j0670p681N151J3182Q615O56j223k523j0244j4497j988J7029
9211G7883J7305l702j8755r677P267Q419k393m981L345P009M62l991J514P775
9197H7480L934o546j1958p482P04L102k973r358n557O606J2931O060l626m174
$$ plain form
9295 89357 97625 93986 98386 108364 103907 86400 79898 91969 102770 99081 92342 92998 91733 81199
9281 81199 76106 92029 117048 124454 108094 88204 83523 91045 94821 85617 69550 61594 70307
9268 70307 86707 92056 79830 64270 61797 70453 75838 72123 66561 65356 66404 67418 71141 78198
9254 78198 82312 78457 71392 70314 76542 81378 76904 66179 60740 68054 82953 93035 91945 84567
9240 84567 78740 76008 73440 70876 71003 73385 74040 72246 73188 80862 90971 94720 89587 82832 82144
9225 82144 85017 82076 71406 63725 68876 82058 90673 91329 90106 87583 77339 62842 60854 77883
9211 77883 95188 91486 72731 63054 70321 78740 76347 71366 74711 81720 82182 78191 79705 87480
9197 87480 91414 84868 72910 65428 66132 69234 66261 56903 51346 57952 70883 76943 73317 69143
9183F9143K79l24l344o05L078k530j1224p141P514J3598N914j26K256J06j1281
9168F5313j4070K286J8602J3739k419o584O92L43j0519j4853n028O673R002N111
9154F8288J636o45j996j137P29K131N355R038L323j3973k4100r587J5080J8476
9140G2618k505j7711r190M549J512r830p889P261J6896J2514L365p93J17K160
9126G3074K547k80n140q304q665q311n939K299J2277J2515J037q886o940M52K681
9111E4417J085K644O337O246J752l832q500r182k920M312J953o261l696J0410
9097E4765J3699l643j7829p441J0095O446j0198j0274N406Q483n199q218Q029
9084D4121J6142P50j3460l973J0814L407j5864j5721O056K0515J0808q436j5964
$$ plain form
9183 69143 69422 69098 65754 65149 68227 65697 54473 47332 54846 68444 74358 74232 76488 76594 65313
9168 65313 51243 53529 72131 85870 83451 76867 77559 77902 67383 52530 47502 54175 63177 68288
9154 68288 69924 69279 67283 66146 66875 69006 74361 83399 86722 72749 48649 39062 54142 72618
9140 72618 70113 52402 43212 47761 49273 39443 31554 38815 55711 68225 71590 70797 70914 73074
9126 73074 75621 75341 70201 61897 53232 44921 38982 41281 53558 66073 67110 58224 51284 51736 54417
9111 54417 55502 58146 64483 70729 72481 68649 60149 50967 48047 52359 54312 48051 44355 54765
9097 54765 68464 64821 46992 39551 49646 56092 45894 35620 41026 49509 44310 36092 44121
9084 44121 60263 61013 47553 43580 54394 57801 41937 26216 32272 52787 63595 55159 39195
9071C9195q526K685P200L480j445n10L324J505m364k874P117J1738M697j803J113
9056F2532L671k582p377j149N350P78m215K966J0152N40j4605j3763l783o183
9042C2332j3939j871K2715K3864k709j7669p32J7483Q537q847o636M250P8r155
9028D7701o66J3350L602k1322k3485K410J9341P128r484o050M689K404m370J858
9014C7106J2441O686j1021j6377k973J0033Q655R02j821j767m814p290l636J802
9000B7926J730o31L530J2282J3232K521p137m043N025M816n537j1771o219K536
8986C8260N200M586N839N266o21m467L99N394q32j0668p047P117J0171l694j3312
8971D1591m072Q155L271r589p056J0227J8868R237l049m614j209m85J681O914
$$ plain form
9071 39195 30669 33354 40554 44034 42589 42079 45403 46908 42544 39670 46787 58525 63222 61419 62532
9056 62532 66203 63621 56244 55095 60445 61223 57008 59974 70126 70666 56061 42298 38515 32332
9042 32332 18393 16522 39237 63101 60392 42723 41991 59474 68011 59164 52528 56778 56856 47701
9028 47701 47035 60385 63987 42665 19180 21590 40931 48059 38575 32525 37214 39618 35248 37106
9014 37106 49547 56233 45212 28835 25862 35895 44550 45452 43631 41864 37050 29760 26124 27926
9000 27926 29656 29025 32555 44837 58069 60590 53453 49410 54435 59251 53714 41943 35724 38260
8986 38260 43460 48046 53885 59151 58530 54063 54462 59856 59024 48356 41309 48426 58597 54903 41591
8971 41591 37519 45674 48945 39356 32300 42527 61395 70632 67583 62969 61760 61275 62956 69870
8957F9870M694q541j5977m103J2144R284p244j0205N939J5292J695j5343j1675
8944D5830M081O064p382j2652J256J6974J5849K494o506n226M2L116K710K99m91
8929F6458K911N813L53j0455j2682j754Q124M633l346j016O794L991p380q116
8915E4328N527J2575K65j3805q441P317Q382o573j3633k024J0032O218k285J942
8901E9825J1556O825q964j2116K135Q842p442k5345j7561P573J9478J0466L91
8888E5663l51k912j0781q388Q217J6320J333j5995j0978N343O335m788l162J1164
8874D7020J1644p392j7664k622J5337J1059n622j0086j249L816J10l561m680p438
8860B8672q104N84J2809J4676M946l917m580j497K46J44k445o592n498L924J0543
$$ plain form
8957 69870 74564 66023 50046 45943 58087 67371 60127 49922 55861 71153 72848 57505 45830
8944 45830 49911 55975 48593 35941 37197 54171 70020 72514 66008 60782 60824 63940 66650 66949 66458
8929 66458 69369 75182 75535 65080 52398 50644 58768 63401 60055 59039 65833 69824 62444 54328
8915 54328 59855 72430 72695 58890 50449 57766 66148 59575 45942 43918 53950 60168 57883 59825
8901 59825 71381 78206 69242 57126 59261 68103 60661 35316 17755 25328 44806 55272 55663
8888 55663 55312 52400 41619 33231 41448 57768 59101 43106 32128 37471 43806 39018 35856 47020
8874 47020 58664 51272 33608 30986 46323 57382 51760 41674 40425 44241 44351 40790 36110 28672
8860 28672 20568 21152 33961 48637 53583 49666 45086 43589 43835 43979 41534 34942 29444 33368 43911
8845D3911K429j1925j2747J193J0733O938K903P207O491r914k4533j3055J6072
8832B5703K7087M920k2315k0123O799K2767J0156r277q601O095Q448o296j5099
8819C0264m488Q700M965q165j0787j636N001N006O735J1373J0196J169p729j1213
8805C9391q919J062J4811J5087p321k9617k0846J1157K6752J2159l134K798J1146
8792F4526J49j5712j2408K275N293j954k574J043n261j4411o635J2928J7848K115
8778D7222j2079j0838m218j098L687J0099O959n691j1692n378o12m472m972M527
8764A1444J1654Q088M237P327O734l340q380J239J0090L187p265l405O800M560
8750E2970o858j0421n706m597n169L096J3929J1289j426n750J55P36o333o394
$$ plain form
8845 43911 46340 34415 21668 22861 33594 40532 43435 50642 57133 47219 22686 9631 25703
8832 25703 52790 57710 35395 15272 22071 44838 54994 45717 37116 43211 51659 45363 30264
8819 30264 25776 34476 39441 31276 20489 18853 23854 28860 35595 46968 57164 58333 50604 39391
8805 39391 30472 31534 46345 61432 54111 24494 3648 14805 41557 53716 50582 53380 64526
8792 64526 64675 48963 36555 38830 44123 42169 39595 40638 35377 20966 14331 27259 45107 47222
8778 47222 35143 24305 20087 18989 22676 32775 39734 34043 22351 16973 16361 11889 6917 11444
8764 11444 23098 31186 35423 42750 49484 46144 37764 39003 49093 52280 45015 41610 48410 52970
8750 52970 46112 35691 29985 25388 20219 23315 37244 48533 47107 41357 41512 42248 35915 29521
8736B9521K957O106j780o289p84L415J248K474P607K680j0576q863J2161K1618
8722F1495L65k3903j7958M607P892p335r885N140R220p250j6314N87K0852J6272
8708D3785m482j1968O84J2828P950p531j5685o892J1186J9904Q457j1785j8979
8695B7472p986M731N846J133O68K355M17j894p7J187k333l678L076Q887L308n768
8679C7344l611N760N685l751m740O645J0764l854j8941j2537P444J4789L047p814
8665C6230l074O180K027j2258j5572J318K0336J6940p457k4056j1865J4229K1675
8652D4653K933j5213q861J1422J7520K176j4981j6222n141M671O990L458k993
8639C0412p544l735P271J2632K536j3742j6599j413J5015J6834Q149K534J936
$$ plain form
8736 29521 32478 38584 36804 30515 29731 33146 34394 36868 44475 47155 36579 27716 39877 61495
8722 61495 61860 37957 19999 24606 32498 25163 15278 20418 29638 22388 6074 6661 27513 43785
8708 43785 39303 27335 28019 40847 48797 41266 25581 18689 29875 49779 58236 46451 27472
8695 27472 19486 24217 30063 31196 31864 34219 34636 32742 32665 33852 31519 27841 30917 39804 43112 37344
8679 37344 33733 39493 45178 41427 36687 43332 54096 50242 31301 18764 26208 40997 44044 36230
8665 36230 33156 39336 41363 29105 13533 14851 35187 52127 44670 20614 8749 22978 44653
8652 44653 47586 32373 23512 34934 52454 54630 39649 23427 18286 22957 29947 33405 30412
8639 30412 22868 19133 26404 39036 41572 27830 11231 9818 24833 41667 49816 52350 54286
8626E4286k008r589j0529k308K938k903r965n969L528M610j460j018P347R542
8612C6502O35n713o86M151k173q715l68J3541J0668p833j5436O58J8984J3686
8598E7901r297k0977q077J1195J1855o556j9737q840J4898K2749N552j2831p431
8585C0404J2713J7287j778j9627j4762L355J2710Q735K123j320k963p59P647J4762
8571F8527J0600j115o750k370K330P8n449q554q531n711PM663L329o30R62O690
8555E8076N951k913p429n16O859K808n540k756R939J5364N584p214q961k057J593
8540F8788r00r70O496J3563Q727o962j8557j3962J524J1757R180J642j097k72
8526G8957k209n249j552Q919J5230R701j105m896O10O635O613L617L039M063K857
$$ plain form
8626 54286 52278 42689 32160 29852 32790 29887 19922 13953 17481 22091 20631 19613 26960 36502
8612 36502 37137 31424 30738 34889 32716 24001 23633 37174 47842 40009 24573 25231 44215 57901
8598 57901 48604 27627 19550 30745 42600 36044 16307 7467 22365 45114 50666 37835 30404
8585 30404 43117 60404 58626 38999 24237 27592 40302 49037 51160 49840 46877 46118 53765 68527
8571 68527 79127 78012 71262 68892 71222 71300 65851 57297 48766 43055 43062 47725 51054 50424 51386 58076
8555 58076 64027 61114 53685 53169 60028 62836 57296 54540 64479 79843 85427 78213 69252 67195 68788
8540 68788 67888 66918 73414 86977 95704 88742 70185 56223 57747 69504 78684 80326 79229 78957
8526 78957 76748 71499 69947 78866 94096 103797 102692 97796 98406 105041 111654 115271 118310 122373 125230
8511A25230pj429k538o373r287l411R642J6274Q208m750p567m32L892K68k979
8496A24741N95N716N205R17j026K90J669K106K730L331L088K717L009L188K241
8481A60517l97n076r118n842O093J4116M206j6113k1601l315J5465J0026j0777
8468A38184j7952m071R005M380q023j0821m280m52k597l475K80L468J957j304
8454A04299j474J942N741O579K993k990n424P67J1786J5412M825r663j0827K036
8440A26002J0272K793n934J473J4721R975q691j0410J2865K7681Q845j8650j6040
8427A54902R920J9750L717p850K304J3742P842k662j608J929n054j2869p826Q88
8413A77125k190j0467q797k649o800j4772q565O529O969r447j8376p556O407P222
$$ plain form
8511 125230 125223 123794 121256 114883 105596 102185 111827 128101 136309 131559 123992 123560 127452 127720 124741
8496 124741 125336 131052 136257 137174 136148 136438 138107 140213 142943 146274 149362 152079 155088 158276 160517
8481 160517 160120 155044 145926 140084 146177 160293 164499 148386 126785 123470 138935 148961 138184
8468 138184 120232 116161 125166 129546 121523 110702 106422 105970 103373 99898 100178 103646 105603 104299
8454 104299 102825 104767 110508 117087 120080 117090 111666 112433 124219 139631 144456 134793 123966 126002
8440 126002 136274 139067 133133 134606 149327 159302 150611 140201 153066 180747 189592 170942 154902
8427 154902 164822 184572 188289 180439 182743 196485 204327 201665 200057 201986 196932 184063 176237 177125
8413 177125 174935 164468 155671 153022 146222 131450 122885 129414 136383 126936 108560 101004 107411 114633
8399A14633j43o591j3099j6707o079J4504J9787L41j6826o959J2345Q312j3958
8386H9560j9755q89J2765L069r381l012Q795K421j5553j9354m877P035M987L3
8372E5844J616K777k560n831P83Q666N977k797m495J284K701m407j0430p233J059
8357D2954N311J856o233j2215r701J35O564K139m735p28J0452J1245k388j2545
8343C2111n147J0162J5789R517N89o695j2096j0990j359P143N227n45J188N858
8329E0752N89j1081j1955L96P763k49r630l844J0944J4777J025j5841j7677k205
8315A3764J4436J4304j565j2990o581N432L503q721r673O079J8786J2566m583
8302D4757j6417j7776j0728K632J4398J2768k62p039L51P831L214m112j545M568
$$ plain form
8399 114633 114490 107899 94800 78093 72014 86518 106305 106646 89820 82861 95206 103518 89560
8386 89560 69805 68916 81681 84750 75369 72357 81152 83573 68020 48666 43789 50824 55811 55844
8372 55844 57460 60237 57677 51846 52629 61295 67272 64475 59980 61264 63965 59558 49128 41895 42954
8357 42954 48265 50121 43888 31673 21972 22107 28671 30810 26075 25347 35799 47044 44656 32111
8343 32111 26964 37126 52915 62432 63021 56326 44230 33240 31881 39024 44251 43706 44894 50752
8329 50752 51341 40260 28305 28701 36464 36215 26585 22741 33685 48462 49487 33646 15969 13764
8315 13764 28200 42504 40939 27949 21368 26800 30303 21582 11909 17988 36774 49340 44757
8302 44757 28340 10564 -164 2468 16866 29634 29372 22333 22684 30515 33729 29617 28072 32640
8288C2640K559k422N78O144K325n861m428L626K647p809j1037k81J1410J1738
8274D1829L598m331p950n948P67O019M347n43k189k442n888q757n756j392r52
8259A0412J552J0379J3002j241j6766j1137P961J3204P66p653l953j554k892M916
8245A6996J6748J0179j1023j4380N887J4040n410j6646M839K2962r39l7293l0482
8232b4522J2012L1695R674j3329q389N080N041J003M770O263j723o291j10L311
8218B4485l739p507M29O400R16l262L041N989n276j5906j0096J961M036J489N321
8203H281P105l448j1618J389K1521J8187p141k0636o399J2564J1576k580q750
8190B0051l070J849j016n882n490k43M232M516K942L527N304L438k398o677o817
$$ plain form
8288 32640 35199 32777 33355 39499 41824 35963 31535 35161 37808 29999 18962 18681 30091 41829
8274 41829 45427 41096 33146 27198 27965 33984 38331 37788 35599 33157 27269 18512 12756 11364 10412
8259 10412 11964 22343 35345 34104 17338 6201 14162 27366 28132 20479 16526 14972 12080 16996
8245 16996 33744 43923 32900 18520 24407 38447 33037 16391 21230 44192 43253 5960 -24522
8232 -24522 -12510 19185 28859 15530 7141 12221 17262 18265 23035 29298 27575 21284 21174 24485
8218 24485 20746 13239 13668 20068 20984 17722 20763 26752 21476 5570 -4526 -2565 1471 2960 8281
8203 8281 15386 11938 320 1709 23230 41417 34276 13640 7241 19805 31381 28801 20051
8190 20051 16981 18830 17814 11932 6442 6199 10431 14947 17889 21416 26720 30158 27760 21083 14266
8175A4266o013m788N24O749L725p614j0519L033J6340J1206m541j0084k761L319
8161A2842K748K295L018k01l334J975Q980K361j4510k0096o425R510J1225J582
8147A1970q739j3599p955Q900K1772J2042j1955j9405q87J6238R319p017p938
8134B746L810R690P183N286K103p788j4387o367M247j807j6044j1797J2219K6266
8120A5360J2380j1959k0834j0026P889K0592J9768L875j4541j7864n967L837L445
8107E955L253Q971R231k294j1000l466R173P682o007j3871q804P33Q058J3286
8093B0900J3224K810j1872j5782m118R959J0747k430j5231j3088L292J6310J0322
8080B5043o764j0953L960J4405J077j9205j6150P755J9044K078j8858j5294P185
$$ plain form
8175 14266 8253 3465 3989 10738 14463 6849 -3670 -637 15703 26909 22368 12284 9523 12842
8161 12842 15590 17885 20903 20702 17368 19343 28323 30684 16174 -3922 -10347 -837 10388 11970
8147 11970 3231 -10368 -18323 -9423 12349 24391 12436 -6969 -7856 8382 17701 10684 2746
8134 2746 6556 16246 23429 28715 30818 23030 8643 2276 6523 4716 -11328 -23125 -10906 15360
8120 15360 27740 15781 -5053 -15079 -7190 13402 33170 37045 22504 4640 -1327 2510 5955
8107 5955 9208 18179 27410 25116 14116 10650 19823 27505 21498 7627 -1177 -444 7614 20900
8093 20900 34124 36934 25062 9280 5162 15121 25868 23438 8207 -4881 -1589 14721 25043
8080 25043 18279 7326 11286 25691 26768 7563 -8587 -832 18212 20290 1432 -13862 -6677
8067f677K0418J1022p883j6668r832K100N964J214J48Q819J4142K452j4376j1468
8053f25R702J8657Q89j8970j4895K218O630k55J415J0922Q935m936q740L762J1432
8038B6141J396j0382p596Q18O58k038M177J1309M579r625j1236K239J2709R073
8024C2222n71n903p017o281k106L697M131j156k324N539J2095N135j0676j7390
8010I395n676J3186J9655P552r779j5039n527P037J1980Q371j75r542j2489l507
7996A5442Q961P794p701j6035m439R703N878n518j123J3345J0422j1304k0809
7983D616l826J4060Q841o200p305J524K671j777R80N722j097j1611o293J0765
7969A1070J6015N502J69Q038J0439m074j8557j5060j410N796O910R976J0596J050
$$ plain form
8067 -6677 13741 24763 16880 212 -9620 -7520 -1556 -342 -194 8625 22767 25219 10843 -625
8053 -625 9077 27734 28623 9653 -5242 -3024 3606 3351 4766 15688 24623 19687 10947 14709 26141
8038 26141 27537 17155 9559 10377 11035 8997 13174 24483 29062 19437 8201 10440 23149 32222
8024 32222 31651 25748 18731 12450 10344 14041 18172 17016 14692 20231 32326 37461 26785 9395
8010 9395 3719 16905 36560 44112 34333 19294 13767 20804 32784 41155 40980 31438 18949 15442
7996 15442 24403 32197 24496 8461 4022 13725 19603 14085 12962 26307 36729 25425 4616
7983 4616 790 14850 23691 17491 10186 11710 14381 12604 13584 19306 18209 6598 305 11070
7969 11070 27085 32587 32756 40794 51233 47159 28602 13542 12132 17928 24838 34814 45410 46460
7955D6460j0455r503R02M540k507p150n78J0023J3858R657K746k796n412n020
7941D4765l541l346m159l897j877J225M768O983N021q06n631n847l268j172k34
7926B8984o60k927l875R30P647O176l101n821L998J0346j527j8193j4362Q053
7912A5668J9271L385j9201k0219N57J9296J8940N044n398l524K758r03j4409j8725
7898B540j616J9235J6578n615j5393q85J1931K605r969m30J8664J6680m758j6416
7884C3151j0439p882j5539j3156N708J6054L661p290N587K2354J2737j2114j7352
7871A5480j535M355q053j2103M401J6384M560j1993q923M427N489k865k959K868
7857I533j316j1751q363R824K0219J0802m618j0177o303O32P553Q129l715j7555
$$ plain form
7955 46460 36005 26502 27404 31944 29437 22287 21709 31732 45590 55247 57993 55197 49785 44765
7941 44765 41224 37878 33719 29822 27945 29170 33938 40921 45942 45136 39505 33658 30390 29218 28984
7926 28984 28324 25397 21522 22452 30099 36275 33174 27353 31351 41697 40170 21977 7615 15668
7912 15668 34939 38324 19123 -1096 -539 18757 37697 42741 37343 33819 36577 35674 21265 2540
7898 2540 924 20159 36737 31122 15729 14844 26775 29380 19411 18981 37645 54325 49567 33151
7884 33151 22712 14830 -709 -13865 -8157 7897 11558 4268 9855 32209 44946 32832 15480
7871 15480 13945 18300 10247 -1856 2545 18929 23489 11496 2573 7000 12489 9624 6665 9533
7857 9533 8217 -3534 -11897 -2073 18146 28948 24330 14153 7850 8482 16035 24164 20449 2894
7843B894j3417P342J8405N900j1082j1020j002M72n434n139J700N396N983Q982
7829I980R099q61j1409q341J906J836o062l158J0852J4623J199r213k560O945
7815A4836K077j0060j2398m134M148R260J2951J0313k590j5959j6204n160L302
7802i618K912N6J133M468M799p0o267n875L478J1269N787o375o884N001Q381n458
7786F737j5809m987J1388Q375q985j5878o808K505N689R749J1636O32j4477j0905
7772b1138R604J7497R03j4941q614N027L913m212k6J0974R641j299l124L564o3
7757G706j4686j7462O6J5425R456n052o138K822K772o708o797P499J6289N126
7743A0318j1366j0746L560Q573j984q719J225J3009Q520l860l912N745M085j0875
$$ plain form
7843 2894 -10523 -3181 15224 21124 10042 -978 -1980 -1508 -6942 -12081 -10381 -4985 998 9980
7829 9980 19079 18218 6809 -1532 374 2210 -3852 -7010 3842 18465 19664 10451 7891 14836
7815 14836 16913 6853 -5545 -9679 -5531 3729 16680 26993 24403 8444 -7760 -12920 -9618
7802 -9618 -6706 -6650 -5517 -1049 3750 3680 -2587 -8462 -4984 6285 12072 5697 -1187 3814 12195 6737
7786 6737 -9072 -14059 -2671 5704 -3281 -19159 -25967 -23462 -17773 -8024 3612 4244 -10233 -21138
7772 -21138 -11534 5963 6866 -8075 -16689 -11662 -7749 -11961 -11987 -1013 8628 7329 4205 7769 7706
7757 7706 -6980 -24442 -24376 -8951 505 -4547 -10685 -7863 -5091 -11799 -18596 -11097 5192 10318
7743 10318 -1048 -11794 -8234 339 -1645 -10364 -9139 3870 12390 8530 4618 10363 14448 3573
7729C573j5626O33J5764P608j1853j5114L92J2166P201l983p685l881N80K284
7715g941P35k836l718J135O055L581k398j387N638O075l283q600L22J3039J2673
7700A9090k9q666m789J624k141j2923j5110j512J4856J4542l783j9366j4012N112
7686b7107J5464Q780n35J369P823L564j0380j6307n143R185Q205m968r814J527
7672a8337J2435P397l745k225P933O198q600j3946j289Q278L5p873L677J8224
7658H162R332j2397j3867N386J1258q582k4250j2025J0175J4758M882K54L198
7645c716K711j843l088j705k029p88M180M778k709o440J151O546k200j0673n26
7630a6351J5676J1136j0582j8846l265J2535R225l420q598n896k309R19K585j233
$$ plain form
7729 3573 -12053 -11420 4344 11952 99 -15015 -14623 -2457 4744 761 -6924 -10805 -10225 -7941
7715 -7941 -7206 -10042 -13760 -12625 -6570 -2989 -5387 -6774 -1136 4939 1656 -6944 -6622 6417 19090
7700 19090 19061 10395 5606 7230 5089 -7834 -22944 -24456 -9600 4942 1159 -18207 -32219 -27107
7686 -27107 -11643 -2863 -3398 -2029 5794 9358 -1022 -17329 -22472 -13287 -5082 -10050 -19864 -18337
7672 -18337 -5902 1495 -2250 -4475 3458 9656 1056 -12890 -14179 -5901 -5866 -13739 -10062 8162
7658 8162 17494 5097 -8770 -3384 7874 -708 -24958 -36983 -26808 -12050 -7168 -6914 -3716
7645 -3716 -1005 -2848 -5936 -7641 -9670 -10458 -6278 -1500 -4209 -10649 -9498 -2952 -5152 -15825 -16351
7630 -16351 -675 10461 -121 -18967 -22232 -9697 -472 -3892 -12490 -18386 -20695 -19776 -17191 -18424
7616a8424o545l682M598M709l148k707Q812J1956k310j4199o121Q510Q089k550
7602a3012l781M807O843j268o611l130J624K613K715K268j227l747J93M521p22
7587g914r988p477P171J5817Q329l993p374l518j079j280j045j492m553o657k675
7572b7728O872J5713J6009L660j4334k0345m956J5381J3704j0892k7644j3462
7560d8022J5832K6987J2169n783p312J309L158m120p660L44J1151J1544J990m951
7546F636l898m031j1644j5986m993J2107J4815J686q025m732l12l314l425O869
7532a8247J3929L965j1796j2608Q51J0630R446M655j80p108j0044r2J5373J8405
7518A7179O287o457j1564j2671q261O696J9472Q108k0483k9799n657J9318J3730
$$ plain form
7616 -18424 -24969 -28651 -24053 -19344 -22492 -25199 -16387 -4431 -6741 -20940 -27061 -18551 -10462 -13012
7602 -13012 -16793 -11986 -5143 -6411 -13022 -16152 -14528 -11915 -9200 -6932 -8159 -11906 -11713 -7192 -7914
7587 -7914 -17902 -25379 -18208 -2391 5938 1945 -5429 -8947 -10026 -11306 -12351 -13843 -18396 -25053 -27728
7572 -27728 -20856 -5143 10866 14526 192 -20153 -25109 -9728 3976 -6916 -34560 -48022
7560 -48022 -32190 -5203 6966 1183 -6129 -4820 -1662 -5782 -13442 -13098 -1947 9597 11587 6636
7546 6636 2738 -1293 -12937 -28923 -33916 -21809 -6994 -5308 -13333 -18065 -18377 -21691 -25116 -18247
7532 -18247 -4318 -353 -12149 -24757 -23906 -13276 -3830 825 645 -6463 -16507 -16599 -1226 17179
7518 17179 23466 17009 5445 -7226 -15487 -8791 10681 18789 -1694 -31493 -37150 -17832 -4102
7505d102o714q783N207P837m409r665k137J205m130k560Q741J1632Q35m404N090
7490f357J0717o25j2176o329N183L454m533j269P786M168r287j2082l04Q478M812
7475h364j168n94J654j44l257m375m133j788L559P048M483J269K746K037o787
7460g814j1846p25J2986P048j0150r294J0475J7282p53j5244n295R430N341o705
7446e264o386K6j867l836N290J0391m553k0227r317J4574J6746l69l848R727R747
7431A0834r521j5195N398J9110K483j8428j2721N258M286j1086j2519L756J4946
7418a3399J0058J144p08K201M074J523o768j4202q432R017J7818P198n876l660
7404a2M049K03p401j409J0358O296j0180j5048m195K040l796n706L089O618l878
$$ plain form
7505 -4102 -10816 -19599 -14392 -6555 -10964 -20629 -22766 -21561 -25691 -28251 -19510 -7878 -7043 -11447 -6357
7490 -6357 4360 3735 -8441 -14770 -9587 -6133 -10666 -11935 -4149 19 -9268 -21350 -21654 -13176 -8364
7475 -8364 -9532 -10126 -8472 -8616 -11873 -16248 -20381 -22169 -18610 -11562 -7079 -5810 -3064 -1027 -7814
7460 -7814 -19660 -20385 -7399 -351 -10501 -19795 -9320 7962 7209 -8035 -13330 -3900 1441 -5264
7446 -5264 -11650 -11624 -13491 -17327 -12037 -1646 -6199 -26426 -35743 -21169 -4423 -4792 -8640 1087 10834
7431 10834 1313 -13882 -8484 10626 13109 -5319 -18040 -12782 -8496 -19582 -32101 -28345 -13399
7418 -13399 -3341 -2197 -2905 -704 3370 4893 -1875 -16077 -24509 -15492 2326 9524 3648 -12
7404 -12 4037 4240 -3161 -4570 5788 12084 1904 -13144 -17339 -15299 -19095 -24801 -21712 -15094 -18972
7389a8972j2271l904J0923J4240N410m024p690n835k09M283K389k290j519K637
7375a6832J037l796m99P706M648q250q313J0423K1442N803j5226j1474R815J6430
7361A2914k39j7087j6649o999j192J786P582J2634R715J76p155p310m547m902
7347b1273n902J92J0583R631p635k0302q097J4580J6311k780j1040K581J1920
7334a1231J299p593J905Q524o346j8303r4K4603J5007j7094k3356L347K0590P755
7320i87o576j53Q255n33j1838p358L494O009N536Q245L752j0935j6317k458R409
7305a2455K070o595L658J6047M385j8906k0161J398J4500O106m486k624K646J777
7291a2640K72L557O936O801N452K038n599j0398m157N183K744q146j0382j960
$$ plain form
7389 -18972 -31243 -35147 -24224 -9984 -4574 -8598 -16288 -22123 -22332 -18049 -15660 -17950 -19469 -16832
7375 -16832 -15795 -19591 -20090 -12384 -7736 -15986 -24299 -13876 7566 13369 -1857 -13331 -3516 12914
7361 12914 12675 -4412 -21061 -28060 -29252 -27466 -19884 -7250 2465 2641 -4514 -11824 -16371 -21273
7347 -21273 -27175 -26983 -16400 -6769 -14404 -34706 -42803 -28223 -11912 -14692 -25732 -23151 -11231
7334 -11231 -9932 -17525 -15620 -7096 -13442 -31745 -31839 -7236 7771 -9323 -32679 -29332 -8742 -987
7320 -987 -7563 -7716 539 6 -11832 -19190 -15696 -9687 -4151 4094 7846 -3089 -19406 -21864 -12455
7305 -12455 -10385 -16980 -13322 2725 7110 -11796 -31957 -30559 -16059 -9953 -14439 -17063 -14417 -12640
7291 -12640 -12368 -8811 -1875 4926 10378 12416 6817 -3581 -7738 -2555 189 -7957 -18339 -20299
7277b0299J754l675m738L701Q186J146n592k191L286K135R73P195J2897P404m924
7262G258j1795r397j903O566J0878N376o138j0556l662K524r29n533j523L958
7248a4876m40q836o424N676J0663R85j0907r808L600J4634J0448o714j9666j2477
7234d4142J0129K4569J4919p497j8131q789N525Q167N79l035L940J1606P648l714
7220A774o128L523P444n269j6979o977J1801R244j2296j8288J994J5822K21j9272
7206c3386j0301J4081J9117M068l750J871K240n960n525M840N563o346r338L694
7192a9132J1010o9j0868l910Q690Q673J125J29L380J419k889k616j329l229k492
7177a2108K645J067j0007j3145J037J2979M819p163M59J5352Q520j4503k0401
$$ plain form
7277 -20299 -18545 -22220 -26958 -23257 -15071 -13925 -19517 -21708 -18422 -16287 -15314 -8119 4778 12182 7258
7262 7258 -4537 -13934 -15837 -9271 1607 6983 845 -9711 -13373 -10849 -11778 -17311 -18834 -14876
7248 -14876 -15316 -24152 -30576 -24900 -14237 -13252 -24159 -33967 -30367 -15733 -5285 -11999 -31665 -44142
7234 -44142 -34013 -9444 5475 -2022 -20153 -28942 -23417 -15250 -14671 -17706 -13766 -2160 5488 1774
7220 1774 -4354 -831 6613 1344 -15635 -22612 -10811 -1567 -13863 -32151 -30157 -14335 -14114 -33386
7206 -33386 -43687 -29606 -10489 -6421 -10171 -8300 -6060 -12020 -17545 -12705 -7142 -13488 -22826 -19132
7192 -19132 -8122 -8191 -19059 -22969 -14279 -5606 -4481 -4352 -972 447 -2442 -5058 -6387 -9616 -12108
7177 -12108 -9463 -8396 -18403 -31548 -30511 -17532 -12713 -19876 -19417 -4065 4455 -10048 -30449
7164c0449k819R491L121j050R194J3369l359j9871j2265P471J2885M011q08O26
7150a0453k868p906j174J1412Q864r163j7246k401J5459J3497j753p697N52P139
7136c738J909n869l149P880J3010M837p769j0862k810M571K337m354n433n89K286
7121g743J58k413k721l089l105K111J1586J4518L836j1402j5339n440M709L655
7107a0679l976n925M03O005M602J093K074M443R58o145o956K30N163J605l152
7092a0257j453J771p37l771J343Q568M240r089j3056p70J2464J1709J143p727
7078e622j2548j4238p498Q734K0551J4098l567j2652o527L114M803q82o673n792
7064b4699M036J4835J1694p198k0938j1378Q570J1750k495q584L440J3141M705
$$ plain form
7164 -30449 -33268 -23777 -20656 -21706 -12512 857 -2502 -22373 -34638 -27167 -14282 -10271 -11079 -10453
7150 -10453 -13321 -21227 -22401 -10989 -2125 -11288 -28534 -30935 -15476 -1979 -3732 -11429 -10877 -3738
7136 -3738 -1829 -7698 -10847 -2967 10043 14880 7111 -3751 -6561 -1990 347 -4007 -9440 -10029 -7743
7121 -7743 -7585 -9998 -12719 -15808 -18913 -16802 -5216 9302 13138 1736 -13603 -19043 -14334 -10679
7107 -10679 -14655 -20580 -20177 -14172 -9570 -8477 -6403 -1960 -1002 -7147 -14103 -13873 -8710 -7105 -10257
7092 -10257 -11710 -9939 -10676 -14447 -13104 -4536 -296 -9385 -22441 -23211 -10747 962 2105 -5622
7078 -5622 -18170 -32408 -39906 -31172 -10621 3477 -90 -12742 -19269 -16155 -11352 -12234 -18907 -24699
7064 -24699 -20663 -5828 5866 -1332 -22270 -33648 -25078 -13328 -15823 -24407 -20967 -7826 -3121
7051c121q665r008n88L792M884P521N758l545p512J880Q557k812j6571q532J1648
7036a6314J2538q703k1311q881R313J2745O238J178l421p286l87J5975K0821L544
7022A6049j6386j7173m913K040J957K928K540l561n794L844J1884K806j1944j0138
7008b5861M398R091J133j505M639L901n296n210O053O944p701j1936P131K1362
6994G143M763k1007j8099P914J7806O20j3391m667P799L680n088P99J2621R132
6980A0025o451j2285m669j504p969o311J0428J9511K157k2181k0332N490K0634
6967a3457Q532r756j2199m738n59M280J4549J6063j960j9584j0618J3939J8256
6954B748m359k1590j1387Q893J4031N506j138k608l995m085r09k8l536k631O318
$$ plain form
7051 -3121 -11786 -20794 -21382 -17590 -12706 -5185 573 -2972 -10484 -8604 -47 -2859 -19430 -27962 -16314
7036 -16314 -3776 -12479 -33790 -42671 -33358 -20613 -14375 -13197 -16618 -23904 -24291 -8316 12505 16049
7022 16049 -337 -17510 -22423 -20383 -18426 -15498 -12958 -16519 -22313 -18469 -6585 -3779 -15723 -25861
7008 -25861 -21463 -12372 -11239 -12744 -8105 -4204 -9500 -14710 -8657 -1713 -9414 -21350 -14219 7143
6994 7143 11906 -9101 -27200 -19286 -1480 -860 -14251 -18918 -11119 -7439 -12527 -11728 893 10025
6980 10025 3574 -8711 -13380 -14884 -22853 -29164 -18736 775 2932 -19249 -39581 -34091 -13457
6967 -13457 -4925 -14681 -26880 -31618 -32177 -27897 -13348 2715 755 -18829 -29447 -15508 2748
6954 2748 -1611 -23201 -34588 -25695 -11664 -6158 -7296 -9904 -13899 -17984 -18893 -18921 -22457 -25088 -18770
6939a8770J1161K770q320q325j003K712L342N378L919l725n813M936J2915K676
6925C853j1722p192Q025O160j2130j6634K067J6439Q003l503L323J3709K644k0141
6911g099k2219J692K1187J4257m242q143L011P921k815j3862r046N117J0376L941
6897G6n67J867n3j0380j3436J171J6742J2009n710j1926k295N276K427o86J073
6882d412k08n734n069K956N657n98l866J25J93o476n935N824J1056k89j1199n164
6866b3139O767O161k609l443L683O714L051j186m168n009J763J3745J5332L46
6852A8008j4043j2312l832l085m170L061Q922J557p212j888N849k376j4147n186
6838c0854J4313J2161j1104k1166n530J0249Q844M610R235J0422N55n699J92L473
$$ plain form
6939 -18770 -7609 -4839 -13159 -21484 -22487 -19775 -16433 -11055 -7136 -10861 -16674 -11738 1177 3853
6925 3853 -7869 -15061 -7036 -876 -13006 -29640 -27573 -11134 -3131 -6634 -3311 10398 13042 -7099
6911 -7099 -29318 -27626 -6439 7818 3576 -4567 -1556 6365 3550 -10312 -19358 -14241 -3865 76
6897 76 -491 1376 1323 -9057 -22493 -21322 -4580 7429 1719 -10207 -12502 -7226 -4799 -5485 -4412
6882 -4412 -4620 -10354 -15423 -12467 -6810 -7408 -11274 -11149 -10956 -17432 -23367 -17543 -6487 -6776 -17975 -23139
6866 -23139 -16372 -10211 -12820 -16263 -12580 -5866 -2815 -4001 -8169 -13178 -11415 2330 17662 18008
6852 18008 3965 -8347 -12179 -15264 -19434 -16373 -7451 -5894 -13106 -14994 -9145 -11521 -25668 -30854
6838 -30854 -16541 -4380 -15484 -36650 -42180 -31931 -23087 -18477 -9242 1180 1735 -3964 -3772 -299
6824b99n015r875K24J0122M146p745r513m598l163k744N69J67n000j900J1961
6809b2663J6611J627j1777l474J1464P765q409j1835L17Q469M302j965l454k983
$$ plain form
6824 -299 -5314 -15189 -14965 -4843 -697 -8442 -17955 -22553 -25716 -28460 -27891 -27724 -32724 -34624 -22663
6809 -22663 -6052 -4425 -16202 -19676 -8212 -447 -8856 -20691 -20374 -11905 -7603 -9568 -13022 -16005
$$ [...]
##END NTUPLES=NMR SPECTRUM
##END=
