##TITLE=1H ikalashn
K-348-2
16.12.2024
##JCAMPDX= 6.0         $$ Bruker NMR JCAMP-DX V2.0
##DATA TYPE= NMR SPECTRUM
##DATA CLASS= NTUPLES
##ORIGIN= UXNMR, Bruker Analytische Messtechnik GmbH
##OWNER= root
$$ TOPSPIN		Version 1.3
$$ 2024-12-16 14:30:21.796 +0400  Irina@DPX200
$$ Compression mode = diff/dup
##.OBSERVE FREQUENCY= 200.131300845
##.OBSERVE NUCLEUS= ^1H
##.ACQUISITION MODE= SIMULTANEOUS
##.ACQUISITION SCHEME= undefined
##.AVERAGES= 16
##.DIGITISER RES= 18
##SPECTROMETER/DATA SYSTEM= spect
##.PULSE SEQUENCE= zg
##.SOLVENT NAME= DMSO
##.SHIFT REFERENCE= INTERNAL, DMSO, 1, 17.49637
##AUDIT TRAIL= $$ (NUMBER, WHEN, WHO, WHERE, WHAT)
$$ ##TITLE= Audit trail, TOPSPIN		Version 1.3
$$ ##JCAMPDX= 5.01
$$ ##ORIGIN= Bruker BioSpin GmbH
$$ ##OWNER= Irina
$$ $$ F:/spectra/data/iren/nmr/1H/4/pdata/1/auditp.txt
$$ ##AUDIT TRAIL=  $$ (NUMBER, WHEN, WHO, WHERE, VERSION, WHAT)
(   1,<2024-12-16 14:30:01.484 +0400>,<Irina>,<DPX200>,<TOPSPIN 1.3>,
      <created by zg
	started at 2024-12-16 14:28:53.906 +0400,
	POWCHK disabled, PULCHK disabled
       terminated by command 'halt'
       configuration hash MD5:
       BE 6D 3F 07 2A EA 11 49 91 17 2B D3 AF B3 58 0D
       data hash MD5: 16K
       0F A3 DA CB E5 5B CC 13 1E A1 72 5E CB 87 A7 32>)
(   2,<2024-12-16 14:30:01.687 +0400>,<Irina>,<DPX200>,<TOPSPIN 1.3>,
      <Start of raw data processing
       fp BC_mod = 2 FT_mod = 6 PKNL = 1 PHC0 = 123.5548 PHC1 = 8.464067 SI = 32K 
       data hash MD5: 32K
       20 3E 2C 79 C8 32 10 A5 95 9A 42 CA 81 D3 88 71>)
(   3,<2024-12-16 14:30:04.906 +0400>,<Irina>,<DPX200>,<TOPSPIN 1.3>,
      <apk 
       data hash MD5: 32K
       4D B5 B3 F3 71 D3 DC 16 F8 C0 35 11 6B 65 31 F9>)
(   4,<2024-12-16 14:30:07.187 +0400>,<Irina>,<DPX200>,<TOPSPIN 1.3>,
      <abs n ABSG = 5 
       data hash MD5: 32K
       B7 C2 C0 A7 41 53 F6 F6 6F 36 BE E1 0F 4A 17 EC>)
$$ ##END=
$$ 
$$ $$ hash MD5
$$ $$ 8A 5C EA 47 43 EC 91 2F E5 6C 56 6E 04 7D 99 02
##$RELAX= 
##$RELAX= 
##$RELAX= 
##$RELAX= 
##$RELAX= 
##$RELAX= 
##$RELAX= 
##$RELAX= 
##$RELAX= 
$$ Bruker specific parameters
$$ --------------------------
##$DU= <F:/spectra>
##$EXPNO= 4
##$NAME= <1H>
##$PROCNO= 1
##$TYPE= <nmr>
##$USER= <iren>
##$AMP= (0..31)
100 100 100 100 100 100 100 100 100 100 100 100 100 100 100 100 100 100 
100 100 100 100 100 100 100 100 100 100 100 100 100 100 
##$ANAVPT= -1
##$AQSEQ= 0
##$AQ_mod= 1
##$AUNM= <au_zg>
##$AUTOPOS= <>
##$BF1= 200.13
##$BF2= 200.13
##$BF3= 200.13
##$BF4= 200.13
##$BF5= 200.13
##$BF6= 200.13
##$BF7= 200.13
##$BF8= 200.13
##$BYTORDA= 1
##$CFDGTYP= 0
##$CFRGTYP= 5
##$CHEMSTR= <none>
##$CNST= (0..63)
1 1 145 1 1 1 1 1 1 1 1 1 1 1 1 1 1 1 1 1 1 1 1 1 1 1 1 1 1 1 1 1 1 1 
1 1 1 1 1 1 1 1 1 1 1 1 1 1 1 1 1 1 1 1 1 1 1 1 1 1 1 1 1 1 
##$CPDPRG= <>
##$CPDPRG1= <>
##$CPDPRG2= <>
##$CPDPRG3= <>
##$CPDPRG4= <mlev>
##$CPDPRG5= <mlev>
##$CPDPRG6= <mlev>
##$CPDPRG7= <mlev>
##$CPDPRG8= <mlev>
##$CPDPRGB= <>
##$CPDPRGT= <>
##$D= (0..63)
$$ [...]
##$SW_h= 4401.40845070422
##$TD= 16384
##$TD0= 1
##$TE= 300
##$TE2= 300
##$TE3= 300
##$TEG= 300
##$TL= (0..7)
0 120 120 120 120 120 120 120 
##$TP= (0..7)
150 150 150 150 150 150 150 150 
##$TP07= 0
##$TPNAME0= <>
##$TPNAME1= <>
##$TPNAME2= <>
##$TPNAME3= <>
##$TPNAME4= <>
##$TPNAME5= <>
##$TPNAME6= <>
##$TPNAME7= <>
##$TPOAL= (0..7)
0.5 0.5 0.5 0.5 0.5 0.5 0.5 0.5 
##$TPOFFS= (0..7)
0 0 0 0 0 0 0 0 
##$TUNHIN= 0
##$TUNHOUT= 0
##$TUNXOUT= 0
##$USERA1= <user>
##$USERA2= <user>
##$USERA3= <user>
##$USERA4= <user>
##$USERA5= <user>
##$V9= 5
##$VALIST= <valist>
##$VCLIST= <CCCCCCCCCCCCCCC>
##$VD= 0
##$VDLIST= <DDDDDDDDDDDDDDD>
##$VPLIST= <PPPPPPPPPPPPPPP>
##$VTLIST= <TTTTTTTTTTTTTTT>
##$WBST= 1024
##$WBSW= 25
##$XGAIN= (0..3)
0 0 0 0 
##$XL= 0
##$YL= 0
##$YMAX_a= 1307688
##$YMIN_a= -1123541
##$ZGOPTNS= <>
##$ZL1= 120
##$ZL2= 120
##$ZL3= 120
##$ZL4= 120
##$ABSF1= 17.49637
##$ABSF2= -4.496376
##$ABSG= 5
##$ABSL= 3
##$ALPHA= 0
##$AQORDER= 0
##$ASSFAC= 0
##$ASSFACI= 0
##$ASSFACX= 0
##$ASSWID= 0
##$AUNMP= <proc_1d>
##$AXLEFT= 0
##$AXRIGHT= 0
##$AXTYPE= 0
##$AXUNIT= <>
##$AZFE= 0.1
##$AZFW= 0.1
##$BCFW= 0
##$BC_mod= 2
##$BYTORDP= 0
##$COROFFS= 0
##$CY= 7568.61572265625
##$DATMOD= 1
##$DC= 0
##$DFILT= <>
##$DTYPP= 0
##$F1P= 17.9538593292236
##$F2P= -4.03888763876832
##$FCOR= 0.5
##$FTSIZE= 32768
##$FT_mod= 6
##$GAMMA= 0
##$GB= 0
##$INTBC= 0
##$INTSCL= 5.656564e-011
##$ISEN= 128
##$LB= 0
##$LEV0= 0
##$LPBIN= 0
##$MAXI= 945.577
##$MC2= 0
##$MEAN= 0
##$ME_mod= 0
##$MI= -402.1523
##$NCOEF= 0
##$NC_proc= -4
##$NLEV= 6
##$NOISF1= 8.587773
##$NOISF2= 6.764455
##$NSP= 0
##$NTH_PI= 0
##$NZP= 0
##$OFFSET= 17.49637
##$PC= 1
##$PHC0= 126.8541
##$PHC1= 1.380095
##$PH_mod= 1
##$PKNL= yes
##$PPARMOD= 0
##$PPDIAG= 0
##$PPIPTYP= 0
##$PPMPNUM= 100
##$PPRESOL= 1
##$PSCAL= 0
##$PSIGN= 0
##$REVERSE= no
##$SF= 200.13
##$SI= 32768
##$SIGF1= 16.12182
##$SIGF2= -4.496377
##$SINO= 3.521527
##$SIOLD= 32768
##$SREGLST= <1H.CDCl3>
##$SSB= 0
##$STSI= 32768
##$STSR= 0
##$SW_p= 4401.40845070422
##$SYMM= 0
##$S_DEV= 0
##$TDeff= 16384
##$TDoff= 0
##$TI= <>
##$TILT= no
##$TM1= 0
##$TM2= 0
##$TOPLEV= 0
##$USERP1= <user>
##$USERP2= <user>
##$USERP3= <user>
##$USERP4= <user>
##$USERP5= <user>
##$WDW= 0
##$XDIM= 32768
##$YMAX_p= 381669329
##$YMIN_p= -710052
$$ End of Bruker specific parameters
$$ ---------------------------------
##NTUPLES= NMR SPECTRUM
##VAR_NAME=  FREQUENCY,     SPECTRUM/REAL,   SPECTRUM/IMAG
##SYMBOL=    X,             R,               I
##VAR_TYPE=  INDEPENDENT,   DEPENDENT,       DEPENDENT
##VAR_FORM=  AFFN,          ASDF,            ASDF
##VAR_DIM=   32768,         32768,           32768
##UNITS=     HZ,            ARBITRARY UNITS, ARBITRARY UNITS
##FACTOR=    0.134324425510551, 1,           1
##FIRST=     4401.40845070422, 44590,        -441446
##LAST=      0,             6931,            -499344
##MIN=       0,             -710052,         0
##MAX=       4401.40845070422, 381669329,    0
$$ Real data points
##PAGE= N=1
##DATA TABLE= (X++(R..R)), XYDATA
$$ [...]
13582C0233L292M591m5502n6181M0863J33763P2512q4706j34871k4697Q3853O3531
$$ 30233 33525 38116 -7386 -63567 -22704 111059 183571 98865 -36006 -60703 23150 86681
13570H6681j7008l7721l132J0601o287o482J5867K0215l987j9531j193K7716K8348
$$ 86681 69673 31952 28820 39421 33134 26652 42519 62734 58747 39216 38023 65739 94087
13557I4087l699l2529k5278N853J9360K401j3487n563M951n909k2463j9509l580
$$ 94087 90388 57859 32581 38434 57794 60195 46708 41145 46096 40187 17724 -1785 -5365
13544e365Q063J5812J4436j3829m6937k3485N2666P9523N183o6167k3806O2414
$$ -5365 2698 18510 32946 19117 -27820 -51305 1361 80884 86067 19900 -3906 58508
13532E8508M6541m7698n8650M0766Q9807L410q9734n9639K8475M5842M472l354
$$ 58508 105049 57351 -1299 39467 129274 132684 42950 -16689 11786 57628 62100 58746
13520E8746K1645J3272j8867j1747K1312J0019l8659m2600J6260N7804K6666l3559
$$ 58746 80391 93663 74796 63049 84361 94380 55721 13121 29381 87185 113851 80292
13508H0292n3115k1176K3256M0922J9059j9926l4881j3653J0288J0656N424J0638
$$ 80292 27177 6001 29257 70179 89238 69312 34431 20778 31066 41722 47146 57784
13496E7784J848l2200m4677k53N3285N1740J3761j788Q34j9964m6168k6191K2036
$$ 57784 59632 27432 -17245 -17498 35787 87527 101288 99500 100334 80370 34202 8011 30047
13483C0047L3613J0091Q128K3212k737n4354m5373K8518O1724O869m6071j9818
$$ 30047 63660 73751 81879 105091 102354 48000 2627 31145 92869 99738 53667 33849
13471C3849K9280J9952j7265p345L4191L4646r737l5550j7951O172J0206N755
$$ 33849 63129 83081 65816 58471 92662 127308 117571 82021 64070 70242 80448 86203
13459H6203K455o325j7920j9022o865J2274L2138L7513J2926k2610k6351K793
$$ 86203 88658 82333 64413 45391 38526 50800 82938 120451 133377 110767 84416 87209
13447H7209J5112q654k1609P465L4753J4113k4123k5798J080J4343J1169J1832
$$ 87209 102321 93667 72058 79523 114276 128389 104266 78468 79548 93891 105060 116892
13435A16892Q222r620j4280R268J8032j7225m3868j1092K9883P208l7243j3170
$$ 116892 125114 115494 101214 110482 128514 111289 67421 56329 86212 93420 56177 43007
13423D3007N1820M7727k6183n2309N328M1248n444m8334j0743M3188L0763n571
$$ 43007 94827 142554 116371 64062 69390 110638 105194 56860 46117 89305 120068 114497
13411A14497R203L4824r750q3858p5486J2898O2779K4638j9367k538K8166J0727
$$ 114497 123700 158524 148774 64916 -10570 2328 65107 89745 70378 67840 96006 106733
13399A06733k4280j3094L1562M3056O500k3326p832K2565J8093j8367l5944o196
$$ 106733 82453 69359 100921 143977 150477 127151 119319 141884 159977 141610 105666 99470
13387I9470L6321L9319M613j5547K384J5426j7593o0895m4073K8664O7643J6144
$$ 99470 135791 175110 179723 164176 166560 181986 164393 103498 59425 88089 155732 171876
13375A71876o5900p6840o785N4835M3936M63m776K1744J6638k8508m6230l364
$$ 171876 105976 29136 22351 77186 121122 121585 116809 138553 155191 126683 80453 77089
13363G7089L4987L101n3498l9824L7590O9930O859o6455n2550K5429P0794M6965
$$ 77089 112076 115177 61679 21855 59445 129375 136234 69779 17229 42658 113452 160417
13351A60417K60k4962k9834k5942j2054O182J2978Q207P732J3310R668l529m375
$$ 160417 160677 135715 105881 79939 67885 74067 87045 95252 102984 116294 125962 122433 118058
13338A18058J5875L2635J8815j6961l8771k7180k339K944j3256k0478k134J7632
$$ 118058 133933 166568 185383 168422 129651 102471 100132 103076 89820 69342 67208 84840
13326H4840J1885m597j274J2961N054j8096j4553J8478L3795J3238l814L893J280
$$ 84840 96725 92128 90854 103815 108869 90773 76220 94698 128493 141731 137917 141810 143090
13313A43090k7592l4632O904L8086O178l8075k0544K8407K6001j8845k5737J1296
$$ 143090 115498 80866 87770 125856 132034 93959 73415 101822 127823 108978 83241 94537
13301I4537J9107j1591n239N0853O3878p156o7852l6946K2271J2030l9865l7760
$$ 94537 113644 102053 96814 147667 211545 204389 136537 99591 121862 133892 94027 56267
13289E6267J9957N0247K7372N737R048o68l2757l8459J838L7202K5518n736j2608
$$ 56267 76224 126471 153843 159580 168628 167960 135203 96744 98582 135784 161302 155566 142958
13276A42958J592J0594J0284M142j8465n1946n6093j0016M2542M7082J5978J621
$$ 142958 144550 155144 165428 169570 151105 99159 43066 33050 75592 122674 138652 140273
13264A40273Q360n342l7157k8038L2543O0885j261p6820m9714N6162R7715K0669
$$ 140273 148633 143291 106134 78096 110639 171524 170263 93443 43729 99891 197606 218275
13252B18275o0868l9108L1120L2752l0744n9719k4815O622J697N745L6874M1189
$$ 218275 157407 118299 149419 182171 151427 91708 66893 73515 75212 80957 117831 159020
13240A59020o735m6799k8506R910J3888J309J5964M2517L5120k548k7274k3571
$$ 159020 152285 105486 76980 86890 100778 102087 118051 160568 195688 193140 165866 142295
13228A42295r828K179R653K521j5252j2606K2096M9303L2315o261k2184j3103
$$ 142295 132467 134646 144299 146820 131568 118962 141058 190361 222676 216415 194231 181128
13216A81128m211l196q868k6959l8679l054O3308P1581r737p8545m0076M0545
$$ 181128 176917 173721 164853 137894 99215 96161 159469 231050 221313 142768 102692 143237
13204A43237L9770k2446k1805N2469P4035r282q8175o5357R061M0710K5260Q278
$$ 143237 183007 160561 138756 191225 265260 255978 167803 102446 111507 152217 177477 185755
13192A85755l023j5860r904J5965J8027j4956k5780J3640M1322O857l8640k9872
$$ 185755 182732 166872 156968 172933 190960 176004 150224 163864 205186 212043 173403 143531
13180A43531L300K03j7036Q139N0377L8818j6291l5224K636L4738K0752j0887
$$ 143531 146831 147034 129998 138137 188514 227332 211041 175817 178453 213191 233943 223056
13168B23056k8384l4781l1316q098J8459J7026k545O02K7584L4815N949k5446
$$ 223056 194672 159891 128575 120477 138936 155962 153417 154019 181603 216418 222367 196921
13156A96921l2555k2743j974L3938O2023M1012k2976o6166m5233R705L8656J9703
$$ 196921 164366 141623 139649 173587 235610 276622 253646 187480 142247 151952 190608 210311
13144B10311j9366l3848k092M6638N2354j525n2789l8257J4598K8587n882k2673
$$ 210311 190945 157097 155005 201643 253997 252472 199683 161426 176024 204611 198729 176056
13132A76056R849M1684K4543j7403l0293k636L1634L5153J56l8560l0693K0484
$$ 176056 185905 227589 252132 234729 204436 201800 233434 268587 268743 230183 199490 219974
13120B19974M0508j5689p7268m7734M1551O8498P953l3303N988M8875K0154l1125
$$ 219974 260482 244793 167525 119791 161342 229840 237793 204490 210478 259353 279507 248382
13108B48382k9542k373j4330m1641j6161M6591O4603J6003l6535m0261m438L3352
$$ 248382 218840 216467 202137 160496 144335 190926 255529 271532 234997 194736 190298 223650
13096B23650L9868J426m8633m7182R462L9824k757m4295n567N6977L6954l9483
$$ 223650 263518 264944 216311 169129 178591 218415 215658 171363 165796 222773 259727 220244
13084B20244n2039R396K8867k8656m8652L4233J08694N6869n5903q2333j3164
$$ 220244 168205 177601 206468 177812 129160 163393 272087 328956 273053 190720 177556
13073A77556L3725Q605j7084M666K1637j1844m6161j7571M3359N6534J4323j3548
$$ 177556 211281 219886 202802 207468 229105 217261 171100 153529 196888 253422 267745 254197
13061B54197P894L1125J1640j7800n071K8585J8491l3310n0220O99N0299K7627
$$ 254197 262091 293216 304856 287056 281985 310570 329061 295751 245531 246230 296529 324156
13049C24156l5583n7022k3426O822J499j1110m424Q227P761k143r311l058K6431
$$ 324156 288573 231551 208125 214947 216446 205336 200912 209139 216900 214757 205446 202388 228819
13036B28819O3224N5385j9249r0987o9920K1765O6920J7928l9246k1899K9609
$$ 228819 292043 347428 328179 237192 167272 189037 255957 273885 234639 212740 242349
13025B42349L1243r440j8969J5762L1695l844m3268l3301J1225L5331J6678j6696
$$ 242349 273592 264152 245183 260945 292640 288796 245528 212227 223452 258783 275461 258765
13013B58765l0429k2033r376L609K7472N2002M1365j2741o0259n1737o608K2197
$$ 258765 228336 206303 196927 200536 228008 280010 321375 308634 248375 196638 190030 212227
13001B12227L0437M9165O4654L0516l6084n6248j1347K1075p737l9768j2472L6920
$$ 212227 242664 291829 356483 386999 350915 294667 283320 304395 296658 256890 244418 281338
12989B81338L9617M896j5509k0537l5854l9976j303M2331K9295k0552l2031N759
$$ 281338 320955 325851 310342 289805 253951 213975 212672 255003 284298 263746 231715 237474
12977B37474K9527Q017k0884k2802o134J5724L8012M0107Q115k3215j2780J4619
$$ 237474 267001 275018 254134 231332 225198 240922 278934 319041 327156 303941 291161 305780
12965C05780O744k2484j9066P316J195k5602p797M2117L7006k7750m6974J9707
$$ 305780 312524 290040 270974 278290 279485 253883 246086 288203 325209 297459 250485 270192
12953B70192P1872L3628k4358j4977K1237P184k7447j2794K2992P944l3988k5520
$$ 270192 342064 375692 351334 336357 357594 364778 337331 324537 347529 355473 321485 295965
12941B95965J8276J6722k4970k2801L0500M7738J709k7310N803L5197M204l7411
$$ 295965 314241 330963 305993 283192 313692 361430 363139 335829 341632 376829 381033 343622
12929C43622k4002J5645J3703k4346l6297k289L4516L3264j548l5024l5439l624
$$ 343622 319620 335265 348968 324622 288325 286036 320552 353816 352268 317244 281805 278181
12917B78181K1862R784j4313j788L6454L7860q110l1766P640N0374K7279l1981
$$ 278181 300043 309827 295514 293726 330180 368040 359930 328164 335804 386178 413457 381476
12905C81476m7996j1302J8007R632p332q242m258n220k212N001M371K73Q236J9882
$$ 381476 333480 322178 340185 349817 342485 334243 329985 324765 322553 327554 331925 332198 340434 360316
12891C60316J2534n059o17K2150J9622j9552m4247j2207M3464N5987J3448l0413
$$ 360316 372850 367791 367174 389324 408946 389394 345147 332940 376404 432391 445839 415426
12879D15426k8600N217K2158J677k4310j5404J7409J9722k6685o3112l0138L7535
$$ 415426 386826 392043 414201 415878 391568 376164 393573 413295 386610 323498 293360 330895
12867C30895N0584l845m0354n779M1256K9501j0878p627K5469J3264m4547o2011
$$ 330895 381479 377634 337280 331501 372757 402258 391380 383753 409222 422486 377939 315928
12855C15928n398N0524M1396N490K686J3255r947m2827k9798J0440J0491k6233
$$ 315928 310530 361054 402450 407940 410626 423881 413934 371107 341309 351749 362240 336007
12843C36007k4914L2044O6080K4639l5117l3789J8381N2387L9632M096l1806n6366
$$ 336007 311093 343137 409217 433856 398739 364950 383331 435718 475350 479446 447640 391274
12831C91274m6326O829N9262N5874N272l1797k5214j578J0395J2465R730k417
$$ 391274 344948 351777 411039 466913 472185 440388 415174 413596 423991 436456 446186 443769
12819D43769j2646J678K8986K5084j8250m7051j8607L1947L7571q198m5887l1960
$$ 443769 431123 432801 461787 486871 468621 421570 402963 434910 472481 464283 418396 386436
12807C86436J0427L0629J5259l286M914K6661K3551j2332l9386j8845K8109M4282
$$ 386436 396863 427492 442751 439465 444379 471040 494591 482259 442873 424028 452137 496419
12795D96419J4222j6710j0448J1581P953j7906k6046j444K6581K7863P606j0466
$$ 496419 510641 493931 483483 495064 503017 485111 459065 457621 484202 512065 519671 509205
12783E09205j8060k3289k6330j4326J2971K8935J1523j7865j6256J5563K6552
$$ 509205 491145 467856 441526 427200 440171 469106 480629 462764 446508 462071 488623
12772D88623n325k8847L522N1084M1559r726j9579K3359L2788l0116p9120l4298
$$ 488623 483298 454451 457973 509057 550616 540890 521311 544670 577458 547342 468222 433924
12760D33924M7175N9816J3089k04L1267K4019m2712p5102j4751N9569N0478j2915
$$ 433924 481099 540915 554004 553800 585067 609086 566374 491272 476521 536090 586568 573653
12748E73653l4671n361L437k4493k5633J9079L7622r941m8676m650O1176L7451
$$ 573653 538982 533621 537058 512565 486932 506011 543633 533692 485016 480366 541542 578993
12736E78993n0575o1028M2549J13733L4370r9110j08069J2669R9400N9783k2864
$$ 578993 528418 467390 509939 623672 658042 558932 450863 463532 562932 622715 599851
12725E99851m4483j7747k618PJ2923J5767r540k2772J0219M4530K3388k3357k7743
$$ 599851 555368 537621 535003 535010 547933 563700 554160 531388 541607 586137 609525 586168 558425
12712E58425L915J2103p818p837J6490K1505L489L774K2078J1390k8812l9492
$$ 558425 562340 574443 566625 558788 575278 596783 600272 604046 626124 637514 608702 569210
12700E69210k427K7199J4892l219M960J5896P762M80L965n744k5218j1619L0666
$$ 569210 566783 593982 608874 605655 610615 626511 634273 634753 638718 632974 607756 596137 626803
12687F26803L2325k3454n2013j332N0840K1070l5835j6545N4129O2536n030m3349
$$ 626803 659128 635674 583661 582329 633169 654239 618404 601859 655988 718524 713494 670145
12675F70145l111L7176P317m8455n3833j3107J7758K1765K4327L3947K9822K170
$$ 670145 667034 704210 711527 663072 609239 596132 613890 635655 659982 693929 723751 725921
12663G25921k6959k7542L176L1567K1398j7614l4104m431K8740J7294k0471l2230
$$ 725921 698962 671420 674596 706163 727561 709947 675843 671412 700152 717446 696975 664745
12651F64745j2843J016K310J7212M0826L5261J503j0567J6094L3499P193k6974
$$ 664745 651902 652918 655228 672440 713266 748527 750030 739463 755557 789056 796249 769275
12639G69275k3630j019n511l1518k8751J7421N7385M2148r013l0203L855L9399
$$ 769275 745645 744626 739115 707597 678846 696267 753652 795800 786787 756584 760439 799838
12627G99838J7616l2104k6995L5648N4043k5065j02905o0981N6855J03542M3631
$$ 799838 817454 785350 758355 794003 848046 822981 720076 659095 715950 819492 863123
12616H63123j4940p140L507l3949n6460l344O4349N6010n089k8544j478J1493
$$ 863123 848183 841043 844550 810601 754141 750797 815146 871156 866067 837523 836045 847538
12604H47538j0670j8597J2111L6634J2069l8240n5098j4877M2289N2612L164m2008
$$ 847538 836868 818271 830382 867016 879085 840845 785747 770870 813159 865771 868935 826927
12592H26927k0088L6673M2054r443l0518J2983M0217n302n0599j4647M7491L4272
$$ 826927 806839 843512 885566 876123 845605 858588 898805 893503 842904 828257 875748 910020
12580I10020k7881k8147M1045P2000J6602m8325m9693p756K9316M9197M5937R462
$$ 910020 882139 853992 895037 967037 983639 935314 885621 877865 907181 956378 1002315 1011777
12568A011777k8427j5286L0447K8937l3262o8854k1524M7749N5520R611k5158
$$ 1011777 983350 968064 998511 1027448 994186 925332 903808 951557 1007077 1016688 991530
12557I91530k1436L36J5292R242j5032k5482M150M0026K7078j4979j3148L1980
$$ 991530 970094 970430 985722 994964 979932 954450 958600 998626 1025704 1010725 997577 1029557
12545A029557L8755j1153l2132J4729M7356Q986k7680M181L7375n028n7119k1646
$$ 1029557 1068312 1057159 1025027 1039756 1087112 1096098 1068418 1072599 1109974 1104946 1047827 1026181
12533A026181M7906L5208k9103j9825N3886N7728k9157p1167o463N5191K6891
$$ 1026181 1074087 1109295 1080192 1060367 1114253 1171981 1142824 1071657 1065194 1120385 1147276
12522A147276k2776j4902N122j9971l5693J7620P3882M2553l3866m9062k985K1278
$$ 1147276 1124500 1109598 1114720 1094749 1059056 1076676 1150558 1193111 1159245 1110183 1107198 1128476
12510A128476P602P938K1144j403l8348j2975O4146Q6962J7324n2138m1186R170
$$ 1128476 1136078 1144016 1165160 1163757 1125409 1112434 1176580 1263542 1280866 1228728 1187542 1196712
12498A196712K5197J2019J0338J2196n069j3605J7976M9970K3930l3126l8382
$$ 1196712 1221909 1233928 1244266 1256462 1251393 1237788 1255764 1305734 1329664 1296538 1258156
12487A258156J8299N4834J9386l7871m5095n312K6782K5508Q708m950j2066p860
$$ 1258156 1276455 1331289 1350675 1312804 1267709 1262397 1289179 1314687 1323395 1318445 1306379 1298519
12475A298519J2058L4644L9325K4857P802k591r878j4207r602L372J7579K8408
$$ 1298519 1310577 1345221 1384546 1409403 1417205 1414614 1404736 1390529 1380927 1384299 1401878 1430286
12463A430286K9165Q337k6753l6334P210O5517O6688J11o1697n4028L967M7791
$$ 1430286 1459451 1467788 1441035 1404701 1411911 1477428 1544116 1544227 1482530 1428502 1432469 1480260
12451A480260M7606J9473j2378k7437p295L7213N5510J6581l4637k6995L5928
$$ 1480260 1527866 1547339 1534961 1507524 1500229 1537442 1592952 1609533 1574896 1547901 1583829
12440A583829P3356L3241m1774p0728k7458L8887N9893J6930l6831l1506L1531
$$ 1583829 1657185 1690426 1648652 1577924 1550466 1589353 1649246 1666176 1629345 1597839 1629370
12429A629370P2274L8174j9056k2077J2253Q499l1252k5437M1538P6545K4718
$$ 1629370 1701644 1739818 1720762 1698685 1710938 1719437 1688185 1662748 1704286 1780831 1805549
12418A805549l5274j3881M6495M1539k9395o4368j0225P1167R3170L9727l6570
$$ 1805549 1770275 1756394 1802889 1844428 1815033 1750665 1740440 1811607 1904777 1944504 1907934
12407A907934o8141k5590M7520O7030J0466m1955j6507M2121M0075j5840l3162
$$ 1907934 1839793 1814203 1861723 1928753 1939219 1897264 1880757 1922878 1962953 1947113 1913951
12396A913951J0242L3471k623k4835K5484Q4751O2392j7889n5176j5259M0125
$$ 1913951 1924193 1957664 1955041 1930206 1955690 2040441 2102833 2084944 2029768 2014509 2054634
12385B054634N2383K5962p950k8891k2224J4640M9730L9698r811l9095q112M8746
$$ 2054634 2107017 2132979 2125029 2096138 2073914 2088554 2138284 2177982 2168171 2129076 2120964 2169710
12373B169710O4675K4788j7480j1965K3003K9816k230j7968J8941O0998M1244
$$ 2169710 2234385 2259173 2241693 2229728 2252731 2282547 2280317 2262349 2281290 2342288 2383532
12362B383532k1029m1063O433N0541L2512j3118k3924j885J1380J1644K5298M8002
$$ 2383532 2362503 2321440 2327873 2378414 2410926 2397808 2373884 2371999 2383379 2395023 2420321 2468323
12350B468323M7135J8332n850k038K1173L9652K9101j7326o1978m4033L6849R5124
$$ 2468323 2515458 2533790 2527940 2525902 2547075 2586727 2615828 2598502 2536524 2492491 2529340 2624464
12338B624464O6049l80j5372J5816K0662n671M185N7317P2132J3500m1738k3571
$$ 2624464 2690513 2690133 2674761 2690577 2711239 2705568 2709753 2767070 2839202 2852702 2810964 2787393
12326B787393L0525N1093L8596K5780N885k8437l3435J7354O1975L4169k1901
$$ 2787393 2817918 2869011 2907607 2933387 2939272 2910835 2877400 2894754 2956729 2990898 2968997
12315B968997j5621M1924N8492J5490q858K0932M4288J9871n851R663L2101K3652
$$ 2968997 2953376 2995300 3053792 3069282 3060424 3081356 3125644 3145515 3139664 3149327 3181428 3205080
12303C205080J3382L3175M9586K6472j523J0818L5544K4179M31J5571M5797K9175
$$ 3205080 3218462 3251637 3301223 3327695 3326172 3336990 3372534 3396713 3397144 3412715 3458512 3487687
12291C487687j4658n240N7343P7742J7088l9865j6418M2718N3622K0722O225J9368
$$ 3487687 3473029 3467789 3525132 3602874 3619962 3580097 3563679 3606397 3660019 3680741 3686966 3706334
12279C706334J8534J12N040L9602N9625M4227K6318L1071L5149J5467j939K0176
$$ 3706334 3724868 3724980 3730020 3769622 3829247 3873474 3899792 3930863 3966012 3981479 3979540 3999716
12267C999716O6136Q0627M2587n544j2116K0082M2866K9644J0076K4040N8069
$$ 3999716 4065852 4146479 4189066 4183522 4171406 4191488 4234354 4263998 4274074 4298114 4356183
12256D356183N9195J3813k3296q71N5013P3928L5687o147J565M6421P3876N4899
$$ 4356183 4415378 4429191 4405895 4405024 4460037 4533965 4569652 4563505 4565070 4611491 4685367 4740266
12244D740266J2839q622R053M5378O5973N7372L4247J6826J2986K2770M3155O1250
$$ 4740266 4753105 4744483 4753536 4798914 4864887 4922259 4956506 4973332 4986318 5009088 5052243 5113493
12232E113493O0011M0751K4092K1201K4788L3784N4373O6546L6314j4427p434
$$ 5113493 5173504 5214255 5238347 5259548 5284336 5318120 5372493 5439039 5475353 5460926 5453492
12221E453492P5197J32374P6463k3508l0377N6590J04019N3639J204K8148P7004
$$ 5453492 5528689 5661063 5737526 5714018 5683641 5740231 5844250 5897889 5899093 5927241 6004245
12210F004245O6982L0800M0270P2220N6289P250J536M7852Q1336P4355O1607O0413
$$ 6004245 6071227 6102027 6142297 6214517 6270806 6278056 6279592 6327444 6408780 6483135 6544742 6605155
12198F605155N3336M9428P6245J05720P6589O146r883O0070J24150R6626J7822
$$ 6605155 6658491 6707919 6784164 6889884 6966473 6972619 6962736 7022806 7146956 7243582 7261404
12187G261404j1777L1911Q3395Q3777M3680K0344N4015J17615J34316P4613J7258
$$ 7261404 7249627 7281538 7364933 7448710 7492390 7512734 7566749 7684364 7818680 7893293 7910551
12176G910551N2571J37680J39937L7456l3688J8234J01987R4125L2663L8709J08573
$$ 7910551 7963122 8100802 8240739 8278195 8244507 8262741 8364728 8458853 8491516 8530225 8638798
12165H638798J26946O5819K6311O5064J09408R1721N7795P3758J11475J07070
$$ 8638798 8765744 8831563 8857874 8922938 9032346 9124067 9181862 9255620 9367095 9474165
12155I474165P3549P1211J02341J16000J00133R3686J08316J06093O9868M1097
$$ 9474165 9547714 9618925 9721266 9837266 9937399 10031085 10139401 10245494 10315362 10356459
12145A0356459O1582J13852J45111J28339Q2214M9210O4280J21787J63215J29487
$$ 10356459 10418041 10531893 10677004 10805343 10887557 10936767 11001047 11122834 11286049 11415536
12135A1415536M4441R434P9663J79724J95104J24405P0959Q8462J19129J08412
$$ 11415536 11459977 11469411 11549074 11728798 11923902 12048307 12119266 12207728 12326857 12435269
12125A2435269R3465J21007J52285J31308R3129J08150J54909J55363J17614J24104
$$ 12435269 12528734 12649741 12802026 12933334 13026463 13134613 13289522 13444885 13562499 13686603
12115A3686603J75151J73844R8088N6433J11396J71205J45673R7819J26159J88731
$$ 13686603 13861754 14035598 14133686 14190119 14301515 14472720 14618393 14716212 14842371 15031102
12105A5031102J80423J20001J12481J63150J79598J44427J35087J65593J59176
$$ 15031102 15211525 15331526 15444007 15607157 15786755 15931182 16066269 16231862 16391038
12096A6391038J06797J04989J83585K34428J85606J21899J39802J91611J82685
$$ 16391038 16497835 16602824 16786409 17020837 17206443 17328342 17468144 17659755 17842440
12087A7842440J36569J42125J95714K17384J89608J67937J72614J71435J60673
$$ 17842440 17979009 18121134 18316848 18534232 18723840 18891777 19064391 19235826 19396499
12078A9396499J69457J88193J80438J63395J87806K34794K26336J56319J18981
$$ 19396499 19565956 19754149 19934587 20097982 20285788 20520582 20746918 20903237 21022218
12069B1022218J70285K41864K44076J90323J58395J72678J89843J81668J73207
$$ 21022218 21192503 21434367 21678443 21868766 22027161 22199839 22389682 22571350 22744557
12060B2744557J94271K30734K39885K03345J55106J49216J94583K37366K27890
$$ 22744557 22938828 23169562 23409447 23612792 23767898 23917114 24111697 24349063 24576953
12051B4576953J87707J74851J95440K01678J79814J77476K16736K39467J91980
$$ 24576953 24764660 24939511 25134951 25336629 25516443 25693919 25910655 26150122 26342102
12042B6342102J23343J29892K13700K68251K22783J39808J26055J86687K28940
$$ 26342102 26465445 26595337 26809037 27077288 27300071 27439879 27565934 27752621 27981561
12033B7981561K00113J55001J62274J99889J96849J48698J23918J55453J91615
$$ 27981561 28181674 28336675 28498949 28698838 28895687 29044385 29168303 29323756 29515371
12024B9515371J79330J41281J29724J44441J47248J33698J35804J59939J71784
$$ 29515371 29694701 29835982 29965706 30110147 30257395 30391093 30526897 30686836 30858620
12015C0858620J50470J19174J07657J11870J08275R2772Q6678J03738J22773J08517
$$ 30858620 31009090 31128264 31235921 31347791 31456066 31548838 31635516 31739254 31862027 31970544
12005C1970544O4609M2927P4614J13306R2533K6972n305J8493M0188K8956K8370
$$ 31970544 32035153 32078080 32152694 32266000 32358533 32385505 32380200 32398693 32438881 32467837 32496207
11994C2496207N8280O1786J0483k6989m59K4853j5123n5424j4033M4602Q319p8418
$$ 32496207 32554487 32616273 32626756 32599767 32599308 32624161 32609038 32553614 32539581 32584183 32592502 32514084
11982C2514084q2078j7296k2814j04471j13091j5629K6627o8791j58321j16480
$$ 32514084 32432006 32414710 32391896 32287425 32174334 32158705 32185332 32116541 31958220 31841740
11972C1841740m2800p5107j53899j46834q2450p3665j04877q7027n3010j01674
$$ 31841740 31798940 31723833 31569934 31423100 31340650 31266985 31162108 31075081 31022071 30920397
11962C0920397j93124j96402j19343r8499j61698j89829j35369r6756j32167j66989
$$ 30920397 30727273 30530871 30411528 30313029 30151331 29961502 29826133 29729377 29597210 29430221
11952B9430221j45998j27136j54924j74936j48122j30303j63686j98301j92255
$$ 29430221 29284223 29157087 29002163 28827227 28679105 28548802 28385116 28186815 27994560
11943B7994560j85087k02444j95733j50477j43676k07249k44209j82195j08023
$$ 27994560 27809473 27607029 27411296 27260819 27117143 26909894 26665685 26483490 26375467
11934B6375467j32471k10159k23634j75294j57610j83387j87062j65271j77563
$$ 26375467 26242996 26032837 25809203 25633909 25476299 25292912 25105850 24940579 24763016
11925B4763016k17031k11314j58771j42438j88788k22359j92187j48420j54368
$$ 24763016 24545985 24334671 24175900 24033462 23844674 23622315 23430128 23281708 23127340
11916B3127340j98921k33310k32606j92845j25989q0849j09554j88754k30836
$$ 23127340 22928419 22695109 22462503 22269658 22143669 22062820 21953266 21764512 21533676
11907B1533676j98166j50985j55241j96648k18861k01170j64013j32440j23086
$$ 21533676 21335510 21184525 21029284 20832636 20613775 20412605 20248592 20116152 19993066
11898A9993066j39789j62712j67345j61382j69528j82106j66564j33874j33999
$$ 19993066 19853277 19690565 19523220 19361838 19192310 19010204 18843640 18709766 18575767
11889A8575767j70218j82068j41839j04913j23404j66977j79604j65083j58838
$$ 18575767 18405549 18223481 18081642 17976729 17853325 17686348 17506744 17341661 17182823
11880A7182823j56807j36833j18790j33890j54848j30537q2559q9590j63528k15125
$$ 17182823 17026016 16889183 16770393 16636503 16481655 16351118 16268559 16178969 16015441 15800316
11870A5800316j75915r4784o6160j03834j41680j38163j21070j25908j40974j36219
$$ 15800316 15624401 15529617 15463457 15359623 15217943 15079780 14958710 14832802 14691828 14555609
11860A4555609j13600r8612r8421r8281r4247j01129j22913j38530j29540j07245
$$ 14555609 14442009 14343397 14244976 14146695 14052448 13951319 13828406 13689876 13560336 13453091
11850A3453091r8087j09289j20515j08765p7654o1323r0942j48710j70919j22563
$$ 13453091 13355004 13245715 13125200 13016435 12938781 12877458 12786516 12637806 12466887 12344324
11840A2344324n6437n5614j16941j46388r1483k1657l1774j10177j62741j42256
$$ 12344324 12287887 12232273 12115332 11968944 11877461 11855804 11824030 11713853 11551112 11408856
11830A1408856r0123n9906o1271q1816j08800j18647r1553m8732l5710n9840q3125
$$ 11408856 11318733 11258827 11197556 11115740 11006940 10888293 10796740 10748008 10712298 10652458 10569333
11819A0569333q4079q4110r9930j11077r4975o3285m5049n4728q4816j09698r9707
$$ 10569333 10485254 10401144 10301214 10190137 10095162 10031877 9986828 9932100 9847284 9737586 9637879
11808I637879n7270k9594n1380q9226q7726n5292m6058o7523p6144o2687o3611
$$ 9637879 9580609 9551015 9499635 9410409 9322683 9267391 9221333 9153810 9077666 9014979 8951368
11797H951368p9674o8122l5143m5295j05099j30147p8106k3814l6738p0030n3692
$$ 8951368 8871694 8803572 8768429 8723134 8618035 8487888 8409782 8385968 8349230 8279200 8225508
11786H225508k1448m5095j00030j04440n7677l3804n4420o6807m5097k4942l2051
$$ 8225508 8204060 8158965 8058935 7954495 7896818 7863014 7808594 7741787 7696690 7671748 7639697
11775G639697m9733o2624p0664o2230l1700j3383l8327p4294p2831n1933n6601
$$ 7639697 7589964 7527340 7456676 7394446 7362746 7349363 7311036 7236742 7163911 7111978 7055377
11764G055377o4940k7176K1741j306q0389j07421n3910j6904n5159r5283o3527
$$ 7055377 6990437 6963261 6985002 6983696 6903307 6795886 6741976 6725072 6669913 6574630 6511103
11753F511103j0010k0045p6632r6916n6729l785J8645P51m8777r5160q8582k9735
$$ 6511103 6501093 6481048 6404416 6307500 6250771 6246986 6265631 6266382 6217605 6122445 6033863 6004128
11741F004128J1191j4386o2995o7776l5941k0645l0396l0480j4836j5642m5887
$$ 6004128 6015319 6000933 5937938 5870162 5834221 5813576 5783180 5752700 5737864 5722222 5676335
11730E676335p8356q1683m9218o50K5510Q43n2428p6390n1745k2925k7777m4902
$$ 5676335 5597979 5516296 5467078 5466428 5491938 5492781 5440353 5363963 5312218 5289293 5261516 5216614
11718E216614m1570k9778l4313m3161l3184j4481r643j5855j9882k2105k2237
$$ 5216614 5175044 5145266 5110953 5067792 5034608 5020127 5010484 4994629 4974747 4952642 4930405
11707D930405j7384k8304p3293j03574m6089O0818P7594l2503j21019o7936L0627
$$ 4930405 4913021 4884717 4811424 4707850 4661761 4722579 4800173 4767670 4646651 4578715 4609342
11696D609342J6962p6438r1897q947L7315j0621n5714k8052J1858R0l1079l7343
$$ 4609342 4626304 4549866 4457969 4449022 4486337 4475716 4420002 4391950 4403808 4403898 4372819 4335476
11684D335476l7635n0736n0244k8985k1404k7613p980K0454p708p0491o0297K9139
$$ 4335476 4297841 4247105 4196861 4167876 4146472 4118859 4110879 4131333 4123625 4053134 3992837 4021976
11672D021976O0078k7406r8230l9694M3488L091r8030q9943J8662O0735q303n2329
$$ 4021976 4082054 4054648 3956418 3916724 3960212 3963303 3865273 3775330 3793992 3854727 3846424 3794095
11660C794095J025M6223n272p6383o7001k0264l0260p1042m6656L2500N2524k3787
$$ 3794095 3795120 3841343 3836071 3759688 3692687 3672423 3642163 3571121 3524465 3556965 3609489 3585702
11648C585702r1590n7412K5633M1494j8577n2217o131M4124J2495o5152q6890
$$ 3585702 3494112 3436700 3462333 3503827 3485250 3433033 3426902 3471026 3483521 3418369 3331479
11637C331479l6666N091n305k2635j1407n417k7296l2844M480K8765m682l8345
$$ 3331479 3294813 3299904 3294599 3271964 3260557 3255140 3227844 3195000 3199480 3228245 3223563 3185218
11625C185218n451M2349Q752q0174j02373k7034M2076K8873j7582k6342j0615
$$ 3185218 3179767 3222116 3230868 3150694 3048321 3021287 3063363 3092236 3074654 3048312 3037697
11614C037697j4636k8140j8887j537j1666m0105m5991j9036J2086K3183J4876
$$ 3037697 3023061 2994921 2976034 2974497 2962831 2922726 2876735 2857699 2869785 2892968 2907844
11603B907844k644j9494k3907r775J0509J1201k0128n8729n7987p484L6281J6054
$$ 2907844 2905200 2885706 2861799 2852024 2862533 2873734 2853606 2794877 2736890 2729406 2765687 2781741
11591B781741l5219l2127K3898K9816n0919j04142l6310N9821L8804o2812q3648
$$ 2781741 2746522 2714395 2738293 2768109 2717190 2613048 2576738 2636559 2675363 2612551 2528903
11580B528903k05M4934q759m5078J5378P4249K7772n5750n3440J5968M0633n547
$$ 2528903 2528698 2573632 2564873 2519795 2535173 2609422 2637194 2581444 2528004 2543972 2584605 2579058
11568B579058n1204n2304k7079K654K1518L994m1862n5008j0885K4282o04k8345
$$ 2579058 2527854 2475550 2448471 2451125 2472643 2476637 2434775 2379767 2368882 2393164 2392560 2364215
11556B364215N996N0750K2729m2637m9872p629j934l5337l1570J2481J9968j8437
$$ 2364215 2370211 2420961 2443690 2401053 2351181 2343552 2341618 2306281 2274711 2287192 2307160 2288723
11544B288723k8694J430l12m2682m0501K5739N7725O871l7225l164L8991O328
$$ 2288723 2260029 2261459 2261147 2218465 2177964 2203703 2261428 2268299 2231074 2227910 2266901 2273229
11532B273229n0387l9618J3561K0417j8870l1205k508J4806O145P372K0634P138
$$ 2273229 2222842 2183224 2196785 2217202 2198332 2167127 2164619 2179425 2185570 2192942 2213576 2220714
11520B220714l2088m5778j5652J3508M709j9613j8120R219K2064r360o1874p4728
$$ 2220714 2188626 2142848 2127196 2140704 2145413 2125800 2107680 2116899 2138963 2129603 2067729 1993001
11508A993001k2227M0273M0262r860l2580q714j680l5950m4494R515M9703N906
$$ 1993001 1970774 2011047 2051309 2041449 2008869 2000155 1998475 1962525 1918031 1927546 1977249 1983155
11496A983155o0067m6858K6058N8174K7767j14q08j1381l2761k0844J8015K3470
$$ 1983155 1923088 1876230 1902288 1960462 1988229 1988115 1987307 1975926 1943165 1922321 1940336 1963806
11484A963806j2962l1057o634J4693N795m791j911p148j6592P58K7989J3913k4520
$$ 1963806 1950844 1919787 1913153 1927846 1933641 1928850 1926939 1919791 1903199 1903957 1931946 1945859 1921339
11471A921339j5703L1066K1198n6677q6039r967O3351L2416l6256l1055J9819
$$ 1921339 1905636 1936702 1957900 1901223 1815184 1805217 1868568 1900984 1864728 1833673 1853492
11460A853492J7387k9894l7827n775l006k6519j0945L4105L1778j7387k9030J5570
$$ 1853492 1870879 1840985 1803158 1797383 1794377 1767858 1756913 1791018 1822796 1805409 1776379 1791949
11448A791949L9294R363j5190o427j5184n2655m6377K3812O0848J703o7482m2528
$$ 1791949 1831243 1840606 1825416 1818989 1803805 1751150 1704773 1728585 1789433 1791136 1723654 1681126
11436A681126L6082N7520J3762j4876o412j3653m7522n0786l1N0417M8376P253
$$ 1681126 1717208 1774728 1788490 1773614 1767202 1753549 1706027 1655241 1655210 1705627 1754003 1761256
11424A761256k8428l4933j5332R448J1313j3196k8986j0373J6039J4733K126J2681
$$ 1761256 1732828 1697895 1682563 1692011 1703324 1690128 1661142 1650769 1666808 1681541 1683667 1696348
11412A696348K8472P023l5233l8829K358L1564K0359j143j3468l2850n0702k5858
$$ 1696348 1724820 1731843 1696610 1657781 1660139 1691703 1712062 1710919 1697451 1664601 1613899 1588041
11400A588041L3126N2562J274n3835m6697l744J6285J4558K0809K0779j2254m8906
$$ 1588041 1621167 1673729 1675003 1621168 1574471 1570727 1587012 1601570 1622379 1643158 1630904 1581998
11388A581998l9708K606K3656J3194P056J6670J8292M559q992k0189l1517k1020
$$ 1581998 1542290 1544896 1568552 1581746 1588802 1605472 1623764 1628323 1619331 1599142 1567625 1546605
11376A546605K1399M8713J5692l4763k4770K8983L2395l2461p1991k8942L1800
$$ 1546605 1568004 1616717 1632409 1597646 1572876 1601859 1634254 1601793 1529802 1500860 1532660
11365A532660L4230N77j3144j3669k7001k3199K7839P2040L6366m7862p8367k8523
$$ 1532660 1566890 1567467 1554323 1540654 1513653 1490454 1518293 1590333 1626699 1578837 1500470 1471947
11353A471947K5950K8418O016k531n897j5811r007K3611L8046m022o6841p8277
$$ 1471947 1497897 1526315 1532331 1529800 1523903 1508092 1499085 1522696 1560742 1556720 1489879 1411602
11341A411602k4100L4984M1778P983j1015R695L6027K4444j6610l6684j2353K1920
$$ 1411602 1387502 1422486 1464264 1472247 1461232 1470927 1506954 1531398 1514788 1478104 1465751 1487671
11329A487671K3299n391l0557l3382j6838J1115L4170K8047o040k8366j2634J2352
$$ 1487671 1510970 1505579 1475022 1441640 1424802 1435917 1470087 1498134 1492094 1463728 1451094 1463446
11317A463446R980k817Q468K3859p08m3022l2518L2413O3728J1443n6917n3235
$$ 1463446 1473426 1470609 1479077 1502936 1502228 1459206 1426688 1459101 1522829 1534272 1477355 1424120
11305A424120O720L5274L59l9671k5245K7617N4653K3890l0095n1539l0133m697
$$ 1424120 1430840 1466114 1466473 1426802 1401557 1429174 1483827 1507717 1477622 1426083 1395950 1391253
11293A391253j706l121P400P513j5694k1856J8359N1198J2766n1229l9695L6833
$$ 1391253 1389547 1386426 1393826 1401339 1385645 1363789 1382148 1433346 1446112 1394883 1355188 1392021
11281A392021O1265N62l7130J3177O0209J4062n6352l9154L3921M9215R94j9445
$$ 1392021 1453286 1453848 1416718 1429895 1490104 1504166 1447814 1408660 1442581 1491796 1492790 1473345
11269A473345O935P927l4979n3253j7790J7354K1224K9215M9722L0204m0115q4437
$$ 1473345 1480280 1488207 1453228 1399975 1382185 1399539 1420763 1449978 1499700 1529904 1489789 1405352
11257A405352m7861K1135M8998L2737J0160n861j5388n823J7087J8910o355j8275
$$ 1405352 1357491 1378626 1427624 1460361 1470521 1464660 1449272 1443449 1460536 1479446 1473091 1454816
11245A454816j822J098k9046m1973j263M3626L0896j7142l6678k0882q130m496
$$ 1454816 1452994 1454092 1425046 1383073 1381810 1425436 1456332 1439190 1402512 1381630 1373500 1369004
11233A369004J2633L4960L2347Q695o115o847p004j484J5505J7945j2269l6342
$$ 1369004 1381637 1416597 1448944 1457639 1451524 1444677 1437673 1436189 1451694 1469639 1457370 1421028
11221A421028r851L8004M3275Q838p121N145k228l5318l7592O705L1902k246l5917
$$ 1421028 1411177 1449181 1492456 1501294 1494173 1499318 1497090 1461772 1424180 1430885 1462787 1460541 1424624
11208A424624l015N5871N0421j8664n6557j2752M9384M8390m288l5137j9630l919
$$ 1424624 1421609 1477480 1527901 1509237 1452680 1439928 1489312 1537702 1533414 1498277 1478647 1474728
11196A474728j7075k1880J6485N9404M5591j2122m2788k2895O46p71J667K0980
$$ 1474728 1457653 1435773 1452258 1511662 1557253 1545131 1502343 1479448 1480094 1479323 1480990 1501970
11184A501970J7059k4252m4447l774M2170K7616j5797j7745J1253J2658m111J5435
$$ 1501970 1519029 1494777 1450330 1446556 1488726 1516342 1500545 1482800 1494053 1506711 1502600 1518035
11172A518035N2233L2870l3122n2156j218L1810j230l0165M792M7701K6685k3427
$$ 1518035 1570268 1603138 1570016 1517860 1516642 1548452 1547222 1517057 1521849 1569550 1596235 1572808
11160A572808k5265J4572L0943J1144k339N602J0553L208m229j2377k5147k3777
$$ 1572808 1547543 1562115 1593058 1604202 1601863 1607465 1618018 1621226 1616997 1604620 1579473 1555696
11148A555696L371K7035J8340j589K88J0614J076j2069J665K4112J8857P65P585
$$ 1555696 1559067 1586102 1604442 1602853 1603141 1613755 1614831 1602762 1604427 1628539 1647396 1648161 1655746
11135A655746K2698J323l8718l3946J6966M4320J8687q371J806J6162J094j5044
$$ 1655746 1678444 1679767 1641049 1607103 1624069 1668389 1687076 1678705 1680511 1696673 1697767 1682723
11123A682723J496K4107J0902k0916k0513J5896L7911J0729m1158o2976k6181
$$ 1682723 1684219 1708326 1719228 1698312 1677799 1693695 1731606 1742335 1701177 1638201 1612020
11112A612020M2949Q5532O7767J5311k1902k8981k5398j8094K681K3494J4461
$$ 1612020 1654969 1740501 1808268 1823579 1801677 1772696 1747298 1729204 1731885 1755379 1769840
11101A769840j4467j6060J6864L1170j35k7084l519L1881J7260k6117k3663L0986
$$ 1769840 1755373 1739313 1756177 1787347 1787212 1760128 1756609 1788490 1805750 1779633 1755970 1786956
11089A786956O1240K3507l0571l4640L716L2178L2665K7380K7753K0978K594j2645
$$ 1786956 1848196 1871703 1841132 1806492 1810208 1842386 1875051 1902431 1930184 1951162 1953756 1941111
11077A941111j5939j4438j1247J669K3001L4838K6696J0460R35j379K898K0333
$$ 1941111 1925172 1910734 1899487 1901156 1924157 1958995 1985691 1996151 1997086 1995707 1998605 2018938
11065B018938M1608L5618l132k5583Q814N7887M5910j6885l7636J7837O6313L5285
$$ 2018938 2060546 2096164 2093032 2067449 2076263 2134150 2180060 2163175 2125539 2143376 2209689 2244974
11053B244974k4285k4425J9898K9183K42K769M5022N2765J621l1680O496N8294
$$ 2244974 2220689 2196264 2216162 2245345 2245587 2248356 2293378 2346143 2347764 2316084 2322580 2380874
11041B380874M9904O336m78K9882L6624L119j9067Q903O0613Q2152N1684l777
$$ 2380874 2430778 2437114 2436636 2466518 2503142 2506261 2487194 2496097 2556710 2638862 2690546 2686769
11029B686769l4065j2166L5063N5042L3974Q865Q673K0495K9853M8748P4232O6501
$$ 2686769 2652704 2640538 2675601 2730643 2764617 2773482 2782155 2802650 2832503 2881251 2955483 3021984
11017C021984J3610k3423J1717P7233Q3519K2414k2630J560N1126O0968L4587
$$ 3021984 3035594 3012171 3023888 3101121 3184640 3207054 3184424 3185984 3237110 3298078 3332665
11006C332665K3642M8442P4981O4224K0939j2988q095J9624L4960L4309M4580
$$ 3332665 3356307 3404749 3479730 3543954 3564893 3551905 3543810 3563434 3598394 3632703 3677283
10995C677283P0447P8893N1749J7169M401L097j667Q123M4628P2507N7060K6517
$$ 3677283 3747730 3826623 3878372 3895541 3899942 3903039 3901372 3909495 3954123 4026630 4083690 4110207
10983D110207L0118N5552N0417J3371k934J9776L8473K1881n942j2576k47J6942
$$ 4110207 4140325 4195877 4246294 4259665 4256731 4276507 4314980 4336861 4330919 4318343 4318096 4335038
10971D335038L7648N5767N2608K5265l057j3136q412O94Q692J1219R942J4429
$$ 4335038 4372686 4428453 4481061 4506326 4503269 4490133 4481721 4482415 4491107 4502326 4512268 4526697
10959D526697K0334N575k6964l5096l010J9257m589k4993R777M3984o205r3614
$$ 4526697 4547031 4552606 4525642 4490546 4487536 4506793 4502204 4477211 4486988 4530972 4524767 4431153
10947D431153q9999O877N7678J966n0799j2802L8182L300o5140n7852Q182L0417
$$ 4431153 4341154 4348031 4405709 4407675 4356876 4344074 4382256 4385556 4320416 4262564 4270746 4301163
10935D301163q210l5183k5657k4939m4035m0131o576Q494j4054l5211k4416L249
$$ 4301163 4292953 4257770 4232113 4207174 4163139 4123008 4116432 4124926 4110872 4075661 4051245 4054494
10923D054494K1547J6400j8273o1940o4446j3492K4496n497n1533l1124K8253
$$ 4054494 4076041 4092441 4074168 4012228 3947782 3934290 3958786 3953289 3901756 3870632 3898885
10912C898885K7176m0532p3635k5790K8314K0958j4080k0793q977r507j2840o018
$$ 3898885 3926061 3885529 3811894 3786104 3814418 3835376 3821296 3800503 3791526 3782019 3769179 3763161
10900C763161j0004k9018k0773K9646O2296K8201k6745k9813O515J3180j9760
$$ 3763161 3753157 3724139 3703366 3733012 3795308 3823509 3796764 3766951 3773466 3786646 3766886
10889C766886l2172M591M3094L2901j0662l5388k0651P409J7383R352O496J8698
$$ 3766886 3734714 3739305 3782399 3815300 3804638 3769250 3748599 3756008 3773391 3782743 3789239 3807937
10877C807937K8354J8689J698j22J0503J2085O72o625j868N798J0743J4543J2976
$$ 3807937 3836291 3854980 3856678 3856556 3867059 3879144 3879816 3873191 3871323 3877121 3887864 3902407 3915383
10864C915383M060J514J3517K0813P030o908L187J8453J2860J0137M1942P1479
$$ 3915383 3919443 3920957 3934474 3955287 3962317 3955409 3958596 3977049 3989909 4000046 4041988 4113467
10852D113467L8131l2349n1453m040L3393K3801J8186M4305N0584R511j9532P234
$$ 4113467 4151598 4119249 4067796 4063756 4097149 4120950 4139136 4183441 4234025 4243536 4224004 4231238
10840D231238L8828K1874n912J0770M7031N0437L0200J9512Q993r135M245N6922
$$ 4231238 4270066 4291940 4286028 4296798 4343829 4394266 4424466 4443978 4452971 4443836 4448081 4505003
10828D505003P1839M383n6238j2098P8465Q6600J6790j4352K2329L7826k721k0414
$$ 4505003 4576842 4581225 4524987 4512889 4591354 4677954 4694744 4680392 4702721 4740547 4737826 4717412
10816D717412L1212Q2784O2547nl3340j5972K8275O7016O6128J6455l1628j7373
$$ 4717412 4748624 4831408 4893955 4893950 4860610 4844638 4872913 4939929 5006057 5022512 4990884 4973511
10804D973511M1371O9756M4187R915k837j560K1294P3338J00819M5509l6456k8188
$$ 4973511 5014882 5084638 5128825 5138740 5135903 5134343 5155637 5228975 5329794 5375303 5338847 5310659
10792E310659O3497J03742L9083k2121Q035O4198N4770Q364P09K5683L3748K7947
$$ 5310659 5374156 5477898 5516981 5494860 5502895 5567093 5621863 5630227 5630936 5656619 5690367 5718314
10780E718314L5392M3016L5787L9455O1072N4769J0145k685N2463R9903O9920
$$ 5718314 5753706 5796722 5832509 5871964 5933036 5987805 5997950 5995265 6047728 6147631 6217551
10769F217551J4346J4231M8730N3912M1018N2681O6896M9770L9790P1552Q3357
$$ 6217551 6231897 6246128 6294858 6348770 6389788 6442469 6509365 6559135 6598925 6670477 6753834
10758F753834K0177l8771Q978J08138J23419N3910J4329L4068L9482K1755N1334
$$ 6753834 6774011 6735240 6744218 6852356 6975775 7029685 7044014 7078082 7117564 7139319 7190653
10747G190653J16887J17278M2363N866N8783J14842J06106P5216O5156N0712L0091
$$ 7190653 7307540 7424818 7467181 7473047 7531830 7646672 7752778 7827994 7893150 7943862 7973953
10736G973953N3126J05261R6845K4784N220P7585J22744O4067M397N0022J30426
$$ 7973953 8027079 8132340 8229185 8253969 8259189 8336774 8459518 8523585 8527982 8578004 8708430
10725H708430J26171O6111N4519Q9065R5078P3563P6588Q9638O9763N2020Q9476
$$ 8708430 8834601 8900712 8955231 9044296 9139374 9212937 9289525 9379163 9448926 9500946 9590422
10714I590422J32905J01160L2054K9447R0970J22885J02177Q7831Q9619O7802
$$ 9590422 9723327 9824487 9856541 9885988 9976958 10099843 10202020 10289851 10379470 10447272
10704A0447272N2834J13981K03337J89107P1852R750P7028J50602J16738N0142
$$ 10447272 10500106 10614087 10817424 11006531 11078383 11088133 11165161 11315763 11432501 11482643
10694A1482643P6177J63230J83190J14169N6099P1751J20902J48277J48614J34459
$$ 11482643 11558820 11722050 11905240 12019409 12075508 12147259 12268161 12416438 12565052 12699511
10684A2699511J08631Q7621J02023J50002J82727J60815J09240R2366J34300J84991
$$ 12699511 12808142 12895763 12997786 13147788 13330515 13491330 13600570 13692936 13827236 14012227
10674A4012227J82673J35873J08575J25812J45331J40711J49307J92787K14204
$$ 14012227 14194900 14330773 14439348 14565160 14710491 14851202 15000509 15193296 15407500
10665A5407500J67091J13949J41474K14133K22387J59935J32097J81039K26582
$$ 15407500 15574591 15688540 15830014 16044147 16266534 16426469 16558566 16739605 16966187
10656A6966187K11812J89349K10578K34420K12758J79473J85149K15501K38066
$$ 16966187 17177999 17367348 17577926 17812346 18025104 18204577 18389726 18605227 18843293
10647A8843293K61519K88926K82337K35230K09476K38185K66650K54052K48666
$$ 18843293 19104812 19393738 19676075 19911305 20120781 20358966 20625616 20879668 21128334
10638B1128334K85523L02975K58865K35489L05422L78481L32891K32607K39236
$$ 21128334 21413857 21716832 21975697 22211186 22516608 22895089 23227980 23460587 23699823
10629B3699823L43941L78990K99202K54347L32654M16733L85902L08217L12598
$$ 23699823 24043764 24422754 24721956 24976303 25308957 25725690 26111592 26419809 26732407
10620B6732407L84624M18118L92063L71394L80780L91228M01888M33156M57469
$$ 26732407 27117031 27535149 27927212 28298606 28679386 29070614 29472502 29905658 30363127
10611C0363127M31451L87192M01172M70613N07076M70201M29513M58680N30431
$$ 30363127 30794578 31181770 31582942 32053555 32560631 33030832 33460345 33919025 34449456
10602C4449456N64688N41962N15480N24477N46179N45859N37063N58271O03205
$$ 34449456 35014144 35556106 36071586 36596063 37142242 37688101 38225164 38783435 39386640
10593C9386640O18375N84149N57464N96543O71477P02242O73079O48327O70895
$$ 39386640 40005015 40589164 41146628 41743171 42414648 43116890 43789969 44438296 45109191
10584D5109191P08742P22927P28442P51464P76235P78674P75340P94666Q28725
$$ 45109191 45817933 46540860 47269302 48020766 48797001 49575675 50351015 51145681 51974406
10575E1974406Q54696Q77089R07422R28059R21034R12144R40440R97474J039032
$$ 51974406 52829102 53706191 54613613 55541672 56462706 57374850 58315290 59312764 60351796
10566F0351796J047283J044917J058301J099083J166865J237590J269027J253471
$$ 60351796 61399079 62443996 63502297 64601380 65768245 67005835 68274862 69528333
10558F9528333J242021J277332J330737J355497J371626J430858J517740J564576
$$ 69528333 70770354 72047686 73378423 74733920 76105546 77536404 79054144 80618720
10550H0618720J562561J577513J641591J706871J734237J757235J816325J888234
$$ 80618720 82181281 83758794 85400385 87107256 88841493 90598728 92415053 94303287
10542I4303287J929918J950151J988546K053227K122803K188032K253377K313506
$$ 94303287 96233205 98183356 100171902 102225129 104347932 106535964 108789341 111102847
10534A11102847K359617K397037K436252K481996K543290K628958K721737K790033
$$ 111102847 113462464 115859501 118295753 120777749 123321039 125949997 128671734 131461767
10526A31461767K838471K905770K996165L064881L098799L152145L258750L368191
$$ 131461767 134300238 137206008 140202173 143267054 146365853 149517998 152776748 156144939
10518A56144939L427499L469531L546921L631474L672986L715692L839098M000153
$$ 156144939 159572438 163041969 166588890 170220364 173893350 177609042 181448140 185448293
10510A85448293M066414M023218M015413M133790M284487M349614M366112M433855
$$ 185448293 189514707 193537925 197553338 201687128 205971615 210321229 214687341 219121196
10502B19121196M531206M560174M531729M560966M678361M779006M788494M762279
$$ 219121196 223652402 228212576 232744305 237305271 241983632 246762638 251551132 256313411
10494B56313411M770675M788170M767580M741421M762553M799618M782296M717600
$$ 256313411 261084086 265872256 270639836 275381257 280143810 284943428 289725724 294443324
10486B94443324M673032M660576M623480M537585M444361M370602M289868M185849
$$ 294443324 299116356 303776932 308400412 312937997 317382358 321752960 326042828 330228677
10478C30228677M084510L992517L868985L699058L535700L417568L297641L113737
$$ 330228677 334313187 338305704 342174689 345873747 349409447 352827015 356124656 359238393
10470C59238393K888158K691057K535889K379557K201811K011866J794535J529521
$$ 359238393 362126551 364817608 367353497 369733054 371934865 373946731 375741266 377270787
10462C77270787J256795J040157Q64585O55055M03212J78738l602k18615m90933
$$ 377270787 378527582 379567739 380432324 381087379 381490591 381669329 381665727 381447112 380956179
10453C80956179p35132r04848j090675j370943j664368j857089j995154k199642
$$ 380956179 380221047 379316199 378225524 376854581 375190213 373333124 371337970 369138328
10445C69138328k446774k607270k684845k828188l081309l304512l405952l483309
$$ 369138328 366691554 364084284 361399439 358571251 355489942 352185430 348779478 345296169
10437C45296169l642033l822752l929015m000187m118666m245293m296793m310178
$$ 345296169 341654136 337831384 333902369 329902182 325783516 321538223 317241430 312931252
10429C12931252m374381m456999m464313m434222m490491m615293m653453m568683
$$ 312931252 308556871 304099872 299635559 295201337 290710846 286095553 281442100 276873417
10421B76873417m512869m577901m646413m586124m453196m383040m384209m369097
$$ 276873417 272360548 267782647 263136234 258550110 254096914 249713874 245329665 240960568
10413B40960568m316891m277945m256683m205209m116543m032869l971754l916191
$$ 240960568 236643677 232365732 228109049 223903840 219787297 215754428 211782674 207866483
10405B07866483l862094l812569l746901l654780l572530l525246l469927l364922
$$ 207866483 204004389 200191820 196444919 192790139 189217609 185692363 182222436 178857514
10397A78857514l255666l208975l196676l137600l030888k948093k905675k848408
$$ 178857514 175601848 172392873 169196197 166058597 163027709 160079616 157173941 154325533
10389A54325533k759540k685624k641373k587666k520196k482863k471180k420665
$$ 154325533 151565993 148880369 146238996 143651330 141131134 138648271 136177091 133756426
10381A33756426k321632k247623k230519k204798k125233k044413k011701j985120
$$ 133756426 131434794 129187171 126956652 124751854 122626621 120582208 118570507 116585387
10373A16585387j916415j843012j815111j802704j759629j715028j710432j703932
$$ 116585387 114668972 112825960 111010849 109208145 107448516 105733488 104023056 102319124
10365A02319124j635572j541489j500514j502958j476361j413983j369728j343388
$$ 102319124 100683552 99142063 97641549 96138591 94662230 93248247 91878519 90535131
10357I0535131j285106j211782j202875j261065j284026j210277j102969j048125
$$ 90535131 89250025 88038243 86835368 85574303 84290277 83080000 81977031 80928906
10349H0928906j047451j054485j048401j026993r83131r29978r02927r05269q98552
$$ 80928906 79881455 78826970 77778569 76751576 75768445 74838467 73935540 73030271 72131719
10340G2131719q69365q50134q50495q33205p89830p69815p89418p82632p04995
$$ 72131719 71262354 70412220 69561725 68728520 67938690 67168875 66379457 65596825 64891830
10331F4891830o24820o33367p05787p34362o80582o16383o14242o60112o88507
$$ 64891830 64267010 63633643 62927856 62193494 61512912 60896529 60282287 59622175 58933668
10322E8933668o61382n98618n52900n57292n87537n90668n58957n42350n68354
$$ 58933668 58272286 57673668 57120768 56563476 55975939 55385271 54826314 54283964 53715610
10313E3715610n93261n69686n21551n02681n13778n16525n05704n07328n18944
$$ 53715610 53122349 52552663 52031112 51528431 51014653 50498128 49992424 49485096 48966152
10304D8966152n10439m80013m58978m62641m78777m97730n13202n05343m66612
$$ 48966152 48455713 47975700 47516722 47054081 46575304 46077574 45564372 45059029 44592417
10295D4592417m29884m25623m31700m17222m08381m42266m80147m53643l86780
$$ 44592417 44162533 43736910 43305210 42887988 42479607 42037341 41557194 41103551 40716771
10286D0716771l74021m28897m56902m05764l41904l33889l55761l64021l79371
$$ 40716771 40342750 39913853 39456951 39051187 38709283 38375394 38019633 37655612 37276241
10277C7276241m17977m24246l61518l00978l20593l71769l57077k97691k98303
$$ 37276241 36858264 36434018 36072500 35771522 35450929 35079160 34722083 34424392 34126089
10268C4126089l64195l86552l22177k61252k77873l24956l33240l17594l16704
$$ 34126089 33761894 33375342 33053165 32791913 32514040 32189084 31855844 31538250 31221546
10259C1221546l09753k72406k48952k82322l23224k99340k37459k22066k57250
$$ 31221546 30911793 30639387 30390435 30108113 29784889 29485549 29248090 29026024 28768774
10250B8768774k70975k48453k53061k98910l10346k52406k05685k43138l07592
$$ 28768774 28497799 28249346 27996285 27697375 27387029 27134623 26928938 26685800 26378208
10241B6378208k96878k20140j75816j98905k26158k15317k08259k44975k85887
$$ 26378208 26081330 25861190 25685374 25486469 25260311 25044994 24836735 24591760 24305873
10232B4305873k69561k06186j63842j79307k21411k38238k13709j75015j58423
$$ 24305873 24036312 23830126 23666284 23486977 23265566 23027328 22813619 22638604 22480181
10223B2480181j72893j96541k07808k08563k07183j96545j72046j55912j70443
$$ 22480181 22307288 22110747 21902939 21694376 21487193 21290648 21118602 20962690 20792247
10214B0792247j97009j99150j78952j68242j70795j64572j56948j74771j96861
$$ 20792247 20595238 20396088 20217136 20048894 19878099 19713527 19556579 19381808 19184947
10205A9184947j72038j19560j23862j94237k25180j57820q6803j16259j91512
$$ 19184947 19012909 18893349 18769487 18575250 18350070 18192250 18105447 17989188 17797676
10196A7797676j91275j27430j15046j71684j93576j39206r6341j28430j76787
$$ 17797676 17606401 17478971 17363925 17192241 16998665 16859459 16763118 16634688 16457901
10187A6457901j72569j43905j44242j56235j38399j06320j00986j20612j36652
$$ 16457901 16285332 16141427 15997185 15840950 15702551 15596231 15495245 15374633 15237981
10178A5237981j39403j30075j09412j00309j28779j61887j34687o3948m8255j15457
$$ 15237981 15098578 14968503 14859091 14758782 14630003 14468116 14333429 14269481 14221226 14105769
10168A4105769j68040j39443j00800j27708j61369j15294l8443m0807j11783j46409
$$ 14105769 13937729 13798286 13697486 13569778 13408409 13293115 13254672 13213865 13102082 12955673
10158A2955673j17018q8450q6457p9095p2920r9752j19473o9725o245m6552j63067
$$ 12955673 12838655 12750205 12663748 12584653 12511733 12411981 12292508 12222783 12216538 12169986 12006919
10147A2006919j90919q1179J2082l2206j24977j25046n3550l0482q0310j22706
$$ 12006919 11816000 11734821 11746903 11714697 11589720 11464674 11411124 11380642 11300332 11177626
10137A1177626j10462p2861m6417m0598n3193o6537n6562m0845o7862j24787j28764
$$ 11177626 11067164 10994303 10947886 10907288 10854095 10787558 10730996 10690151 10622289 10497502 10368738
10126A0368738n8396q659m6043r7754p6244k8152m3244q7513o6324o105j9181
$$ 10368738 10310342 10301683 10255640 10157886 10081642 10053490 10010246 9922733 9856409 9850304 9831123
10115I831123j03311j31809n9509O560j6839p1457p5090m7284m5617o3254o6135
$$ 9831123 9727812 9596003 9536494 9543054 9526215 9454758 9379668 9332384 9286767 9223513 9157378
10104I157378o6357q5204r3909n9723j2283k999k9737n5208o8846p7811o6969
$$ 9157378 9091021 9005817 8911908 8852185 8839902 8836903 8807166 8751958 8683112 8605301 8538332
10093H538332k5912N807j9835q1822j08413p2334k0381l967k3004m8883o5605
$$ 8538332 8512420 8518227 8498392 8416570 8308157 8235823 8215442 8211475 8188471 8139588 8073983
10082H073983p0480o1556m5286m0344n4981o9669n8510k4458O72p698m1570p3974
$$ 8073983 8003503 7941947 7896661 7856317 7801336 7731667 7673157 7648699 7649371 7641673 7600103 7526129
10070G526129q6362p4971m2458p55K3252P559l4764o4204o0543m2663l5754l8601
$$ 7526129 7439767 7364796 7322338 7321583 7344835 7352394 7317630 7253426 7192883 7150220 7114466 7075865
10058G075865l4819k0073o069q228l2511o1662o2611l1224j3724m2465p0178l4313
$$ 7075865 7041046 7020973 7014904 7006676 6974165 6912503 6849892 6818668 6804944 6762479 6692301 6657988
10046F657988K6435J4791n9350p5784n630K2289n9543j15409k2138R8835N5941
$$ 6657988 6684423 6699214 6639864 6564080 6558450 6580739 6521196 6405787 6383649 6482484 6538425
10035F538425r1763j16733P512O9342k1417r1341j3989P1724O771j13836j03849
$$ 6538425 6446662 6329929 6337441 6406783 6385366 6294025 6280036 6351760 6358531 6244695 6140846
10024F140846J1107N8452L449l4206q588K19l9863n6784j7095J6267L346j3813
$$ 6140846 6151953 6210405 6213854 6179648 6171060 6171279 6131416 6074632 6057537 6073804 6077150 6063337
10012F063337o967j0698l6303l3036J6834M6769N277n6881n6815M225M7733K2948
$$ 6063337 6056370 6045672 6009369 5976333 5993167 6039936 6045213 5988332 5931517 5935742 5983475 6006423
10000F006423l3608m5695Q495O1511L7179l7780n5430J8259Q0815M2489l3710
$$ 6006423 5972815 5927120 5935615 5997126 6034305 5996525 5941095 5959354 6040169 6082658 6048948
9989F048948l2448L0409M3651r519l2126J1718L6941r510n5123k4366L8916M7156
$$ 6048948 6016500 6046909 6090560 6081041 6048915 6060633 6097574 6088064 6032941 6008575 6047491 6094647
9977F094647K386k1264Q738N0033N0607P641l3700k7877J5578L6585Q198j5456
$$ 6094647 6097033 6075769 6084507 6134540 6185147 6192788 6159088 6131211 6146789 6183374 6191572 6176116
9965F176116J6791N9481L7210k5854m0848j447J5423o840l232L6491L9927p297
$$ 6176116 6192907 6252388 6289598 6263744 6222896 6221449 6236872 6230032 6226800 6263291 6303218 6295921
9953F295921k4906J0616J2362n3920q8019k4236M4262J6873n0712n2814o814O047
$$ 6295921 6271015 6281631 6293993 6240073 6152054 6127818 6172080 6188953 6138241 6085427 6078613 6084660
9941F084660j0240n864k261l9304o8912l2763J2462j7142p5203n9771K792L834
$$ 6084660 6074420 6068556 6066295 6026991 5958079 5925316 5937778 5920636 5845433 5785662 5788454 5792288
9929E792288n2399o2915j7921j2537o4454q1990l3562J401k1228n1471n8674p0004
$$ 5792288 5739889 5676974 5659053 5646516 5582062 5500072 5466510 5467911 5446683 5395212 5336538 5266534
9917E266534p4662k9522J9792k3538j21387j20032j331O3959j4654j05738q3237
$$ 5266534 5191872 5162350 5182142 5158604 5037217 4917185 4915854 4979813 4965159 4859421 4776184
9906D776184k0339k7240n5840k2929Q008n4909j37210j06632k296K7651l2691
$$ 4776184 4755845 4728605 4672765 4649836 4657844 4602935 4465725 4359093 4356797 4384448 4351757
9895D351757o6262l3793j3089l6894n0946l8184m0742n1631k1465K0933n861p8093
$$ 4351757 4285495 4251702 4238613 4201719 4150773 4112589 4071847 4020216 3998751 4019684 4013823 3935730
9883C935730p9559K686M2373k1718q7788o3036m973o954m8827n4551j8890J0452
$$ 3935730 3856171 3858857 3901230 3879512 3791724 3728688 3723715 3716761 3667934 3613383 3594493 3604945
9871C604945J5454k74m3477r0788p9177l174M3654j982o7083n1518J4803K5484
$$ 3604945 3620399 3620125 3576648 3485860 3406683 3403509 3447163 3445181 3378098 3326580 3341383 3366867
9859C366867l1334o6194l8866p600j6536k9632q971J6105K421l4389m4752j5589
$$ 3366867 3335533 3269339 3230473 3222873 3206337 3176705 3167734 3183839 3186260 3151871 3107119 3091530
9847C091530J7848J7672j8719n8349o3434l1776l970j4923m4841m2990J495M0523
$$ 3091530 3109378 3127050 3108331 3049982 2986548 2954772 2950802 2935879 2891038 2848048 2849543 2890066
9835B890066K6376l1244p7420o8450j1483M1506M0011j2468n6125m0851J1673
$$ 2890066 2916442 2885198 2807778 2739328 2727845 2769351 2809362 2796894 2740769 2699918 2711591
9824B711591L4912L769l6961l9605j7305j5269l8849m6939j7227J6721J2807j7392
$$ 2711591 2746503 2750272 2713311 2673706 2656401 2641132 2602283 2555344 2538117 2554838 2567645 2550253
9812B550253k4427O228L0839R214l7904n8040l5928l347J0712O187r791l3574
$$ 2550253 2525826 2532054 2562893 2572107 2534203 2476163 2440235 2436888 2447600 2453787 2443996 2410422
9800B410422m5830j9904L0603M6953q41o1555o3768j3259J7211o438l5631j9723
$$ 2410422 2364592 2344688 2375291 2422244 2421403 2359848 2296080 2282821 2300032 2293594 2257963 2238240
9788B238240J5806J3073k4296l6018j366K6020J574m0389m2366j3764p289k3192
$$ 2238240 2254046 2267119 2242823 2206805 2205439 2231459 2233033 2192644 2150278 2136514 2129225 2106033
9776B106033q272M2351N7215k509p0008o4242p001J7971q503l0114j7808n906
$$ 2106033 2097761 2140112 2197327 2194818 2124810 2060568 2053567 2071538 2063035 2032921 2015113 2009207
9764B009207j6808j9783Q413L5387J9785k7839n9942m7352k211L7989M1676J3264
$$ 2009207 1992399 1972616 1981029 2016416 2036201 2008362 1948420 1901068 1898857 1936846 1978522 1991786
9752A991786j1233j3734j8919m2140m6555m021L4476M805n5794n3761P695K9608
$$ 1991786 1980553 1966819 1947900 1905760 1859205 1855184 1889660 1894465 1838671 1784910 1792605 1822213
9740A822213j3957k8977L1589P4574J7871o9137p6107k1057J603j8394j5921J8336
$$ 1822213 1808256 1779279 1810868 1885442 1903313 1834176 1758069 1737012 1738615 1720221 1704300 1722636
9728A722636L0917J1931L092P158j3560m9295m4639N188M0775K9587m36k1753
$$ 1722636 1753553 1765484 1768576 1775734 1762174 1712879 1668240 1673428 1714203 1743790 1743354 1721601
9716A721601l3920l0326n340J0170j1873l4029n519L8500J9178n2699q2980l6101
$$ 1721601 1687681 1657355 1652015 1662185 1650312 1616283 1610764 1649264 1668442 1615743 1532763 1496662
9704A496662K5909N2080N1100K5313l5502q1755m2448M2278N1327k4110n4842
$$ 1496662 1522571 1574651 1625751 1651064 1615562 1533807 1491359 1533637 1584964 1560854 1506012
9693A506012J0609N5285j365n9073j4080N3547J8874o6377o0769K5711N3710j1479
$$ 1506012 1516621 1571906 1570541 1511468 1497388 1550935 1569809 1503432 1442663 1468374 1522084 1510605
9681A510605n7404k0796K5390J2712k0458j4917J4388J8480j2345m9979o2286
$$ 1510605 1453201 1432405 1457795 1470507 1450049 1435132 1449520 1468000 1455655 1405676 1343390
9670A343390l3811J3246K9839P795K297L7258M4162k5324q6519l6367O4830O8376
$$ 1343390 1309579 1322825 1352664 1360459 1362756 1400014 1444176 1418852 1332333 1295966 1360796 1429172
9658A429172k5364o3855R041O6415J3370o4990n7651j356P910k0716j4284K4473
$$ 1429172 1403808 1339953 1348994 1415409 1428779 1363789 1306138 1304782 1312692 1291976 1277692 1302165
9646A302165L2700L110j5718j0548r135j2036L717K2676K846n0235p7922m3818
$$ 1302165 1334865 1337975 1322257 1311709 1302574 1290538 1294255 1316931 1319777 1269542 1191620 1147802
9634A147802K3407O5487M9044r205n5001m7043l192K5122K2941J6388J0593j5162
$$ 1147802 1171209 1236696 1285740 1276535 1221534 1174491 1171299 1196421 1219362 1235750 1246343 1231181
9622A231181m2381k0603L5487M1454k2312o0921j1449N0042L1306k7398l0654
$$ 1231181 1188800 1168197 1203684 1245138 1222826 1161905 1150456 1200498 1231804 1204406 1173752
9611A173752J1232J6138j9844k9095l706J335j5257j164L2973J6953m5578o4690
$$ 1173752 1184984 1201122 1181278 1152183 1148477 1149812 1134555 1133391 1166364 1183317 1137739 1073049
9599A073049j2097L0769J1426j3877R046L9347K3093j4364k5808k2218k8329k2112
$$ 1073049 1060952 1091721 1103147 1089270 1098316 1137663 1160756 1146392 1120584 1098366 1070037 1047925
9587A047925J1779K6799j1914m9552j9085M2979M6089j2755m6905j5283K5151
$$ 1047925 1059704 1086503 1074589 1025037 1005952 1048931 1095020 1082265 1035360 1020077 1045228
9576A045228J7599j5769k3887l566J1377P232N40K432J032j5704l4189k7462M173
$$ 1045228 1062827 1047058 1023171 1019605 1030982 1038214 1038754 1041186 1042218 1026514 992325 964863 969036
9563I69036K2448M63l2107k7643L143L174l4770m3337J5769P8574O3065j1593
$$ 969036 991484 991947 959840 932197 935340 938514 903744 860407 876176 954750 1017815 1006222
9551A006222n4056k9311Q438R709p516p054M840N97j6483j5760J2553L7067K0455
$$ 1006222 952166 922855 931293 941002 933486 926432 931272 931869 915386 899626 912179 949246 969701
9538I69701l1752o7900m5461J4730M8637K7004j1483j7695L712J1639r604l5135
$$ 969701 937949 870049 824588 839318 887955 914959 903476 885781 889493 901132 891528 856393
9526H56393l7072j3312J6241K6299P892j5833j2156J3389J9397n908j9949L840
$$ 856393 819321 806009 822250 848549 856441 840608 828452 841841 861238 855330 835381 839221
9514H39221K3439n188m4905k7418L2576M9241n487n9166m7359J83J9217N133j212
$$ 839221 862660 857472 812567 785149 817725 866966 861479 802313 754954 755137 774354 779487 778275
9501G78275J1178J5032O22o427R731K4729P866k8124l6075l8L0094q23o5309p2209
$$ 778275 789453 804485 805107 798680 808411 833140 841006 812882 776807 776769 806863 806040 740731 668522
9487F68522Q724Q9789P5567p858n3199j9122L0856L1785q526m8654o5481m9668
$$ 668522 677246 767035 842602 834744 781545 762423 793279 825064 816538 767884 702403 652735
9475F52735l579L7823L4188K752o4K7323K3638k5747m9222m031M4235K3089k8974
$$ 652735 649156 686979 721167 723919 723855 751178 774816 749069 699847 695816 740051 763140 734166
9462G34166k6834K3942M2201n83n1112o2865l9090N929N6538P1584K3887l6952
$$ 734166 707332 731274 773475 772892 721780 658915 619825 625754 682292 753876 777763 740811
9450G40811l6186J0278J5383l3690m6539J8741P2218K7684n6498o1523J4757O1979
$$ 740811 704625 714903 730286 696596 650057 668798 741016 768700 712202 650679 665436 727415
9438G27415K2806l7571m0921m04J9278j688k4475j6127P252P737j8555k9401Q273
$$ 727415 750221 712650 671729 671325 690603 688915 664440 648313 655565 663302 644747 615346 623619
9425F23619O1339O0165o141o1856m0398K4643M7836R459k9642k4420J484J0628
$$ 623619 684958 745123 738982 677126 636728 661371 709207 718666 689024 664604 666088 676716
9413F76716N297N03j1236l2641l3832O026N0813M5173q212m8600l4925R399L4073
$$ 676716 682013 682516 671280 638639 604807 610833 661646 706819 698607 650007 615082 624481 658554
9400F58554J7156k3519n1761m0000N668M3418L7272J861j5846K45J8085Q645j6316
$$ 658554 675710 652191 600430 560430 566098 609516 646788 648649 632803 633048 651133 659778 643462
9387F43462k9953k5109q041J4656K5698M219l4950m1799M29M1131L3471M506M697
$$ 643462 613509 588400 580359 595015 620713 624932 589982 548183 548612 589743 623214 627720 632417
9374F32417J9726m99m3574m4401M654L3603N609k7406j5323J2615R763o599L925
$$ 632417 652143 651644 608070 563669 568323 601926 607535 580129 564806 577421 587184 580585 584510
9361E84510K5642J3581k6030m3142j9625J2666K2101O528j7595k5035M36L2243
$$ 584510 610152 623733 597703 554561 534936 547602 569703 576231 558636 533601 534037 566280
9349E66280J9050l1361l6976L6862R7373M7238n8273q2061q844M1320N541m0805
$$ 566280 585330 553969 516993 553855 651228 698466 640193 558132 549288 590608 596149 555344
9337E55344k7813L213k848j4439J1340L4713L351m3681l3948J6875L1734k863
$$ 555344 527531 530744 527896 513457 524797 559510 562861 519180 485232 502107 533841 530978
9325E30978k3713L543L9436L7749K361l1431l5233p085K1052R062l4014m7014
$$ 530978 507265 510808 550244 587993 590354 558923 523690 516605 537657 546719 512705 465691
9313D65691k617M2575K9729j1052j2531K0589K7888j386j6672M165K4725J5633
$$ 465691 463074 505649 535378 524326 511795 532384 560272 558886 542214 546379 571104 586737
9301E86737r183k7856l3070k0654J40j040k6051k1119L7620P2230Q250q2980o7502
$$ 586737 577554 549698 516628 495974 496114 495074 469023 447904 485524 557754 566004 483024 415522
9288D15522L9338Q4354J5199m3614m112M6392R711n2711l4886K8917L0703k7548
$$ 415522 454860 539214 554413 510799 506687 553079 562790 510079 475193 504110 534813 507265
9276E07265n2686k1173P504J2940K7519M1886J3239l4907l2257J4735K5803j6226
$$ 507265 454579 433406 440910 453850 481369 523255 536494 501587 469330 484065 509868 493642
9264D93642l8346p247J9190K666j3599K764J1819j4129k8876K292K9576J901l8596
$$ 493642 455296 448049 467239 469905 456306 459070 470889 456760 427884 430176 459752 461653 423057
9251D23057k3235K7776L8332j638k6130J112L7196K6684k7252p1019n6839J1400
$$ 423057 399822 427598 465930 464292 438162 439274 476470 503154 475902 404883 348044 359444
9239C59444P5092P3586J1800m2723m1497p206J1482L777r693j5671j0116J1748
$$ 359444 434536 508122 519922 477199 435702 428496 439978 443755 434062 418391 408275 420023
9227D20023L6706L1323j0084m1938k5874J2810K3684K470j5107j0749M068J6909
$$ 420023 456729 488052 477968 436030 410156 422966 446650 449120 434013 423264 427332 444241
9215D44241K0049L814k3297k8344p98J9856O02k9518k4278P593K4760K1076J6824
$$ 444241 464290 468104 444807 416463 415665 435521 436123 406605 382327 389920 414680 435756 452580
9202D52580Q691j1416j4097K2119M8056P261n7148n3158J0091K9893k1015m8650
$$ 452580 461271 449855 435758 457877 505933 513194 456046 402888 412979 442872 421857 373207
9190C73207P17M7014J2056m8358l7570K7394N2495J4447k2062j3750J5534K9893
$$ 373207 373924 420938 432994 384636 347066 374460 426955 441402 419340 405590 421124 451017
9178D51017J8577j3968m5062l7209R327L4232j418m5699l0446K0006L1611K611
$$ 451017 469594 455626 410564 373355 382682 416914 415496 369797 339351 359357 390968 393579
9166C93579p772N242r752m6533l4545L1136N9810R837l4804K153O2577M4523l8038
$$ 393579 385807 391049 381297 334764 300219 331355 391165 401002 366198 368351 430928 475451 437413
9153D37413p7304k6525M7975O4066J2418n2925p1090k5420L4375L8534j1309l4185
$$ 437413 360109 333584 381559 445625 458043 405118 334028 308608 342983 381517 370208 336023
9141C36023J2140N7354K4356m0844l5450L2742N3931n815n0922j6197K8640K708
$$ 336023 348163 405517 429873 389029 353579 386321 440252 434437 383515 367318 395958 398666
9129C98666m7792l0242L5356M7992q707m3893r790K8815J0577k5598j7805J2847
$$ 398666 350874 320632 355988 403980 395273 351380 341590 370405 380982 355384 337579 350426
9117C50426P613k2786j9406J6947K4807q432k0912J4782L6942k907n1332l5209
$$ 350426 358039 335253 315847 332794 357601 349169 328257 343039 379981 377074 325742 290533
9105B90533J8745L0745J791K570L6782K5012m9166q4553j5318P1128N8096k2409
$$ 290533 309278 340023 341814 344384 381166 406178 357012 272459 257141 328269 386365 363956
9093C63956m2594K2412O4337J5537n3548m8749J6715N8255L5070k0138n4134l8136
$$ 363956 321362 343774 408111 423648 370100 321351 338066 396321 431391 411253 357119 318983
9081C18983J4529N0005K1669m4247o7939k1566L1432L2227P331O028J1153j7424
$$ 318983 333512 383517 405186 360939 293000 271434 302866 335093 342424 348452 359605 342181
9069C42181m9151k0194M8669O2992k438n5485j9108N5265O2168j1311p4129n4079
$$ 342181 293030 272836 321505 384497 382059 326574 307466 362731 424899 413588 339459 285380
9057B85380J8635N9871L3142j7149k8420K042K0464l322l2167k1321J0563J5072
$$ 285380 304015 363886 397028 379879 351459 353501 373965 370643 338476 317155 327718 342790
9045C42790l873j926K0084J3864k4007l4147L500K6668m015l1574n55L9379J5706
$$ 342790 338917 336991 357075 370939 346932 312785 316285 342953 338938 307364 306809 346188 361894
9032C61894l3822j8480M3771M4355l2974p2769r958O3190M1663l2572m6718R065
$$ 361894 328072 309592 353363 397718 364744 291975 282017 345207 386870 354298 307580 316645
9020C16645M5082J8892j9425k4997j4884j1924l355J6832J9027j4143m8198l9215
$$ 316645 361727 380619 361194 336197 321313 309389 306034 322866 341893 327750 279552 240337
9008B40337N884L8960K9339n842k4213k494L7110M6659Q164l9093m5200j3317
$$ 240337 246221 285181 314520 308678 284465 281971 319081 365740 373904 334811 289611 276294
8996B76294J0705N328n737j088Q541R860J1701K2152K8674J9003m73k0183l7436
$$ 276294 286999 292327 286590 285502 294043 303903 315604 337756 366430 385433 384960 364777 327341
8983C27341m2241k3191K997M634j0287P36L5486L2041k7931o4475j3767N6606
$$ 327341 285100 261909 264906 269540 259253 259989 295475 327516 299585 235110 221343 277949
8971B77949L7204n0503p7696k198P1860N6900J135j0723J0765M442k6248k9056
$$ 277949 315153 264650 186954 184756 256616 313516 314651 303928 314693 319135 292887 263831
8959B63831K16J7565J0221L930J331j7948l9614k5424J4875K8834P905J123K4704
$$ 263831 264047 281612 291833 295763 297094 279146 239532 214108 228983 257817 265722 266845 291549
8946B91549K8742j2785m6156k1772K2268K1797j0921j6153J0270J8900j70m951
$$ 291549 320291 307506 261350 239578 261846 283643 272722 256569 266839 285739 285569 280618
8934B80618J1916L519l9280n0835P139O7927M8939k3181n1230j0732K5260O876
$$ 280618 292534 296053 256773 205938 213077 281004 329943 306762 255532 244800 270060 276936
8922B76936k5216j9101Q716J5519L548r20j402j1245j0688J7840L5973j517n7335
$$ 276936 251720 232619 241335 256854 260402 259482 258080 246835 236147 253987 289960 288443 231108
8909B31108m8294K5214O6770K3733l8590m2807q200L138j0726j1141K496N811
$$ 231108 182814 208028 274798 298531 259941 217134 208934 212072 201346 190205 192701 198512
8897A98512Q424K7939L4078m122m1415j5391L6041J9946n0281n6448L4391J01355
$$ 198512 206936 234875 268953 264831 223416 208025 244066 264012 213731 157283 191674 293029
8885B93029N1181l9012m8008N971J6224l2791n4289r233M0255L7518N594q200
$$ 293029 344210 305198 257190 263161 279385 246594 192305 183072 223327 260845 266439 258239
8873B58239P64Q105k61j9385k9787j0868K6832L9561J0377j7065n447J2568n476
$$ 258239 259003 267108 266847 247462 217675 206807 233639 273200 283577 266512 261065 273633 268157
8860B68157k8228m624L2586J4110l6444l2820J8615K0362m0072n1684L0834R2525
$$ 268157 239929 235305 267891 282001 245557 212737 231352 251714 211642 159958 190792 283317
8848B83317L7300n4456n6004J1432L8114R749j609J3817J202l1719j7921L5659
$$ 283317 320617 266161 210157 221589 259703 269452 267843 281660 282862 251143 233222 268881
8836B68881M1883k0079o4016l3836J7993K7539O804q239j8594k7409j3959J6428
$$ 268881 310764 290685 226669 192833 210826 238365 245169 236930 218336 190927 176968 193396
8824A93396K2117J305P538N0718O2036Q557l9652k3896J898k9627p0169l3571
$$ 193396 215513 216818 224356 275074 337110 345667 306015 282119 284017 254390 184221 150650
8812A50650M6814N9545o792m8235j3305K8662J5297j5493q564J5825J3795O30
$$ 150650 197464 257009 250217 201982 188677 217339 232636 217143 208579 224404 238199 238829
8800B38829J5264M1236K7968k6487o7063n2851q12M1056M1626J0557j2765j624
$$ 238829 254093 295329 323297 296810 229747 176896 176084 217140 258766 269323 256558 254934
8788B54934K2957J8812j3690k8534o801R849j2815m0896k4812J7437K5964n481
$$ 254934 277891 296703 283013 254479 247678 257527 244712 203816 179004 196441 222405 216924
8776B16924j9987J1607M6120L4851r122l8913l6693j7448O080K8205L4257J4370
$$ 216924 196937 208544 254664 289515 280393 241480 204787 187339 193419 221624 255881 270251
8764B70251j1146j1573P708R097j8340l5487j0992K2858R932m1440n6062M077
$$ 270251 259105 247532 255240 264337 245997 210510 199518 222376 232308 190868 134806 138883
8752A38883P3705O4734q886m5565k36N0445K4536l9059m0251K4641N3887j347
$$ 138883 212588 277322 268436 222871 222635 273080 297616 258557 218306 242947 296834 295487
8740B95487n9139l4769K6630K3227m1038o1520N166P5119O0233j3913n7814l7502
$$ 295487 236348 201579 228209 251436 210398 148878 154044 229163 289396 275483 217669 180167
8728A80167M332J8935N42k1668j3104L1241O6896M1767k7273n9598j7957L6390
$$ 180167 184499 203434 203976 182308 169204 200445 267341 309108 281835 222237 204280 240670
8716B40670L4669k488j5058n485j6479l8339k3547J9218L1375L957j2213j97M197
$$ 240670 275339 272851 257793 252308 235829 197490 173943 193161 224536 228493 216280 216083 220280
8703B20280m047J1439L8397J5210m9676o3979l565L3234j0057m4205J0599P4261
$$ 220280 216233 227672 266069 281279 231603 167624 164059 197293 187236 143031 153630 227891
8691B27891L7625m4209m0036L4752M8957j6564m2905J4502N1711p03o3783m7221
$$ 227891 265516 221307 181271 216023 264980 248416 205511 220013 271724 271021 207238 160017
8679A60017J4838M0695K4138P154r05j1839j9931k2072k7042j8844K5251O4799
$$ 160017 174855 215550 239688 246842 245937 234098 214167 192095 165053 146209 171460 236259
8667B36259L1646m3661m8807K9718O5968m120p0798l1079M3264L6960j8740k5582
$$ 236259 267905 224244 175437 205155 271123 267003 196205 165126 208390 245350 226610 201028
8655B01028L058n369k4888J2194N7361J6270o1890m6043M5270O3348j5783n2055
$$ 201028 204086 198717 173829 186023 243384 259654 197764 151721 196991 260339 244556 192501
8643A92501J0027M9723o475n5170p746N1567K0297m4658l6657J9999L3305M397
$$ 192501 202528 252251 245776 190606 182860 234427 254724 210066 173409 193408 226713 231110
8631B31110m631K184j6293l6110j2639J9070J257l1929j0007M1822M2754j602
$$ 231110 226479 228663 212370 176260 163621 182691 183948 152019 142012 183834 226588 224986
8619B24986j6376M628J61k9404j9002K9105L2963k5763n9700j5464M3962M5229
$$ 224986 208610 213238 213399 183995 164993 194098 227061 201298 141598 126134 170096 215325
8607B15325R777j202J7043K5353O334k4103m2446l3279n116P907p290j1294K2591
$$ 215325 225102 223900 240943 266296 272630 248527 206081 172802 167686 175593 168303 157009 179600
8594A79600M0866j3174p9679m8882N4505Q2572r160q1117k4012P1045O1303k6598
$$ 179600 220466 207292 127613 78731 133236 215808 206648 125531 101519 172564 233867 207269
8582B07269n4497O429N0022J4557l7203l5001J910K1958K3437L2756M3146K1549
$$ 207269 152772 159201 209223 223780 186577 151576 153486 175444 198881 231637 274783 296332
8570B96332l4635p8351o0600Q020N8568M1661r941k7294j146J7513P965L700J4196
$$ 296332 261697 183346 122746 130766 189334 230995 221054 193760 192614 210127 218092 221792 235988
8557B35988N47l9776m4694P014M2178R530k9457p869K5239n074n3511k5350M9938
$$ 235988 236535 196759 152065 159079 201257 210787 181330 173461 198700 193626 140115 114765 164703
8544A64703N6119j5333n1821p755L5499K5247J4811L7545L4844k2138n7832k1525
$$ 164703 220822 205489 153668 145913 181412 206659 221470 259015 293859 271721 213889 192364
8532A92364J5644j3491m7277o207N5603L7811k8946l2988K5868L9409j8182m7112
$$ 192364 208008 194517 147240 141033 196636 234447 205501 172513 198381 237790 219608 172496
8520A72496K623M5428Q187m6047k4437M4193N8122l45m7909k8317J9516L1832
$$ 172496 175119 220547 228734 182687 158250 202443 260565 260220 212311 183994 203510 235342
8508B35342K094k8979k9827j936L2367M7082K8559j0431l7458l1905o532J0538
$$ 235342 237436 208457 178630 176694 209061 256143 284702 274271 236813 204908 198376 208914
8496B08914J0033N136M607K378j897L559J4574M166k9948m0044N578N5068L4646
$$ 208914 218947 224083 228690 231068 229171 232730 247304 251470 221522 181478 187056 242124 276770
8483B76770l1664m4028J7932N2998l032o6142l2145N4326O7010m818m7350o230
$$ 276770 245106 201078 219010 272008 268976 202834 170689 225015 292025 287207 239857 233627
8471B33627M0420K1388k1893k2310N658J2597M515J3854K4135k488m6953n1232
$$ 233627 274047 295435 273542 251232 256890 269487 274002 287856 311991 309503 262550 211318
8459B11318o050L6957L9966J7453l122j6114k2949j6129O108K7406K7621L949
$$ 211318 205268 242225 282191 299644 296522 280408 257459 241330 247438 274844 302465 306414
8447C06414k3585k6881P80K9205K3090q278k0157J539J8973M840j3483k173K2790
$$ 306414 282829 255948 256728 285933 309023 300745 280588 282127 301100 305940 292457 290284 313074
8434C13074K6156R924k198r455j9280j5258J1355K5411j302l0166j1588K5074
$$ 313074 339230 349154 346956 337501 318221 302963 314318 339729 338427 308261 296673 321747
8422C21747J6343k0005j0340L7963L5678l1460o2101n282M6991J2638l7626NP8301
$$ 321747 338090 318085 307745 345708 381386 349926 287825 282543 329534 342172 304546 304551 382852
8409C82852O8013l1196q9059m7256J0558J2493k337J4804K9668J863k9752j5335
$$ 382852 450865 419669 330610 283354 293912 306405 304068 318872 348540 350403 320651 305316
8397C05316J4558M110k8611k7014M222J5754O698J6512L4103N891n4452n6238
$$ 305316 319874 323984 295373 268359 272581 288335 295033 311545 345648 351539 297087 240849
8385B40849K9398J00302N6610n2508r3736l2652L2939K3414k1902k6485Q738K8874
$$ 240849 270247 370549 427159 374651 280915 248263 281202 304616 282714 256229 264967 293841
8373B93841J9757J0747L059l0007o8315m7332L5646Q7767M4247l1715m1044L720
$$ 293841 313598 324345 327404 297397 229082 181750 217396 305163 349410 317695 276651 280371
8361B80371J0770l4218m7263P579N3980K7596k3648k6507R53l510l4302l7829
$$ 280371 291141 256923 209660 217239 271219 298815 275167 248660 249613 246103 211801 173972
8349A73972j1894N76j070J9363M8096K9676k6982l9657J9418O6867K7311n4923
$$ 173972 162078 162654 161584 180947 229043 258719 231737 192080 211498 278365 305676 250753
8337B50753q1667l3082K6743M7086L4101J1172j0749k3046j9420j0477j1978j8419
$$ 250753 169086 136004 162747 209833 243934 255106 244357 221311 201891 191414 179436 161017
8325A61017j0193J4676L5098L2201P287k1184l0292j2264J1604J0964j3648l0790
$$ 161017 150824 165500 200598 232799 240086 218902 188610 176346 187950 198914 185266 154476
8313A54476k3779q723K432K0714M3464L9210j14k9830j5051J1567J788k8392k6821
$$ 154476 130697 121974 124406 145120 188584 227794 227680 197850 182799 194366 196154 167762 140941
8300A40941Q149L0401K4267J7143J6232l060l7086m3665r805K4160K8775K2797
$$ 140941 149090 179491 203758 220901 237133 234073 196987 153322 143517 167677 196452 219249
8288B19249K2610N996l8607p0165m5913J2607M4057K2997j8679l4899r331L3272
$$ 219249 241859 247855 209248 139083 93170 105777 149834 172831 154152 119253 109922 143194
8276A43194M7944J6190k5221k6758K994Q640k3251l8903m552L4210K1653k2105
$$ 143194 191138 207328 182107 155349 158343 166983 143732 104829 100277 134487 156140 134035
8264A34035l4787k948L1207L6219J9073j739j2834o537N874j30j7843m153M5187
$$ 134035 99248 96300 127507 163726 182799 181060 168226 161689 167563 167433 149590 145437 190624
8251A90624N9750p665q7694p8717O87L7932O0k4246J9432N8812J7618n4405n7472
$$ 190624 250374 242709 155015 76298 76985 114917 114977 90731 110163 168975 186593 132188 74716
8238G4716O342M6957K5523p864j1968p756j5801j1208K1580M2215J3167k8688
$$ 74716 81058 128015 153538 145674 133706 125950 110149 98941 120521 162736 175903 147215
8226A47215j8055L2960L9372l0059q9660m7203N9442J02225L3859n0751m7950
$$ 147215 129160 162120 201492 171433 81773 34570 94012 196237 230096 179345 131395
8215A31395J9914N1545R063m7104n1872r155L1153K9990j1416n0314l5721K8420
$$ 131395 151309 202854 211917 164813 112941 103786 134939 164929 153513 103199 67478 95898
8203I5898O8439K8771m3523n7039o655K4798p76k3496O044M3156K7640j5078j9336
$$ 95898 164337 193108 149585 92546 85891 110689 109913 86417 92461 135617 163257 148179 128843
8190A28843J4121K8170M774j7951j7847j5126k0929j4562J1721K9409J7253m670
$$ 128843 142964 171134 175908 157957 140110 124984 104055 89493 101214 130623 147876 143206
8178A43206q807l794j6370m1193l8957Q437O1180O1220N837m2385l1856J3361
$$ 143206 134399 130605 114235 73042 34085 42522 103702 164922 170759 128374 96518 109879
8166A09879L0438L088k6762k6460q942M812J6977K9980K9134R299j0407j6180
$$ 109879 140317 143405 116643 90183 81241 86053 103030 133010 162144 171443 161036 144856
8154A44856j6111j4854m531P381J90j6574o970K6834L5107p75l5305l3608j9666
$$ 144856 128745 113891 109360 116741 116931 100357 93387 120221 155328 154553 119248 85640 65974
8141F5974j4380P251M8915N3056q206o7253n7729j3904L914J3646M7515N6720
$$ 65974 51594 58845 107760 160816 152610 85357 27628 13724 17638 31284 78799 135519
8129A35519j625m7791P676Q5874M1797q3700j04477J1344Q4781J8257n6548j6342
$$ 135519 133894 86103 93779 179653 221450 137750 33273 44617 129398 147655 91107 74765
8117G4765N2353K2515n3260m9419J6146L4997J227n025K3315K3164r251k1577
$$ 74765 127118 149633 96373 46954 63100 98097 99324 94299 117614 140778 131527 109950
8105A09950j1514j3222r215K8730M8041r738p8360n0302L6412M8699j6563k8044
$$ 109950 98436 85214 75999 104729 152770 143032 64672 14370 50782 99481 82918 54874
8093E4874M4163O7844k0490r3291l4835P1677P6626j5731p8902n1691J3599N0588
$$ 54874 99037 166881 146391 53100 18265 89942 166568 150837 71935 20244 33843 84431
8081H4431L8514r418n0637l5329K5507N4263J3707l4354k8061L88n154k3659n760
$$ 84431 122945 113527 62890 27561 53068 107331 121038 86684 58623 59011 53857 30198 24438
8068B4438K9624L3714J8404J9903J4512l1386o4719j2585P5265P4232k2723q5011
$$ 24438 54062 87776 106180 126083 140595 109209 44490 31905 107170 181402 158679 73668
8056G3668m0889K7064K9068l012l646Q085j0906k4755J8294O8911L6118n5710
$$ 73668 32779 59843 88911 85899 82253 90338 79432 54677 72971 141882 178000 122290
8044A22290q2833n766O8486M6367k1113l1940J0698K2438j6726l7201l053K8791
$$ 122290 39457 33691 102177 148544 127431 95491 106189 128627 111901 74700 71647 100438
8032A00438P304k6979j2627K7299K3660k1089l4226Q106M1940J9441j8085j3846
$$ 100438 107742 80763 68136 95435 119095 98006 63780 71886 113826 133267 115182 101336
8020A01336J3704J0548k0549l0821r617M984l434o636J1083K3252R245q642l658
$$ 101336 115040 125588 105039 74218 64601 69585 66151 59515 70598 93850 103095 94453 90795
8007I0795R548Ok5883l0825m641J6338R86k8881k7906N683K6309J0808n847R462
$$ 90795 100343 100349 74466 43641 39000 55338 56324 27443 -463 5220 31529 42337 36490 45952
7993D5952K7991O174l1057j8632M0006O4304J5516m4754n0225k0511p452p930
$$ 45952 73943 80117 49060 30428 70434 134738 150254 105500 55275 34764 27312 19382
7981A9382P756K6167J9317R146K9875N1021J6465n3085p7265l4901J1600J7975
$$ 19382 27138 53305 72622 81768 111643 162664 179129 126044 48779 13878 25478 43453
7969D3453Q879J1259J0084l230l399J6309K1358k289j7214N57J7297J393j9579
$$ 43453 52332 63591 73675 70445 67046 83355 104713 102424 85210 85767 103064 104457 84878
7956H4878o432K5165L2546J1721q964j8765k6403k7754j0548J5743K4863P122
$$ 84878 78446 103611 136157 147878 138914 120149 93746 65992 55444 71187 96050 103172
7944A03172j9155k5810K94L8505M3640j579m8609l5696K2628M8497J1666l0269
$$ 103172 84017 58207 58501 97006 140646 139067 90458 54762 77390 125887 137553 107284
7932A07284k4690K889N755p804m257J1114J2100K964K824L687r919k1790r472
$$ 107284 82594 85483 91238 83434 79177 90291 102391 105355 108179 111866 101947 80157 70685
7919G0685J0296N160j8303k4064q29K6662L3061J5763p050r356J3311K5326l936
$$ 70685 80981 86141 67838 43774 42945 69607 102668 118431 111381 102025 115336 140662 136726
7906A36726l9789k4256J9641P925n8788p0678J8201R6495N8595l2712n2902n782
$$ 136726 96937 72681 92322 100247 41459 -29219 -11018 85477 144072 111360 58458 52676
7894E2676J6912L705J3258L6087R373m7930n2167j203K6677J5200J8470L0963
$$ 52676 69588 73293 86551 122638 132011 84081 31914 30711 57388 72588 91058 122021
7882A22021n731o0407l3304N7765P6294p351n9100j1148K6732k3689o1948L744
$$ 122021 116290 55883 22579 80344 156638 149287 90187 79039 105771 82082 20134 23878
7870B3878P7023L5074n5692n4360K0007M2136j132j9520P87n587l4116j9198K3345
$$ 23878 100901 135975 80283 25923 45930 88066 86934 67414 68201 62614 28498 9300 32645
7857C2645J6228k4582q194N5745N5600k7460p5572k6386L1574J4536k9708k2822
$$ 32645 48873 24291 16097 71842 127442 99982 24410 -1976 29598 44134 14426 -8396
7845h396J7487K9629J1193o50L429J1898K1524K2846J671k3293j6551Q812N420
$$ -8396 9091 38720 49913 49263 52692 64590 86114 108960 110631 87338 70787 79599 85019
7832H5019k1203j6944J8999K5165j0933k8867q449l003k3723m485O3457P9134
$$ 85019 63816 46872 65871 91036 80103 51236 42787 39784 16061 11576 75033 154167
7820A54167o775q6763n1811L9469N8197j037m1252k4842K438J4123K1127J1639
$$ 154167 147392 60629 8818 48287 106484 105447 64195 39353 41791 55914 77041 88680
7808H8680k7567n0813q933N4117N2598r538m9334l2490J12J9966L2890K4812j9499
$$ 88680 61113 10300 1367 55484 108082 98544 49210 16720 16832 36798 69688 94500 75001
7795G5001n2212j5899M5350L5441l3225m7945J9729O5317K6498k0366m952J3853
$$ 75001 22789 6890 52240 87681 54456 6511 26240 91557 118055 97689 92737 106590
7783A06590l6029r5375o1376L9117Q3627L5585j9873k0928o208j9704k6127K1284
$$ 106590 70561 -24814 -86190 -47073 36554 72139 52266 31338 25130 5426 -20701 583
7771E83Q1821O9419j6784p3554l2538L6191K1126n9617p6734Q141O8271O445p8450
$$ 583 82404 151823 135039 61485 28947 65138 86264 26647 -50087 -41946 26325 32770 -45680
7758d5680l9731P4165Q6876j9757p1713J2390Q8725L0988o0652l4323N7007M9756
$$ -45680 -85411 -11246 75630 55873 -15840 -3450 85275 116263 55611 21288 78295 128051
7746A28051n4283r5127j7117N6079L2831j8578j0113K7845K6375j278m698O415
$$ 128051 73768 -21359 -38476 17603 50434 31856 21743 49588 75963 74685 69987 76402
7734G6402n869k5027r993K1326J5386k2802l1719N729L0307N65l5747j1087N1591
$$ 76402 70533 45506 35513 56839 72225 49423 17704 23433 53740 54305 18558 7471 59062
7721E9062N9704j3729p6768m0103N1942P8608J3709m3527k3367J7427L792l2518
$$ 59062 118766 105037 28269 -11834 40108 118716 132425 88898 65531 82958 86750 54232
7709E4232j8898K4086J8201l0803l7958J4776M6348J4090j8821K897L5855K0892
$$ 54232 35334 59420 77621 46818 8860 23636 69984 84074 65253 68150 104005 124897
7697A24897j7542k4180p979j1884k9764k4797r89R678P939J3784J4951r267l3202
$$ 124897 107355 83175 75196 63312 33548 8751 7762 17440 25379 39163 54114 44847 11645
7684A1645j8719J2625R808j7367j2694K5162L6234M715j1016J9149M2293J3763
$$ 11645 -7074 5551 15359 -2008 -14702 10460 46694 51409 40393 59542 101835 115598
7672A15598k4398j4136K1132J6061l1398o0365l8451M659L0366K8901N124k8730
$$ 115598 91200 77064 98196 114257 82859 22494 -15957 -11298 19068 47969 53093 24363
7660B4363m3720j8290K3234L3444Q197q226P959K6873J6934r155k4105k7090k6038
$$ 24363 -19357 -37647 -14413 19031 27228 19002 26961 53834 70768 61613 37508 10418 -15620
7647a5620j0669K0325L1770k325m2399k5814L7250O6735K4920k9342k8907P319
$$ -15620 -26289 -5964 25806 23481 -18918 -44732 -7482 59253 84173 54831 25924 33243
7635C3243J6079q372j6129O219J2152k1997n0009k6555J8761K6044k092q202K5176
$$ 33243 49322 40950 24821 31040 43192 21195 -28814 -55369 -36608 -10564 -12656 -20858 4318
7622D318M5907J4788l1133l4192j842J1606n683q474K2092L6700m564n5008l8970
$$ 4318 50225 65013 33880 -312 -2154 9452 3769 -4705 17387 54087 49523 -5485 -44455
7609d4455L1159O2218J3695m2474l1002J5577J6857k1987k0117L9425O9516J2933
$$ -44455 -13296 48922 62617 20143 -10859 4718 21575 -412 -20529 18896 88412 101345
7597A01345n8902m6215K9075N6229J220m9211k5758K2827J6151l1200m0713L027
$$ 101345 42443 -3772 25303 81532 82752 33541 7783 30610 46761 15561 -25152 -22125
7585b2125L5835K3231Q301K4982L3240q441n7899m5190J4704M0492Q784j7682
$$ -22125 13710 36941 45242 70224 103464 95023 37124 -8066 6638 47130 55914 38232
7573C8232J640K5098R745j6928j4694j100n570n032K4420L7635j1764o8287m2507
$$ 38232 39872 64970 74715 57787 43093 41993 36423 31391 55811 93446 81682 13395 -29112
7560b9112L4259M1847l2257n8488K5453R9330M4767o1155o2765L0687O4239j8336
$$ -29112 5147 46994 14737 -43751 -18298 81032 125799 64644 1879 32566 96805 78469
7548G8469r4054n4763L8733O1359P11m9850l3842Q085J6769j959L528M7379P3400
$$ 78469 -15585 -70348 -31615 29744 30455 -19395 -53237 -45152 -28383 -30342 -26814 20565 93965
7535I3965K6192n7919p8055n103O3328L4171m2357m4679L5497P9917K2286o0210
$$ 93965 120157 62238 -15817 -20920 42408 76579 34222 -10457 25040 104957 127243 67033
7523F7033p1328k4452J0650J9381K9652L6856J7281j1506j3048J664o291k8926
$$ 67033 -4295 -28747 -18097 1284 30936 67792 85073 73567 60519 62183 55892 26966
7511B6966k0917J6026K3747j9383n2751j7191N2443O5718r81o5419m3018L8725
$$ 26966 6049 22075 45822 26439 -26312 -43503 8940 74658 73677 8258 -34760 3965
7499C965P1366J0632o0875m8777K0361M4073k489l9821j5733K1417J3752j6502
$$ 3965 75331 85963 25088 -23689 -3328 40745 38256 -1565 -17298 4119 17871 1369
7487A369j8693K700J1337K659n354p810R2K7156M3586k529q2697q3154K9045J21297
$$ 1369 -17324 -14624 -3287 -628 -5982 -13792 -13700 13456 57042 54513 -28184 -111338 -82293 39004
7473C9004P3203m1716p3508k2974j208j6246J8627Q2001M9949o8971j04234L402
$$ 39004 112207 70491 -3017 -25991 -27199 -43445 -24818 57183 107132 38161 -66073 -62671
7461f2671Q8779K5632p0976m4200N0619O0352p705k6744J9571L3551l134r264
$$ -62671 26108 51740 -19236 -63436 -12817 47535 39830 13086 32657 66208 63074 53810
7449E3810K7725K6539k8826n2659j0939K1810o78k3803m925J1717j0019k6230
$$ 53810 81535 108074 79248 26589 15650 37460 36782 12979 8054 19771 9752 -16478
7437a6478O24K8177J2906j0791K501K6057J2581k2471l3983k1499j1570l513J3066
$$ -16478 -15854 12323 25229 14438 16939 42996 55577 33106 -877 -22376 -33946 -37459 -24393
7424b4393K1874J1342O975K4688L0782p74l2002j9459R645M901j7504o020K8827
$$ -24393 -2519 8823 15798 40486 71268 70494 38492 19033 28678 33579 16075 10055 38882
7411C8882K8142j2371l2537p471J6395L928j5403o376J3069Q142j5888k9097k2862
$$ 38882 67024 54653 22116 14645 31040 34968 19565 13189 26258 34400 18512 -10585 -33447
7398c3447r002O920K2419K3873M632j1829L525L7691M1408n244n5719n0525K505
$$ -33447 -42449 -35529 -13110 10763 15395 3566 7091 44782 86190 80946 25227 -25298 -22793
7385b2793L5961J7001p146J2721M2527J4972n3447p0390m769N8394L8261k9155
$$ -22793 13168 30169 23023 35744 78271 93243 39796 -30594 -35363 23031 61292 32137
7373C2137n3249j6581K3875L2645K5632J7775L259j3077j4823n754k933l996P41
$$ 32137 -21112 -37693 -13818 18827 44459 62234 65493 52416 37593 31839 28906 24910 25651
7360B5651k534k5346l6962m385M0825L7919o490k4290Q128L8424K6021n262k2692
$$ 25651 23117 -2229 -39191 -43576 -2751 35168 28678 4388 12516 50940 76961 71699 49007
7347D9007k9771l1310j3749J1965P231k4098k3701K6837O2302L0844k4652l7128
$$ 49007 19236 -12074 -25823 -13858 -6627 -30725 -54426 -27589 34713 65557 40905 3777
7335C777j3535n91n48R341J3572r722k4875J1862N9481L5845n0348r7954n5549
$$ 3777 -9758 -10349 -10897 -1556 12016 2294 -22581 -10719 48762 84607 34259 -63695 -119244
7322a19244J5236M2538L5906L6506L8648J4629k1424k8898l194J9324J3318p913
$$ -119244 -104008 -61470 -25564 10942 49590 64219 42795 13897 10703 30027 43345 35432
7310C5432j5921m21K0019J4319k5939o4743n2362J3179P3079P1090J6764l1818
$$ 35432 19511 19090 39109 53428 27489 -37254 -89616 -76437 -3358 67732 84496 52678
7298E2678l9425k5545k2368k4532l790L3742M1025k40l6122r330M8041N1171r220
$$ 52678 13253 -12292 -34660 -59192 -62982 -29240 11785 11545 -24577 -33907 14134 65305 56085
7285E6085m8501k0071J4296l917k5608J7520Q0431O5488j6945o1643l3325l277
$$ 56085 7584 -12487 1809 -2108 -27716 -10196 70235 135723 118778 57135 23810 20533
7273B0533j1358j0515J7868J2442m4060n9594K1398R9402N6693n3751q0874j850
$$ 20533 9175 -1340 16528 28970 -15090 -74684 -53286 46116 102809 49058 -31816 -33666
7261c3666N5404J5914m2511k9633K2598L0321r629l2383j1642J6997K5336K4880
$$ -33666 21738 37652 -4859 -34492 -11894 18427 8798 -23585 -35227 -18230 7106 31986
7249C1986K6679J7937n669k0909j3464o923k5722m7072k8366K2454M7661K0729
$$ 31986 58665 76602 70933 50024 36560 29637 3915 -43157 -71523 -49069 -1408 19321
7237A9321j7345k3636r856j387J1356L2710K3402k9839n4149Q623P9953M1741
$$ 19321 1976 -21660 -31516 -32903 -21547 11163 34565 4726 -49423 -40800 39153 80894
7225H0894o4246p7780K6469Q7120J1809p6687m7031L5002L9790r738j1882J8407
$$ 80894 16648 -61132 -34663 52457 64266 -12421 -59452 -24450 15340 5602 -6280 12127
7213A2127q27m1736j7062M0050K8009k5404p997N4422K8743o9320p4582L5108
$$ 12127 11300 -30436 -47498 -7448 20561 -4843 -12840 41582 70325 1005 -73577 -38469
7201c8469P9303j5331p9005O930J00277M6169n8569m6991L0173J8921n5330n2303
$$ -38469 40834 25503 -53502 -46572 53705 99874 41305 -5686 24487 43408 -11922 -64225
7189f4225J6660K1561l4022k4964M9388N6895k1019n0587J4512N7682J4614k5828
$$ -64225 -47565 -26004 -60026 -84990 -35602 21293 274 -50313 -35801 21881 36495 10667
7177A0667j723J7260j6559l3853N910K5346k0088m5229Q877N7502K2208k8113
$$ 10667 8944 26204 9645 -24208 -18298 7048 -13040 -58269 -49392 8110 30318 2205
7165B205p422L2436Q376l5278j4261L6248L1170r015j1892M188j8119m2777o499
$$ 2205 -5217 27219 35595 317 -13944 22304 53474 44459 32567 36755 18636 -24141 -30640
$$ [...]
##END NTUPLES=NMR SPECTRUM
##END=
