##TITLE=1H ikalashn
K-324-2
22.11.2024
##JCAMPDX= 6.0         $$ Bruker NMR JCAMP-DX V2.0
##DATA TYPE= NMR SPECTRUM
##DATA CLASS= NTUPLES
##ORIGIN= UXNMR, Bruker Analytische Messtechnik GmbH
##OWNER= root
$$ TOPSPIN		Version 1.3
$$ 2024-11-22 15:48:59.781 +0400  Irina@DPX200
$$ Compression mode = diff/dup
##.OBSERVE FREQUENCY= 200.131300845
##.OBSERVE NUCLEUS= ^1H
##.ACQUISITION MODE= SIMULTANEOUS
##.ACQUISITION SCHEME= undefined
##.AVERAGES= 64
##.DIGITISER RES= 18
##SPECTROMETER/DATA SYSTEM= spect
##.PULSE SEQUENCE= zg
##.SOLVENT NAME= CDCl3
##.SHIFT REFERENCE= INTERNAL, CDCl3, 1, 17.49637
##AUDIT TRAIL= $$ (NUMBER, WHEN, WHO, WHERE, WHAT)
$$ ##TITLE= Audit trail, TOPSPIN		Version 1.3
$$ ##JCAMPDX= 5.01
$$ ##ORIGIN= Bruker BioSpin GmbH
$$ ##OWNER= Irina
$$ $$ F:/spectra/data/iren/nmr/1H/4/pdata/1/auditp.txt
$$ ##AUDIT TRAIL=  $$ (NUMBER, WHEN, WHO, WHERE, VERSION, WHAT)
(   1,<2024-11-22 15:48:28.562 +0400>,<Irina>,<DPX200>,<TOPSPIN 1.3>,
      <created by zg
	started at 2024-11-22 15:44:15.531 +0400,
	POWCHK disabled, PULCHK disabled
       configuration hash MD5:
       BE 6D 3F 07 2A EA 11 49 91 17 2B D3 AF B3 58 0D
       data hash MD5: 16K
       76 74 9B 68 CF C3 6D 1E 1E D5 5B 29 D9 B4 F1 A4>)
(   2,<2024-11-22 15:48:31.828 +0400>,<Irina>,<DPX200>,<TOPSPIN 1.3>,
      <Start of raw data processing
       efp BC_mod = 2 LB = 0.02 FT_mod = 6 PKNL = 1 PHC0 = 296.1914 PHC1 = 12.6848 SI = 32K 
       data hash MD5: 32K
       3C 19 01 A6 E0 32 25 52 FB A4 4C 5E 26 E0 DE 5B>)
(   3,<2024-11-22 15:48:33.921 +0400>,<Irina>,<DPX200>,<TOPSPIN 1.3>,
      <apk 
       data hash MD5: 32K
       1C AC 1A 0B 8E CB 44 06 36 AB 7F 8F 3D 05 AA 09>)
(   4,<2024-11-22 15:48:47.234 +0400>,<Irina>,<DPX200>,<TOPSPIN 1.3>,
      <pk fgphup PHC0 = 15.07813 PHC1 = -32 
       data hash MD5: 32K
       C9 C5 84 C2 EA 39 6E 7A AA D6 D1 8D 2A 08 A3 1E>)
(   5,<2024-11-22 15:48:48.968 +0400>,<Irina>,<DPX200>,<TOPSPIN 1.3>,
      <abs n ABSG = 5 
       data hash MD5: 32K
       C8 7A FE 6B 85 85 44 C8 BA F0 8A 69 B7 A1 9C AE>)
$$ ##END=
$$ 
$$ $$ hash MD5
$$ $$ 40 9B 37 0F 93 27 B9 1A 12 12 6B 16 CF 5F 52 C1
##$RELAX= 
##$RELAX= 
##$RELAX= 
##$RELAX= 
##$RELAX= 
##$RELAX= 
##$RELAX= 
##$RELAX= 
##$RELAX= 
$$ Bruker specific parameters
$$ --------------------------
##$DU= <F:/spectra>
##$EXPNO= 4
##$NAME= <1H>
##$PROCNO= 1
##$TYPE= <nmr>
##$USER= <iren>
##$AMP= (0..31)
100 100 100 100 100 100 100 100 100 100 100 100 100 100 100 100 100 100 
100 100 100 100 100 100 100 100 100 100 100 100 100 100 
##$ANAVPT= -1
##$AQSEQ= 0
##$AQ_mod= 1
##$AUNM= <au_zg>
##$AUTOPOS= <>
##$BF1= 200.13
##$BF2= 200.13
##$BF3= 200.13
##$BF4= 200.13
##$BF5= 200.13
##$BF6= 200.13
##$BF7= 200.13
##$BF8= 200.13
##$BYTORDA= 1
##$CFDGTYP= 0
##$CFRGTYP= 5
##$CHEMSTR= <none>
##$CNST= (0..63)
1 1 145 1 1 1 1 1 1 1 1 1 1 1 1 1 1 1 1 1 1 1 1 1 1 1 1 1 1 1 1 1 1 1 
1 1 1 1 1 1 1 1 1 1 1 1 1 1 1 1 1 1 1 1 1 1 1 1 1 1 1 1 1 1 
##$CPDPRG= <>
##$CPDPRG1= <>
##$CPDPRG2= <>
##$CPDPRG3= <>
##$CPDPRG4= <mlev>
$$ [...]
##$SW_h= 4401.40845070422
##$TD= 16384
##$TD0= 1
##$TE= 300
##$TE2= 300
##$TE3= 300
##$TEG= 300
##$TL= (0..7)
0 120 120 120 120 120 120 120 
##$TP= (0..7)
150 150 150 150 150 150 150 150 
##$TP07= 0
##$TPNAME0= <>
##$TPNAME1= <>
##$TPNAME2= <>
##$TPNAME3= <>
##$TPNAME4= <>
##$TPNAME5= <>
##$TPNAME6= <>
##$TPNAME7= <>
##$TPOAL= (0..7)
0.5 0.5 0.5 0.5 0.5 0.5 0.5 0.5 
##$TPOFFS= (0..7)
0 0 0 0 0 0 0 0 
##$TUNHIN= 0
##$TUNHOUT= 0
##$TUNXOUT= 0
##$USERA1= <user>
##$USERA2= <user>
##$USERA3= <user>
##$USERA4= <user>
##$USERA5= <user>
##$V9= 5
##$VALIST= <valist>
##$VCLIST= <CCCCCCCCCCCCCCC>
##$VD= 0
##$VDLIST= <DDDDDDDDDDDDDDD>
##$VPLIST= <PPPPPPPPPPPPPPP>
##$VTLIST= <TTTTTTTTTTTTTTT>
##$WBST= 1024
##$WBSW= 25
##$XGAIN= (0..3)
0 0 0 0 
##$XL= 0
##$YL= 0
##$YMAX_a= 2893188
##$YMIN_a= -2463008
##$ZGOPTNS= <>
##$ZL1= 120
##$ZL2= 120
##$ZL3= 120
##$ZL4= 120
##$ABSF1= 17.49637
##$ABSF2= -4.496376
##$ABSG= 5
##$ABSL= 3
##$ALPHA= 0
##$AQORDER= 0
##$ASSFAC= 0
##$ASSFACI= 0
##$ASSFACX= 0
##$ASSWID= 0
##$AUNMP= <proc_1d>
##$AXLEFT= 0
##$AXRIGHT= 0
##$AXTYPE= 0
##$AXUNIT= <>
##$AZFE= 0.1
##$AZFW= 0.1
##$BCFW= 0
##$BC_mod= 2
##$BYTORDP= 0
##$COROFFS= 0
##$CY= 7568.61572265625
##$DATMOD= 1
##$DC= 0
##$DFILT= <>
##$DTYPP= 0
##$F1P= 17.9538593292236
##$F2P= -4.03888763876832
##$FCOR= 0.5
##$FTSIZE= 32768
##$FT_mod= 6
##$GAMMA= 0
##$GB= 0
##$INTBC= 0
##$INTSCL= 5.656564e-011
##$ISEN= 128
##$LB= 0.02
##$LEV0= 0
##$LPBIN= 0
##$MAXI= 945.577
##$MC2= 0
##$MEAN= 0
##$ME_mod= 0
##$MI= -402.1523
##$NCOEF= 0
##$NC_proc= -5
##$NLEV= 6
##$NOISF1= 8.587773
##$NOISF2= 6.764455
##$NSP= 0
##$NTH_PI= 0
##$NZP= 0
##$OFFSET= 17.49637
##$PC= 1
##$PHC0= 100.6371
##$PHC1= 11.53887
##$PH_mod= 1
##$PKNL= yes
##$PPARMOD= 0
##$PPDIAG= 0
##$PPIPTYP= 0
##$PPMPNUM= 100
##$PPRESOL= 1
##$PSCAL= 0
##$PSIGN= 0
##$REVERSE= no
##$SF= 200.13
##$SI= 32768
##$SIGF1= 16.12182
##$SIGF2= -4.496377
##$SINO= 3.521527
##$SIOLD= 32768
##$SREGLST= <1H.CDCl3>
##$SSB= 0
##$STSI= 32768
##$STSR= 0
##$SW_p= 4401.40845070422
##$SYMM= 0
##$S_DEV= 0
##$TDeff= 16384
##$TDoff= 0
##$TI= <>
##$TILT= no
##$TM1= 0
##$TM2= 0
##$TOPLEV= 0
##$USERP1= <user>
##$USERP2= <user>
##$USERP3= <user>
##$USERP4= <user>
##$USERP5= <user>
##$WDW= 1
##$XDIM= 32768
##$YMAX_p= 320912326
##$YMIN_p= -1322616
$$ End of Bruker specific parameters
$$ ---------------------------------
##NTUPLES= NMR SPECTRUM
##VAR_NAME=  FREQUENCY,     SPECTRUM/REAL,   SPECTRUM/IMAG
##SYMBOL=    X,             R,               I
##VAR_TYPE=  INDEPENDENT,   DEPENDENT,       DEPENDENT
##VAR_FORM=  AFFN,          ASDF,            ASDF
##VAR_DIM=   32768,         32768,           32768
##UNITS=     HZ,            ARBITRARY UNITS, ARBITRARY UNITS
##FACTOR=    0.134324425510551, 1,           1
##FIRST=     4401.40845070422, -337055,      776763
##LAST=      0,             -684110,         126214
##MIN=       0,             -1322616,        0
##MAX=       4401.40845070422, 320912326,    0
$$ Real data points
##PAGE= N=1
##DATA TABLE= (X++(R..R)), XYDATA
$$ [...]
$$ plain form
20551 1087801 1173664 1191756 1002390 917472 1239145 1697130 1809403 1609797 1501760 1525081
20541 1525081 1365095 1071327 1117449 1589564 1911087 1667369 1217973 1132965 1401519 1583503
20531 1583503 1467896 1209594 1007180 965216 1118948 1330453 1327212 1080114 941967 1165926
20521 1165926 1523475 1687930 1734323 1888628 2027421 1896355 1658931 1694257 1909113 1812555
20511 1812555 1333886 1012064 1184257 1481333 1422787 1113672 988717 1144826 1310681 1321102
20501 1321102 1274344 1284312 1345152 1403868 1376387 1174040 900916 898907 1342881 1882367 1982325
20490 1982325 1595797 1202767 1165215 1358101 1520155 1632937 1746854 1713806 1411071 1077608
20480 1077608 1076751 1357573 1493017 1310626 1145298 1292589 1520675 1438271 1141719 1077182
$$ packed form
20551A087801Q5863J8092j89366q4918L21673M57985J12273j99606j08037K3321
20541A525081j59986k93768M6122M72115L21523k43718m49396q5008K68554J81984
20531A583503j15607k58302k02414m1964J53732K11505l241k47098j38147K23959
20521A165926L57549J64455M6393J54305J38793j31066k37424L5326K14856r6558
20511A812555m78669l21822J72193K97076n8546l09115j24955J56109J65855J0421
20501A321102m6758R968O0840N8716k7481k02347k73124k009M43974N39486R9958
20490A982325l86528l93030l7552J92886J62054J12782J13917l3048l02735l33463
20480A077608q57K80822J35444j82391j65328J47291K28086q2404k96552o4537
$$ plain form
20470 1077182 1308703 1390615 1101944 859991 1080868 1476983 1469707 1121448 1086123 1595831
20460 1595831 2064017 1944314 1511311 1380322 1579958 1617292 1324138 1092698 1206938 1415128
20450 1415128 1380388 1207904 1234049 1497537 1714130 1689187 1509189 1343144 1245967 1184966
20440 1184966 1142254 1157627 1301648 1566180 1767290 1684803 1374830 1188971 1343500 1622819
20430 1622819 1703742 1621060 1639315 1779226 1822620 1747122 1752982 1811239 1634191 1263134 1218121
20419 1218121 1732085 2242749 2120086 1610175 1483881 1890991 2195877 1985956 1618623
20410 1618623 1555846 1700370 1731836 1671469 1697002 1705528 1509691 1278610 1344104 1664025 1880694
20399 1880694 1868413 1839644 1906219 1912519 1774595 1645477 1621211 1570153 1407280 1299447 1418744
$$ packed form
20470A077182K31521Q1912k88671k41953K20877L96115p276l48259l5325N09708
20460A595831M68186j19703m33003j30989J99636L7334k93154k31440J14240K08190
20450A415128l4740j72484K6145K63488K16593k4943j79998j66045r7177o1001
20440A184966m2712J5373J44021K64532K01110q2487l09973j85859J54529K79319
20430A622819Q0923q2682J8255J39911M3394p5498N860N8257j77048l71057m5013
20419A218121N13964N10664j22663n09911j26294M07110L04886k09921l67333
20410A618623o2777J44524L1466o0367K5533Q526j95837k31081O5494L19921K16669
20399A880694j2281k8769O6575O300j37924j29118k4266n1058j62873j07833J19297
$$ plain form
20388 1418744 1664806 1805835 1775810 1681678 1605505 1537945 1462143 1402215 1401832 1492662 1657433
20377 1657433 1824042 1937016 2001844 2008236 1903647 1751495 1782606 2088687 2384534 2354890
20367 2354890 2151775 2188255 2460223 2508066 2151121 1811387 1880065 2157608 2231691 2081731
20357 2081731 1948245 1869886 1754890 1723943 1957587 2297955 2393721 2203541 2015763 1996152
20347 1996152 2036172 2037216 2041805 2070032 2079422 2082518 2094373 2034509 1903652 1918217 2177742 2365644
20335 2365644 2158548 1780075 1695294 1884059 1953967 1890193 2054887 2420481 2504402 2222139
20325 2222139 2099452 2366369 2535847 2261375 1941330 1988670 2135485 2040856 1986676 2277138
20315 2277138 2494908 2173628 1757090 1956765 2486034 2469770 1938101 1789885 2242002 2474220
$$ packed form
20388A418744K46062J41029l0025r4132p6173o7560p5802n9928l83R0830J64771
20377A657433J66609J12974O4828O392j04589j52152L1111L06081K95847k9644
20367B354890k03115L6480K71968M7843l56945l39734O8678K77543P4083j49960
20357B081731j33486p8359j14996l0947K33644L40368R5766j90180j87778j9611
20347A996152M0020J044M589K8227R390L096J1855n9864j30857J4565K59525J87902
20335B365644k07096l78473q4781J88765O9908o3774J64694L65594Q3921k82263
20325B222139j22687K66917J69478k74472l20045M7340J46815r4629n4180K90462
20315B277138K17770l21280m16538J99675N29269j6264n31669j48216M52117K32218
$$ plain form
20305 2474220 2077598 1732827 1962635 2236028 1997962 1709177 2005564 2495794 2355806
20296 2355806 1696127 1383612 1717489 2159602 2294078 2248980 2160887 1969801 1829296 2034922
20286 2034922 2410158 2401082 1952037 1663204 1847512 2057073 1893443 1704039 1973413 2460889
20276 2460889 2535417 2134876 1821855 1951781 2278262 2436005 2420423 2445963 2582614 2691748
20266 2691748 2609768 2311460 1952268 1766617 1864212 2129310 2358001 2449587 2422680 2328339
20256 2328339 2226096 2172825 2158660 2128738 2126590 2292899 2623747 2869240 2827049 2624602
20246 2624602 2527218 2556628 2520770 2380773 2341073 2527109 2774836 2838844 2682961 2473568
20236 2473568 2363873 2356877 2346160 2268218 2230615 2428001 2846132 3137472 2980470 2544928
$$ packed form
20305B474220l96622l44771K29808K73393k38066k88785K96387M90230j39988
20296B355806o59679l12515L33877M42113J34476m5098q8093j91086j40505K05626
20286B034922L75236r076m49045k88833J84308K09561j63630j89404K69374M87476
20276B460889P4528m00541l13021J29926L26481J57743j5582K5540J36651J09134
20266B691748q1980k98308l59192j85651R7595K65098K28691R1586k6907r4341
20256B328339j02243n3271j4165k9922k148J66309L30848K45493m2191k02447
20246B624602r7384K9410l5858j39997l9700J86036K47727O4008j55883k09393
20236B473568j09695o996j0717p7942l7603J97386M18131K91340j57002m35542
$$ plain form
20226 2544928 2369512 2701212 3167274 3246912 2899175 2523930 2408922 2460865 2482639 2486265
20216 2486265 2617132 2885656 3104413 3085117 2844942 2606394 2585363 2765388 2915119 2869816
20206 2869816 2736791 2722686 2806855 2766221 2559534 2476805 2746750 3140993 3204658 2843476
20196 2843476 2449737 2409696 2691494 2993261 3102938 2997769 2769465 2605151 2687199 2941143
20186 2941143 3039678 2859056 2746782 3032668 3432418 3372227 2870108 2582623 2844320 3180927
20176 3180927 3084905 2808071 2899071 3283141 3410757 3184777 3090484 3341289 3516580 3301275
20166 3301275 3060606 3267320 3710896 3766423 3296817 2823258 2793062 3061667 3215961 3136825
20156 3136825 3058741 3197290 3476115 3623267 3488107 3231855 3146910 3278989 3359034 3203938
$$ packed form
20226B544928j75416L31700M66062P9638l47737l75245j15008N1943K1774L626
20216B486265J30867K68524K18757j9296k40175k38548k1031J80025J49731m5303
20206B869816j33025j4105Q4169m0634k06687q2729K69945L94243O3665l61182
20196B843476l93739m0041K81798L01767J09677j05169k28304j64314Q2048K53944
20186B941143R8535j80622j12274K85886L99750o0191n02119k87485K61697L36607
20176C180927r6022k76834R1000L84070J27616k25980r4293K50805J75291k15305
20166C301275k40669K06714M43576N5527m69606m73559l0196K68605J54294p9136
20156C136825p8084J38549K78825J47152j35160k56252q4945J32079Q0045j55096
$$ plain form
20146 3203938 3034237 3189792 3616125 3898411 3817052 3603098 3547578 3602811 3555404 3419083
20136 3419083 3407781 3574588 3706863 3619785 3398511 3278115 3369407 3562448 3656198 3551172
20126 3551172 3345421 3251284 3387632 3659256 3872742 3941374 3915407 3846248 3727965 3579973
20116 3579973 3478473 3466733 3519247 3617906 3753417 3822069 3684726 3425362 3375099 3696156
20106 3696156 4082115 4123380 3888471 3833739 4131462 4426636 4377535 4126424 4027832 4159420
20096 4159420 4352951 4508602 4591950 4480637 4147242 3897053 4062295 4482542 4652767 4426590
20086 4426590 4203128 4299896 4501047 4447521 4186965 4045921 4129326 4239188 4222431 4159853
20076 4159853 4208993 4412156 4668708 4820557 4788869 4657885 4561658 4503309 4427229 4442835
$$ packed form
20146C203938j69701J55555M26333K82286q1359k13954n5520N5233m7407j36321
20136C419083j1302J66807J32275q7078k21274j20396R1292J93041R3750j05026
20126C551172k05751r4137J36348K71624K13486O8632k5967o9159j18283j47992
20116C579973j01500j1740N2514R8659J35511O8652j37343k59364n0263L21057
20106C696156L85959M1265k34909n4732K97723K95174m9101k51111r8592J31588
20096D159420J93531J55651Q3348j11313l33395k50189J65242M20247J70225k26177
20086D426590k23462R6768K01151n3526k60556j41044Q3405J09862j6757o2578
20076D159853M9140K03163K56552J51849l1688j30984r6227n8349p6080J5606
$$ plain form
20066 4442835 4721896 5124152 5238384 4950372 4664480 4737532 4992300 5086677 5071577 5184424
20056 5184424 5320677 5197239 4927179 4926708 5253492 5506721 5445285 5274891 5229681 5282262
20046 5282262 5394451 5654602 5995425 6140768 6023111 5923151 6017748 6133838 6138536 6189583
20036 6189583 6347291 6334646 6029656 5840406 6158587 6707128 6901091 6681284 6511510 6638439
20026 6638439 6824076 6819787 6696526 6634379 6695644 6863189 7054137 7086647 6873784 6624246
20016 6624246 6598531 6724354 6748611 6701001 6836581 7134774 7270272 7148610 7059500 7161796
20006 7161796 7212800 7023464 6830110 6924557 7178083 7254462 7131797 7094203 7265875 7425937
19996 7425937 7322050 7006209 6795189 6936065 7324274 7585120 7489638 7228463 7159377 7362353
$$ packed form
20066D442835K79061M02256J14232k88012k85892P3052K54768R4377j5100J12847
20056E184424J36253j23438k70060m71L26784K53229o1436j70394m5210N2581
20046E282262J12189K60151L40823J45343j17657r9960R4597J16090M698N1047
20036F189583J57708j2645l04990j89250L18181N48541J93963k19807j69774J26929
20026F638439J85637m289j23261o2147O1265J67545J90948L2510k12863k49538
20016F624246k5715J25823K4257m7610J35580K98193J35498j21662q9110J02296
20006G161796N1004j89336j93354R4447K53526P6379j22665l7594J71672J60062
19996G425937j03887l15841k11020J40876L88209K60846r5482k61175o9086K02976
$$ plain form
19986 7362353 7624236 7784683 7844639 7781457 7569955 7391719 7481846 7722687 7759837 7598445
19976 7598445 7651821 8033545 8269699 8008256 7585431 7498523 7686886 7800215 7872773 8176901
19966 8176901 8585965 8661975 8339005 8002601 7867733 7759878 7587576 7565736 7800523 8030100
19956 8030100 7992458 7791784 7721827 7914441 8277367 8608535 8704347 8526208 8290214 8219797
19946 8219797 8241086 8149262 8010801 8079958 8339170 8493232 8449939 8414376 8441721 8334087
19936 8334087 8119997 8176680 8633019 9065774 9090035 8884176 8803718 8835775 8825201 8905046
19926 8905046 9224080 9499980 9376860 9083244 9192962 9771356 10270387 10308135 10084220 9939908
19916 9939908 9946353 10056618 10256677 10399821 10272248 10017856 10121668 10713705 11240957 11169724
$$ packed form
19986G362353K61883J60447N9956o3182k11502j78236R0127K40841L7150j61392
19976G598445N3376L81724K36154k61443m22825q6908J88363J13329P2558L04128
19966H176901M09064P6010l22970l36404j34868j07855j72302k1840K34787K29577
19956H030100l7642k00674o9957J92614L62926L31168R5812j78139k35994p0417
19946H219797K1289r1824j38461O9157K59212J54062m3293l5563K7345j07634
19936H334087k14090N6683M56339M32755K4261k05859q0458L2057j0574P9845
19926H905046L19034K75900j23120k93616J09718N78394M99031L7748k23915j44312
19916I939908O445J10265K00059J43144j27573k54392J03812N92037N27252p1233
$$ plain form
19906 11169724 10727622 10547582 10786935 11067144 11183658 11344852 11632175 11735163 11486489
19897 11486489 11267136 11498670 11982480 12183187 12048261 12056571 12416934 12722282 12622318 12404681
19887 12404681 12534644 12931275 13163418 13175525 13303147 13629890 13863105 13903923 14017725 14290247
19877 14290247 14428164 14340800 14421608 14909050 15423659 15567687 15572483 15835459 16180361 16213307
19867 16213307 16156486 16589293 17437498 17969140 17889125 17750499 18077406 18708840 19302679 19914257
19857 19914257 20675200 21362386 21748246 22057560 22634243 23382106 23937426 24219986 24435303
19848 24435303 24656433 24757773 24705288 24630260 24642149 24744797 24856540 24794881 24421000 23939378
19838 23939378 23797642 24077044 24266142 23933357 23352986 23096811 23237553 23389804 23377893
$$ packed form
19906A1169724m42102j80040K39353K80209J16514J61194K87323J02988k48674
19897A1486489k19353K31534M83810K00707j34926Q310L60363L05348r9964k17637
19887A2404681J29963L96631K32143J2107J27622L26743K33215M0818J13802K72522
19877A4290247J37917q7364Q0808M87442N14609J44028M796K62976L44902L2946
19867A6213307n6821M32807Q48205N31642q0015j38626L26907O31434N93839O11578
19857A9914257P60943O87186L85860L09314N76683P47863N55320K82560K15317
19848B4435303K21130J01340n2485p5028J1889J02648J11743o1659l73881m81622
19838B3939378j41736K79402J89098l32785n80371k56175J40742J52251j1911
$$ plain form
19829 23377893 23389001 23520740 23618983 23583142 23480990 23370847 23329718 23584513 24235238 24914967
19819 24914967 25160730 25094601 25261354 25771215 26130480 26041550 25842666 25924265 26179957 26342502
19809 26342502 26473957 26767221 27138292 27347122 27329019 27147582 26808140 26340761 25876180
19800 25876180 25445003 24909479 24261739 23728838 23390975 22995145 22394032 21867828 21706992
19791 21706992 21743458 21619579 21281137 20886578 20489660 20162164 20149460 20482888 20695448 20399292
19781 20399292 19918410 19821147 20031786 20019929 19724817 19578790 19632987 19429860 18893799 18597408
19771 18597408 18837827 19125637 19007371 18797230 18970229 19317305 19308788 18961452 18729126 18741546
19761 18741546 18744828 18681370 18755050 18939782 18949571 18751644 18647884 18761665 18875935 18904440
$$ packed form
19829B3377893J1108J31739R8243l5841j02152j10143m1129K54795O50725O79729
19819B4914967K45763o6129J66753N09861L59265q8930j98884Q1599K55692J62545
19809B6342502J31455K93264L71071K08830j8103j81437l39442m67379m64581
19800B5876180m31177n35524o47740n32901l37863l95830o01113n26204j60836
19791B1706992L6466j23879l38442l94559l96918l27496j2704L33428K12560k96156
19781B0399292m80882r7263K10639j1857k95112j46027N4197k03127n36061k96391
19771A8597408K40419K87810j18266k10141J72999L47076q517l47336k32326J2420
19761A8741546L282o3458P3680J84732R789j97927j03760J13781J14270K8505
$$ plain form
19751 18904440 19097939 19562922 19929604 19801094 19319857 18994782 19069930 19317183 19431159
19742 19431159 19417546 19505870 19766864 19951259 19799759 19460093 19387240 19734711 20074425 19953672
19732 19953672 19541611 19382548 19622706 19901133 19982411 20012172 20050266 19876058 19510531 19433249
19722 19433249 19878422 20333781 20249339 19908261 19971713 20385249 20482731 20137417 19999509 20397304
19712 20397304 20789682 20725333 20644094 21101192 21738782 21814769 21429072 21362327 21803304 22120504
19702 22120504 22003256 21965367 22389249 22840749 22842984 22707416 22970071 23471078 23690620 23679332
19692 23679332 23918814 24428592 24748452 24769918 24882478 25241992 25568993 25792196 26220892
19683 26220892 26879727 27335282 27462823 27728517 28344490 28807315 28769685 28732054 29222296 29847559
$$ packed form
19751A8904440J93499M64983L66682j28510m81237l25075P5148K47253J13976
19742A9431159j3613Q8324K60994J84395j51500l39666p2853L47471L39714j20753
19732A9953672m12061j59063K40158K78427Q1278K9761L8094j74208l65527p7282
19722A9433249M45173M55359q4442l41078O3452M13536R7482l45314j37908L97795
19712B0397304L92378o4349q1239M57098O37590P5987l85697o6745M40977L17200
19702B2120504j17248l7889M23882M51500K235j35568K62655N01007K19542j1288
19692B3679332K39482N09778L19860K1466J12560L59514L27001K23203M28696
19683B6220892O58835M55555J27541K65694O15973M62825l7630l7631M90242O25263
$$ plain form
19673 29847559 29949559 29762681 30003276 30575363 30690715 30224765 29937156 30190010 30422707
19664 30422707 30243837 30149689 30636507 31344336 31699166 31797168 31986797 32098225 31854239 31662801
19654 31662801 32148451 33065020 33508354 33224429 32942255 33252400 33840429 34131258 34139338 34269167
19644 34269167 34628892 34962696 35099359 35136950 35235078 35435792 35675950 35871689 36016131 36214688
19634 36214688 36545459 36899485 37094984 37136833 37184314 37255377 37179371 36902857 36631605 36560962
19624 36560962 36632808 36675461 36645515 36608042 36580947 36524788 36442222 36402874 36472846 36633519 36773484
19613 36773484 36825260 36930236 37315355 37907877 38286367 38238076 38158365 38554386 39303496 39839029
19603 39839029 39999650 40181908 40610594 41020016 41250348 41618633 42359682 43136865 43510985
$$ packed form
19673B9847559J02000j86878K40595N72087J15352m65950k87609K52854K32697
19664C0422707j78870r4148M86818P07829L54830R8002J89629J11428k43986j91438
19654C1662801M85650R16569M43334k83925k82174L10145N88029K90829Q080J29829
19644C4269167L59725L33804J36663L7591R8128K00714K40158J95739J44442J98557
19634C6214688L30771L54026J95499M1849M7481P1063p6006k76514k71252p0643
19624C6560962P1846M2653k9946l7473k7095n6159q2566l9348O9972J60673J39965
19613C6773484N1776J04976L85119N92522L78490m8291p9711L96021P49110N35533
19603C9839029J60621J82258M28686M09422K30332L68285P41049P77183L74120
$$ plain form
19594 43510985 43557702 43612672 43698073 43643429 43544286 43635811 43857273 43973772 44012727 44157761
19584 44157761 44307524 44177284 43794490 43480821 43363526 43297563 43250393 43350062 43533992 43559744
19574 43559744 43425828 43409440 43617532 43843792 43924651 43902232 43809647 43657454 43645608 43979449
19564 43979449 44447441 44627096 44543090 44608672 44857538 44862996 44597354 44667551 45325228 45910521
19554 45910521 45816852 45434106 45470439 45795781 45738914 45259789 45007621 45275630 45635954 45679819
19544 45679819 45490647 45258849 44972969 44657522 44471459 44422516 44351506 44266335 44301647 44329663
19534 44329663 44088761 43754179 43829385 44314122 44554392 44199858 43771748 43884421 44363353
19525 44363353 44627932 44608278 44723563 45122188 45487450 45596937 45640998 45887084 46314888 46698666
$$ packed form
19594D3510985M6717N4970Q5401n4644r9143R1525K21462J16499L8955J45034
19584D4157761J49763j30240l82794l13669j17295o5963m7170R9669J83930K5752
19574D3559744j33916j6388K08092K26260Q0859k2419r2585j52193j1846L33841
19564D3979449M67992J79655q4006O5582K48866N458k65642P0197O57677N85293
19554D5910521r3669l82746L6333L25342n6867m79125k52168K68009L60324M3865
19544D5679819j89172k31798k85880l15447j86063m8943p1010q5171L5312K8016
19534D4329663k40902l34582P5206M84737K40270l54534m28110J12673M78932
19525D4363353K64579j9654J15285L98625L65262J09487M4061K46086M27804L83778
$$ plain form
19515 46698666 46892665 46956354 47058770 47278552 47521666 47719983 48038013 48644662 49304615
19506 49304615 49562225 49432460 49501623 50119396 50892644 51304715 51456953 51767800 52262346
19497 52262346 52686361 53098580 53766634 54576562 55115338 55323153 55535963 55882792 56192927
19488 56192927 56536703 57241522 58210456 58838157 58899015 58975516 59617508 60540194 61123937 61351038
19478 61351038 61719709 62444232 63263149 63963921 64642094 65421570 66270455 67142901 68043187
19469 68043187 68916258 69678299 70366082 71098278 71919778 72818489 73808574 74842820 75759545
19460 75759545 76494021 77207090 78011202 78747596 79285759 79839900 80644897 81498473 82058586
19451 82058586 82474766 83208451 84242924 85032556 85346708 85609263 86182112 86850810 87355219
$$ packed form
19515D6698666J93999O3689J02416K19782K43114J98317L18030O06649O59953
19506D9304615K57610j29765O9163O17773P73248M12071J52238L10847M94546
19497E2262346M24015M12219O68054Q09928N38776K07815K12810L46829L10135
19488E6192927L43776P04819R68934O27701O0858P6501O41992R22686N83743K27101
19478F1351038L68671P24523Q18917P00772O78173P79476Q48885Q72446R00286
19469F8043187Q73071P62041O87783P32196Q21500Q98711R90085J034246R16725
19460G5759545P34476P13069Q04112P36394N38163N54141Q04997Q53576N60113
19451H2058586M16180P33685J034473P89632L14152K62555N72849O68698N04409
$$ plain form
19442 87355219 87924283 88809310 89697964 90187868 90577851 91515475 92940524 94070226 94548596
19433 94548596 94968953 95958707 97281560 98306407 99004630 99917339 101264211 102654069 103777938
19424 103777938 104906947 106408435 108076464 109355822 110157830 111054660 112540917 114408283
19416 114408283 116100642 117487187 118926033 120604755 122226473 123513687 124689924 126152066
19408 126152066 127862923 129444326 130817438 132369366 134402173 136736526 139029188 141245953
19400 141245953 143618497 146301326 149281868 152512562 155918238 159348101 162740380 166316436
19392 166316436 170418298 175139086 180271368 185627329 191238772 197207758 203545419 210264945
19384 210264945 217505558 225429138 234040161 243186585 252671080 262248687 271538596 280061656
$$ packed form
19442H7355219N69064Q85027Q88654M89904L89983R37624J425049J129702M78370
19433I4548596M20357R89754J322853J024847O98223R12709J346872J389858J123869
19424A03777938J129009J501488J668029J279358Q02008Q96830J486257J867366
19416A14408283J692359J386545J438846J678722J621718J287214J176237J462142
19408A26152066J710857J581403J373112J551928K032807K334353K292662K216765
19400A41245953K372544K682829K980542L230694L405676L429863L392279L576056
19392A66316436M101862M720788N132282N355961N611443N968986O337661O719526
19384B10264945P240613P923580Q611023R146424R484495R577607R289909Q523060
$$ plain form
19376 280061656 287424086 293424051 297942747 300786570 301762733 300996466 299112663 296942670
19368 296942670 294976985 293172674 291298225 289280386 287102233 284582713 281545098 278124498
19360 278124498 274616532 271052051 267259573 263400630 260072891 257703134 256148151 255120225
19352 255120225 254702560 255126048 256287557 257894970 259948276 262655664 265933150 269415098
19344 269415098 272977433 276825066 280955704 284921659 288300684 291111943 293619841 296013391
19336 296013391 298421251 300926272 303364678 305385495 306875726 307973678 308410186 307229321
19328 307229321 303588717 297595574 289958777 281092473 271094417 260427097 249951083 240181306
19320 240181306 231004823 222249109 214064719 206575195 199573976 192813094 186286630 180045889
$$ packed form
19376B80061656P362430N999965M518696K843823R76163p66267j883803k169993
19368B96942670j965685j804311j874449k017839k178153k519520l037615l420600
19360B78124498l507966l564481l792478l858943l327739k369757j554983j027926
19352B55120225m17665M23488J161509J607413K053306K707388L277486L481948
19344B69415098L562335L847633M130638L965955L379025K811259K507898K393550
19336B96013391K407860K505021K438406K020817J490231J097952M36508j180865
19328C07229321l640604n993143p636797q866304r998056j0667320j0476014r769777
19320B40181306r176483q755714q184390p489524p001219o760882o526464o240741
$$ plain form
19312 180045889 174050767 168391145 163324401 158868167 154672934 150543763 146758844 143567667
19304 143567667 140695865 137733000 134741765 132030945 129521636 126860440 124101503 121755048
19296 121755048 120064405 118647767 117013756 115135671 113368570 112014466 111078649 110296394
19288 110296394 109362929 108281999 107422887 107012066 106691877 105946636 104884384 104101205 103733513
19279 103733513 103232408 102306160 101496610 101373494 101620840 101506841 100957094 100500382 100282098
19270 100282098 99839691 98945597 98020079 97423006 96849336 95837320 94541347 93542572 93039965
19261 93039965 92645757 91974478 91101741 90361110 89919268 89667080 89394764 88965628 88379441
19252 88379441 87751059 87231997 86924662 86832395 86838796 86753526 86490321 86232767 86285515 86673676
$$ packed form
19312A80045889n995122n659622n066744m456234m195233m129171l784919l191177
19304A43567667k871802k962865k991235k710820k509309k661196k758937k346455
19296A21755048j690643j416638j634011j878085j767101j354104r35817p82255
19288A10296394r33465j080930q59112m10821l20189p45241j062252p83179l67692
19279A03733513n01105r26248q09550j23116K47346j13999n49747m56712k18284
19270A00282098m42407q94094r25518n97073n73670j012016j295973r98775n02607
19261I3039965l94208o71279q72737p40631m41842k52188k72316m29136n86187
19252H8379441o28382n19062l07335r2267O401q5270k63205k57554N2748L88161
$$ plain form
19242 86673676 87038421 87079322 86956926 87034051 87334288 87573870 87701847 88020283 88646989 89234945
19232 89234945 89487757 89654964 90159524 90940314 91585164 92006909 92508805 93158158 93594228
19223 93594228 93633440 93612752 93826472 93985145 93633408 92860083 92150244 91664668 91123033 90374570
19213 90374570 89627334 89014866 88334792 87410821 86423932 85671929 85199036 84839143 84453483
19204 84453483 83967730 83341433 82670207 82181842 81978531 81908978 81821669 81780899 81876200 81997514
19194 81997514 82014577 82036531 82248699 82585329 82807937 82850141 82856681 82929230 83061386 83280849
19184 83280849 83605900 83876389 83888211 83716887 83654557 83783594 83872050 83764423 83598209 83487270
19174 83487270 83241393 82623119 81724640 80865067 80204259 79653646 79096937 78492826 77787376
$$ packed form
19242H6673676L64745M0901j22396P7125L00237K39582J27977L18436O26706N87956
19232H9234945K52812J67207N04560P80790O44850M21745N01896O49353M36070
19223I3594228L9212k0688K13720J58673l51737p73325p09839m85576n41635p48463
19213I0374570p47236o12468o80074r23971r86889p52003m72893l59893l85660
19204H4453483m85753o26297o71226m88365k03311o9553q7309m0770R5301J21314
19194H1997514J7063K1954K12168L36630K22608M2204O540P2549J32156K19463
19184H3280849L25051K70489J1822j71324o2330J29037Q8456j07627j66214j10939
19174H3487270k45877o18274q98479q59573o60808n50613n56709o04111p05450
$$ plain form
19165 77787376 76937267 76063797 75406742 75022509 74646469 73998104 73176473 72581586 72393525
19156 72393525 72299389 71906342 71313880 70991623 71072201 71113736 70759590 70313093 70290122 70605437
19146 70605437 70682414 70334297 70032430 70170102 70512419 70630016 70525375 70515695 70741157 71095383
19136 71095383 71458902 71722871 71757574 71642852 71758815 72331908 73039285 73410339 73498662 73763728
19126 73763728 74358327 74977037 75437940 75959238 76702934 77429017 77845567 78038054 78307625
19117 78307625 78754918 79223909 79533982 79623454 79582243 79639491 79966150 80403213 80577306 80391408
19107 80391408 80179047 80230154 80411006 80456099 80378279 80289208 80024109 79344225 78435880 77808580
19097 77808580 77654379 77634752 77375875 76879286 76345757 75889856 75588601 75543659 75668187 75620084
$$ packed form
19165G7787376q50109q73470o57055l84233l76040o48365q21631n94887j88061
19156G2393525r4136l93047n92462l22257Q0578M1535l54146m46497k2971L15315
19146G0605437P6977l48117l01867J37672L42317J17597j04641r680K25462L54226
19136G1095383L63519K63969L4703j14722J15963N73093P07377L71054Q8323K65066
19126G3763728N94599O18710M60903N21298P43696P26083M16550J92487K69571
19117G8307625M47293M68991L10073Q9472m1211N7248L26659M37063J74093j85898
19107H0391408k12361N1107J80852M5093p7820q9071k65099o79884r08345o27300
19097G7808580j54201j9627k58877m96589n33529m55901l01255m4942J24528m8103
$$ plain form
19087 75620084 75218010 74784939 74778537 75148495 75392122 75276563 75156776 75405787 75828721 75960295
19077 75960295 75783998 75755241 76083101 76380413 76237195 75848763 75735727 75978465 76115237
19068 76115237 75824317 75352103 75111034 75129397 75136720 75019010 74910330 74885827 74813627 74552483
19058 74552483 74130174 73665465 73216762 72760524 72260951 71728511 71226960 70802434 70389043
19049 70389043 69852627 69172543 68483516 67858432 67174916 66345409 65565084 65101910 64876562
19040 64876562 64502784 63792813 62997991 62447353 62136520 61815998 61349055 60820531 60364112
19031 60364112 60024430 59765755 59522960 59257832 59006983 58826894 58671576 58428093 58124756
19022 58124756 57970854 58083623 58299952 58407025 58450933 58615977 58863869 58948195 58821895 58786821
$$ packed form
19087G5620084m02074m33071o402L69958K43627j15559j19787K49011M22934J31574
19077G5960295j76297k8757L27860K97312j43218l88432j13036K42738J36772
19068G6115237k90920m72214k41069J8363P323j17710j08680k4503p2200k61144
19058G4552483m22309m64709m48703m56238m99573n32440n01551m24526m13391
19049G0389043n36416o80084o89027o25084o83516q29507p80325m63174k25348
19040F4876562l73778p09971p94822n50638l10833l20522m66943n28524m56419
19031F0364112l39682k58675k42795k65128k50849j80089j55318k43483l03337
19022E8124756j53902J12769K16329J07073M3908J65044K47892Q4326j26300l5074
$$ plain form
19012 58786821 59109613 59666628 60144814 60479469 60879152 61446229 62000428 62367152 62678172
19003 62678172 63220457 64036355 64835679 65343578 65625999 65996230 66659809 67526946 68335271
18994 68335271 68871564 69088067 69097741 69086690 69168058 69281080 69262131 69029912 68672390 68356663
18984 68356663 68198638 68205922 68268714 68198835 67874151 67392325 67010664 66884997 66924924 66933034
18974 66933034 66797770 66507508 66098912 65696790 65504090 65604230 65819337 65901067 65832532 65807186
18964 65807186 65934713 66125117 66273100 66399760 66565222 66769288 66987064 67188485 67288207
18955 67288207 67210556 67050112 67015679 67145903 67244761 67187418 67087488 67003130 66689815 65907994
18945 65907994 64833979 63857475 63054921 62203619 61273981 60491401 59847890 59011092 57924403
$$ packed form
19012E8786821L22792N57015M78186L34655L99683N67077N54199L66724L11020
19003F2678172N42285Q15898P99324N07899K82421L70231O63579Q67137Q08325
18994F8335271N36293K16503R674j1051Q1368J13022j8949k32219l57522l15727
18984F8356663j58025P284O2792o9879l24684m81826l81661j25667L9927Q110
18974F6933034j35264k90262m08596m02122j92700J00140K15107Q1730o8535k5346
18964F5807186J27527J90404J47983J26660J65462K04066K17776K01421R9722
18955F7288207p7651j60444l4433J30224R8858n7343r9930q4358l13315p81821
18945F5907994j074015r76504q02554q51302r29638p82580o43511q36798j086689
$$ plain form
18936 57924403 57055599 56699780 56412183 55614459 54502650 53778995 53599144 53406220 52845275
18927 52845275 52214691 51818132 51456519 50897475 50348642 50036298 49720489 49117496 48479587
18918 48479587 48214993 48173512 47889528 47370050 47016098 46836956 46419155 45734624 45301584
18909 45301584 45345188 45419948 45151309 44780403 44615950 44484006 44173234 43949698 44083281 44236059
18899 44236059 43925246 43339386 43077744 43233664 43351661 43227764 43139462 43241126 43300972 43171237
18889 43171237 43036734 43028481 42995677 42829284 42661999 42595265 42542679 42467991 42471498 42539756 42527120
18878 42527120 42471134 42581861 42833350 42949667 42905359 43017876 43384581 43666313 43644559 43562122
18868 43562122 43657754 43793441 43834224 43958105 44242892 44382024 44213682 44102032 44328836 44538666
$$ packed form
18936E7924403q68804l55819k87597p97724j111809p23655j79851j92924n60945
18927E2845275o30584l96559l61613n59044n48833l12344l15809o02993o37909
18918D8479587k64594m1481k83984n19478l53952j79142m17801o84531m33040
18909D5301584M3604P4760k68639l70906j64453j31944l10772k23536J33583J52778
18899D4236059l10813n85860k61642J55920J17997j23897q8302J01664N9846j29735
18889D3171237j34503q253l2804j66393j67285o6734n2586p4688L507O8258j2636
18878D2527120n5986J10727K51489J16317m4308J12517L66705K81732k1754q2437
18868D3562122R5632J35687M0783J23881K84787J39132j68342j11650K26804K09830
$$ plain form
18858 44538666 44353485 44140972 44483205 45162780 45426729 45108596 44744756 44646888 44615311 44584748
18848 44584748 44776285 45073697 44991985 44498829 44194682 44405154 44734062 44822262 44902139 45204378
18838 45204378 45433025 45328129 45217868 45457653 45767912 45714831 45474027 45502240 45753267 45861069
18828 45861069 45878047 46165817 46669032 46941535 46867366 46768660 46792165 46759686 46673039 46793301
18818 46793301 47094116 47172416 46889338 46618318 46635106 46710610 46585281 46444435 46573447 46841701
18808 46841701 46907615 46758832 46701012 46889859 47164206 47341779 47474185 47754237 48251639 48779839
18798 48779839 49058684 49053543 49069709 49377914 49837776 50103690 50125811 50154940 50277415 50299352
18788 50299352 50153138 50050825 50083788 50006339 49630881 49159193 48881987 48771349 48602039 48288036
$$ packed form
18858D4538666j85181k12513L42233O79575K63949l18133l63840r7868l1577l0563
18848D4584748J91537K97412q1712m93156l04147K10472L28908Q8200P9877L02239
18838D5204378K28647j04896j10261K39785L10259n3081k40804K8213K51027J07802
18828D5861069J6978K87770N03215K72503p4169r8706K3505l2479q6647J20262
18818D6793301L00815P8300k83078k71020J6788P5504j25329j40846J29012K68254
18808D6841701O5914j48783n7820J88847K74347J77573J32406K80052M97402N28200
18798D8779839K78845n141J6166L08205M59862K65914K2121K9129J22475K1937
18788E0299352j46214j02313L2963p7449l75458m71688k77206j10638j69310l14003
$$ plain form
18778 48288036 47887677 47457370 47099041 46959572 46977642 46837294 46405734 46013004 46026734 46324513
18768 46324513 46479428 46333503 46098364 45990051 46032231 46135821 46144623 45916201 45572641 45499473
18758 45499473 45838976 46191180 46145126 45895451 45918604 46217518 46392743 46366492 46470848 46797220
18748 46797220 47029012 47048989 47172170 47556251 47872154 47859205 47797153 48086455 48681101 49270359
18738 49270359 49750326 50183927 50527022 50733545 50957918 51343327 51753436 51985843 52096691
18729 52096691 52242845 52362045 52302984 52141025 52071532 52090112 52040353 51870019 51597022 51169352
18719 51169352 50629527 50247679 50171582 50115551 49771613 49364691 49335351 49572689 49505290 48978087
18709 48978087 48487328 48399635 48451745 48271125 47945533 47752445 47677027 47558198 47453512 47497918
$$ packed form
18778D8288036m00359m30307l58329j39469J8070j40348m31560l92730J3730K97779
18768D6324513J54915j45925k35139j08313M2180J03590Q802k28422l43560p3168
18758D5499473L39503L52204m6054k49675K3153K98914J75225k6251J04356L26372
18748D6797220K31792J9977J23181L84081L15903j2949o2052K89302N94646N89258
18738D9270359M79967M33601L43095K06523K24373L85409M10109K32407J10848
18729E2096691J46154J19200n9061j61959o9493J8580m9759j70334k72997m27670
18719E1169352n39825l81848p6097n6031l43938m06922k9340K37338o7399n27203
18709D8978087m90759q7693N2110j80620l25592j93088p5418j18829j04686M4406
$$ plain form
18699 47497918 47578744 47488797 47282600 47177976 47193015 47161492 47046036 46968940 46955838 46884622
18689 46884622 46700032 46501134 46404183 46436691 46536034 46560139 46390843 46140856 46123242 46450367
18679 46450367 46813020 46888639 46836879 47084112 47671673 48157103 48213179 48026083 47980278 48186017
18669 48186017 48478015 48716754 48911551 49107100 49277225 49344574 49286704 49220071 49306409 49511331
18659 49511331 49571393 49349821 49110142 49200997 49537105 49692594 49521933 49362347 49510258 49797727
18649 49797727 49883374 49737611 49610854 49660601 49814867 49920815 49881475 49728944 49661353 49878737
18639 49878737 50284644 50524841 50451477 50344457 50491678 50770399 50904209 50942336 51148813 51530697
18629 51530697 51838248 52001578 52222335 52606760 53016490 53330799 53576009 53752542 53822879
$$ packed form
18699D7497918Q0826q9947k06197j04624J5039l1523j15456p7096j3102p1216
18689D6884622j84590j98898r6951L2508R9343K4105j69296k49987j7614L27125
18679D6450367L62653P5619n1760K47233N87561M85430N6076j87096m5805K05739
18669D8186017K91998K38739J94797J95549J70125O7349n7870o6633Q6338K04922
18659D9511331O0062k21572k39679R0855L36108J55489j70661j59586J47911K87469
18649D9797727Q5647j45763j26757M9747J54266J05948l9340j52531o7591K17384
18639D9878737M05907K40197p3364j07020J47221K78721J33810L8127K06477L81884
18629E1530697L07551J63330K20757L84425M09730L14309K45210J76533P0337
$$ plain form
18620 53822879 53923540 54279629 54826835 55240168 55449251 55774370 56378288 56949694 57198826
18611 57198826 57337859 57727176 58315751 58822484 59250922 59776179 60277907 60500419 60631858
18602 60631858 61175472 62146646 62919459 63102913 63121346 63586688 64439588 65132775 65463460
18593 65463460 65780086 66411537 67281632 68147957 68914245 69590159 70174587 70735243 71459567
18584 71459567 72464274 73609182 74619875 75386733 76068151 76885769 77856546 78757474 79365806
18575 79365806 79712868 80043488 80509482 80988899 81288352 81456657 81755205 82306695 82914431
18566 82914431 83315134 83519240 83772837 84205855 84662492 84947326 85131292 85469128 86034484
18557 86034484 86605305 86984088 87289675 87788824 88528806 89315644 90016008 90684971 91396398
$$ packed form
18620E3822879J00661L56089N47206M13333K09083L25119O03918N71406K49132
18611E7198826J39033L89317N88575N06733M28438N25257N01728K22512J31439
18602F0631858N43614R71174P72813J83454J8433M65342Q52900O93187L30685
18593F5463460L16626O31451Q70095Q66325P66288O75914N84428N60656P24324
18584G1459567J004707J144908J010693P66858O81418Q17618R70777R00928O08332
18575G9365806L47062L30620M65994M79417K99453J68305K98548N51490O07736
18566H2914431M00703K04106K53597M33018M56637K84834J83966L37836N65356
18557H6034484N70821L78783L05587M99149P39982P86838P00364O68963P11427
$$ plain form
18548 91396398 92161068 93053072 94184595 95459301 96585883 97486398 98457803 99717392 101018045
18539 101018045 102021152 102879503 104062220 105663279 107288924 108662104 109935213 111284272
18531 111284272 112585511 113724429 114905087 116351901 117929690 119379632 120779994 122439948
18523 122439948 124412973 126446165 128417753 130527941 132979591 135702251 138507944 141368301
18515 141368301 144429652 147842955 151647173 155755124 160019814 164377583 168945179 173927847
18507 173927847 179448239 185520679 192134280 199252637 206778943 214661932 223020246 232020941
18499 232020941 241628233 251584671 261605318 271419165 280610327 288601935 294879620 299162777
18491 299162777 301405087 301806016 300812266 298889948 296249406 292979338 289434584 286163534
$$ packed form
18548I1396398P64670Q92004J131523J274706J126582R00515R71405J259589J300653
18539A01018045J003107Q58351J182717J601059J625645J373180J273109J349059
18531A11284272J301239J138918J180658J446814J577789J449942J400362J659954
18523A22439948J973025K033192J971588K110188K451650K722660K805693K860357
18515A41368301L061351L413303L804218M107951M264690M357769M567596M982668
18507A73927847N520392O072440O613601P118357P526306P882989Q358314R000695
18499B32020941R607292R956438J0020647R813847R191162P991608O277685M283157
18491B99162777K242310M00929r93750j922318k640542l270068l544754l271050
$$ plain form
18483 286163534 283326834 280498382 277252028 273671692 270023117 266211477 261984648 257533489
18475 257533489 253428115 249941441 246844949 243975968 241636878 240236013 239808315 240114249
18467 240114249 241009392 242487146 244509269 247031452 250092598 253641362 257336953 260761960
18459 260761960 263813859 266650594 269246294 271293033 272670523 273759002 275043687 276542017
18451 276542017 277867799 278755872 279178681 278911936 277369266 274109326 269261464 263167400
18443 263167400 255811977 247012180 237092997 226913357 217118517 207748416 198719275 190266485
18435 190266485 182633056 175689989 169244186 163433085 158384386 153739677 149056628 144539007
18427 144539007 140759462 137680236 134608185 131252264 128151934 125745945 123642319 121300768
$$ packed form
18483B86163534k836700k828452l246354l580336l648575l811640m226829m451159
18475B57533489m105374l486674l096492k868981k339090j400865m27698L05934
18467B40114249Q95143J477754K022123K522183L061146L548764L695591L425007
18459B60761960L051899K836735K595700K046739J377490J088479J284685J498330
18451B76542017J325782Q88073M22809k66745j542670l259940m847862o094064
18443B63167400p355423q799797r919183j0179640r794840r370101r029141q452790
18435A90266485p633429o943067o445803n811101n048699m644709m683049m517621
18427A44539007l779545l079226l072051l355921l100330k405989k103626k341551
$$ plain form
18419 121300768 118928933 117068092 115623064 114010751 112134173 110496853 109297912 108071456
18411 108071456 106453193 104780286 103596060 102916776 102333461 101605743 100825425 100119608 99478282
18402 99478282 98845560 98199956 97560167 97001655 96600075 96292037 95906883 95418619 95026765
18393 95026765 94871413 94805474 94601066 94273016 94025535 93940701 93885586 93715203 93449329 93248121
18383 93248121 93270446 93513629 93751622 93725981 93468333 93318421 93518854 93911945 94174449 94232210
18373 94232210 94258354 94355422 94469748 94587403 94774161 94991536 95096338 95101475 95242668 95664732
18363 95664732 96190043 96542627 96704306 96904285 97317751 97918486 98597599 99275726 99882901
18354 99882901 100372658 100825542 101433316 102291601 103289174 104301512 105399267 106697860 108070100
$$ packed form
18419A21300768k371835j860841j445028j612313j876578j637320j198941j226456
18411A08071456j618263j672907j184226o79284n83315p27718p80318p05817o41326
18402I9478282o32722o45604o39789n58512m01580l08038l85154m88264l91854
18393I5026765j55352o5939k04408l28050k47481q4834n5115j70383k65874k01208
18383I3248121K2325K43183K37993k5641k57648j49912K00433L93091K62504N7761
18373I4232210K6144R7068J14326J17655J86758K17375J04802N137J41193M22064
18363I5664732N25311L52584J61679J99979M13466O00735O79113O78127O07175
18354I9882901M89757M52884O07774Q58285R97573J012338J097755J298593J372240
$$ plain form
18345 108070100 109272269 110390266 111842237 113751500 115617823 116957836 118072285 119720784
18337 119720784 122089157 124582394 126737422 128833178 131332811 134155036 136895685 139490749
18329 139490749 142245527 145365754 148812024 152479674 156200826 159728021 163052270 166545816
18321 166545816 170387328 174045232 176844381 178904372 180902937 182944132 184353144 184716112
18313 184716112 184413068 183823392 182666172 180591310 177889721 175067752 172118458 168789338
18305 168789338 165263113 161961510 158867505 155650615 152373069 149490916 147165352 145118459
18297 145118459 143227171 141748919 140828127 140222647 139700407 139359832 139385473 139762190 140364021
18288 140364021 141093685 141867702 142708067 143864465 145549573 147548663 149444029 151243951
$$ packed form
18345A08070100J202169J117997J451971J909263J866323J340013J114449J648499
18337A19720784K368373K493237K155028K095756K499633K822225K740649K595064
18329A39490749K754778L120227L446270L667650L721152L527195L324249L493546
18321A66545816L841512L657904K799149K059991J998565K041195J409012L62968
18313A84716112l03044n89676j157220k074862k701589k821969k949294l329120
18305A68789338l526225l301603l094005l216890l277546k882153k325564k046893
18297A45118459j891288j478252r20792o05480n22240l40575K5641L76717O01831
18288A40364021P29664P74017Q40365J156398J685108J999090J895366J799922
$$ plain form
18280 151243951 153374932 155989320 158750560 161443344 164299466 167486721 170761736 173943551
18272 173943551 177275329 180944649 184686898 188305907 192146877 196475452 200742008 204148992
18264 204148992 206737431 209183371 211601025 213314099 213896716 213695573 213068698 211767311
18256 211767311 209455710 206309674 202644228 198366402 193308046 187813742 182458673 177314501
18248 177314501 171987376 166356129 160834574 155847324 151418398 147390010 143728634 140434175
18240 140434175 137381575 134485506 131911951 129911708 128456838 127205517 125872559 124522368
18232 124522368 123412927 122625506 121984732 121339699 120753501 120316918 119920976 119396697 118799940
18223 118799940 118338578 118035845 117696116 117232440 116784976 116428076 115994763 115339628 114588113
$$ packed form
18280A51243951K130981K614388K761240K692784K856122L187255L275015L181815
18272A73943551L331778L669320L742249L619009L840970M328575M266556L406984
18264B04148992K588439K445940K417654J713074N82617k01143o26875j301387
18256B11767311k311601l146036l665446m277826n058356n494304n355069n144172
18248A77314501n327125n631247n521555m987250m428926m028388l661376l294459
18240A40434175l052600k896069k573555k000243j454870j251321j332958j350191
18232A24522368j109441p87421o40774o45033n86198m36583l95942n24279n96757
18223A18799940m61362l02733l39729m63676m47464l56900m33313o55135p51515
$$ plain form
18214 114588113 113959130 113487494 113069945 112630087 112080833 111299235 110339696 109504755 108961861
18205 108961861 108439793 107594469 106559509 105796052 105450573 105221761 104870857 104486040 104161663
18196 104161663 103803522 103436269 103359668 103723555 104195560 104354254 104243208 104231147 104447378
18187 104447378 104693768 104876684 105177338 105711390 106296167 106708071 106992895 107360797 107881311
18178 107881311 108438203 108941449 109443736 110022238 110627657 111110938 111395803 111586126 111861235
18169 111861235 112269477 112687228 113005288 113268682 113554156 113793333 113864907 113838970 113952598
18160 113952598 114280829 114577188 114559106 114264933 113994699 113939344 114014806 114075486 114142952 114329538
18150 114329538 114628274 114917515 115154403 115413821 115688988 115815387 115746530 115794271 116339178
$$ packed form
18214A14588113o28983m71636m17549m39858n49254p81598r59539q34941n42894
18205A08961861n22068q45324j034960p63457l45479k28812l50904l84817l24377
18196A04161663l58141l67253p6601L63887M72005J58694j11046j2061K16231
18187A04447378K46390J82916L00654N34052N84777M11904K84824L67902N20514
18178A07881311N56892N03246N02287N78502O05419M83281K84865J90323K75109
18169A11861235M08242M17751L18060K63394K85474K39177P1574k5937J13628
18160A13952598L28231K96359j8082k94173k70234n5355P5462O0680O7466J86586
18150A14329538K98736K89241K36888K59418K75167J26399o8857M7741N44907
$$ plain form
18141 116339178 117283214 118064297 118354752 118494592 118980656 119731553 120243421 120398868 120656265
18132 120656265 121326138 122104565 122596941 122942191 123525002 124312472 124940424 125352782 125879662
18123 125879662 126662730 127445820 128039559 128602047 129316436 130153646 131109162 132281946 133502521
18114 133502521 134306539 134608889 135006182 135973109 137115230 137779087 138129114 138925086 140337061
18105 140337061 141735158 142735473 143705297 144977152 146267715 147301731 148409605 149949303
18097 149949303 151597558 152843160 153853741 155179631 156800422 158175594 159189805 160337949
18089 160337949 161854402 163299413 164267018 164987050 165896150 167002003 168025547 168894599
18081 168894599 169746074 170606885 171375293 172034256 172671332 173356150 174132594 175025901 175946661
$$ packed form
18141A16339178R44036P81083K90455J39840M86064P50897N11868J55447K57397
18132A20656265O69873P78427M92376L45250N82811P87470O27952M12358N26880
18123A25879662P83068P83090N93739N62488P14389Q37210R55516J172784J220575
18114A33502521Q04018L02350L97293R66927J142121O63857L50027P95972J411975
18105A40337061J398097J000315R69824J271855J290563J034016J107874J539698
18097A49949303J648255J245602J010581J325890J620791J375172J014211J148144
18089A60337949J516453J445011R67605P20032R09100J105853J023544Q69052
18081A68894599Q51475Q60811P68408O58963O37076O84818P76444Q93307R20760
$$ plain form
18072 175946661 176726350 177362069 178072450 178990455 179966518 180815394 181598751 182511181 183620504
18063 183620504 184848765 186071767 187140089 187986690 188821483 189993676 191524987 193040888
18055 193040888 194343119 195746487 197582138 199674989 201689952 203747196 206232100 209139981
18047 209139981 212103571 215037307 218278015 222024972 226055700 230103402 234156580 238257741
18039 238257741 242317715 246267856 250142311 253903273 257413538 260638871 263624678 266241034
18031 266241034 268252941 269687130 270786691 271530562 271581943 270844103 269678472 268397082
18023 268397082 266930441 265203465 263409039 261609835 259486662 256874648 254192725 251900204
18015 251900204 249836534 247583865 245212117 243117424 241332457 239604921 238034849 236976318
$$ packed form
18072A75946661P79689O35719P10381R18005R76063Q48876P83357R12430J109323
18063A83620504J228261J223002J068322Q46601Q34793J172193J531311J515901
18055A93040888J302231J403368J835651K092851K014963K057244K484904K907881
18047B09139981K963590K933736L240708L746957M030728M047702M053178M101161
18039B38257741M059974L950141L874455L760962L510265L225333K985807K616356
18031B66241034K011907J434189J099561P43871N1381p37840j165631j281390
18023B68397082j466641j726976j794426j799204k123173k612014k681923k292521
18015B51900204k063670k252669k371748k094693j784967j727536j570072j058531
$$ plain form
18007 236976318 236320085 235552089 234635363 234169471 234442702 234952827 235219594 235513155 236315084
17998 236315084 237519837 238729243 240012694 241758762 243935455 246113977 248229812 250774343
17990 250774343 254106824 258010459 262099677 266310700 270785861 275557574 280570130 285795657
17982 285795657 291100846 296167127 300778183 305069799 309256228 313175183 316348866 318504218
17974 318504218 319822682 320615357 320912326 320459404 319011905 316548833 313272217 309462120
17966 309462120 305270318 300612505 295349036 289623068 283895128 278521530 273390694 268128524
17958 268128524 262601097 257045389 251755862 246862728 242422194 238476285 234943401 231674692
17950 231674692 228728987 226365720 224620692 223138892 221656363 220412725 219758265 219520180
$$ packed form
18007B36976318o56233p67996r16726m65892K73231N10125K66767K93561Q01929
17998B36315084J204753J209406J283451J746068K176693K178522K115835K544531
17990B50774343L332481L903635M089218M211023M475161M771713N012556N225527
17982B85795657N305189N066281M611056M291616M186429L918955L173683K155352
17974C18504218J318464P92675K96969m52922j447499k463072l276616l810097
17966C09462120m191802m657813n263469n725968n727940n373598n130836n262170
17958B68128524n527427n555708n289527m893134m440534l945909l532884l268709
17950B31674692k945705k363267j745028j481800j482529j243638o54460k38085
$$ plain form
17942 219520180 219171655 218589194 218218040 218404328 218941214 219441357 219843441 220327866 220968054
17933 220968054 221713554 222575807 223621011 224873947 226377591 228231967 230431551 232791520
17925 232791520 235190880 237775117 240771553 244223179 248043573 252173653 256483313 260655093
17917 260655093 264406052 267740822 270754260 273258067 274862554 275414424 275128169 274291391
17909 274291391 273060256 271547241 269865551 268000555 265788989 263087084 259872915 256218509
17901 256218509 252300203 248386156 244646239 241040352 237587184 234620830 232459135 230879999
17893 230879999 229338925 227756940 226649959 226310073 226307317 226120688 225894303 226141939 226944396
17884 226944396 227907119 228787596 229688637 230651245 231532016 232387004 233552126 235134636 236754597
$$ packed form
17942B19520180l48525n82461l71154J86288N36886N00143M02084M84425O40188
17933B20968054P45500Q62253J045204J252936J503644J854376K199584K359969
17925B32791520K399360K584237K996436L451626L820394M130080M309660M171780
17917B60655093L750959L334770L013438K503807J604487N51870k86255q36778
17909B74291391j231135j513015j681690j864996k211566k701905l214169l654406
17901B56218509l918306l914047l739917l605887l453168k966354k161695j579136
17893B30879999j541074j581985j106981l39886k756j86629k26385K47636Q02457
17884B26944396R62723Q80477R01041R62608Q80771Q54988J165122J582510J619961
$$ plain form
17875 236754597 238047659 239174469 240537354 242161907 243692568 244947760 246157095 247588478
17867 247588478 249207604 250854625 252568500 254512922 256637111 258625386 260235214 261522707
17859 261522707 262613779 263357560 263392154 262570806 261184126 259700927 258382112 257195337
17851 257195337 255988482 254635471 253073813 251300670 249309276 247009913 244346310 241570920
17843 241570920 239203308 237490321 236061671 234443720 232819751 231831111 231566965 231281873
17835 231281873 230420590 229461581 229226542 229643889 229844368 229404389 228794360 228446614 228068176
17826 228068176 227277751 226366925 225838358 225527026 224834883 223698403 222681993 222109970 221723630
17817 221723630 221314072 221089550 221167241 221261579 221257382 221620811 222762233 224355690 225835670
$$ packed form
17875B36754597J293062J126810J362885J624553J530661J255192J209335J431383
17867B47588478J619126J647021J713875J944422K124189J988275J609828J287493
17859B61522707J091072P43781L4594q21348j386680j483199j318815j186775
17851B57195337j206855j353011j561658j773143j991394k299363k663603k775390
17843B41570920k367612j712987j428650j617951j623969r88640k64146k85092
17835B31281873q61283r59009k35039M17347K00479m39979o10029l47746l78438
17826B28068176p90425r10826n28567l11332o92143j136480j016410n72023l86340
17817B21723630m09558k24522P7691R4338m197L63429J141422J593457J479980
$$ plain form
17808 225835670 227308023 229361482 232109179 235060552 237964743 241153683 244870314 248793422
17800 248793422 252500636 255964273 259262204 262143312 264250327 265565666 266331915 266698158
17792 266698158 266697665 266387809 265733357 264500500 262532011 259998801 257147648 253976340 250444150
17783 250444150 246834325 243556879 240694916 238098976 235846217 234197833 233097086 232121115
17775 232121115 231039482 230085352 229540685 229344870 229267283 229218792 229230174 229322093 229534868 229906314
17765 229906314 230318762 230581429 230769673 231221717 232032752 232825101 233276753 233653778 234487587
17756 234487587 235851049 237315297 238623637 240091157 242228978 245168561 248575311 252031239
17748 252031239 255412957 258905998 262651179 266397787 269628020 272076755 273940734 275411357
$$ packed form
17808B25835670J472353K053459K747697K951373K904191L188940L716631L923108
17800B48793422L707214L463637L297931K881108K107015J315339P66249L66243
17792B66698158m93l09856o54452j232857j968489k533210k851153l171308l532190
17783B50444150l609825l277446k861963k595940k252759j648384j100747r75971
17775B32121115j081633r54130n44667j95815p7587m8491J1382R1919K12775L71446
17765B29906314M12448K62667J88244M52044Q11035P92349M51652L77025Q33809
17756B34487587J363462J464248J308340J467520K137821K939583L406750L455928
17748B52031239L381718L493041L745181L746608L230233K448735J863979J470623
$$ plain form
17740 275411357 276209050 275913521 274671913 273158377 271716498 269901002 267105358 263375790
17732 263375790 259290532 255204824 251010396 246646125 242464557 238891779 235934621 233258084
17724 233258084 230667381 228299135 226329658 224676327 223087507 221450296 219902063 218625174
17716 218625174 217587518 216541048 215294310 213950258 212819165 212104443 211742659 211548420
17708 211548420 211399748 211241623 211065305 211012537 211358288 212185875 213166904 213900539 214419798
17699 214419798 215091926 216041081 216997278 217754273 218402945 218992084 219362982 219541947 219892962
17690 219892962 220554951 221093666 221103665 220796465 220507255 219976390 218768077 217139568 215710545
17681 215710545 214376665 212414666 209729599 207097006 204928650 202706405 200066890 197571555
$$ packed form
17740B75411357P97693k95529j241608j513536j441879j815496k795644l729568
17732B63375790m085258m085708m194428m364271m181568l572778k957158k676537
17724B33258084k590703k368246j969477j653331j588820j637211j548233j276889
17716B18625174j037656j046470j246738j344052j131093p14722l61784j94239
17708B11548420j48672j58125j76318n2768L45751Q27587R81029P33635N19259
17699B14419798O72128R49155R56197P56995O48672N89139L70898J78965L51015
17690B19892962O61989N38715R999l07200k89210n30865j208313j628509j429023
17681B15710545j333880j961999k685067k632593k168356k222245k639515k495335
$$ plain form
17673 197571555 195778499 194329691 192732876 191367762 190774631 190466367 189526488 188084919
17665 188084919 187070075 186604728 185821356 184385619 183028708 182188261 181197123 179439815
17657 179439815 177436660 176021113 175095629 174004267 172662088 171497390 170584313 169632894
17649 169632894 168677677 168030137 167604413 166980480 166152168 165556670 165280740 164890316 164234112
17640 164234112 163777451 163797231 163800911 163238692 162394564 161971575 161989835 161748422 160934962 160169553
17630 160169553 160140706 160622863 160801155 160365435 159788347 159531840 159470601 159285904 159022778
17621 159022778 158924479 158970594 158944544 158817569 158731799 158712643 158725149 158905668 159383718 159982878
17611 159982878 160492179 161108497 162121103 163266499 164020100 164509605 165395447 166721528 167731713
$$ packed form
17673A97571555j793056j448808j596815j365114n93131l08264r39879j441569
17665A88084919j014844m65347p83372j435737j356911q40447r91138j757308
17657A79439815k003155j415547r25484j091362j342179j164698r13077r51419
17649A69632894r55217o47540m25724o23933q28312n95498k75930l90424o56204
17640A64234112m56661J9780L680n62219q44128m22989J8260k41413q13460p65409
17630A60169553k8847M82157J78292m35720n77088k56507o1239j84697k63126
17621A59022778r8299M6115k6050j26975q5770j9156J2506J80519M78050N99160
17611A59982878N09301O16318J012606J145396P53601M89505Q85842J326081J010185
$$ plain form
17602 167731713 168170079 168892464 170584565 172640555 174110063 175142527 176568599 178514529
17594 178514529 180472040 182473892 185100080 188357253 191602568 194709287 198378065 203141223
17586 203141223 208963201 215942386 224312036 233403608 241744479 248755665 255201798 261062922
17578 261062922 264028346 261490660 253580332 242981994 232029739 221273343 210818985
17571 210818985 201522094 194142617 188273673 182944559 177831175 173249027 169302420 165680577
17563 165680577 162187368 158968297 156175268 153736147 151522482 149516759 147706210 145926520
17555 145926520 143945639 141745555 139657989 138075023 136971574 135879227 134466145 132961239
17547 132961239 131774171 130861292 129810541 128478495 127145094 126006792 124927241 123832706
$$ packed form
17602A67731713M38366P22385J692101K055990J469508J032464J426072J945930
17594A78514529J957511K001852K626188L257173L245315L106719L668778M763158
17586B03141223N821978O979185Q369650R091572Q340871P011186O446133N861124
17578B61062922K965424k537686p910328j0598338j0952255j0756396j0454358
17571B10818985r296891p379477n868944n329114n113384m582148l946607l621843
17563A65680577l493209l219071k793029k439121k213665k005723j810549j779690
17555A45926520j980881k200084k087566j582966j103449j092347j413082j504906
17547A32961239j187068r12879j050751j332046j333401j138302j079551j094535
$$ plain form
17539 123832706 122976004 122557086 122358239 122033548 121559550 121120178 120709907 120176316 119583344
17530 119583344 119195795 119055699 118851736 118342529 117719645 117363063 117315955 117202062 116706690
17521 116706690 115984837 115450195 115226485 115011628 114536199 113945310 113549418 113347893 113070325
17512 113070325 112649371 112348276 112331552 112371763 112166583 111773428 111503024 111454269 111374394 111006404
17502 111006404 110424737 109962713 109884579 110175955 110599888 110898728 110962136 110865995 110787098 110859506
17492 110859506 111069785 111283550 111394094 111427130 111456531 111449469 111291892 110972148 110625377 110353070
17482 110353070 110100111 109763415 109330920 108868956 108460883 108162494 107883082 107339976 106376346
17473 106376346 105338976 104793347 104741891 104523645 103730198 102794641 102289177 102060962 101623937
$$ packed form
17539A23832706q56702m18918j98847l24691m73998m39372m10271n33591n92972
17530A19583344l87549j40096k03963n09207o22884l56582m7108j13893m95372
17521A16706690p21853n34642k23710k14857m75429n90889l95892k01525k77568
17512A13070325m20954l01095j6724M0211k05180l93155k70404m8755p9875l67990
17502A11006404n81667m62024p8134K91376M23933K98840O3408r6141p8897P2408
17492A10859506K10279K13765J10544L3036K9401p062j57577l19744l46771k72307
17482A10353070k52959l36696m32495m61964m08073k98389k79412n43106r63630
17473A06376346j037370n45629n1456k18246p93447r35557n05464k28215m37025
$$ plain form
17464 101623937 101067226 100851214 100877404 100572086 99909179 99533428 99696648 99866952 99696960
17455 99696960 99602953 99922857 100208567 99966581 99529026 99496545 99748882 99726884 99371785 99052470
17445 99052470 98794831 98330443 97768063 97463621 97273321 96683179 95715756 94963791 94590508
17436 94590508 94032346 92956230 91833572 91169867 90714020 89901231 88697351 87551848 86764070
17427 86764070 86272934 85887479 85420015 84745594 83957945 83304032 82816183 82258042 81584637
17418 81584637 81111310 80980352 80821646 80297075 79666238 79372838 79310711 79016436 78476838
17409 78476838 78197209 78407810 78678862 78516272 78001687 77596141 77506753 77494957 77253605 76782221
17399 76782221 76329518 76042443 75791698 75409980 75000134 74812320 74826863 74712132 74286158
$$ packed form
17464A01623937n56711k16012K6190l05318o62907l75751J63220J70304j69992
17455I9696960r4007L19904K85710k41986m37555l2481K52337k1998l55099l19315
17445I9052470k57639m64388n62380l04442j90300n90142r67423p51965l73283
17436I4590508n58162j076116j122658o63705m55847q12789j203880j145503p87778
17427H6764070m91136l85455m67464o74421p87649o53913m87849n58141o73405
17418H1584637m73327j30958j58706n24571o30837k93400o2127k94275n39598
17409G8476838k79629K10601K71052j62590n14585m05546q9388j1796k41352m71384
17399G6782221m52703k87075k50745l81718m09846j87814J4543j14731m25974
$$ plain form
17390 74286158 73768180 73417994 73178266 72895942 72650470 72546421 72369799 71842972 71142241
17381 71142241 70760008 70827816 70938338 70729238 70325231 70056353 69998113 69978289 69865486 69666763
17371 69666763 69436203 69231135 69107411 69062635 69018690 68914734 68782525 68696182 68669860 68613109
17361 68613109 68392358 67995263 67639213 67580508 67745174 67721040 67263775 66640838 66267172 66170182
17351 66170182 66096485 65992656 65993065 66003053 65756890 65354123 65273472 65657053 65989415 65783448
17341 65783448 65263750 65014689 65179336 65395206 65391097 65244785 65072801 64847965 64615438 64580534
17331 64580534 64810388 65045907 64995068 64703632 64466225 64430424 64467159 64441603 64430047 64555307
17321 64555307 64731613 64760082 64636470 64542083 64501863 64321898 63999896 63902213 64248207 64656281
$$ packed form
17390G4286158n17978l50186k39728k82324k45472j04049j76622n26827p00731
17381G1142241l82233O7808J10522k09100m04007k68878n8240j9824j12803j98723
17371F9666763k30560k05068j23724m4776m3945j03956j32209q6343k6322n6751
17361F8613109k20751l97095l56050n8705J64666k4134m57265o22937l73666r6990
17351F6170182p3697j03829M09R988k46163m02767q0651L83581L32362k05967
17341F5783448n19698k49061J64647K15870m109j46312j71984k24836k32527l4904
17331F4580534K29854K35519n0839k91436k37407l5801L6735k5556j1556J25260
17321F4555307J76306K8469j23612r4387m0220j79965l22002r7683L45994M08074
$$ plain form
17311 64656281 64609645 64241160 64170926 64574597 64946597 64928291 64843095 65112890 65594526 65905704
17301 65905704 66073278 66392656 66863195 67238166 67516348 67933794 68517002 69057008 69510914
17292 69510914 70035614 70616718 71062876 71416763 71965904 72726451 73296157 73412391 73344420
17283 73344420 73499725 73869369 74097020 73949103 73518987 73055943 72724942 72466978 72044455
17274 72044455 71328385 70536364 70003328 69718350 69343223 68727827 68095023 67603622 67067941
17265 67067941 66323313 65564354 65032873 64610720 64050261 63439711 63097348 63091958 63173207 63128392
17255 63128392 62949296 62698766 62454217 62327725 62321192 62250878 62045203 61974384 62275735 62692057
17245 62692057 62784340 62622062 62696610 63149543 63600847 63845809 64178578 64780552 65301054 65430017
$$ packed form
17311F4656281m6636l68485p0234M03671L72000j8306q5196K69795M81636L11178
17301F5905704J67574L19378M70539L74971K78182M17446N83208N40006M53906
17292F9510914N24700N81104M46158L53887N49141P60547N69706J16234o7971
17283G3344420J55305L69644K27651j47917m30116m63044l31001k57964m22523
17274G2044455p16070p92021n33036k84978l75127o15396o32804m91401n35681
17265F7067941p44628p58959n31481m22153n60459o10550l42363n390Q1249m4815
17255F3128392j79096k50530k44549j26492o533p0314k05675p0819L01351M16322
17245F2692057R2283j62278P4548M52933M51304K44962L32769O01974N20502J28963
$$ plain form
17235 65430017 65473860 65892792 66562949 67006511 67164485 67413817 67896147 68341505 68576273
17226 68576273 68737474 68901983 68933124 68826640 68812847 68932241 68857578 68353721 67614526 66916867
17216 66916867 66223436 65392280 64527039 63807902 63162400 62420249 61646901 60996571 60353953
17207 60353953 59488554 58515307 57820678 57493166 57181706 56623971 55992794 55543654 55184371
17198 55184371 54639853 53894614 53228822 52852359 52673861 52445952 52048236 51602457 51318266
17189 51318266 51217743 51067755 50671490 50163919 49853980 49795660 49723430 49446747 49086184 48828743
17179 48828743 48661998 48487246 48310872 48160621 47968755 47713267 47539655 47559460 47644786 47607142
17169 47607142 47469555 47368527 47298577 47177715 47074196 47113111 47201118 47097113 46756496 46384050
$$ packed form
17235F5430017M3843M18932O70157M43562J57974K49332M82330M45358K34768
17226F8576273J61201J64509L1141j06484j3793J19394p4663n03857p39195o97659
17216F6916867o93431q31156q65241p19137o45502p42151p73348o50330o42618
17207F0353953q65399r73247o94629l27512l11460n57735o31177m49140l59283
17198E5184371n44518p45239o65792l76463j78498k27909l97716m45779k84191
17189E1318266j00523j49988l96265n07571l09939n8320p2230k76683l60563k57441
17179D8828743j66745j74752j76374j50251j91866k55488j73612J9805Q5326l7644
17169D7607142j37587j01028o9950j20862j03519L8915Q8007j04005l40617l72446
$$ plain form
17159 46384050 46141767 46012434 45945833 45912662 45800778 45490121 45066417 44744236 44551845 44325066
17149 44325066 44040233 43878605 43888943 43874294 43734596 43636590 43674595 43636291 43331818 42925945
17139 42925945 42689028 42608323 42514838 42425643 42453071 42499066 42380431 42202366 42256414 42520842
17129 42520842 42593983 42237313 41723552 41485764 41594378 41739690 41629531 41273330 40921639
17120 40921639 40806159 40916236 41012902 40901986 40662114 40511087 40488923 40433734 40277467 40168914
17110 40168914 40215750 40276467 40158244 39906777 39721672 39642158 39514701 39286571 39132093 39181508
17100 39181508 39279461 39197360 39010271 39027945 39325515 39591758 39574341 39442045 39470855 39566278
17090 39566278 39444679 39181069 39138001 39327130 39326857 39008882 38860537 39242387 39740677 39741296
$$ packed form
17159D6384050k42283j29333o6601l3171j11884l10657m23704l22181j92391k26779
17149D4325066k84833j61628J0338j4649j39698r8006L8005l8304l04473m05873
17139D2925945k36917q0705r3485q9195K7428M5995j18635j78065N4048K64428
17129D2520842P3141l56670n13761k37788J08614J45312j10159l56201l51691
17120D0921639j15480J10077R6666j10916k39872j51027k2164n5189j56267j08553
17110D0168914M6836O0717j18223k51467j85105p9514j27457k28130j54478M9415
17100C9181508R7953q2101j87089J7674K97570K66243j7417j32296K8810R5423
17090C9566278j21599k63610m3068J89129k73l17975j48345L81850M98290O19
$$ plain form
17080 39741296 39359288 39230707 39523364 39754694 39600490 39306357 39159460 39070080 38911143
17071 38911143 38837727 38974252 39120781 39070757 38952246 38969484 39048656 39031937 39002637 39102012
17061 39102012 39206643 39129719 39015897 39176943 39575541 39801308 39599113 39178687 38941786
17052 38941786 39057552 39331342 39393748 39056563 38562599 38374709 38616682 38897462 38846034 38594647
17042 38594647 38474863 38462986 38306703 38052035 37993276 38144927 38226949 38198631 38313576 38529256
17032 38529256 38389822 37772076 37276641 37451756 37958199 38003779 37434802 36885528 36862556 37150050
17022 37150050 37243403 37003129 36672219 36488261 36507941 36689356 36940199 37112121 37086652 36887029
17012 36887029 36653517 36515488 36508724 36576363 36612231 36539658 36393799 36304431 36352822 36454413
$$ packed form
17080C9741296l82008j28581K92657K31330j54204k94133j46897q9380j58937
17071C8911143p3416J36525J46529n0024j18511J7238P9172j6719k9300R9375
17061C9102012J04631p6924j13822J61046L98598K25767k02195m20426k36901
17052C8941786J15766K73790O2406l37185m93964j87890K41973K80780n1428k51387
17042C8594647j19784j1877j56283k54668n8759J51651Q2022k8318J14945K15680
17032C8529256j39434o17746m95435J75115N06443M5580n68977n49274k2972K87494
17022C7150050R3353k40274l30910j83958J9680J81415K50843J71922k5469j99623
17012C6887029k33512j38029o764O7639L5868p2573j45859q9368M8391J01591
$$ plain form
17002 36454413 36429326 36208304 35940191 35849369 35973434 36091179 35972543 35674933 35485501 35539165
16992 35539165 35621078 35461387 35130766 34959729 35086413 35298170 35379306 35387431 35429769 35383475
16982 35383475 35124959 34909279 35131283 35678387 35930676 35594513 35167800 35252314 35697268
16973 35697268 35872505 35621489 35411904 35545583 35758452 35753416 35645288 35626969 35614227 35535127
16963 35535127 35603298 35937574 36232832 36219292 36155624 36390685 36692713 36585621 36188704 36082940
16953 36082940 36382047 36597768 36503951 36461776 36677934 36789421 36538282 36298599 36484407 36880028
16943 36880028 37039714 36986097 37006153 37062437 36961544 36885692 37168679 37652824 37844321 37692407
16933 37692407 37668615 38007977 38379612 38454333 38357963 38366488 38517309 38739314 39065561 39482637
$$ packed form
17002C6454413k5087k21022k68113r0822J24065J17745j18636k97610j89432N3664
16992C5539165Q1913j59691l30621j71037J26684K11757Q1136Q125M2338m6294
16982C5383475k58516k15680K22004N47104K52289l36163m26713Q4514M44954
16973C5697268J75237k51016k09585J33679K12869n036j08128j8319j2742p9100
16963C5535127O8171L34276K95258j3540o3668K35061L02028j07092l96917j05764
16953C6082940K99107K15721r3817m2175K16158J11487k51139k39683J85808L95621
16943C6880028J59686n3617K0056N6284j00893p5852K82987M84145J91497j51914
16933C7692407k3792L39362L71635P4721r6370Q525J50821K22005L26247M17076
$$ plain form
16923 39482637 39796128 39870215 39849152 39966811 40250639 40532636 40649818 40570887 40441820 40511884
16913 40511884 40841267 41103843 40940652 40516932 40385210 40700468 40956850 40721586 40261959
16904 40261959 40094599 40195227 40112279 39738327 39478638 39590218 39766387 39583055 39090803
16895 39090803 38703476 38617544 38601678 38389193 38079669 38000128 38238218 38509469 38550716 38465484
16885 38465484 38506058 38641707 38610451 38367554 38172443 38153991 38096684 37837083 37608569 37724063
16875 37724063 38082765 38282702 38147153 37873461 37685811 37590554 37509284 37449906 37464309 37548066
16865 37548066 37631926 37616807 37438202 37167274 36992395 36999189 37033313 36908402 36686902 36597407
16855 36597407 36713087 36880956 36955895 36934619 36846836 36679138 36454575 36265724 36182190 36199916
$$ packed form
16923C9482637L13491P4087k1063J17659K83828K81997J17182p8931j29067P0064
16913D0511884L29383K62576j63191m23720j31722L15258K56382k35264m59627
16904D0261959j67360J00628q2948l73952k59689J11580J76169j83332m92252
16895C9090803l87327q5932j5866k12485l09524p9541K38090K71251M1247q5232
16885C8465484M0574J35649l1256k42897j95111j8452n7307k59601k28514J15494
16875C7724063L58702J99937j35549k73692j87650r5257q1270n9378J4403Q3757
16865C7548066Q3860j5119j78605k70928j74879O794L4124j24911k21500q9495
16855C6597407J15680J67869P4939k1276q7783j67698k24563j88851q3534J7726
$$ plain form
16845 36199916 36276071 36330623 36260810 36080316 35985952 36110435 36257019 36116563 35749803 35567986
16835 35567986 35742310 35927398 35774191 35467372 35442646 35713267 35854011 35660134 35446490
16826 35446490 35531885 35735864 35680123 35405023 35316083 35551489 35788368 35779921 35712803 35799009
16816 35799009 35851149 35633924 35376935 35441584 35624758 35404357 34897303 34884492 35630223 36336658
16806 36336658 36238731 35688321 35523992 35786866 35839360 35539896 35442098 35784863 36078355 35930620
16796 35930620 35630224 35578181 35670350 35615145 35447420 35352226 35299668 35191463 35101144 35084717
16786 35084717 35019737 34881641 34880196 35068851 35155489 34989071 34870936 35037996 35209635 35064879
16776 35064879 34814667 34818274 34958119 34934455 34869737 34993278 35000425 34478833 33812679 33817577 34467826
$$ packed form
16845C6199916P6155N4552o9813j80494r4364J24483J46584j40456l66760j81817
16835C5567986J74324J85088j53207l06819k4726K70621J40744j93877k13644
16826C5446490Q5395K03979n5741k75100q8940K35406K36879q447o7118Q6206
16816C5799009N2140k17225k56989O4649J83174k20401n07054j2811P45731P06435
16806C6336658r7927n50410j64329K62874N2494k99464r7798L42765K93492j47735
16796C5930620l00396n2043R2169n5205j67725r5194n2558j08205r0319j6427
16786C5084717o4980j38096j445J88655Q6638j66418j18135J67060J71639j44756
16776C5064879k50212L607J39845k3664o4718J23541P147n21592o66154M898O50249
$$ plain form
16765 34467826 34853256 34562712 34237263 34412867 34662435 34445770 34100506 34251375 34711490
16756 34711490 34764657 34302479 33942149 34077315 34444122 34663377 34682916 34595715 34459673 34408287
16746 34408287 34582020 34851056 34912411 34732525 34597496 34669357 34807767 34902862 35039836 35199432
16736 35199432 35141155 34807491 34551972 34672518 34929965 34872978 34528401 34388871 34684579 35024987
16726 35024987 34948127 34570391 34399597 34615076 34875108 34881190 34782846 34807665 34789183 34458634
16716 34458634 34058253 34154745 34774921 35230393 35052097 34664754 34743109 35233216 35515690 35351039
16706 35351039 35109041 35092543 35172846 35196108 35271659 35465805 35610073 35643600 35795020 36154992
16696 36154992 36379483 36151836 35717003 35599274 35914212 36291825 36418180 36348076 36292853 36368337
$$ packed form
16765C4467826L85430k90544l25449J75604K49568k16665l45264J50869M60115
16756C4711490N3167m62178l60330J35166L66807K19255J9539q7201j36042n1386
16746C4408287J73733K69036O1355j79886j35029P1861J38410R5095J36974J59596
16736C5199432n8277l33664k55519J20546K57447n6987l44577j39530K95708L40408
16726C5024987p6860l77736j70794K15479K60032O082r8344K4819j8482l30549
16716C4458634m00381R6492O20176M55472j78296l87343P8355M90107K82474j64651
16706C5351039k41998j6498Q0303K3262P5551J94146J44268L3527J51420L59972
16696C6154992K24491k27647m34833j17729L14938L77613J26355p0104n5223P5484
$$ plain form
16686 36368337 36582765 36854656 37002231 36904645 36724886 36805632 37266981 37826183 38096832 37999303
16676 37999303 37814662 37865725 38189988 38543802 38723663 38805794 38965123 39130447 39055322 38768204
16666 38768204 38662093 38964701 39381087 39525385 39483205 39595648 39850283 39926406 39793935 39788872
16656 39788872 40018539 40161142 40042855 39972035 40194792 40394230 40150988 39654305 39478349
16647 39478349 39750078 40007760 39914088 39679816 39634611 39728434 39697429 39504714 39361319 39405920
16637 39405920 39564064 39686704 39685211 39553110 39365022 39239915 39224293 39232303 39166726 39062439
16627 39062439 39033603 39110461 39213296 39270013 39272680 39221071 39098597 38926992 38780608 38722934
16617 38722934 38771933 38922935 39136860 39310191 39360869 39373363 39536867 39864827 40103361 40057860
$$ packed form
16686C6368337K14428K71891J47575r7586j79759Q0746M61349N59202K70649r7529
16676C7999303j84641N1063L24263L53814J79861Q2131J59329J65324p5125k87118
16666C8768204j06111L02608M16386J44298m2180J12443K54635P6123j32471n063
16656C9788872K29667J42603j18287p0820K22757J99438k43242m96683j75956
16647C9478349K71729K57682r3672k34272m5205R3823l1005j92715j43395M4601
16637C9405920J58144J22640j493j32101j88088j25107j5622Q010o5577j04287
16627C9062439k8836P6858J02835N6717K667n1609j22474j71605j46384n7674
16617C8722934M8999J51002K13925J73331N0678J2494J63504L27960K38534m5501
$$ plain form
16607 40057860 39911768 40020889 40427541 40811246 40956324 41022267 41231506 41515224 41666227
16598 41666227 41673632 41673006 41694045 41723572 41917215 42418535 42993494 43212240 43068320 43056809 43480871
16587 43480871 44029262 44293095 44389236 44705727 45230122 45555524 45502637 45351251 45412835 45693346
16577 45693346 46060596 46466697 46877719 47193355 47373516 47511301 47697054 47931887 48217687
16568 48217687 48584432 48985014 49318071 49595852 49928250 50312982 50634721 50908624 51293623
16559 51293623 51789756 52171962 52346487 52525347 52880895 53263324 53473885 53613632 53910491
16550 53910491 54350226 54730429 54975596 55175900 55410794 55734913 56222171 56816980 57275552
16541 57275552 57483198 57685738 58149462 58747897 59191685 59514943 59961421 60505857 60919294
$$ packed form
16607D0057860j46092J09121M06652L83705J45078O5943K09239K83718J51003
16598D1666227P405o26K1039K9527J93643N01320N74959K18746j43920j1511M24062
16587D3480871N48391K63833R6141L16491N24395L25402n2887j51386O1584K80511
16577D5693346L67250M06101M11022L15636J80161J37785J85753K34833K85800
16568D8217687L66745M00582L33057K77781L32398L84732L21739K73903L84999
16559E1293623M96133L82206J74525J78860L55548L82429K10561J39747K96859
16550E3910491M39735L80203K45167K00304K34894L24119M87258N94809M58572
16541E7275552K07646K02540M63724N98435M43788L23258M46478N44436M13437
$$ plain form
16532 60919294 61253008 61788626 62494749 63024010 63336380 63824853 64657071 65487823 66067555
16523 66067555 66648841 67452701 68194329 68599993 69027466 70015199 71426389 72608920 73330220
16514 73330220 74016593 75028547 76192559 77214164 78173327 79363701 80851021 82413141
16506 82413141 83848413 85215696 86763305 88633528 90664590 92596500 94491014 96738284
16498 96738284 99526285 102536958 105384196 108147275 111202383 114701885 118514039 122513143
16490 122513143 126613487 130697390 134885292 139692811 145450310 151703231 157742769 163680869
16482 163680869 170386877 178304899 186982118 195942862 205357650 215482080 225988094 236293837
16474 236293837 246098848 255096733 262520574 267528517 269860779 269687721 267012122 261678361
$$ packed form
16532F0919294L33714N35618P06123N29261L12370M88473Q32218Q30752N79732
16523F6067555N81286Q03860P41628M05664M27473R87733J411190J182531P21300
16514G3330220O86373J011954J164012J021605R59163J190374J487320J562120
16506H2413141J435272J367283J547609J870223K031062J931910J894514K247270
16498I6738284K788001L010673K847238K763079L055108L499502L812154L999104
16490A22513143M100344M083903M187902M807519N757499O252921O039538N938100
16482A63680869O706008P918022Q677219Q960744R414788J0124430J0506014J0305743
16474B36293837R805011Q997885P423841N007943K332262j73058k675599n333761
$$ plain form
16466 261678361 253845400 244042308 232852060 220876799 208843858 197319942 186387671
16459 186387671 175940019 166165163 157375569 149512146 142261147 135575822 129642375 124394374
16451 124394374 119524674 114963046 110885416 107238904 103723561 100299932 97256896 94680126
16443 94680126 92284498 89882053 87587925 85432155 83201016 80844828 78649383 76806481
16435 76806481 75164857 73567857 72064282 70623339 69053378 67407898 66051674 65082281
16427 65082281 64111791 62901768 61773673 61041998 60468108 59695630 58844155 58201235 57656931
16418 57656931 56949995 56201098 55677768 55252465 54622134 53880125 53337972 52942527 52419710
16409 52419710 51853382 51532210 51322328 50820258 50092440 49610878 49418705 49027116 48269364
$$ packed form
16466B61678361p832961r803092j1190248j1975261j2032941j1523916j0932271
16459A86387671j0447652r774856q789594p863423p250999o685325n933447n248001
16451A24394374m869700m561628m077630l646512l515343l423629l043036k576770
16443I4680126k395628k402445k294128k155770k231139k356188k195445j842902
16435G6806481j641624j597000j503575j440943j569961j645480j356224r69393
16427F5082281r70490j210023j128095p31675n73890p72478q51475o42920n44304
16418E7656931p06936p48897n23330m25303o30331p42009n42153l95445n22817
16409E2419710n66328l21172k09882n02070p27818m81562j92173l91589p57752
$$ plain form
16400 48269364 47611878 47405884 47412576 47304890 47088662 46787020 46272492 45684159 45424875 45428449
16390 45428449 45069642 44221048 43700804 44032040 44388228 43647677 42096597 41097053 41189228
16381 41189228 41504280 41189118 40515055 40192752 40270210 40235027 39827096 39279782 38924541 38864725
16371 38864725 38937068 38833078 38392748 37853448 37594963 37584319 37388587 36862538 36446703 36515475
16361 36515475 36761833 36622701 36106676 35743798 35768356 35809355 35505981 35048400 34850683 34921367
16351 34921367 34886897 34577334 34265317 34229710 34342858 34302660 34103378 33981522 33963409 33820986
16341 33820986 33526718 33370135 33448572 33425713 33097722 32834810 33009750 33281863 33049954 32463194
16331 32463194 32273726 32649245 32883269 32530565 32103901 32184126 32461729 32306621 31846430
$$ packed form
16400D8269364o57486k05994O692j07686k16228l01642n14528n88333k59284L574
16390D5428449l58807q48594n20244L31236L56188p40551j551080r99544R2175
16381D1189228L15052l15162o74063l22303P7458l5183m07931n47314l55241n9816
16371C8864725P2343j03990m40330n39300k58485j0644j95732n26049m15835O8772
16361C6515475K46358j39132n16025l62878K4558M0999l03374m57581j97717P0684
16351C4921367l4470l09563l12017l5607J13148m0198j99282j21856j8113j42423
16341C3820986k94268j56583P8437k2859l27991k62912J74940K72113k31909n86760
16331C2463194j89468L75519K34024l52704m26664Q0225K77603j55108m60191
$$ plain form
16322 31846430 31721772 31995265 32083899 31759122 31479703 31567653 31689311 31458296 31063194 30918981
16312 30918981 31029872 31083976 30978306 30890589 30915759 30924425 30784024 30534339 30320019 30233417
16302 30233417 30215281 30097137 29819044 29596077 29710400 30103234 30362623 30204449 29789505
16293 29789505 29457617 29329175 29311993 29330171 29355012 29323879 29216171 29137095 29168819 29208846
16283 29208846 29107335 28903361 28778366 28819628 28952089 29053504 29028159 28832907 28543602 28331014
16273 28331014 28271218 28262528 28220710 28228275 28359895 28496717 28483610 28354293 28230217 28125166
16263 28125166 28037094 28079767 28284701 28420119 28287654 28061041 28009239 28027598 27848646 27605252
16253 27605252 27673416 27964517 27946944 27499111 27161735 27282084 27458496 27227397 26824990 26764564
$$ packed form
16322C1846430j24658K73493Q8634l24777k79419Q7950J21658k31015l95102j44213
16312C0918981J10891N4104j05670q7717K5170Q666j40401k49685k14320q6602
16302C0233417j8136j18144k78093k22967J14323L92834K59389j58174m14944
16293B9789505l31888j28442j7182J8178K4841l1133j07708p9076L1724M0027
16283B9208846j01511k03974j24995M1262J32461J01415k5345j95252k89305k12588
16273B8331014n9796q690m1818P565J31620J36822j3107j29317j24076j05051
16263B8125166q8072M2673K04934J35418j32465k26613n1802J8359j78952k43394
16253B7605252O8164K91101j7573m47833l37376J20349J76412k31099m02407o0426
$$ plain form
16243 26764564 27018267 27172188 27138221 27131701 27106919 26824078 26425789 26345190 26584889 26650344
16233 26650344 26337572 26065613 26210561 26567680 26745446 26703553 26597422 26423563 26163242
16224 26163242 26025975 26190930 26455681 26452528 26126084 25762815 25635901 25801136 26121306 26325504
16214 26325504 26194563 25846962 25652290 25707601 25680191 25404797 25285814 25695362 26264756 26331190
16204 26331190 25936806 25762299 26074199 26386953 26326812 26205067 26401172 26694146 26662400 26392656
16194 26392656 26304698 26485234 26659229 26706266 26774551 26919154 27004879 26978784 26926402 26859955
16184 26859955 26752378 26759033 27048359 27385571 27288871 26732463 26301872 26413348 26727891 26683643
16174 26683643 26340665 26241242 26539079 26766582 26564440 26213802 26186986 26457631 26594142 26402850
$$ packed form
16243B6764564K53703J53921l3967o520k4782k82841l98289q0599K39699O5455
16233B6650344l12772k71959J44948L57119J77766m1893j06131j73859k60321
16224B6163242j37267J64955K64751l153l26444l63269j26914J65235L20170K04198
16214B6325504j30941l47601j94672N5311k7410k75394j18983M09548N69394O6434
16204B6331190l94384j74507L11900L12754o0141j21745J96105K92974l1746k69744
16194B6392656q7958J80536J73995M7037O8285J44603Q5725k6095n2382o6447
16184B6859955j07577O655K89326L37212r6700n56408m30591J11476L14543m4248
16174B6683643l42978r9423K97837K27503k02142l50638k6816K70645J36511j91292
$$ plain form
16164 26402850 26124520 25990496 25920501 25796136 25755647 25953823 26182772 26065346 25634692 25404795
16154 25404795 25718922 26270969 26506146 26337279 26165525 26243770 26358625 26241336 26001761
16145 26001761 25935419 26077983 26208179 26213333 26195278 26215393 26178266 26039671 25923214 25905475
16135 25905475 25844904 25587399 25239060 25053352 25090412 25162321 25115675 25002206 24926005 24867823
16125 24867823 24748132 24569778 24408712 24320380 24321903 24409059 24522712 24552923 24453310 24313156
16115 24313156 24246795 24247271 24215557 24097575 23927889 23780651 23740184 23855232 24037860 24087721
16105 24087721 23936835 23783944 23815441 23875827 23672147 23289223 23172578 23481433 23780767 23629557
16095 23629557 23227494 23123859 23419447 23676010 23627747 23544697 23697824 23828100 23505746 22836921
$$ packed form
16164B6402850k78330j34024o9995j24365m0489J98176K28949j17426m30654k29897
16154B5404795L14127N52047K35177j68867j71754P8245J14855j17289k39575
16145B6001761o6342J42564J30196N154j8055K0115l7127j38595j16457j7739
16135B5905475o0571k57505l48339j85708L7060P1909m6646j13469p6201n8182
16125B4867823j19691j78354j61066q8332J523Q7156J13653L0211r9613j40154
16115B4313156o6361M76l1714j17982j69686j47238m0467J15048J82628M9861
16105B4087721j50886j52891L1497O0386k03680l82924j16645L08855K99334j51210
16095B3629557m02063j03635K95588K56563m8263q3050J53127J30276l22354o68825
$$ plain form
16085 22836921 22408092 22521578 22840114 22914961 22766427 22700171 22760087 22714293 22533749 22505480
16075 22505480 22748598 22944728 22802909 22552893 22620770 22934356 22973129 22538856 22049806 21898617
16065 21898617 21915555 21782519 21655825 21915366 22443692 22666413 22355892 21946355 21886928 22057689
16055 22057689 22079541 21911617 21815520 21894325 22000134 22038121 22064526 22080256 21993390 21840231
16045 21840231 21810337 21954028 22057553 21937300 21703297 21576939 21569217 21529742 21444915 21464280
16035 21464280 21616185 21710772 21618909 21478135 21478950 21569308 21551228 21400270 21281702 21256235 21186885
16024 21186885 21006696 20889753 21025314 21341039 21580038 21580695 21388882 21178042 21144672 21377172
16014 21377172 21717844 21856709 21682765 21440340 21414464 21586989 21754067 21833380 21844208 21723472
$$ packed form
16085B2836921m28829J13486L18536P4847j48534o6256N9916m5794j80544k8269
16075B2505480K43118J96130j41819k50016O7877L13586L8773m34273m89050j51189
16065B1898617J6938j33036j26694K59541N28326K22721l10521m09537n9427J70761
16055B2057689K1852j67924r6097P8805J05809L7987K6405J5730q6866j53159
16045B1840231k9894J43691J03525j20253k34003j26358p722l9475q4827J9365
16035B1464280J51905R4587r1863j40774Q15R0358j8080j50958j18568k5467o9350
16024B1186885j80189j16943J35561L15725K38999O57j91813k10840l3370K32500
16014B1377172L40672J38865j73944k42425k5876J72525J67078P9313J0828j20736
$$ plain form
16004 21723472 21434904 21172877 21170562 21360619 21505440 21587662 21741561 21873057 21762539 21526106
15994 21526106 21502968 21639631 21516786 21120204 20990960 21332248 21571098 21254638 20838199
15985 20838199 20983507 21496956 21667345 21382322 21155209 21168484 21059315 20692709 20436205
15976 20436205 20509952 20672050 20732579 20821211 20947777 20853269 20546066 20448343 20704722 20856151
15966 20856151 20562515 20170548 20132547 20278459 20154649 19762942 19467620 19412228 19490629 19673789
15956 19673789 19909413 19918899 19582605 19326405 19591966 20085413 20144839 19763192 19592321 19895139
15946 19895139 20163985 19978124 19636158 19599332 19775408 19764764 19511144 19307651 19321424 19438410
15936 19438410 19495988 19432972 19262376 19052832 18887389 18762586 18615900 18477879 18440830 18454943
$$ packed form
16004B1723472k88568k62027k315J90057J44821Q2222J53899J31496j10518k36433
15994B1526106k3138J36663j22845l96582j29244L41288K38850l16460m16439
15985B0838199J45308N13449J70389k85023k27113J3275j09169l66606k56504
15976B0436205P3747J62098O0529Q8632J26566r4508l07203r7723K56379J51429
15966B0856151k93636l91967l8001J45912j23810l91707k95322n5392P8401J83160
15956A9673789K35624R486l36294k56200K65561M93447N9426l81647j70871L02818
15946A9895139K68846j85861l41966l6826J76076j0644k53620k03493J3773J16986
15936A9438410N7578o3016j70596k09544j65443j24803j46686j38021l7049J4113
$$ plain form
15926 18454943 18368799 18215961 18202938 18328600 18307951 18023762 17761348 17778411 17906750 17856000
15916 17856000 17696933 17714822 17906536 17957566 17705562 17365412 17248821 17415150 17632220 17617321
15906 17617321 17344638 17120774 17231017 17515846 17544663 17267172 17143639 17435178 17743190
15897 17743190 17609224 17253210 17227331 17531199 17630684 17315743 16986069 16988876 17162611 17218205
15887 17218205 17159191 17097140 16993328 16831514 16767393 16859840 16892599 16708275 16509097 16572256
15877 16572256 16839249 17034584 17040146 16905188 16626966 16199295 15791510 15607740 15605382 15584171
15867 15584171 15516620 15556881 15739158 15902045 15932894 15880993 15799621 15673613 15546550 15524589
15857 15524589 15582324 15543183 15347708 15181300 15213538 15344628 15361236 15250090 15182713 15225400
$$ packed form
15926A8454943q6144j52838j3023J25662k0649k84189k62414J7063J28339n0750
15916A7856000j59067J7889J91714N1030k52004l40150j16591J66329K17070j4899
15906A7617321k72683k23864J10243K84829K8817k77491j23533K91539L08012
15897A7743190j33966l56014k5879L03868R9485l14941l29674K807J73735N5594
15887A7218205n9014o2051j03812j61814o4121R2447L2759j84324j99178O3159
15877A6572256K66993J95335N562j34958k78222m27671m07785j83770k358k1211
15867A5584171o7551M0261J82277J62887L0849n1901q1372j26008j27063k1961
15857A5524589N7735l9141j95475j66408L2238J31090J6608j11146o7377M2687
$$ plain form
15847 15225400 15242965 15120805 14931581 14805646 14757854 14757182 14867536 15138427 15390177 15338634
15837 15338634 15005231 14778667 14907229 15131341 15072802 14827595 14808943 15058106 15154412 14914506
15827 14914506 14732212 14945982 15238448 15079868 14546512 14226560 14372900 14599333 14492921
15818 14492921 14156414 13980789 14133411 14441900 14631296 14557645 14316157 14171849 14271864
15809 14271864 14434660 14390313 14201224 14196397 14463818 14692133 14611582 14322365 14054581 13869855
15799 13869855 13775793 13876975 14175701 14424589 14423129 14299776 14275089 14322795 14316864 14328225 14466323
15788 14466323 14582338 14483874 14329141 14412517 14622390 14552106 14167979 13906518 13991101 14102569
15778 14102569 13950188 13765950 13908448 14276278 14481014 14410182 14262210 14143042 13971410
$$ packed form
15847A5225400J7565j22160j89224j25935m7792o72J10354K70891K51750n1543
15837A5338634l33403k26564J28562K24112n8539k45207j8652K49163R6306k39906
15827A4914506j82294K13770K92466j58580n33356l19952J46340K26433j06412
15818A4492921l36507j75625J52622L08489J89396p3651k41488j44308J00015
15809A4271864J62796m4347j89089m827K67421K28315q0551k89217k67784j84726
15799A3869855r4062J01182K98726K48888j460j23353k4687M7706n931J1361J38098
15788A4466323J16015r8464j54733Q3376K09873p0284l84127k61461Q4583J11468
15778A4102569j52381j84238J42498L67830K04736p0832j47972j19168j71632
$$ plain form
15769 13971410 13733410 13528426 13376851 13240190 13209765 13409105 13708325 13810313 13665237
15760 13665237 13538504 13589675 13639486 13487997 13243607 13151921 13247742 13368714 13421988 13448734
15750 13448734 13458608 13370406 13149496 12902719 12783850 12824791 12874568 12732404 12395921 12157007
15740 12157007 12333793 12869402 13322911 13346201 13058436 12827662 12788567 12765758 12630863 12501313
15730 12501313 12512339 12584081 12567900 12507225 12557996 12681854 12633706 12332228 12064328 12147913
15720 12147913 12481074 12641862 12441042 12159188 12147390 12384863 12585278 12587063 12438153 12211251
15710 12211251 11980098 11908905 12085302 12283344 12199493 11950983 11985883 12391022 12681984 12510493
15700 12510493 12194985 12184705 12333001 12209445 11909321 11921757 12230666 12225862 11688640 11236311
$$ packed form
15769A3971410k38000k04984j51575j36661l0425J99340K99220J01988j45076
15760A3665237j26733N1171M9811j51489k44390r1686R5821J20972N3274K6746
15750A3448734R874q8202k20910k46777j18869M0941M9777j42164l36483k38914
15740A2157007J76786N35609M53509K3290k87765k30774l9095k2809j34895j29550
15730A2501313J1026P1742j6181o0675N0771J23858m8148l01478k67900Q3585
15720A2147913L33161J60788k00820k81854j1798K37473K00415J785j48910k26902
15710A2211251k31153p1193J76397J98042q3851k48510L4900M05139K90962j71491
15700A2510493l15508j0280J48296j23556l00124J2436L08909m804n37222m52329
$$ plain form
15690 11236311 11420368 11899505 12007809 11760238 11686489 11878015 11874033 11509137 11243837 11438691
15680 11438691 11794712 11835936 11595145 11449200 11493757 11474135 11264339 11067029 11092039 11281365
15670 11281365 11436864 11458959 11374538 11240014 11108894 11046351 11101405 11252148 11392163 11397198
15660 11397198 11249499 11092683 11091472 11222099 11299128 11245227 11196837 11248419 11245979 11020378 10722014
15649 10722014 10676508 10922510 11140185 11090283 10895883 10790866 10799226 10807040 10772766 10692351 10510780
15638 10510780 10274809 10242456 10583306 11038913 11159241 10873288 10553181 10476998 10521836 10499689
15628 10499689 10501047 10680978 10917465 10959581 10802789 10655059 10595514 10526256 10437484 10451960
15618 10451960 10569969 10614160 10503379 10368672 10310910 10254307 10153971 10133627 10250963 10318673
$$ packed form
15690A1236311J84057M79137J08304k47571p3749J91526l982l64896k65300J94854
15680A1438691L56021M1224k40791j45945M4557j9622k09796j97310K5010J89326
15670A1281365J55499K2095q4421j34524j31120o2543N5054J50743J40015N035
15660A1397198j47699j56816j211J30627P7029n3901m8390N1582k440k25601k98364
15649A0722014m5506K46002K17675m9902j94400j05017Q360P814l4274q0415j81571
15638A0510780k35971l2353L40850M55607J20328k85953l20107p6183M4838k2147
15628A0499689J358J79931K36487M2116j56792j47730n9545o9258q8772J4476
15618A0451960J18009M4191j10781j34707n7762n6603j00336k0344J17336O7710
$$ plain form
15608 10318673 10174710 9981252 10005779 10206662 10310170 10247906 10222040 10323319 10388266 10323516
15598 10323516 10283915 10366482 10377655 10136902 9830176 9784145 9984921 10110054 10023071 9949547
15588 9949547 10082970 10259382 10193295 9901368 9701872 9812616 10082221 10165522 9918984 9570932
15578 9570932 9466733 9660314 9855541 9815463 9702035 9824350 10120151 10170977 9795935 9344030
15568 9344030 9218838 9359553 9460592 9508749 9729117 10072381 10175967 9913592 9612283 9557417
15558 9557417 9603821 9504527 9337256 9299234 9302402 9144814 8951577 9032197 9322372 9385598 9064831
15547 9064831 8761359 8879352 9283977 9544436 9505751 9366989 9316975 9331161 9291675 9150522
15537 9150522 8992029 8993174 9226351 9465025 9380740 9027226 8869134 9136155 9430364 9301324
$$ packed form
15608A0318673j43963j93458K4527K00883J03508o2264k5866J01279O4947o4750
15598A0323516l9601Q2567J1173k40753l06726m6031K00776J25133q6983p3524
15588I949547J33423J76412o6087k91927j99496J10744K69605Q3301k46538l48052
15578I570932j04199J93581J95227m0078j13428J22315K95801N0826l75042m51905
15568I344030j25192J40715J01039M8157K20368L43264J03586k62375l01309n4866
15558I557417M6404r9294j67271l8022L168j57588j93237Q0620K90175O3226l20767
15547I064831l03472J17993M04625K60459l8685j38762n0014J4186l9486j41153
15537I150522j58493J145K33177K38674q4285l53514j58092K67021K94209j29040
$$ plain form
15527 9301324 8974225 9043551 9542794 9846824 9577640 9115974 8995952 9197244 9347211 9326488
15517 9326488 9308561 9362690 9367819 9270977 9159966 9090260 9041814 9027722 9069805 9089878 8986334
15506 8986334 8797061 8645892 8564959 8509107 8490605 8537931 8573597 8518813 8484174 8647575 8942390
15495 8942390 9084825 8957600 8763450 8715396 8759732 8731233 8638327 8631517 8755227 8877139
15485 8877139 8860627 8715911 8570267 8542981 8657974 8838921 8963438 8932215 8727497 8447859
15475 8447859 8264821 8267491 8342178 8299451 8141687 8076962 8213072 8397636 8472907 8517683 8658160
15464 8658160 8796626 8770886 8661652 8648928 8644528 8418300 8082174 8058864 8466248 8892005
15454 8892005 8953872 8767061 8641059 8608193 8530937 8438812 8444142 8491005 8490656 8557369 8790370
$$ packed form
15527I301324l27099O9326M99243L04030k69184m61666j20022K01292J49967k0723
15517I326488j7927N4129N129r6842j11011o9706m8446j4092M2083K0073j03544
15506H986334j89273j51169q0933n5852j8502M7326L5666n4784l4639J63401K94815
15495H942390J42435j27225j94150m8054M4336k8499r2906o810J23710J21912
15485H877139j6512j44716j45644k7286J14993J80947J24517l1223k04718k79638
15475H447859j83038K670P4687m2727j57764o4725J36110J84564P5271M4776J40477
15464H658160J38466k5740j09234j2724m400k26228l36126k3310M07384M25757
15454H892005O1867j86811j26002l2866p7256r2125N330M6863l49O6713K33001
$$ plain form
15443 8790370 8959935 8790862 8485425 8540234 9010446 9369630 9227755 8815479 8558403 8505097
15433 8505097 8458633 8413642 8503252 8644145 8601449 8395178 8318767 8484472 8624014 8476497
15423 8476497 8167703 8029684 8178209 8446317 8643944 8696275 8580787 8331301 8101832 8037428
15413 8037428 8069334 8034776 8006712 8228356 8635605 8777080 8433139 8009723 7982444 8205703
15403 8205703 8211929 8006295 8008734 8267957 8362280 8180296 8152606 8448759 8572365 8180947
15393 8180947 7759063 7909680 8395109 8526013 8214585 7960090 7959013 7929950 7775335 7739311
15383 7739311 7854826 7856943 7742661 7820865 8080047 8108082 7817774 7646449 7795130 7878512
15373 7878512 7651870 7488918 7714477 7999841 7921660 7667602 7647928 7786688 7759130 7617732
$$ packed form
15443H790370J69565j69073l05437N4809M70212L59184j41875m12276k57076n3306
15433H505097m6464m4991Q9610J40893m2696k06271p6411J65705J39542j47517
15423H476497l08794j38019J48525K68108J97627N2331j15488k49486k29469o4404
15413H037428L1906l4558k8064K21644M07249J41475l43941m23416k7279K23259
15403H205703O226k05634K439K59223R4323j81984k7690K96153J23606l91418
15393H180947m21884J50617M85429J30904l11428k54495j077k9063j54615l6024
15383G739311J15515K117j14282P8204K59182K8035k90308j71325J48681Q3382
15373G878512k26642j62952K25559K85364p8181k54058j9674J38760k7558j41398
$$ plain form
15363 7617732 7614023 7662881 7554795 7469828 7698162 8052542 8156431 8118975 8264729 8365063
$$ packed form
15363G617732l709M8858j08086q4967K28334L54380J03889l7456J45754J00334
$$ [...]
##END NTUPLES=NMR SPECTRUM
##END=
