##TITLE=1H ikalashn
K-324-1
25.11.2024
##JCAMPDX= 6.0         $$ Bruker NMR JCAMP-DX V2.0
##DATA TYPE= NMR SPECTRUM
##DATA CLASS= NTUPLES
##ORIGIN= UXNMR, Bruker Analytische Messtechnik GmbH
##OWNER= root
$$ TOPSPIN		Version 1.3
$$ 2024-11-25 10:33:04.375 +0400  Irina@DPX200
$$ Compression mode = diff/dup
##.OBSERVE FREQUENCY= 200.131300845
##.OBSERVE NUCLEUS= ^1H
##.ACQUISITION MODE= SIMULTANEOUS
##.ACQUISITION SCHEME= undefined
##.AVERAGES= 64
##.DIGITISER RES= 18
##SPECTROMETER/DATA SYSTEM= spect
##.PULSE SEQUENCE= zg
##.SOLVENT NAME= DMSO
##.SHIFT REFERENCE= INTERNAL, DMSO, 1, 17.49637
##AUDIT TRAIL= $$ (NUMBER, WHEN, WHO, WHERE, WHAT)
$$ ##TITLE= Audit trail, TOPSPIN		Version 1.3
$$ ##JCAMPDX= 5.01
$$ ##ORIGIN= Bruker BioSpin GmbH
$$ ##OWNER= Irina
$$ $$ F:/spectra/data/iren/nmr/1H/4/pdata/1/auditp.txt
$$ ##AUDIT TRAIL=  $$ (NUMBER, WHEN, WHO, WHERE, VERSION, WHAT)
(   1,<2024-11-25 10:32:30.578 +0400>,<Irina>,<DPX200>,<TOPSPIN 1.3>,
      <created by zg
	started at 2024-11-25 10:28:17.312 +0400,
	POWCHK disabled, PULCHK disabled
       configuration hash MD5:
       BE 6D 3F 07 2A EA 11 49 91 17 2B D3 AF B3 58 0D
       data hash MD5: 16K
       57 58 90 78 22 2B 53 6A 6B D9 C4 B8 0E 3A B6 8A>)
(   2,<2024-11-25 10:32:32.968 +0400>,<Irina>,<DPX200>,<TOPSPIN 1.3>,
      <Start of raw data processing
       efp BC_mod = 2 LB = 0.02 FT_mod = 6 PKNL = 1 PHC0 = 97.09374 PHC1 = 8.257627 SI = 32K 
       data hash MD5: 32K
       C2 18 3D B6 1E CF 8F AC CA 8E FA C8 8B 9A 60 D4>)
(   3,<2024-11-25 10:32:38.125 +0400>,<Irina>,<DPX200>,<TOPSPIN 1.3>,
      <apk 
       data hash MD5: 32K
       19 23 B9 AF 28 6E 3B A8 CF 42 0E EB DC C6 B7 03>)
(   4,<2024-11-25 10:32:51.968 +0400>,<Irina>,<DPX200>,<TOPSPIN 1.3>,
      <pk fgphup PHC0 = -0.6 PHC1 = 0 
       data hash MD5: 32K
       82 51 2E EE 3B 10 7D 2F 30 ED A5 E9 F5 1B B4 C0>)
(   5,<2024-11-25 10:32:54.265 +0400>,<Irina>,<DPX200>,<TOPSPIN 1.3>,
      <abs n ABSG = 5 
       data hash MD5: 32K
       9B 90 61 5C B1 16 F2 47 BE A1 DA 05 17 E9 B2 F7>)
$$ ##END=
$$ 
$$ $$ hash MD5
$$ $$ 16 A5 8C FD C1 F6 32 36 59 09 90 88 0D 37 4F B8
##$RELAX= 
##$RELAX= 
##$RELAX= 
##$RELAX= 
##$RELAX= 
##$RELAX= 
##$RELAX= 
##$RELAX= 
##$RELAX= 
$$ Bruker specific parameters
$$ --------------------------
##$DU= <F:/spectra>
##$EXPNO= 4
##$NAME= <1H>
##$PROCNO= 1
##$TYPE= <nmr>
##$USER= <iren>
##$AMP= (0..31)
100 100 100 100 100 100 100 100 100 100 100 100 100 100 100 100 100 100 
100 100 100 100 100 100 100 100 100 100 100 100 100 100 
##$ANAVPT= -1
##$AQSEQ= 0
##$AQ_mod= 1
##$AUNM= <au_zg>
##$AUTOPOS= <>
##$BF1= 200.13
##$BF2= 200.13
##$BF3= 200.13
##$BF4= 200.13
##$BF5= 200.13
##$BF6= 200.13
##$BF7= 200.13
##$BF8= 200.13
##$BYTORDA= 1
##$CFDGTYP= 0
##$CFRGTYP= 5
##$CHEMSTR= <none>
##$CNST= (0..63)
1 1 145 1 1 1 1 1 1 1 1 1 1 1 1 1 1 1 1 1 1 1 1 1 1 1 1 1 1 1 1 1 1 1 
1 1 1 1 1 1 1 1 1 1 1 1 1 1 1 1 1 1 1 1 1 1 1 1 1 1 1 1 1 1 
##$CPDPRG= <>
##$CPDPRG1= <>
##$CPDPRG2= <>
##$CPDPRG3= <>
##$CPDPRG4= <mlev>
$$ [...]
##$SW_h= 4401.40845070422
##$TD= 16384
##$TD0= 1
##$TE= 300
##$TE2= 300
##$TE3= 300
##$TEG= 300
##$TL= (0..7)
0 120 120 120 120 120 120 120 
##$TP= (0..7)
150 150 150 150 150 150 150 150 
##$TP07= 0
##$TPNAME0= <>
##$TPNAME1= <>
##$TPNAME2= <>
##$TPNAME3= <>
##$TPNAME4= <>
##$TPNAME5= <>
##$TPNAME6= <>
##$TPNAME7= <>
##$TPOAL= (0..7)
0.5 0.5 0.5 0.5 0.5 0.5 0.5 0.5 
##$TPOFFS= (0..7)
0 0 0 0 0 0 0 0 
##$TUNHIN= 0
##$TUNHOUT= 0
##$TUNXOUT= 0
##$USERA1= <user>
##$USERA2= <user>
##$USERA3= <user>
##$USERA4= <user>
##$USERA5= <user>
##$V9= 5
##$VALIST= <valist>
##$VCLIST= <CCCCCCCCCCCCCCC>
##$VD= 0
##$VDLIST= <DDDDDDDDDDDDDDD>
##$VPLIST= <PPPPPPPPPPPPPPP>
##$VTLIST= <TTTTTTTTTTTTTTT>
##$WBST= 1024
##$WBSW= 25
##$XGAIN= (0..3)
0 0 0 0 
##$XL= 0
##$YL= 0
##$YMAX_a= 3154579
##$YMIN_a= -2515381
##$ZGOPTNS= <>
##$ZL1= 120
##$ZL2= 120
##$ZL3= 120
##$ZL4= 120
##$ABSF1= 17.49637
##$ABSF2= -4.496376
##$ABSG= 5
##$ABSL= 3
##$ALPHA= 0
##$AQORDER= 0
##$ASSFAC= 0
##$ASSFACI= 0
##$ASSFACX= 0
##$ASSWID= 0
##$AUNMP= <proc_1d>
##$AXLEFT= 0
##$AXRIGHT= 0
##$AXTYPE= 0
##$AXUNIT= <>
##$AZFE= 0.1
##$AZFW= 0.1
##$BCFW= 0
##$BC_mod= 2
##$BYTORDP= 0
##$COROFFS= 0
##$CY= 7568.61572265625
##$DATMOD= 1
##$DC= 0
##$DFILT= <>
##$DTYPP= 0
##$F1P= 17.9538593292236
##$F2P= -4.03888763876832
##$FCOR= 0.5
##$FTSIZE= 32768
##$FT_mod= 6
##$GAMMA= 0
##$GB= 0
##$INTBC= 0
##$INTSCL= 5.656564e-011
##$ISEN= 128
##$LB= 0.02
##$LEV0= 0
##$LPBIN= 0
##$MAXI= 945.577
##$MC2= 0
##$MEAN= 0
##$ME_mod= 0
##$MI= -402.1523
##$NCOEF= 0
##$NC_proc= -2
##$NLEV= 6
##$NOISF1= 8.587773
##$NOISF2= 6.764455
##$NSP= 0
##$NTH_PI= 0
##$NZP= 0
##$OFFSET= 17.49637
##$PC= 1
##$PHC0= 113.9091
##$PHC1= 9.38271
##$PH_mod= 1
##$PKNL= yes
##$PPARMOD= 0
##$PPDIAG= 0
##$PPIPTYP= 0
##$PPMPNUM= 100
##$PPRESOL= 1
##$PSCAL= 0
##$PSIGN= 0
##$REVERSE= no
##$SF= 200.13
##$SI= 32768
##$SIGF1= 16.12182
##$SIGF2= -4.496377
##$SINO= 3.521527
##$SIOLD= 32768
##$SREGLST= <1H.CDCl3>
##$SSB= 0
##$STSI= 32768
##$STSR= 0
##$SW_p= 4401.40845070422
##$SYMM= 0
##$S_DEV= 0
##$TDeff= 16384
##$TDoff= 0
##$TI= <>
##$TILT= no
##$TM1= 0
##$TM2= 0
##$TOPLEV= 0
##$USERP1= <user>
##$USERP2= <user>
##$USERP3= <user>
##$USERP4= <user>
##$USERP5= <user>
##$WDW= 1
##$XDIM= 32768
##$YMAX_p= 385928761
##$YMIN_p= -141386
$$ End of Bruker specific parameters
$$ ---------------------------------
##NTUPLES= NMR SPECTRUM
##VAR_NAME=  FREQUENCY,     SPECTRUM/REAL,   SPECTRUM/IMAG
##SYMBOL=    X,             R,               I
##VAR_TYPE=  INDEPENDENT,   DEPENDENT,       DEPENDENT
##VAR_FORM=  AFFN,          ASDF,            ASDF
##VAR_DIM=   32768,         32768,           32768
##UNITS=     HZ,            ARBITRARY UNITS, ARBITRARY UNITS
##FACTOR=    0.134324425510551, 1,           1
##FIRST=     4401.40845070422, 73182,        -199504
##LAST=      0,             23587,           -237508
##MIN=       0,             -141386,         0
##MAX=       4401.40845070422, 385928761,    0
$$ Real data points
##PAGE= N=1
##DATA TABLE= (X++(R..R)), XYDATA
$$ [...]
14884i5368k1828K0715M1579K5443P221N275M496l160p383m654q86M380J0457
14871a3713N400j1723j7024K286J8905M096k5045l2049j6055k839J882R315J2769
14858f3795J20j0024Q298L5726K7676j4249m1396l1995j3989n526J1406L8503
14846e9245L8559j013l0430p349L2907K7806j6839l7990j2429J3910K487k1730
14834g1356j5961J3467K5114P137q991j141R735l661k6731k1362J4184L7522K2829
14821a9215k653l632R184K089k3158l2973j7065P0M207Q773J9202J7727j073j3432
14807e1949m246P785L559n206j021P852N733k148m283n871j3174j5414o782l831
14793h8996j3828j1461J8735M2813K3738j4047j7650J0919K1695J353j1581j418
$$ plain form
14884 -95368 -117196 -96481 -54902 -29459 -22238 -16963 -12467 -15627 -23010 -27664 -28550 -24170 -13713
14871 -13713 -8313 -20036 -37060 -34774 -15869 -11773 -36818 -68867 -84922 -87761 -85879 -76564 -63795
14858 -63795 -63675 -73699 -65401 -29675 -1999 -16248 -57644 -89639 -103628 -109154 -97748 -59245
14846 -59245 -20686 -21699 -52129 -59478 -26571 1235 -15604 -53594 -66023 -52113 -49626 -71356
14834 -71356 -87317 -73850 -48736 -41599 -50590 -51731 -41996 -45657 -72388 -93750 -79566 -42044 -19215
14821 -19215 -21868 -25500 -16316 -14227 -37385 -70358 -87423 -87353 -83146 -74373 -55171 -37444 -38517 -51949
14807 -51949 -56195 -48410 -44851 -50057 -51078 -43226 -37493 -39641 -43924 -49795 -62969 -78383 -85165 -88996
14793 -88996 -102824 -114285 -95550 -52737 -28999 -43046 -60696 -49777 -28082 -26729 -38310 -39728
14781c9728J37j7865j8036J3069K6533r599m6388k6711K1182K9604P9q652J4553
14768f1822K0270p275k2042j689J2529n490j5881J2056L4428M848l5497j5749
14756h1314M5170N9889O244m3113l6534j0203r181j2772J2811M2110L0245r335
14744e983k5890r914L743j066p026n890p391p402P013K0744N454k5276k4773J2487
14730g1170L4619Q864l0993l8284j4656R903K2619K4207J0912j0009j5109k043
14718g1140j468k3576k9163Q333M7635L5460r862k5995o67J9807R797m887p58
14705d6484Q571M351q583j7060j5710l540J1266Q830j2610j8456J4147M8175L5026
14692G923o027j6919K789J102k7141k9353L579J4063j4795j9814K6480N0790o64
$$ plain form
14781 -39728 -39591 -57456 -75492 -62423 -35890 -45489 -91877 -118588 -97406 -67802 -67723 -76375 -61822
14768 -61822 -41552 -48827 -70869 -72558 -60029 -65519 -81400 -69344 -34916 -30068 -65565 -81314
14756 -81314 -36144 23745 29989 -13124 -49658 -59861 -69042 -81814 -69003 -26893 3352 -5983
14744 -5983 -31873 -41787 -38044 -39110 -46136 -52026 -59417 -66819 -59806 -39062 -33608 -58884 -83657 -71170
14730 -71170 -36551 -27687 -58680 -96964 -111620 -101717 -79098 -54891 -43979 -53988 -69097 -71140
14718 -71140 -72608 -96184 -125347 -117014 -69379 -33919 -43781 -69776 -70443 -50636 -40839 -45726 -46484
14705 -46484 -37913 -33562 -42145 -59205 -74915 -78455 -67189 -58359 -70969 -89425 -75278 -27103 7923
14692 7923 1896 -15023 -12234 -11132 -38273 -67626 -64047 -49984 -64779 -84593 -58113 -7323 -7987
14679g987n7623l1160L9681N0139l825l2477n764J3289p324j8297J0795L3813
14667a6740J2090j8362j1563J3980J4481q260k1198j4591k956N670J0034M466
14655c2949q349j2029j788N826K200N56P477Q919p70n778k7M07p962m303J3992
14640c4578J5728j1148k9733j0610J7796J5270m850k439J9843K3494j93j8696
14628b0116j1682L759O542K2n68R951K1090J4590j4335l8062k1084K3744L5486
14615I337j1488n7753l4605L5065O4533K2352l0733l0390J2250L8728J9344k0115
14603A6525l4838j2442J2160J80l3502l3567J3066M7278K2138k2707k0959J8276
14591b8392L1846O175j1968l041K99j5344j7825N680K0820Q185m626l60m936k9913
$$ plain form
14679 -7987 -65610 -96770 -57089 -6950 -10775 -43252 -49016 -35727 -43051 -61348 -50553 -16740
14667 -16740 -4650 -23012 -34575 -20595 -6114 -14374 -35572 -50163 -53119 -47449 -37415 -32949
14655 -32949 -41298 -53327 -55115 -49289 -47089 -46533 -39056 -30137 -30907 -36685 -36712 -36305 -44267 -48570 -34578
14640 -34578 -18850 -29998 -59731 -70341 -52545 -37275 -42125 -44564 -24721 -1227 -1420 -20116
14628 -20116 -31798 -28039 -21497 -21475 -22043 -12092 8998 23588 9253 -28809 -49893 -26149 9337
14615 9337 -2151 -59904 -94509 -59444 5089 27441 -3292 -33682 -21432 17296 36640 16525
14603 16525 -18313 -30755 -18595 -18415 -51917 -85484 -72418 -25140 -3002 -25709 -46668 -28392
14591 -28392 3454 9629 -2339 -5380 -5081 -20425 -38250 -32570 -11750 -3565 -8191 -8551 -13487 -43400
14577d3400l6660K51L9928L1898q853k8327r038K0175K9746J3416j4870k6479
14565c2213l681K6195J6507k5960m1224q447J9933Q106l598K2040M3939J3643
14553C5240l1501k5004J7290K5837q046k9999k0397j2070j5542n400J6078J5092
14541c8422o798r301J4643K6631J0297r104j7616k4999k2823N186L0425Q181l7823
14528g1523l7198J3101L9942J3962r924M056J8931Q120K482J3986K542l4410l2680
14515f8613K1945M4681r852n6701j5945N1355M6462o820k2008l350j2135l1555
14503f2536j436M6453K8390l3871l7515K2086M0476j2187m0580N577M6479J5410
14491A6746l2477k5356J1012J8926O497O910Q753o193j5400l303K140j0395m506
$$ plain form
14577 -43400 -80060 -79809 -39881 -7983 -16836 -45163 -54201 -34026 -4280 9136 -5734 -32213
14565 -32213 -35894 -9699 6808 -19152 -60376 -68823 -48890 -40784 -44382 -22342 21597 35240
14553 35240 3739 -21265 -3975 21862 13816 -16183 -36580 -48650 -64192 -69592 -53514 -38422
14541 -38422 -45220 -54521 -39878 -13247 -2950 -12054 -29670 -54669 -77492 -72306 -41881 -33700 -71523
14528 -71523 -108721 -95620 -55678 -41716 -51640 -47584 -28653 -20533 -18051 -4065 -1523 -35933 -68613
14515 -68613 -46668 -1987 -11839 -68540 -84485 -33130 13332 6512 -15496 -18846 -30981 -62536
14503 -62536 -63972 -17519 10871 -23000 -60515 -38429 2047 -10140 -50720 -45143 1336 16746
14491 16746 -15731 -41087 -30075 -11149 -4652 2258 11011 4818 -10582 -13885 -11745 -22140 -26646
14478b6646K6792K7822k0250m7248q522L0741O713k7670K811N5492L8035l3294
14466B4776o2021k7025N655Q079J6044L6397L3051O772m444l210k1259l8087p353
14453c2625M3116M1928m2q000J3953j0798o8969n0126N4403R7992L174j00523
14441a6517p0821L5005P0354K5823N03J4172K398l3700k3550K9884L9653j5598
14429E7606n2242k1551J9166J5640N64J6246L3632J0529k8398l1885k647J7036
14417C3696J3146O341Q383J0896P651R70o505j0340n500J756j529j2714j5270
14404C0981o529m03K96O711J5756J0571m968n702J2596K4418J6716M506m021j8096
14390H2832l0107j6387J2680J3290j9509l3671l885K3546J0657n460J7377M2416
$$ plain form
14478 -26646 146 27968 7718 -39530 -48052 -17311 -10598 -38268 -35457 20035 58070 24776
14466 24776 -37245 -64270 -58615 -50536 -34492 1905 34956 41728 37284 34074 12815 -25272 -32625
14453 -32625 10491 52419 52377 44377 58330 47532 -21437 -71563 -17160 80832 84006 -16517
14441 -16517 -87338 -52333 18021 43844 44347 58519 60917 27217 3667 33551 73204 57606
14429 57606 5364 -16187 2979 18619 19183 35429 69061 79590 51192 19307 16660 33696
14417 33696 46842 53183 61566 72462 80113 81083 74578 64238 58738 60494 58965 46251 30981
14404 30981 24452 24049 24345 31056 46812 57383 52415 46713 59309 83727 100443 104949 100928 82832
14390 82832 52725 36338 49018 62308 42799 9128 5243 28789 39446 33986 51363 93779
14378I3779J2953m3177n0605o333K2287J1407N653K2185J6691k8176n7215k6023
14366b6574L0450N4865M2345J7378j5294m9708n2131r329L0675K1253q452j601
14354C3877K7947J6835l6124n6772j0349M0483K8589k0566l3511L607L5902K5136
14342E5054n597j7468p208L212L094q55k555k643p67L845M300q157k5948k5663
14328b7356J558K8897K1815j3129k9695l206L0917K3387j7239l2639K798M2605
14316B8713L1716j6465l9620j3412J8726J1629j8920k4809K182K2160R997r026
14304B871k943J5609J1963j2030j9401J809J8325N429j3428o652J3559J4357j180
14291B8288k311J2206J0619j3741k6338r534N617p436k2774m380L0480L4006l20
$$ plain form
14378 93779 106732 63555 12950 6617 28904 40311 45964 68149 84840 56664 -551 -26574
14366 -26574 3876 58741 101086 118464 103170 53462 1331 -7998 22677 43930 35478 33877
14354 33877 61824 78659 42535 -14237 -24586 15897 44486 23920 -9591 -5984 29918 55054
14342 55054 49457 31989 24781 27993 31087 30232 27677 25034 24267 28112 32412 24255 -1693 -27356
14328 -27356 -25798 3099 24914 11785 -17910 -21116 9801 33188 15949 -16690 -13892 28713
14316 28713 60429 43964 4344 -9068 9658 21287 2367 -22442 -20260 1900 11897 2871
14304 2871 -72 15537 27500 15470 -3931 -2122 16203 21632 8204 1552 15111 29468 28288
14291 28288 25977 38183 48802 35061 8723 -811 4806 -2630 -25404 -29784 696 34702 34382
14278C4382l1486l1162j0486J1807K8738L0110P702j7492j2720J1876Q982k9267
14266I84m8046j2528L2747L1120R21k029J9251J3566k1507k9523N289K2347j6270
14253c678n4411k4152M4480O3127J4068k9500j5367J8576J3003k2932l2301J569
14241b7518L2551J9580j6658k4189Q309L5673J7363k6606m2008j4235J4398Q352
14229a4988j1903q508J1776J2898n388m809K3633L6419M758l4456l1087K826J4826
14216d003n420j5602N224K2452N879j8195r610J9240K2538n828k3883r649N671
14203a1186q537l0332j8708K1432M3650K3827j2046k6960j3763R243K1373J0954
14191H947j5794l0581j0251K4632K7369n520j9304J6686M9912J7260n0023o1482
$$ plain form
14278 34382 2896 -28266 -38752 -26945 1793 31903 39605 22113 9393 21269 30251 984
14266 984 -47062 -59590 -26843 4277 5198 3169 22420 35986 14479 -15044 -9755 12592 -3678
14253 -3678 -58089 -82241 -37761 25366 39434 9934 -5433 13143 26146 3214 -29087 -27518
14241 -27518 5033 24613 7955 -16234 -7925 27748 45111 18505 -23503 -37738 -23340 -14988
14229 -14988 -26891 -35399 -23623 -10725 -16113 -20922 2711 39130 43888 9432 -21655 -18829 -4003
14216 -4003 -9423 -25025 -19801 2651 8530 -9665 -19275 -35 22503 16675 -7208 -16857 -11186
14203 -11186 -19723 -50055 -68763 -47331 -3681 20146 8100 -18860 -32623 -23380 -2007 8947
14191 8947 -6847 -37428 -47679 -23047 4322 -1198 -20502 -3816 46096 63356 13333 -48149
14179d8149l143L7909O535l6824j5697L9157M0139j6637m6141p055M1253L6502
14167B7849l25j5662o401k541m466O931J9479N427k0661j4834K1920L4896l026
14154D8586m7523m6596j0528J5249J9062K4301L6349L0593l530l8688m1417r741
14142b3883K8937M4733K6150j2978m2201l9198j0332J7746K4820J0412j1823k2685
14130a0302r236J7486K5339k19k9886k6684M70J1500l18K82K5959L7478M696l8593
14116G972l6825J0969N2246M7765P610l2601m5931k8599q13J0330Q22q239o722
14103b2016r581k0590j5813J0181J9814n791k0128J7093N7854L1313l2391l7024
14091b7079K3816M9897l094n0332k0239K7376O736m6947l7541L1402O3474K0859
$$ plain form
14179 -48149 -51292 -13383 -6848 -43672 -59369 -20212 19927 3290 -42851 -49906 -8653 27849
14167 27849 27524 11862 5461 2920 -1546 5385 24864 30291 9630 -5204 16716 51612 48586
14154 48586 1063 -45533 -56061 -40812 -21750 2551 38900 69493 65963 27275 -14142 -23883
14142 -23883 5054 49787 75937 62959 20758 -18440 -28772 -11026 13794 24206 12383 -10302
14130 -10302 -19538 -2052 23287 23068 -6818 -33502 -33032 -21532 -21850 -21568 4391 41869 46565 7972
14116 7972 -28853 -17884 34362 82127 89737 57136 11205 -17394 -18207 -7877 -7055 -15294 -22016
14103 -22016 -31597 -52187 -68000 -57819 -38005 -43796 -63924 -46831 11023 42336 9945 -27079
14091 -27079 -3263 46634 43540 -6792 -27031 345 7081 -39866 -77407 -46005 17469 38328
14079C8328l0576l3156q046N296Q207J3395J2388J335k798N131N798o787j0070
14066a555P339K3405J7021l509j9321k2411j0235J3355K6864J0745j8472k5683
14054b457q937K951K173O555J2625k862k8201k1739J5019L0199O813r648M544
14041G035R534j6853k8116O409L4087M826l5358j7805L0041L0834j0845k1061
14029g272J4387L1917L856k2078j3517j138j0445j8001n505M656j899k566J3478
14016a4127J9075M1j5796q256K876J086J759J1648Q919q408n928K3001L1093n225
14002D1758l6765j9201J2423N958j7071k957L5409L7476l774l3163k2300o96O124
13989C221R305J6955J4775Q99m079M262M276j0921j8768n222J4850K4653K2558
$$ plain form
14079 38328 7752 -25404 -33450 -28154 -19947 -6552 5836 7171 4373 9504 15302 8515 -1555
14066 -1555 5784 29189 46210 42701 23380 969 -9266 4089 30953 41698 23226 -2457
14054 -2457 -11394 -8443 -6270 285 12910 10048 -18153 -39892 -24873 5326 12139 2491 7035
14041 7035 16569 -284 -28400 -21991 12096 16922 -18436 -36241 -6200 24634 13789 -7272
14029 -7272 7115 39032 42888 20810 7293 6155 -4290 -22291 -27796 -23140 -25039 -27605 -14127
14016 -14127 4948 4989 -10807 -19063 -16187 -15101 -13342 -1694 7225 -1183 -7111 15890 46983 41758
14002 41758 4993 -14208 -1785 4173 -12898 -15855 19554 57030 53256 20093 -2207 -2903 3221
13989 3221 12526 29481 44256 45155 41076 45338 49614 38693 19925 14703 29553 54206 76764
13976G6764P326k0291l7075j6659K3091L2370N59k6581j7058L918M799j169R270
13963C9264J9939M444k0172j6784P671R561k0056l6994j0635K7882K9666k411
13951C1375j9873R45K6247J5669j7025k3149O879K5699N15l1974j7890K8222L9711
13938F5351k374l8932k1087J8456J8801j6992l0366L700M2153L5926o825l6924
13926C0887k5917N941J8664j643k8729k6909O971L8323L4054m38l0134l0595r961
13913a9486P605J0441O374N614N640j329j1353j1642j362N825O180J3966L1378
13900D7851L1563l529m5022m9602k0119L282P178J6211L6823L8131O870k2441
13888D7196j9354k505j795q792r94J1788O324q215n409R061M606k1630l6668j9174
$$ plain form
13976 76764 84090 63799 26724 10065 33156 65526 66085 39504 22446 26364 31163 29994 39264
13963 39264 59203 63647 43475 26691 34362 43923 23867 -13127 -23762 4120 33786 31375
13951 31375 11502 12447 38694 54363 37338 14189 21068 46767 47282 15308 -2582 25640 65351
13938 65351 62977 24045 2958 21414 40215 23223 -7143 -3443 38710 74636 67811 30887
13926 30887 4970 10911 29575 27932 -797 -27706 -20735 17588 51642 51204 21070 -9525 -19486
13913 -19486 -11881 -1440 4934 10548 16188 14859 3506 -8136 -9498 -3673 2507 16473 47851
13900 47851 79414 75885 30863 -18739 -38858 -35576 -28398 -12187 24636 62767 69637 47196
13888 47196 27842 25337 23542 14750 13756 25544 31868 23653 18244 27305 31911 10281 -26387 -45561
13874d5561J3714L0631J7022j5736l5856j6381K6790M0532M048l0929q772M2496
13862B1998M6637n968m1968j5080K8061K2823k0337m0195j3750K2858L2065J7281
13850E4425M122K356j467j8017l1672j6761J9284L2297J454l1065j7050K0813
13838A8719K1519j3265j7384K8331N4089P786n7844o0549p179K6754J0043j7073
13826f053j9001o535K227J0697K0162J7289Q28q741Q07J6476K0865J0522q607
13813E0936k4256j9530M437J4516j3567m6309k7556L4128O3515K3239k8829k1965
13801H759K7169M4561O161l6985l6483k953K3677K4128O058j3496j7945k375J5010
13788D5286J0711q209r742J1420J7857j2418m0900j9609L0791M2296k183m2381
$$ plain form
13874 -45561 -31847 -1216 15806 70 -35786 -52167 -25377 15155 19203 -11726 -20498 21998
13862 21998 68635 62667 20699 5619 33680 56503 36166 -4029 -17779 5079 37144 54425
13850 54425 58547 60903 59436 41419 9747 -7014 12270 44567 46021 14956 -2094 18719
13838 18719 40238 26973 9589 37920 92009 99795 41951 -18598 -25777 977 11020 -6053
13826 -6053 -25054 -31589 -29362 -18665 1497 18786 19614 10873 11680 28156 49021 59543 50936
13813 50936 26680 7150 11587 26103 12536 -33773 -61329 -27201 36314 59553 30724 8759
13801 8759 35928 80489 86650 49665 13182 10229 33906 58034 64092 50596 32651 30276 45286
13788 45286 55997 47788 38046 49466 67323 54905 14005 -5604 25187 67483 65300 22919
13776B2919k8625J0532K0238J514k740J7483K7474O859k2125l1498j9727L8J6098
13763A8440J6725j693k0255j5858M565J4642J1494J4363K1190Q990j6774k0506
13751C5323K271J1816p340j7422L894K0786N568p018J5117L2911P7m5919l5696
13738A4368J6249L2327l974l0715j5674K918j857l429J3310J7408m776j5914N817
13725B6058K3643M776k4275k4511k749J3477J8315J2702r989l3236j9937K3489
13713G763L9292Q835j1959Q808J7389k5553n6925j1330N2732L5522l6711m8723
13701b0860J6512N5136J6035k7283j2706J6725R262m862J1955K2816j1160m2993
13689B8577j2224M3557M1968r571k7225J1240L5480K867l5074k2040J3769J0903
$$ plain form
13776 22919 -5706 4826 25064 26578 23838 41321 68795 75654 53529 22031 2304 2342 18440
13763 18440 35165 33472 13217 -2641 1924 16566 28060 42423 63613 72603 55829 35323
13751 35323 37594 49410 42070 24648 28542 49328 54896 47878 62995 95906 95983 50064 14368
13738 14368 30617 62944 58970 28255 12581 15499 13642 10213 23523 40931 36155 20241 26058
13725 26058 49701 54477 30202 5691 2942 16419 34734 47436 37447 4211 -15726 7763
13713 7763 47055 55890 43931 52739 70128 44575 -12350 -23680 29052 64574 27863 -20860
13701 -20860 -4348 50788 66823 39540 26834 43559 52821 47959 59914 82730 71570 28577
13689 28577 16353 59910 101878 92307 65082 76322 111802 114669 79595 57555 71324 82227
13677H2227k6918m0295n280L6252L9854J2144j3190k3463k7377k5042p273J8380
13665B0019K9080J9862J0223Q692j123k3264k9570m474J9478Q908j2417n23L2236
13652G7127L4583J819j8974j1137q760k2512j6442J5339K1172j8168m1210k812
13640A0025M3239K7608k1010k6297J0527K5101O254M151K7321K4556j7824m5931
13628F7720k9501o572p266n338J6560K2016r946l0821L479N1695M4350j0214m1097
13615F5065j8237J8802K8646J3537l703q477J013R876m843l5812l6098J5146O1082
13602A05997L3440m3572p6470k9360L4701N0354K5916n6j8346k8686j2463K6834
13590F8289L8378n760m8101j7140N8306P7487J0539n8242n1026L018K7321R071
$$ plain form
13677 82227 55309 15014 9734 45986 85840 97984 84794 61331 33954 8912 1639 20019
13665 20019 49099 68961 79184 87876 86753 63489 33919 29445 48923 57831 45414 44891 77127
13652 77127 111710 113529 94555 83418 74658 52146 35704 51043 72215 54047 12837 10025
13640 10025 53264 80872 59862 33565 44092 69193 75447 79598 106919 131475 113651 67720
13628 67720 38219 31647 24381 19043 35603 57619 47673 16852 20331 72026 116376 106162 65065
13615 65065 46828 65630 94276 107813 104110 95633 96646 106522 101679 65867 29769 44915 105997
13602 105997 139437 95865 19395 -9965 24736 75090 101006 100950 82604 53918 41455 68289
13590 68289 106667 100907 52806 35666 93972 171459 181998 123756 72730 75748 103069 112140
13578A12140m152P606J2138j1358l4513k4092Q397K5309J4276j477J130J6743
13566A22147K2346P426j2518j3168Q949K8217J7149j9095m4061l0680N919K5813
13554A18444J3047o010j369J5474P306k7549m0637j434M6435L7749j7500m2912
13542A01044q131K7014J0224k0054l586L5962K9963j5855k8109R826L0976L294
13530A72568j5027J6560M0466l071o4617n4977J5701N7846L8989J0702N823j254
13518B19709k0648j8461J0834J7946j8216m4905j6254L4410M9966L1281J3805
13507B59467K086j7365k7807m921K9810L2857O275q083L663J3378M553n461k936
13494B85516K296K856N635R683L828p210n943K957l861k1715j5134K0678L7362
$$ plain form
13578 112140 107988 115594 127732 116374 81861 57769 66166 91475 105751 104274 105404 122147
13566 122147 144493 151919 139401 126233 135182 163399 180548 161453 117392 86712 92631 118444
13554 118444 131491 125481 124112 139586 146892 119343 78706 77272 123707 161456 143956 101044
13542 101044 92913 119927 130151 110097 106511 142473 172436 156581 128472 138298 169274 172568
13530 172568 157541 174101 214567 211496 146879 91902 107603 165449 204438 215140 220963 219709
13518 219709 199061 180600 191434 209380 191164 146259 130005 164415 214381 245662 259467
13507 259467 261553 244188 216381 211460 241270 274127 280402 272319 275982 289360 293913 288452 285516
13494 285516 287812 290668 296303 305986 309814 302604 296661 299618 295757 274042 258908 279586 316948
13481C16948L194l9957l1831J7110M0905J4924j3871l539K2374J8217j2921k9083
13469C02470j4111O522J2422J4109K2750K5854J1734n722r161o328j2481j9818
13457C28240j1882L996Q945P414J5656K2882M622k6324k7977L978K4637J0693
13445C64880n615K362J0010o920k0545J104L0123J8586k1351l4929r723J2600
13433C40582O114q948r030K675J3845J6207K067k0752k0636J4174M0162J4595
13421C91055l0259k9728Q618J7261j4675k2723J6083L6709j855m0619j8251K4319
13409C35935J3684l1915l4344J5545M6402J9727k0317k2701L717J9673J0695p749
13397C48352j5625o195Q007P094p772j1367M956J2799p714k8287j5026J2872J2607
$$ plain form
13481 316948 320142 280185 248354 265464 306369 321293 307422 303883 326257 344474 331553 302470
13469 302470 288359 294881 307303 321412 344162 370016 381750 376028 366867 360539 348058 328240
13457 328240 316358 320354 329299 336713 352369 375251 379873 353549 325572 329550 354187 364880
13445 364880 359265 361627 371637 364717 344172 345276 375399 393985 372634 337705 327982 340582
13433 340582 346696 337748 328718 331393 345238 361445 363512 342760 322124 336298 376460 391055
13421 391055 360796 331068 339686 356947 342272 319549 335632 372341 370486 329867 311616 335935
13409 335935 349619 317704 283360 298905 345307 365034 344717 322016 325733 345406 356101 348352
13397 348352 332727 326532 334539 341633 333861 322494 327450 340249 332535 304248 289222 302094 314701
13384C14701j1001j4943R853K8498K3285J3321Q765l763k0988j7996K747O404
13372C38883j2608j4278J6192L2489J069l3720j1466M6403O1833J4869k7914j3197
13360C98555K3591J7290k6953m2499k776L8873L1513M240J5809N3534M7584j3378
13348E45383n2377j8644L4188L5438O729J2800M3934L5644j0988k3125K1513N6017
13336F86512L5170K965P010J7863q716m5510l6654R207L3676J6880o882j1737
13324F99784p454o431o125p143j6219k8295l0128k1731j5098j4982j6939j7895
13312E11344j5869r222n507j4087k1793l120L1369L2249j6805n9494l8718J9561
13300D09908M1274O713l1510k9511m722K244j5922l1616k1142O516J8734k34k2650
$$ plain form
13384 314701 303700 288757 298610 327108 350393 363714 372479 368716 347728 329732 332479 338883
13372 338883 326275 311997 328189 360678 361747 328027 316561 362964 424797 439666 411752 398555
13360 398555 422146 439436 412483 369984 367208 406081 437594 441834 457643 511177 558761 545383
13348 545383 493006 474362 508550 543988 550717 563517 607451 643095 632107 608982 630495 686512
13336 686512 721682 724647 731657 749520 740804 695294 658640 667847 701523 718403 711521 699784
13324 699784 692330 685899 679774 672631 656412 628117 597989 576258 561160 546178 529239 511344
13312 511344 495475 486253 480746 466659 444866 441746 473115 505364 488559 429065 390347 409908
13300 409908 451182 457895 426385 396874 392152 394396 378474 346858 325716 332232 350966 350732 328082
13287C28082j0374K7372M1691J5098j5797k2408k1037k4769j2668J7599K2942
13276C45731j1741l0135N910M0382J1559l7078k6494K0857K1111k2298k8877R814
13264B98741J6751k4279l5278J2246M1855Q718k2400J928K9593M450l1620k1925
13252B78780K042r150k2003J3123N4668L1865l1032n3294k5984m196o82J4189
13240B48326K8702O071k9175j9233K0599K1992j3405j4295K9656M3830j675m0217
13228B81176k3541M684k181j4548O437L2116J8417j8087l4068k6919j7672n515
13216B00299J3359J8241M30q026J4188L3204J2982k2001k6755p965l219j3066
13204B11671q937Q282J2083K435K842J1155K874j7767j8500L583J1169j3151l5309
$$ plain form
13287 328082 317708 345080 386771 401869 386072 363664 342627 317858 305190 322789 345731
13276 345731 333990 303855 309765 350147 361706 324628 298134 318991 340102 317804 288927 298741
13264 298741 315492 291213 255935 268181 310036 318754 296354 298282 327875 332325 300705 278780
13252 278780 280822 271672 249669 262792 317460 349325 318293 264999 239015 234819 234137 248326
13240 248326 277028 283099 253924 234691 255290 277282 263877 249582 279238 323068 321393 281176
13228 281176 257635 262319 260138 245590 252027 284143 302560 284473 250405 223486 205814 200299
13216 200299 213658 231899 232329 224303 238491 271695 284677 262676 235921 227956 224737 211671
13204 211671 202734 211016 223099 225534 228376 239531 242405 224638 206138 209721 220890 207739 172430
13191A72430k0162J5272K5937K175j7408M79L5123L4649j2357n1648l1302K2588
13179A75776L6856n771m2829k5075J5439K1050q122k7223j5852P039J9947J5524
13167A66759m274k1145q525K6386L6509K640k7289r235K3467J4441k0070k0380
13155A59284J2385K0836n687j6046N548J0662k0520l6790n343K7297J4390j1683
13143A54333L60K9371J9335k2455l6021n969J7652Q91k6140k0142J4920M0072
13131A66207L2367M462j7673k2827j8521j2204M49J9306K4305Q4k9714k4762J3049
13118A34528L8570K8514P888j418j2633l1632l0687K27K0582J378k1754r054J0452
13105A34961q706l7077j1561M8661N6982l475m5267q298N0403M5317j6628n8733
$$ plain form
13191 172430 152268 167540 193477 195652 178244 178723 213846 248495 236138 184490 153188 175776
13179 175776 212632 206861 164032 138957 154396 175446 167324 140101 124249 131288 151235 166759
13167 166759 162485 141340 132815 159201 195710 198350 171061 161826 185293 199734 179664 159284
13155 159284 171669 192505 186818 170772 176320 186982 166462 129672 124329 151626 166016 154333
13143 154333 154693 184064 203399 180944 144923 138954 156606 157497 131357 111215 126135 166207
13131 166207 198574 203036 185363 162536 144015 131811 132260 151566 175871 175955 146241 121479 134528
13118 134528 173098 201612 209500 208082 195449 163817 133130 133357 153939 155317 133563 124509 134961
13105 134961 126255 89178 77617 126278 183260 179785 134518 126220 176623 221940 205312 146579
13093A46579m2192J720K8601K6063P936o017n175K627J924o921j0297p291q244
13080A29313p180J1173L3390K6774m357j7481j557L788j7987k4810Q226L4304
13068A73596Q462l3620l3378n223l117k1777j0118L2288N1774L0941Q286L765
13056B01879m331k0454j9183l015m766k0103q959K1674J6278k5039k9316K3291
13044A27956M8235q115o8020l9386L7352N5834P145k6133r207J3182J1863N658
13032A56364J10k0833l9073j7989K3007K7456k498j0901Q976O765k0650j6600
13020I4134K1573K2158k9513m8635L363M0809R65l6662J4274Q2545M5965n6938
13008A54038p4469J8437Q0349K2986o6118p1467r470K9756K1017P262J1161J3808
$$ plain form
13093 146579 104387 106107 134708 160771 168707 162690 157515 160142 162066 155145 144848 137557 129313
13080 129313 122133 133306 166696 193470 189113 171632 170075 173863 155876 131066 139292 173596
13068 173596 182058 148438 115060 109837 106720 84943 74825 107113 158887 189828 198114 201879
13056 201879 197548 177094 157911 154896 150130 130027 121068 142742 159020 133981 104665 127956
13044 127956 176191 168076 100056 60670 98022 153856 161001 134868 125661 138843 150706 156364
13032 156364 156474 135641 96568 78579 101586 129042 126544 115643 124619 131384 110734 94134
13020 94134 115707 137865 108352 59717 63080 103889 104854 68192 82466 165011 210976 154038
13008 154038 79569 98006 178355 201341 135223 63756 54286 84042 105059 112321 123482 137290
12996A37290K624r788r689J515J0912O483m298K987K7033K2887l1030p3225l3387
12983E0314M8889O5329J208m2044j0235K3766n025m2337j8160K6312J6026k0646
12971I3397n636M2772L8819j7625l9282k959J7211j1626k4687J5744M4219M687
12959A55034m6779l0956K5067L3689j4798m5093j6257K7118L1291L006j6723j0748
12947I3851L852N198q004j5439R92K9869L8092J3793j5056j8548l730L586m26
12934A28030j84O651O013o054j6931j7715j1330p89J3111K1825J3899o392j8747
12921A11387j0297Q846J6965L473j9825k8190r271J9346K6897P184j3493j3175
12909I9847k138k17l505L860J6234J2808n682j4768n133L106m170r890N048K5468
$$ plain form
12996 137290 139914 130126 120437 121952 132864 139347 135049 138036 165069 187956 156926 83701 50314
12983 50314 99203 164532 165740 123696 113461 137227 132202 89865 71705 98017 114043 93397
12971 93397 87761 130533 169352 151727 112445 109486 126697 115071 90384 106128 150347 155034
12959 155034 108255 77299 102366 136055 121257 76164 59907 87025 118316 121322 104599 93851
12947 93851 97703 102901 94897 79458 80450 110319 148411 162204 147148 128600 124870 128456 128030
12934 128030 127846 134497 140510 134456 117525 99810 88480 87691 100802 122627 136526 130134 111387
12921 111387 101090 109936 126901 130374 110549 82359 73088 92434 119331 126515 113022 99847
12909 99847 97709 97492 93987 97847 114081 126889 121207 106439 101306 104412 100242 90352 95400 120868
12895A20868K0807o792k0875k392K1022J3103j9853l8529k5158k840M019K855
12883F6235J1418K4101K3249J0640J047p517k6402m1449k1667K7522N4675K7723
12871A49575j8172k6770L691K4607R379j3662q652J5423K0548m012k4990j0832
12859A16133K2429L0201J204k4529j2041J7092J6176j7477l8886j9117K0124M0932
12847A52241K9935q37k6605k0424J8066M3375J2519m4145n0367N277M5098J6637
12835A80770l0193k6496J1042K1218N53p252M537N417n456l290L011j3380l1009
12822A09472o014L8507L1774k6768n4514j3664L2169K5931J519R347K8081J3813
12810A89653j7602k4106j2515j5241k3602p155K3436L1697J6312L981j891j4396
$$ plain form
12895 120868 141675 134883 114008 111616 132638 145741 125888 87359 62201 59361 63380 66235
12883 66235 77653 101754 125003 135643 136690 129173 102771 61322 39655 67177 121852 149575
12871 149575 131403 104633 108324 132931 142310 128648 119996 135419 155967 151955 126965 116133
12859 116133 138562 168763 169967 145438 133397 150489 166665 149188 110302 91185 111309 152241
12847 152241 182176 181339 154734 134310 152376 195751 208270 164125 113758 119035 164133 180770
12835 180770 150577 124081 135123 156341 156894 149642 154179 159596 154140 150850 153861 140481 109472
12822 109472 103458 141965 173739 146971 92457 78793 110962 136893 138412 147759 175840 189653
12810 189653 172051 147945 135430 120189 96587 89432 112868 144565 160877 164858 162967 148571
12798A48571k2098p037J1128K362j5839m138K5393K3522j0866k3909N657L3345
12786A66091K2513l562r781k477l153o696k74M187q897k3820j2526K0581L9978
12773A82164K3786j1707l3957k8613q149Q489J7437K5345K8761J5902p611j8256
12761A93591j2069j5088l5539l7241L998M6468L5273j0025k0204J6352L6129J891
12749B03536m0577l5133N532K9160J6660r278k3211j5809O583K0503M268k6375
12737A35859k8001R444M2403L3872J148k0044k5255k5880j6089R113K8077K1209
12725A65856N307N315J1946K982j2192q607P516P854r667j8491o110J2015J8751
12712A82475J0469p294j7472O32L6137M0648p666n6094l9905K1821M7174N333
$$ plain form
12798 148571 126473 119436 130564 132926 117087 112949 138342 161864 150998 127089 132746 166091
12786 166091 188604 185042 175261 172784 169631 162935 162661 166848 157951 134131 121605 142186 182164
12773 182164 205950 194243 160286 131673 123524 132013 149450 174795 203556 219458 211847 193591
12761 193591 181522 166434 130895 93654 97652 144120 179393 169368 149164 165516 201645 203536
12749 203536 162959 127826 133358 162518 179178 169900 146689 130880 137463 157966 162234 135859
12737 135859 107858 117302 159705 193577 194725 174681 149426 123546 107457 116570 144647 165856
12725 165856 171163 176478 188424 191406 179214 170607 178123 185977 176310 157819 151709 163724 182475
12712 182475 192944 185650 168178 168810 204947 245595 237929 181835 141930 163751 210925 216258
12700B16258m6221m7668q613K4937L1711J8716k931k0204j8876j149J4284J8981
12688A79225K0750J8926K274k1969k9244j7772j3046j9649p881L0895N5603L3295
12676B31407q418k3681j4384j1787j5424l86K5435K4673m973j8782O008L1575
12664B21263J6915j9121k8501p879J363j5761k1358J2335M9958L9305q618l0890
12652B09011l195K7853J8889q283j1438K180k885k2927k2699n31R518J159N136
12639B01788K4656J9661k0686m4538j3159L5182M1581J1048q327l824k133j0434
12627B30815p978O078N948j3071k2155n856J3671J3779M155N698J7395K1008P217
12614B76704j4203k4612j4380M077P052p351j0296J5223L8714K0539k3482l6770
$$ plain form
12700 216258 170037 122369 113756 138693 170404 189120 186189 165985 147109 145960 160244 179225
12688 179225 199975 218901 221175 199206 169962 152190 139144 119495 111614 142509 198112 231407
12676 231407 222989 199308 184924 173137 157713 157327 182762 207435 202462 183680 189688 221263
12664 221263 238178 219057 190556 182677 184040 168279 146921 159256 209214 248519 239901 209011
12652 209011 205816 233669 252558 244275 232837 235017 232132 209205 186506 185975 195493 196652 201788
12639 201788 226444 246105 225419 180881 167722 202904 244485 255533 247206 243382 241249 230815
12627 230815 222837 228915 234863 221792 199637 193781 207452 221231 225386 231084 248479 269487 276704
12614 276704 262501 237889 223509 227586 234638 227287 216991 232214 270928 291467 267985 231215
12602B31215m203K4186Q250k4394k5472P73J1401n745j9507r688N976Q188O123
12589B07103J3512J9826Q453j2503k1482j5208n436O582K3925K9030K490l1281
12577B25011k2719K3171L6796j3112n8229k7426L9397N0477N837j2905J2022R414
12565B67734l9099m8708J9847O9890J7128o1423m2814M1729N7990j1568m6175
12554B24531P646N2369Q078n8037m6698J9523M5369Q740k7668k0294J1522L2785
12542B57866L0032P846j5695j9282o614n043j9194j8629O701K0151p09j9912j814
12529B15704K5367J5528j7387k3137L773K1474P874j7325l0475k4121M46K5595
12517B03316J8663k2584m7104j5320L6386M4604J0905j0606q21J0015O234L306
$$ plain form
12602 231215 227012 251198 259448 235054 209582 210355 221756 216011 196504 186816 192792 200980 207103
12589 207103 220615 240441 248894 236391 214909 199701 194265 200847 224772 253802 256292 225011
12577 225011 202292 225463 262259 249147 190918 163492 202889 253366 259203 246298 258320 267734
12565 267734 228635 179927 199774 269664 286792 225369 182555 224284 282274 270706 224531
12554 224531 232177 284546 292624 234587 187889 207412 252781 261521 233853 213559 225081 257866
12542 257866 287898 295744 280049 260767 254153 249110 229916 211287 217988 238139 237430 217518 215704
12529 215704 241071 256599 239212 216075 219848 241322 249196 231871 201396 177275 177721 203316
12517 203316 221979 199395 152291 136971 173357 217961 228866 218260 217439 227454 233688 236994
12505B36994L326o564j2770P526K9175N669m3062m2846J8592O2005L3146k0170
12493B71021k8901j131J0499o087k2046k1436r599R662K8414K6977K435j6522
12481B43286q874Q299J1109K990l839r910j0413Q128L0833J7569k8314m4030J89
12468B17023M3759K3853k6152l2293L199J7154m790j5033M175J4059m323j5525
12456B25106O627L5614L6970J4136j0589k5067k1812K272K7483K4775k343k0780
12444B92392j7754j1510q382O660K6832J9271j7082l5923j1997J8410J6973J967
12432B79857O992J6634n557m5166m7596N67M6932M1505k790l3260k0301J8561
12420B56378M5656L9485P018k8293m5333l7219j3933M800P855O797J9984L9022
$$ plain form
12505 236994 240320 233756 220986 228512 257687 263356 220294 177448 196040 258045 291191 271021
12493 271021 242120 240989 251488 245401 223355 201919 192320 201982 230396 257373 259808 243286
12481 243286 234412 242711 253820 256810 252971 243061 232648 240776 271609 289178 260864 216834 217023
12468 217023 260782 284635 258483 226190 229389 246543 241753 226720 230895 244954 240631 225106
12456 225106 231733 267347 304317 318453 307864 282797 260985 263257 290740 315515 313172 292392
12444 292392 274638 263128 254746 261406 288238 307509 290427 254504 242507 260917 277890 279857
12432 279857 286849 303483 297926 252760 205164 205731 252663 294168 291378 258118 237817 256378
12420 256378 302034 341519 348537 320244 274911 237692 223759 228559 236414 243211 263195 302217
12408C02217L1720q402l9849k5668J2337K5048N462j2463j2614r326o462P631
12396B69631K2805J4258p765o999J2246N617k9183l5664P254M0004J5561k1991
12384B85774r706L2386L8404J557k6595k1391n218N749J5959J8379R82j9461j6882
12371B99937r91K162M77J5998L0512J0390k5032k5000O877J6958n983j4817Q051
12358C19539K0622J302j2431L293J4334m324j9263j888J5774J06k0036n488K0674
12345C32214J4855p974l270K0200J5484j7274k8181l11K5306J6955o161j3752
12333C48091n611K061J532o435j4990j0830P790J8517N703p731O450K8475J5720
12320C88742k3309l3170K214L1338J4537j7671j7925O795J7480P424O92L208j922
$$ plain form
12408 302217 333937 325535 285686 260018 272355 297403 302865 290402 277788 268462 262000 269631
12396 269631 292436 306694 298929 291930 304176 309793 280610 244946 252200 292204 307765 285774
12384 285774 276068 308454 346858 348415 321820 300429 295211 300960 316919 335298 336280 316819 299937
12371 299937 298946 301108 301585 317583 348095 358485 333453 308453 315330 332288 326305 311488 319539
12358 319539 340161 341463 329032 332325 346659 342335 323072 321184 336958 337064 317028 311540 332214
12345 332214 347069 339095 335825 356025 371509 354235 326054 325743 351049 368004 361843 348091
12333 348091 342480 344541 346073 339638 324648 313818 321608 340125 345828 338097 344547 373022 388742
12320 388742 365433 332263 334477 365815 380352 362681 344756 351551 369031 376455 377147 380355 378433
12307C78433j6201k0334q101N388J2271K0055K5942J2553j7669l0737n309L0332
12295C86623L2245J312k0246j1097L448j599j0351L059K6646K7515M960r265j574
12282D31676P647K560p476j2943j6405j1737J1641L3285J5702k7780l2353J7878
12270D11695M6829j605o2005l6812M8672P7342J6828l8149j8934K1278J1896k0350
12258D56685j1863K3272K1841j7222l1219L354L6453K3886j3139k7740q672J9907
12246D75543L5467L3272J8213k824k1560k8041j4716J3214L3709K7819O074k086
12234E74084J0159J8117P619q70J0846K3047P640k3840l3287r730J7892K0766
12222F22443K547r437N613L7479M8356J5725k7255k3698K5954N5115K5551j5521
$$ plain form
12307 378433 362232 341898 333797 339185 351456 371511 397453 410006 392337 361600 356291 386623
12295 386623 418868 420180 399934 388837 392285 390686 380335 383394 410040 437555 442515 433250 431676
12282 431676 439323 441883 434407 421464 405059 393322 404963 438248 453950 426170 393817 411695
12270 411695 458524 456919 394914 358102 406774 484116 500944 462795 443861 465139 477035 456685
12258 456685 444822 468094 489935 472713 441494 444848 481301 505187 492048 464308 455636 475543
12246 475543 511010 544282 562495 559671 538111 510070 495354 508568 542277 570096 576170 574084
12234 574084 584243 602360 609979 609109 619955 643002 650642 626802 593515 583785 601677 622443
12222 622443 624990 615553 621166 658645 707001 722726 695471 671773 697727 752842 778393 762872
12210G62872j2533R795m957m1622l5075J7997M9133K6009n540o041K860k218R0
12197G60770K1941K6660o191k9350j112L5741J8802k4913j7882L6065N0516l052
12185H67995m4169j0213M4509L8323q105j1920L3754N1990J2030k1671q4K8764
12173I81203M759l6916j9921M4376O8296K3535j9502o890K2347J3931j3950j4632
12161A046636N346R138p76L515J6574J2884p86j870j150j7503k4701R917N1283
12148A108507L7710j3064k3577J5744L0408r074l6915p503K8479J7341o639J0544
12136A151961M6468M5503J0901j4065j9712k2750j8821O57J6064J5064K2722M6237
12124A280229L8641k0370o0962j9479M9175M8454p821k5570J0014K0305k1175
$$ plain form
12210 762872 750339 760134 755177 713555 678480 696477 745610 771619 766079 760038 762898 760680 760770
12197 760770 782711 809371 803180 773830 772718 808459 827261 802348 784466 820531 871047 867995
12185 867995 823826 813613 858122 896445 888340 876420 910174 962164 974194 952523 952439 981203
12173 981203 985962 949046 929125 973501 1041797 1065332 1045830 1038940 1061287 1075218 1061268 1046636
12161 1046636 1051982 1061120 1060344 1063859 1080433 1093317 1092531 1090661 1089511 1072008 1047307 1057224 1108507
12148 1108507 1146217 1133153 1109576 1125320 1155728 1146654 1109739 1102236 1130715 1148056 1141417 1151961
12136 1151961 1198429 1243932 1254833 1240768 1221056 1198306 1179485 1180142 1196206 1211270 1233992 1280229
12124 1280229 1318870 1298500 1237538 1218059 1267234 1315688 1307867 1282297 1292311 1312616 1291441
12113A291441m4113o519L7266L2145J871q290J392J3307K6138K8829J608l0503
12101A344572j1277N0918P2868J9500l5985k3835J9643K2252r403j5235J7961
12090A451979M8470M8378K5965k606k1840j6113P035J6223L519m87J8203L0214
12078A608940J8478J0694K2624K3181l572j8520L065K0837K597j2329J3242L7910
12066A727147J4317j8801l002L2160K2820j1200n283K7814K5138k488Q337M2616
12054A859575K3187m0062m7790J9980O0936J7735l2246j2785L3683L6323J1836
12043A930372J0767K1960J0800n570L438J6595K387j7684j0126Q571J0448J2128
12031A994086L1933L7648L859k3429N817N2084M1240j5465m0852j4300J0135K904
$$ plain form
12113 1291441 1247328 1240809 1278075 1310220 1312091 1303801 1305193 1318500 1344638 1373467 1375075 1344572
12101 1344572 1333295 1384213 1457081 1476581 1440596 1416761 1436404 1458656 1449253 1434018 1451979
12090 1451979 1500449 1548827 1574792 1572186 1550346 1534233 1541268 1557491 1561010 1560523 1578726 1608940
12078 1608940 1627418 1638112 1660736 1683917 1680345 1661825 1664890 1685727 1688324 1675995 1689237 1727147
12066 1727147 1741464 1722663 1719661 1751821 1774641 1763441 1758158 1785972 1811110 1808622 1816959 1859575
12054 1859575 1882762 1842700 1794910 1814890 1875826 1893561 1861315 1848530 1882213 1918536 1930372
12043 1930372 1941139 1963099 1973899 1968329 1971767 1988362 1990749 1973065 1962939 1971510 1981958 1994086
12031 1994086 2026019 2063667 2067526 2044097 2049914 2101998 2143238 2127773 2086921 2072621 2082756 2085660
12019B085660o028J933L834p809m384K0780L1868J3021l65J7443L4771J2168l1369
12006B171523m1006r42M6079N2945J9529j6102k4224q175J4064L2946M0212K0310
11994B307159k2120m2618p262M5499M6265j698k3882Q440L5997J5635j0655J563
11982B352323K1682J1622J126K1060K8407j3328m1294J2012Q2704N9440k9376
11971B506378n0807J9341O3899K2864k0335K463L3477Q706k5855n862L3293K3921
11959B611483j5060j8183J5891L7214L1421J9785M344j9031k2495J3664M9462
11948B708495L6980n15l913K7733M1637J6863j3814k1315q437J4204L6055L7247
11936B871220J1877q180Q814M3265M9048J9545q353q622Q983K2616K0534O588
$$ plain form
12019 2085660 2079632 2081565 2085399 2077590 2073206 2093986 2125854 2138875 2138510 2155953 2190724 2202892 2171523
12006 2171523 2130517 2129575 2175654 2228599 2248128 2232026 2207802 2199627 2213691 2246637 2286849 2307159
11994 2307159 2285039 2242421 2235159 2280658 2326923 2325225 2301343 2309783 2345780 2361415 2350760 2352323
11982 2352323 2374005 2385627 2386753 2407813 2436220 2422892 2381598 2393610 2476314 2535754 2506378
11971 2506378 2455571 2474912 2538811 2561675 2541340 2543803 2577280 2585986 2560131 2554269 2587562 2611483
11959 2611483 2596423 2578240 2594131 2631345 2662766 2682551 2686895 2667864 2645369 2659033 2708495
11948 2708495 2745475 2744960 2741047 2768780 2810417 2827280 2813466 2792151 2783714 2797918 2833973 2871220
11936 2871220 2883097 2874917 2883731 2926996 2976044 2995589 2987236 2978614 2987597 3010213 3030747 3037335
11924C037335r6J4132K9206J4757j0991M204N5445O8732J5643l0900j0082K8542
11912C215927J4222k2479q787L9288M8248J5029j779N248m148j7819J2658O1410
11900C357018N0385j1994l2501J0131L2246m29j1398M1349P8626L3275l2506l0308
11888C483894J7191L3743J7356J6396K8022J3748j5402j3216K0874M4269L9575
11877C686450K4565J1359K965Q973K4126K0119m863q637K3803M3036J8252o88
11865C849460L1739O7717M2325j1020j3586K7771M1518J8459J4719L8505L7104
11854D144711J360j3967J1098L0889K0575J1623K0325J9711N286J1790L9212L8611
11842D341224N36j8859O665K8966J6367J0435M0937N9800K5444j2672R671O1335
$$ plain form
11924 3037335 3037239 3051371 3080577 3095334 3084343 3088547 3143992 3212724 3228367 3197467 3187385 3215927
11912 3215927 3230149 3207670 3198883 3238171 3286419 3301448 3299669 3304917 3300769 3282950 3295608 3357018
11900 3357018 3407403 3395409 3362908 3373039 3405285 3404856 3393458 3434807 3513433 3546708 3514202 3483894
11888 3483894 3501085 3534828 3552184 3568580 3596602 3610350 3594948 3581732 3602606 3646875 3686450
11877 3686450 3711015 3722374 3725339 3734312 3758438 3778557 3773694 3765057 3788860 3831896 3850148 3849460
11865 3849460 3881199 3948916 3991241 3980221 3966635 3994406 4035924 4054383 4069102 4107607 4144711
11854 4144711 4146071 4132104 4143202 4174091 4194666 4206289 4226614 4246325 4251611 4263401 4302613 4341224
11842 4341224 4341760 4322901 4329566 4358532 4374899 4385334 4426271 4486071 4511515 4498843 4508514 4569849
11830D569849O4495J9239m372J8304L9939L0035J7369K7853L8652K2050l708Q51
11818D840556L7989O5237M8185P510k495L3226O2310L6458j0597o831M5199O7637
11806E224384L2018O445L9383P3965M4908l698J2792P4475Q3201K1017k1341J1246
11794E598795N9598N2893J3332O600M1733P4910P8574N8409K5837k721J711M6083
11782F055754Q5409O9793J6535o323K7979P1074P3041N0463M8842O5904O1216
11771F619687L4243L5118P8720J03271O0112J785J2769P5502R0567L4259J423
11760G147456N4048J17759R9078L2927J9636O3503Q2627N7970N6149R5420J03547
11749G930120M7601L976L7352R2826Q6559M1867M4763R9792J24742Q3248L7404
$$ plain form
11830 4569849 4634344 4653583 4649211 4667515 4707454 4737489 4754858 4782711 4821363 4843413 4839705 4840556
11818 4840556 4878545 4943782 4991967 4999477 4996982 5030208 5092518 5128976 5118379 5111548 5156747 5224384
11806 5224384 5256402 5262847 5302230 5376195 5421103 5417405 5430197 5504672 5587873 5608890 5587549 5598795
11794 5598795 5658393 5711286 5724618 5731218 5772951 5847861 5926435 5984844 6010681 6007960 6009671 6055754
11782 6055754 6141163 6210956 6227491 6221168 6249147 6320221 6393262 6443725 6492567 6558471 6619687
11771 6619687 6653930 6689048 6767768 6871039 6931151 6932936 6945705 7021207 7111774 7146033 7147456
11760 7147456 7201504 7319263 7418341 7451268 7470904 7534407 7617034 7675004 7731153 7826573 7930120
11749 7930120 7977721 7981697 8019049 8111875 8198434 8240301 8285064 8384856 8509598 8592846 8630250
11738H630250M9015R3905J08440Q0186N5107P1218J12867J32036J05667O6228
11728I504919O6175J10827J46996J31753Q8945P1863R0527J11683J17491J21159
11718A0562338J27104J20858J07366J16263J50393J67363J39851J03772J11634
11709A1706942J57762J87874J75066J48658J43383J53183J52090J38966J37937
11700A3101861J60300J85997J88606J68431J51817J60068J87186K10585K16647
11691A4731498K09478J99924J96245K03601K20580K34397K32040K20406K21878
11682A6670047K42650K60898K59370K54309K70953L01193L12898K98697K86298
11673A9157313K95682L14698L27337L37760L50801L57139L58167L75844M10491
$$ plain form
11738 8630250 8679265 8773170 8881610 8961796 9016903 9088121 9200988 9333024 9438691 9504919
11728 9504919 9571094 9681921 9828917 9960670 10049615 10121478 10212005 10323688 10441179 10562338
11718 10562338 10689442 10810300 10917666 11033929 11184322 11351685 11491536 11595308 11706942
11709 11706942 11864704 12052578 12227644 12376302 12519685 12672868 12824958 12963924 13101861
11700 13101861 13262161 13448158 13636764 13805195 13957012 14117080 14304266 14514851 14731498
11691 14731498 14940976 15140900 15337145 15540746 15761326 15995723 16227763 16448169 16670047
11682 16670047 16912697 17173595 17432965 17687274 17958227 18259420 18572318 18871015 19157313
11673 19157313 19452995 19767693 20095030 20432790 20783591 21140730 21498897 21874741 22285232
11664B2285232M20776L85720L57079L94542M67906M92195M56479M40702M87961
11655B6188592N40630N42797N30612N58915O00686N99219N76971O02293O69347
11646C1410062P03395O82877O66026O83063O90000O60300O41694O73144P10234
11637C7520795O92571O40689O26354O73382P39327P78473P81799P68539P70435
11628D3992364Q09538Q68349R04864R15851R46796J011795J054249J035782J016060
11619E2555648J074661J186359J254809J256010J263325J324459J396483J429224
11611F2740978J442604J480733J541148J592445J626298J654004J679123J706339
11603G5463672J753813J826758J898567J944762J977880K025346K091350K164174
$$ plain form
11664 22285232 22706008 23091728 23448807 23843349 24311255 24803450 25259929 25700631 26188592
11655 26188592 26729222 27272019 27802631 28361546 28962232 29561451 30138422 30740715 31410062
11646 31410062 32113457 32796334 33462360 34145423 34835423 35495723 36137417 36810561 37520795
11637 37520795 38213366 38854055 39480409 40153791 40893118 41671591 42453390 43221929 43992364
11628 43992364 44801902 45670251 46575115 47490966 48437762 49449557 50503806 51539588 52555648
11619 52555648 53630309 54816668 56071477 57327487 58590812 59915271 61311754 62740978
11611 62740978 64183582 65664315 67205463 68797908 70424206 72078210 73757333 75463672
11603 75463672 77217485 79044243 80942810 82887572 84865452 86890798 88982148 91146322
11595I1146322K243731K336657K437678K539372K649231K775579K906769L025636
11587A12060975L138073L269019L433560L623933L820455M009135M198292M420567
11579A41974009M700882N017888N323027N609341N930668O329587O775511P209111
11571A88870024P627224Q080706Q595490R140278R679092J0214427J0755726J1272173
11563B64235140J1706372J2023632J2217490J2262284J2087748J1625520J0873953
11556C47032139R890645Q717349P344659N772702M076848K371637P22782q61688
11548C85067073k365142l749341n016701o219419p372985q412998r276127r972787
11540C32681573j0531620j0923362j1107686j1119258j1030512j0850699j0542639
$$ plain form
11595 91146322 93390053 95726710 98164388 100703760 103352991 106128570 109035339 112060975
11587 112060975 115199048 118468067 121901627 125525560 129346015 133355150 137553442 141974009
11579 141974009 146674891 151692779 157015806 162625147 168555815 174885402 181660913 188870024
11571 188870024 196497248 204577954 213173444 222313722 231992814 242207241 252962967 264235140
11563 264235140 275941512 287965144 300182634 312444918 324532666 336158186 347032139
11556 347032139 356922784 365640133 372984792 378757494 382834342 385205979 385928761 385067073
11548 385067073 382701931 378952590 373935889 367716470 360343485 351930487 342654360 332681573
11540 332681573 322149953 311226591 300118905 288999647 277969135 267118436 256575797
11533B56575797j0129677r698895r290334q867242q415764p989470p620060p263858
11525A87300497o885870o525366o220203n933476n625798n339307n124387m933232
11517A40712858m687774m419353m224423m092548l907238l639303l408814l296625
11509A09036780l212469l041547k826414k685299k614269k506149k338650k203452
11501H7608531k138818k067111j940577j829379j796088j782435j708576j606671
11493G2738876j554878j535670j472129j372111j318137j320689j298522j221985
11485F1644755j164802j174081j188985j147407j088979j079459j098329j081794
11477E2620919j030684r95186r84009r66128r40816r30974r21101q75744q12889
$$ plain form
11533 256575797 246446120 236747225 227456891 218589649 210173885 202184415 194564355 187300497
11525 187300497 180414627 173889261 167669058 161735582 156109784 150770477 145646090 140712858
11517 140712858 136025084 131605731 127381308 123288760 119381522 115742219 112333405 109036780
11509 109036780 105824311 102782764 99956350 97271051 94656782 92150633 89811983 87608531
11501 87608531 85469713 83402602 81462025 79632646 77836558 76054123 74345547 72738876
11493 72738876 71183998 69648328 68176199 66804088 65485951 64165262 62866740 61644755
11485 61644755 60479953 59305872 58116887 56969480 55880501 54801042 53702713 52620919
11477 52620919 51590235 50595049 49611040 48644912 47704096 46773122 45852021 44976277 44163388
11468D4163388p87180q00512p98893p61967p25383p05365o74062o28278o09300
11459C7672448o24781o20355n68994n24078n33556n58158n35826m82993m63715
11450C2759992m85978m96999m70008m33978m17399m15109m16609m23416m28509
11441B8771987m13932l79967l51110l44985l54250l61289l54020l29863l01068
11432B5581503k90251l03635l17664l09572k88010k73313k64615k52412k45366
11423B3036665k52851k57471k41054k23140k33525k59469k64193k46641k34118
11414B0824203k25938k01781j80567k02593k46576k39915j74555j35656j74089
11405A9042533k23845k06224j53077j48780j93844k14144j84751j56999j62655
$$ plain form
11468 44163388 43376208 42575696 41776803 41014836 40289453 39584088 38910026 38281748 37672448
11459 37672448 37047667 36427312 35858318 35334240 34800684 34242526 33706700 33223707 32759992
11450 32759992 32274014 31777015 31307007 30873029 30455630 30040521 29623912 29200496 28771987
11441 28771987 28358055 27978088 27626978 27281993 26927743 26566454 26212434 25882571 25581503
11432 25581503 25291252 24987617 24669953 24360381 24072371 23799058 23534443 23282031 23036665
11423 23036665 22783814 22526343 22285289 22062149 21828624 21569155 21304962 21058321 20824203
11414 20824203 20598265 20396484 20215917 20013324 19766748 19526833 19352278 19216622 19042533
11405 19042533 18818688 18612464 18459387 18310607 18116763 17902619 17717868 17560869 17398214
11396A7398214j71480j59196j48450j57616j65680j55772j46135j50759j51529
11387A5991597j36870j28485j41314j53957j48316j41837j48081j42833j09079
11378A4740825q1983j01670j46406j62342j41901j22870j22341j22494j15486
11369A3623332j13254j15061j11105j13752j37316j54169j28156q6548r0444j30930
11359A2442597j34680q9304p2515j18711j50780j09072n9984q6416j43184j32019
11349A1345932o9036n2802r3458j06020p0555o2795j03147j10405n4145k5560
11339A0598009q2868j40133j05159l3407l3197r0066j07252p2238n6329p3180
11329I804180o4212k4296k2558p6638j10722p4737j9248j0606m2175p0549q0899
$$ plain form
11396 17398214 17226734 17067538 16919088 16761472 16595792 16440020 16293885 16143126 15991597
11387 15991597 15854727 15726242 15584928 15430971 15282655 15140818 14992737 14849904 14740825
11378 14740825 14658842 14557172 14410766 14248424 14106523 13983653 13861312 13738818 13623332
11369 13623332 13510078 13395017 13283912 13170160 13032844 12878675 12750519 12663971 12573527 12442597
11359 12442597 12307917 12218613 12146098 12027387 11876607 11767535 11707551 11621135 11477951 11345932
11349 11345932 11276896 11224094 11130636 11024616 10954061 10891266 10788119 10677714 10623569 10598009
11339 10598009 10515141 10375008 10269849 10236442 10203245 10113179 10005927 9933689 9877360 9804180
11329 9804180 9739968 9715672 9693114 9616476 9505754 9431017 9411769 9401163 9358988 9288439 9207540
11318I207540p8233o3535n0641o1837q4047p7941m7579m2427p0837q0634n3900
11307H495929m3990p5295q7449m2736j1812o6198j46128j38314m9661L547l2749
11296G805144r2487j08648r4060q0905o4989m5681n1281q4522j00025p5190n1701
11285F955655o5752q6368p1380m2121m5707p3175p6774n3362m8444p6044r2114
11274F224414o5244k8387l1587p1691r9683q4294m2274j0057o877k7995n8008
11263E698317q2097r0331p8857n0640j7851j798j9313o0227q6825p1390l1662
11252E107326j1156k3848m0833l8037k9747l7464n1730n2339m5749m9049n2978
11241D674396l8983k0391k2983l3806k0794J85k0427p5501r2469m0787J6429J6624
$$ plain form
11318 9207540 9129307 9065772 9015131 8953294 8869247 8791306 8743727 8701300 8630463 8549829 8495929
11307 8495929 8451939 8376644 8289195 8246459 8234647 8168449 8022321 7884007 7834346 7837893 7805144
11296 7805144 7712657 7604009 7509949 7429044 7364055 7318374 7267093 7182571 7082546 7007356 6955655
11285 6955655 6889903 6803535 6732155 6690034 6644327 6571152 6494378 6441016 6392572 6316528 6224414
11274 6224414 6159170 6130783 6099196 6027505 5927822 5843528 5801254 5791197 5784320 5756325 5698317
11263 5698317 5616220 5525889 5447032 5396392 5378541 5376743 5357430 5297203 5210378 5138988 5107326
11252 5107326 5096170 5072322 5031489 4993452 4963705 4926241 4874511 4822172 4776423 4727374 4674396
11241 4674396 4635413 4615022 4592039 4558233 4537439 4537624 4517197 4441696 4349227 4308440 4324869 4341493
11229D341493j6814l1621l1431m2355m5423j5740R276j8716o5594n7843m486J3006
11217D033752k8066o0633m2597j5825k1075l2419j8377k376j3933l2101k6630
11206C739720j3397k1176l7296l2310j3007q837k4045l7792l7133k4840j0777
11195C479110j2205l9132o6469n3640p316J5525j1639m5467m1995j7946o468J75
11183C192533J6477J6823j9920n4807m1316o747j3509n5959o7356k6718J1312
11172B950813N648j4207n838J8847J7596j7344m8794m1865n242J8282K985k4858
11160B856023k2079M642M666l3336n3785k1280J5638q36m2309m0099K728K0434
11148B690407p182l1535k1726l935l634j0494j5078k4852l0485r540K3672K5592
$$ plain form
11229 4341493 4324679 4293058 4261627 4219272 4173849 4158109 4167385 4148669 4083075 4025232 4020746 4033752
11217 4033752 4005686 3945053 3902456 3886631 3865556 3833137 3814760 3812384 3798451 3766350 3739720
11206 3739720 3726323 3705147 3667851 3635541 3622534 3613697 3589652 3551860 3514727 3489887 3479110
11195 3479110 3466905 3427773 3361304 3307664 3300348 3315873 3304234 3258767 3216772 3198826 3192358 3192533
11183 3192533 3209010 3225833 3205913 3151106 3109790 3103043 3089534 3033575 2966219 2939501 2950813
11172 2950813 2956461 2942254 2936416 2955263 2972859 2955515 2906721 2864856 2859614 2877896 2880881 2856023
11160 2856023 2833944 2838586 2843252 2809916 2756131 2734851 2750489 2749653 2707344 2667245 2669973 2690407
11148 2690407 2683225 2651690 2629964 2626029 2622395 2611901 2596823 2571971 2541486 2531946 2555618 2581210
11136B581210o283k5859j5774j3210l7037m9229k0935J5757J9380p69j2353j1270
11124B423628j1184j2580j1745j4241j8678j4557q258j6226k5528q166J7848K472
11112B302785m5307n2099K920M1493N800m8202m2608O62R246j6668j7890J6164
11100B156296L7515K3338l579k7728m8234m5879q777K1963J053l8251k5359K9898
11088B072256M3602j0386n8704m3018k93Q591j2581k3039j3930m297j61L842M375
11075A966257k70J76O551O7k7066n1602m8018j9849J0787K7246K2673J78k2106
11062A865024k4155q200O421J0780Q298l646k5475l6088j6811J0765J0399j0269
11050A787043j3077J600m830l3450l5170N671L6227J7289j4467r341J5893J1773
$$ plain form
11136 2581210 2574927 2549068 2533294 2520084 2483047 2433818 2412883 2428640 2448020 2447251 2434898 2423628
11124 2423628 2412444 2399864 2388119 2373878 2355200 2340643 2332385 2316159 2290631 2282465 2300313 2302785
11112 2302785 2257478 2205379 2208299 2249792 2255592 2207390 2164782 2165444 2174690 2158022 2140132 2156296
11100 2156296 2193811 2217149 2213570 2185842 2137608 2091729 2082952 2104915 2105968 2067717 2042358 2072256
11088 2072256 2115858 2105472 2046768 2003750 2003457 2012048 1999467 1976428 1962498 1958201 1958040 1961882 1966257
11075 1966257 1965987 1966163 1972714 1972781 1945715 1894113 1846095 1826246 1837033 1864279 1886952 1887130 1865024
11062 1865024 1840869 1832669 1839090 1849870 1858168 1854522 1829047 1792959 1776148 1786913 1797312 1787043
11050 1787043 1773966 1775566 1770736 1737286 1702116 1707787 1744014 1761303 1746836 1737495 1753388 1765161
11038A765161k2859m4580l1558k757J7567K0084M875j7234k7408k1336j4160j0816
11026A614979K742K4342K6093J626j5007n385m07k1574l2152K424M2801K7890
11014A668372k4946m0848j119L2182J3475k5036l0702k990J8433R740j5369k5518
11002A575674l857K9122L0622r162m1405j8864L1885M1788j321l5305j5942K3283
10990A606518K8521J366j7935j4457n856k89J2650K9392K6141k540k4996j2707
10978A625808J6464K1264k367j5333K373J8626L352j6269J746L7531L2681j4352
10966A711524m0714j9058K122j3421k7763j571L0223J6653k1551l0452j3262j0156
10954A582574j5868M376L4436K4750j5767k7135r4J1698q256j2195J5762K1359
$$ plain form
11038 1765161 1742302 1697722 1666164 1663407 1680974 1701058 1705933 1688699 1661291 1639955 1625795 1614979
11026 1614979 1617721 1642063 1668156 1669782 1654775 1649390 1648983 1627409 1595257 1597681 1640482 1668372
11014 1668372 1643426 1602578 1601459 1633641 1647116 1622080 1591378 1588388 1606821 1616561 1601192 1575674
11002 1575674 1571817 1600939 1631561 1622399 1580994 1562130 1594015 1635803 1634482 1599177 1583235 1606518
10990 1606518 1635039 1636405 1618470 1604013 1598157 1597868 1610518 1639910 1666051 1663511 1638515 1625808
10978 1625808 1642272 1663536 1661169 1645836 1648209 1666835 1670187 1653918 1655664 1693195 1725876 1711524
10966 1711524 1670810 1651752 1653874 1640453 1612690 1611119 1641342 1657995 1636444 1605992 1592730 1582574
10954 1582574 1566706 1571082 1605518 1630268 1614501 1587366 1587272 1598970 1590714 1578519 1594281 1615640
10942A615640k2556n7780l2412J3626J4446k1354l8497k3568l531J3485L3211
10931A490710L3575p593n4605m7224P332L5234J269m1328l2495P794J5813j7928
10919A390554l7285q451K8034J9868j6256k2173Q417K2095k588j9706o94J1098
10907A372913j8126l8387J757M9460K1119n0589n5913J4663N3654J2751k7925
10896A335377p800J5826j6538n6550l6801J3174K7022J0770P329J0502l014j0096
10884A289201R682J5866k0486m4558o338L8855J8176k9339k3369J2694M242k4902
10872A239724J210M9060J9978n8546n7357K8955O0089r312m9023J6578P3023J5928
10860A330307o7390m9250K8630M2723p505l1164j4901j3812k0817J1669N0543
$$ plain form
10942 1615640 1593084 1535304 1502892 1516518 1530964 1509610 1471113 1447545 1444014 1457499 1490710
10931 1490710 1524285 1516692 1462087 1414863 1422195 1457429 1458698 1417370 1384875 1392669 1408482 1390554
10919 1390554 1353269 1344818 1372852 1392720 1376464 1354291 1362708 1384803 1382215 1362509 1361815 1372913
10907 1372913 1354787 1316400 1318157 1367617 1388736 1338147 1282234 1296897 1350551 1363302 1335377
10896 1335377 1327577 1343403 1326865 1270315 1233514 1246688 1273710 1284480 1291809 1302311 1299297 1289201
10884 1289201 1298883 1314749 1294263 1249705 1243367 1282222 1300398 1271059 1247690 1260384 1264626 1239724
10872 1239724 1240934 1289994 1309972 1251426 1194069 1223024 1283113 1273801 1224778 1241356 1314379 1330307
10860 1330307 1262917 1213667 1242297 1285020 1277515 1246351 1231450 1217638 1196821 1208490 1259033
10849A259033K2148m2722m0949K7951N4658K643l5486p02L7990J1752l1335j6148
10837A248833L1872L5482q233l4029j5018J0058Q542o902j5146j7098j7573r035
10825A211753J0617K3377J1452j4711k4432o205J3504M316k2767k7179K314K9317
10813A211356K3360K169l095K050p123k5871k5803l81K7882L9731L1289M031k8443
10800A251152l5272l151L3097K8977q473l2394k1117M660K2196K5681J1127j7258
10788A259225l0408o519K4582J5346k3969l5808m033K4688J9665P732J3976J7363
10776A281840j405j6451j545J9901J2151j4136k1973o153P507P043L734M566L500
10763A278579l641j4190k2624j9040K883K7936K9496P553q191m671l311j4098
$$ plain form
10849 1259033 1281181 1238459 1197510 1225461 1280119 1282762 1247276 1246574 1284564 1296316 1264981 1248833
10837 1248833 1280705 1316187 1307954 1273925 1258907 1268965 1277507 1270605 1255459 1238361 1220788 1211753
10825 1211753 1222370 1245747 1257199 1242488 1218056 1211851 1225355 1229671 1206904 1179725 1182039 1211356
10813 1211356 1234716 1236885 1233790 1235840 1228717 1202846 1177043 1176662 1204544 1244275 1275564 1279595 1251152
10800 1251152 1215880 1212729 1245826 1274803 1266330 1233936 1212819 1217479 1239675 1265356 1276483 1259225
10788 1259225 1228817 1222298 1246880 1262226 1238257 1202449 1198416 1223104 1242769 1250501 1264477 1281840
10776 1281840 1280435 1263984 1262439 1282340 1294491 1280355 1258382 1252229 1259736 1266779 1270513 1275079 1278579
10763 1278579 1274938 1260748 1238124 1219084 1221967 1249903 1279399 1286952 1278761 1274090 1270779 1256681
10751A256681r478K5311N0706K4883k6468m0939q377K0199J2307n152J570J9841
10739A321084J6691n870j3406P741K7583J4554j6819k3743K420K2137R096p439
10727A354029O949K8565J3137k1257j4533L1298M2202j0560n5634k8334L0466
10716A376328M1804O213j4745m92J7296K4604L3733L2401l292m5102l4363K1066
10704A455451M2229m084m9662k5551L5687N1214O812l3183k3140R690J7701Q14
10692A483978l191K0363M0586K5986q671k2254n972P673o98q353N864K2466J6687
10679A574464M360J2413K5339Q912k4838k8189P383L7029L0954J0765L793L690
10667A666075l231p552L691K1640K9162K2226O923o920n142J5517L0682J4039
$$ plain form
10751 1256681 1247203 1272514 1323220 1348103 1321635 1280696 1272319 1292518 1304825 1299673 1301243 1321084
10739 1321084 1337775 1331905 1318499 1326240 1353823 1368377 1351558 1327815 1330235 1352372 1361468 1354029
10727 1354029 1360978 1389543 1402680 1381423 1366890 1398188 1440390 1429830 1374196 1345862 1376328
10716 1376328 1418132 1424345 1409600 1409108 1426404 1451008 1484741 1517142 1513850 1468748 1434385 1455451
10704 1455451 1497680 1493596 1443934 1418383 1454070 1505284 1512096 1478913 1455773 1465463 1483164 1483978
10692 1483978 1480787 1501150 1541736 1567722 1559051 1536797 1530825 1538498 1537800 1529447 1535311 1557777 1574464
10679 1574464 1578824 1591237 1616576 1625488 1600650 1572461 1579844 1616873 1647827 1658592 1662385 1666075
10667 1666075 1662844 1655292 1658983 1680623 1709785 1732011 1738934 1732014 1726872 1742389 1773071 1787110
10655A787110j9979l1097j1673O521O699N577R711O70k0044j8905J2850L5264
10643A762704K1945M001J6340L8368L0266q32j4570K160K7005L9494L4124J1403
10631A972408j4699j6863J0093L2441K3542M728R184K8086K9786J3922O656J4186
10619B113470J9025J4844J1699J3155J5977K2821L1128K5762P927P285L3879M7351
10607B364323J6498j9469l695M6419O3060L2031N676J2673K3327J5755J1408K3898
10595B591904L1025K3342K7098N0322N7094K8856L688J5340L6383K7166M686J1128
10583B908032M0083M8778K9916J8405K9714M0334L5391L2249M2687M8072L3050
10572C306711J6638K4564M8496N9692N3282M9999N5248M8879K7207K2650N3969
$$ plain form
10655 1787110 1767131 1736034 1724361 1730882 1737581 1743158 1752869 1753539 1733495 1714590 1727440 1762704
10643 1762704 1784649 1788650 1804990 1843358 1873624 1872792 1858222 1860382 1887387 1926881 1961005 1972408
10631 1972408 1957709 1940846 1950939 1983380 2006922 2011650 2020834 2048920 2078706 2092628 2099284 2113470
10619 2113470 2132495 2147339 2159038 2172193 2188170 2210991 2242119 2267881 2275808 2283093 2316972 2364323
10607 2364323 2380821 2361352 2357657 2404076 2467136 2499167 2504843 2517516 2540843 2556598 2568006 2591904
10595 2591904 2622929 2646271 2673369 2723691 2780785 2809641 2813329 2828669 2865052 2892218 2896904 2908032
10583 2908032 2948115 2996893 3026809 3045214 3074928 3115262 3150653 3182902 3225589 3273661 3306711
10572 3306711 3323349 3347913 3396409 3456101 3509383 3559382 3614630 3663509 3690716 3713366 3767335
10561C767335Q2947O3196J8011J5334O3432R3662O7792L7570N5445Q6761P3797
10550D425282L8635M3861Q2675R4786P5098P5168R9113R3638N5450N2289J05739
10539E241734J43798J15566P1241P3279J01599J08904J04163J13770J18565J00862
10529F293481R9970J44441J79174J44654Q5906Q9541J45273J70296J50383J49121
10519G652240J80782J85587J49515J42214J96106K40647K12895J60314J68446
10510I288746K36264K88020K81365K49056K44049K80963L29913L51615L43339
10501A1893330L47062L92738M46694M56027M33475M40788M87408N14917M98761
10492A5911200M91323N28578N64968N53418N29102N48196N90229N94748N65190
$$ plain form
10561 3767335 3850282 3913478 3931489 3946823 4010255 4103917 4171709 4209279 4264724 4351485 4425282
10550 4425282 4463917 4507778 4590453 4685239 4760337 4835505 4934618 5028256 5083706 5135995 5241734
10539 5241734 5385532 5501098 5572339 5645618 5747217 5856121 5960284 6074054 6192619 6293481
10529 6293481 6393451 6537892 6717066 6861720 6947626 7037167 7182440 7352736 7503119 7652240
10519 7652240 7833022 8018609 8168124 8310338 8506444 8747091 8959986 9120300 9288746
10510 9288746 9525010 9813030 10094395 10343451 10587500 10868463 11198376 11549991 11893330
10501 11893330 12240392 12633130 13079824 13535851 13969326 14410114 14897522 15412439 15911200
10492 15911200 16402523 16931101 17496069 18049487 18578589 19126785 19717014 20311762 20876952
10483B0876952N61074N98942O30159O18682N82970N52746N32023N15772N04754
10474B5974074M92968M70008M42393M27608M25457M19315M03437L83759L55295
10465B9794314L06149K42270J82105J28321O9815R531l4899n7777p1396q8555
10455C0479878j17260j63230k16740k51333k61734k85633l53651m34648m73661
10446B7921988m72055m79774n12555n33188n22762n13914n32314n54520n52975
10437B3247931n42535n50454n72168n87981n96566o02389n94905n70566n52554
10428A8077813n56729n58557n28862m85821m72313m89965m95908m66718m28038
10419A3594902m08938l98078l67339l20490k91400k95518l06180k90804k55895
$$ plain form
10483 20876952 21438026 22036968 22667127 23285809 23868779 24421525 24953548 25469320 25974074
10474 25974074 26467042 26937050 27379443 27807051 28232508 28651823 29055260 29439019 29794314
10465 29794314 30100463 30342733 30524838 30653159 30722974 30732505 30697606 30639829 30568433 30479878
10455 30479878 30362618 30199388 29982648 29731315 29469581 29183948 28830297 28395649 27921988
10446 27921988 27449933 26970159 26457604 25924416 25401654 24887740 24355426 23800906 23247931
10437 23247931 22705396 22154942 21582774 20994793 20398227 19795838 19200933 18630367 18077813
10428 18077813 17521084 16962527 16433665 15947844 15475531 14985566 14489658 14022940 13594902
10419 13594902 13185964 12787886 12420547 12100057 11808657 11513139 11206959 10916155 10660260
10410A0660260k34066k30424k13019j69582j40112j59709j94391j82792j30614
10401I005551j04965j29403j48490j21941r1659j08897j45498j40387j02413r6277
10391G815621j36653j65367j43090j04764j00972j28663j48868j43987j29265
10382F613992j23066j27652j33516j31794j24580j21962j23904j16944j01864
10373E508710j04940j34834j48747j04748l6666k2273p3157j15002r6814o1255
10363D610274o8925j02714j01197n6795k2889l3281o4073p7039o3385l9998k9264
10352C950714m3776p0120p3828m1852q501j2716m3302n9539n2893m7393m7292
10341C449502l2903r531r465l3799m1780j7427R50j5085l5392k3088L320L539
$$ plain form
10410 10660260 10426194 10195770 9982751 9813169 9673057 9513348 9318957 9136165 9005551
10401 9005551 8900586 8771183 8622693 8500752 8409093 8300196 8154698 8014311 7911898 7815621
10391 7815621 7678968 7513601 7370511 7265747 7164775 7036112 6887244 6743257 6613992
10382 6613992 6490926 6363274 6229758 6097964 5973384 5851422 5727518 5610574 5508710
10373 5508710 5403770 5268936 5120189 5015441 4978775 4956502 4883345 4768343 4671529 4610274
10363 4610274 4541349 4438635 4337438 4280643 4257754 4224473 4160400 4083361 4019976 3979978 3950714
10352 3950714 3906938 3836818 3762990 3721138 3712637 3699921 3656619 3597080 3544187 3496794 3449502
10341 3449502 3416599 3407068 3397603 3363804 3322024 3304597 3305547 3290462 3255070 3231982 3235302 3238841
10329C238841j7783k5642j6603j7401l1078l1457j1317M056l908k5661m3245m4634
10317B974168k3039Q778J3074k6945o6058m9392l38K965n4054r4226o4021j1102
10305B609810k478k3874k2339m958j9429n8369o2014j7566J5623k902l8183m0891
10293B332430j6757k672r111k0101k6549k9272k4937j3700q225j5787k4063k1270
10281B119986j6137k1167l0116k9336j8884o688M560R719k419k6678l4158j1462
10269A937220J0057n241m0274m5124r841K1213J3998j2659k4547k0610k0030k3319
10257A780843j5704P00N860p081k1317k1706j4186j2608j7689j7847n091J5897
10245A670071K9966K0131j6713n6440o1836k4046J8582K2402n605j9293j598J2449
$$ plain form
10329 3238841 3221058 3195416 3178813 3161412 3130334 3098877 3087560 3091616 3087708 3062047 3018802 2974168
10317 2974168 2951129 2959907 2972981 2946036 2879978 2830586 2830248 2833213 2779159 2684933 2620912 2609810
10305 2609810 2607332 2583458 2561119 2556161 2536732 2478363 2416349 2398783 2414406 2411504 2373321 2332430
10293 2332430 2315673 2313001 2303890 2283789 2257240 2227968 2203031 2189331 2181106 2165319 2141256 2119986
10281 2119986 2103849 2082682 2052566 2023230 2004346 1997658 2002218 2011937 2009518 1982840 1948682 1937220
10269 1937220 1947277 1942036 1901762 1856638 1846797 1868010 1882008 1869349 1844802 1824192 1804162 1780843
10257 1780843 1765139 1765839 1771699 1764618 1743301 1721595 1707409 1694801 1677112 1659265 1654174 1670071
10245 1670071 1700037 1720168 1703455 1647015 1585179 1561133 1579715 1602117 1596512 1577219 1575621 1588070
10233A588070m414k4860j2268J5236J1374k2420l8955k1573n371j1941j5961L36
10221A457253R243j1181l0133j1477K3710K8530J577j9066j6185l071J2513K7820
10209A469533K1080k1823o3875n2886l00K8798Q474j9474j9101o205k342K173
10197A344052J2396N366k4975m2943k5427j110k03n302P174J5975n770l3723k9133
10184A216377o418o142k0385q266K3875K4506j6767m7786l3691k531J0103J1071
10172A143946J6382J2777j1701l2364k1027P513J6423j338k2239l0232k6582j1909
10160A039649J2398K9690K2205q77j2757o833k368j0020j6294j1484r626k2763
10148A010920l2749j4273K0891L1433L812k4880j7660J0817J9011L55j2336q95
$$ plain form
10233 1588070 1583656 1558796 1546528 1561764 1573138 1550718 1511763 1490190 1484819 1472878 1456917 1457253
10221 1457253 1466496 1455315 1425182 1413705 1437415 1465945 1467522 1448456 1432271 1429200 1441713 1469533
10209 1469533 1490613 1468790 1404915 1352029 1351729 1380527 1389001 1369527 1350426 1344221 1341879 1344052
10197 1344052 1356448 1361814 1336839 1293896 1268469 1267359 1267156 1261854 1269028 1285003 1279233 1245510 1216377
10184 1216377 1209959 1203817 1183432 1175166 1199041 1223547 1206780 1158994 1125303 1122772 1132875 1143946
10172 1143946 1160328 1173105 1161404 1129040 1108013 1115526 1131949 1130611 1108372 1078140 1051558 1039649
10160 1039649 1052047 1081737 1103942 1103065 1090308 1083475 1081107 1071087 1054793 1043309 1033683 1010920
10148 1010920 978171 963898 984789 1016222 1020034 995154 977494 988311 1007322 1007677 995341 994446
10136I94446J4334J1484l027j3457j5819p704J3907L1091J5166k2734l0271R034
10124I96450L9807J6437k1855j3951K1371J9121j8628k7000O974K1389j1228l4813
10112I94074n247L7221L7303P298r495p996l335J1763L8504M0710j445m0198k1582
10099A077575K9566M6054J7277j0095j3231j0254n279J8115M6971M3327P759j4174
10087A233611p3K1902K4806J7623J5868J7738K1963L3695M3562L5127J8397J9981
10075A504200L7314M1984L0823L0560M7590N8644N6732N8801O2264M6105K2795
10064A997812L0915O3667O7473L0885Q207K7715M5719K8094O427O912m181m4773
10052B264872n8278p145L8056l922q5475r2132j7959K8384j1046p3855q7188n8259
$$ plain form
10136 994446 1008780 1020264 1017237 1003780 987961 980257 994164 1025255 1040421 1017687 987416 996450
10124 996450 1036257 1052694 1030839 1016888 1038259 1057380 1038752 1011752 1018726 1040115 1028887 994074
10112 994074 988827 1026048 1063351 1070649 1061154 1053158 1049823 1061586 1100090 1140800 1139355 1099157 1077575
10099 1077575 1107141 1153195 1170472 1160377 1147146 1136892 1131613 1149728 1196699 1240026 1247785 1233611
10087 1233611 1233538 1255440 1280246 1297869 1313737 1331475 1353438 1387133 1430695 1465822 1484219 1504200
10075 1504200 1541514 1583498 1614321 1644881 1692471 1751115 1807847 1866648 1928912 1975017 1997812
10064 1997812 2028727 2092394 2159867 2190752 2198959 2226674 2272393 2300487 2306914 2313826 2309645 2264872
10052 2264872 2206594 2199449 2237505 2233583 2148108 2055976 2038017 2066401 2055355 1981500 1894312 1836053
10040A836053k9929j9741l0048n7536p1817m2330m21j0509o4841q0628k7514J9704
10028A420443k535n0078m8261o526J1052j0577l0420k5372j2602r281j5142k6348
10016A194353l3643k0783P575J7548o676l3123k9353j0212n029r140o261o517
10004A058739j9042j9807M745J6628j4173m3350j5486L4390K6313l1163m6730
9993I51064P156M8823J8330l3299l5161m259R04j8507j6708J1546K7483J6982
9981I74354N705P923P453n156j3545l637J3701J7624J814j9036k0824N792L7079
9968A009247L6164J330k4423r129K1724J9675j8901m8727l5580O394L9905M4772
9956A042451K6515J793j4262j4845m733M441N844M800J2436K9168L7254K0938
$$ plain form
10040 1836053 1806124 1786383 1756335 1698799 1626982 1584652 1584231 1573722 1508881 1428253 1400739 1420443
10028 1420443 1417908 1367830 1319569 1313043 1324095 1313518 1283098 1257726 1245124 1235843 1220701 1194353
10016 1194353 1160710 1139927 1147502 1165050 1158374 1125251 1095898 1085686 1080657 1071517 1065256 1058739
10004 1058739 1039697 1019890 1024635 1041263 1027090 983740 968254 1002644 1028957 997794 951064
9993 951064 958220 1007043 1025373 992074 956913 952654 953558 935051 918343 929889 957372 974354
9981 974354 980059 987982 995435 990279 976734 973097 986798 1004422 1006236 987200 966376 972168 1009247
9968 1009247 1045411 1046741 1022318 1013189 1034913 1054588 1035687 986960 951380 957774 997679 1042451
9956 1042451 1068966 1070759 1056497 1041652 1036919 1041360 1047204 1052004 1064440 1093608 1130862 1151800
9944A151800m378l001K7726L9803n31n1709m5712J2027M6673K2628j0942l228
9932A181156K7250L8373K9766J9930K907k3381k4929J7140N6160M0024n432j6100
9920A342864J0209K2689J0832J2841L4818L9063J9910J5763L2164K8930M167J1247
9908A585497N9852Q1265M0200L689L3703P9861O0995J698p513M2622P0940L9119
9896B091928J097L456J8024O252j4944j3804k393j0126l0844l8240l3381l8145
9884A938880n3136n7529m7409m2771n1162n0816k4922M309j164m0011o4321m1414
9872A468534k793k701l7750m8785j0621K5494P697l6305m0140K868L4549J9529
9860A379576j2783k1666p028Q215J2809N491j3878l3208l1523j0715k534k5490
$$ plain form
9944 1151800 1147422 1144421 1172147 1211950 1211419 1159710 1113998 1126025 1172698 1195326 1184384 1181156
9932 1181156 1208406 1246779 1276545 1296475 1299382 1276001 1251072 1268212 1324372 1364396 1358964 1342864
9920 1342864 1353073 1375762 1386594 1399435 1434253 1473316 1493226 1508989 1541153 1570083 1574250 1585497
9908 1585497 1645349 1726614 1766814 1770503 1804206 1884067 1945062 1946760 1939247 1981869 2052809 2091928
9896 2091928 2093025 2096481 2114505 2120757 2105813 2092009 2089616 2079490 2048646 2010406 1977025 1938880
9884 1938880 1885744 1828215 1780806 1738035 1686873 1636057 1611135 1615444 1614280 1574269 1509948 1468534
9872 1468534 1465741 1463040 1425290 1376505 1365884 1391378 1399075 1362770 1322630 1325498 1360047 1379576
9860 1379576 1366793 1345127 1338099 1346314 1359123 1364614 1350736 1317528 1286005 1275290 1272756 1247266
9848A247266n3922n0849j7980P765P2l1278n6427n4453k9182m269m08j4878k8387
9835I13070l0663k8340k8062k6344j9854j2291o768k833l259j1138j9248j6862
9823G07408p997o718j3498j4777p913n853j2359j4016m490K868l818j7390k3075
9810E78372j4471M622K0338J3971j3975l1969j6043Q727J812k5339k3916R454
9798E11583K3384j134j7978J169J5790o935k5546M393M2863K4106l1446m5546
9786D94703n590K1981R37k9195k8903j1282J311J3247K3852J2195j9525l3518
9774D40213j4234M530j264l034K6981N5952L1899l3084o7497l0560L4677N2165
9762D96744L222n1145m5660M463K4413j0728l5131N260N8504M0694k8580n1770
$$ plain form
9848 1247266 1193344 1142495 1124515 1132280 1132352 1101074 1044647 990194 961012 956743 956335 941457 913070
9835 913070 882407 854067 826005 799661 779807 767516 760748 757915 754656 743518 724270 707408
9823 707408 699411 692693 679195 664418 656505 650652 638293 624277 619787 622655 618837 601447 578372
9810 578372 563901 568523 588861 602832 588857 556888 540845 549572 551384 526045 502129 511583
9798 511583 534967 533833 515855 517024 532814 525879 500333 504726 547589 571695 540249 494703
9786 494703 489113 511094 512031 482836 453933 442651 443962 457209 481061 493256 473731 440213
9774 440213 425979 430509 429245 426211 453192 509144 541043 507959 440462 409902 444579 496744
9762 496744 499966 448821 403161 407624 432037 421309 386178 391438 449942 490636 462056 410286
9750D10286n623K8826L892k6038j2846K482k2637m4202j0196L7953L1597o989
9738C86505p865K0940J2927l0615l9813k326J4103j5213k5635K0391N9023K4944
9726D17366m2848o1845k4500J1842K0670K3290K6212Q588k4908l5313r356J5309
9714C24507O624j3958q461J6485K1295k604j8862l972J6721J3176O63R010K2979
9701C83603L874l5263l5944J1083L8896M294m2110l3732J2014L1305J4222o1j808
9688C50373j1567j8949K995K9274Q535m0582m1801J5544N0441J6046l0590k7114
9676C02605J242K975j0149l44J8746J0248j4348j5869M030J2122K101p237j3762
9663B92360k4230k3383K440K8354K2772j355j0642o341r691j3274L471K7909L2585
$$ plain form
9750 410286 404663 433489 437381 411343 398497 400979 378342 334140 323944 361897 393494 386505
9738 386505 378640 399580 412507 381892 342079 339753 353856 338643 313008 333399 392422 417366
9726 417366 374518 312673 288173 300015 320685 343975 370187 378775 353867 318554 309198 324507
9714 324507 331131 317173 308712 325197 346492 343888 325026 321054 337775 350951 351614 360624 383603
9701 383603 387477 352214 316270 327353 366249 370543 328433 294701 306715 338020 352242 352181 350373
9688 350373 338806 319857 322852 352126 360661 320079 278278 293822 344263 360309 329719 302605
9676 302605 303847 306822 296673 296329 315075 325323 310975 295106 299136 311258 313359 306122 292360
9663 292360 268130 244747 247187 275541 298313 296958 286316 279975 270284 257010 260481 288390 320975
9650C20975K2660J7197N206k6354m5300j7463K3780K0778j2307j3244J8891K2937
9638C37756j4723l7436j8448J725q44L194K1149J1781k8182l5589J2863M7335
9626C00581J6214k7074j8025J0747k016l1730j6526K5757K9149k112p550J4305
9614B91720O754l1689l6101Q481L4527M468k8579j1575K8209L7777J4583j4499
9602C04076l8156m3614o418N6478P2967J0153n9817n0852J3399L7768k504l6828
9590B56652j7519J5162J1937p595m49K2788K0709m602j2184N794J0688j4393l1876
9577B55112j0295K1599J8460j0827k0915m160L490j0207j3848O141J5701o736
9565B43515k5780n140K8199K4439r985k6444j1758K183k09q56O759O074k346K273
$$ plain form
9650 320975 343635 360832 366038 339684 294384 276921 300701 321479 309172 295928 314819 337756
9638 337756 323033 285597 267149 268874 268030 271224 292373 304154 275972 240383 253246 300581
9626 300581 316795 289721 271696 282443 280427 248697 232171 257928 287077 284965 277415 291720
9614 291720 298474 266785 230684 239165 273692 278160 249581 238006 266215 303992 318575 304076
9602 304076 265920 222306 215888 272366 345333 355486 295669 244817 258216 295984 293480 256652
9590 256652 239133 254295 266232 258637 258188 280976 301685 297083 284899 290693 301381 286988 255112
9577 255112 244817 266416 284876 274049 253134 248974 252464 242257 228409 234550 250251 243515
9565 243515 217735 212595 240794 265233 255248 228804 217046 219229 219020 218164 224923 230997 228651 230924
9551B30924J4923M819k5814l3195j543K7399J9180m759j1604o495n553j436R451
9538B16297N929j5173j8048Q698J5165k8655o1424j3582P1576Q6784J7848l8532
9526B46883k1865J5284O907k7007k9042J997K0246N434j8698k3700m317K1798
9514A93920K7114L030j9687o312K4912K2621j5060l2188p125J0020j2427k5938
9502A62880J2353N0707J8630m8643n3660J2347N7304L1211j1889j7911r939j8632
9490A84758j5066K4095M7402K910n9494m7801K6124N2062j3640p5153l5214N9706
9478A50689Q4365J3215m9419k5153L0883K4414l2363m5745P981M3719K046n6841
9466A47791m8545O361K5777K295L554M4305N5621M720m3520l0100P696Q140j4447
$$ plain form
9551 230924 245847 250666 224852 191657 190114 217513 236693 231934 220330 213835 208282 206846 216297
9538 216297 222226 207053 189005 197703 212868 184213 122789 109207 180783 267567 285415 246883
9526 246883 225018 240302 247209 220202 191160 193157 213403 218837 200139 176439 172122 193920
9514 193920 221034 224064 204377 198065 222977 245598 230538 198350 191225 201245 188818 162880
9502 162880 175233 225940 244570 195927 142267 154614 211918 243129 231240 213329 203390 184758
9490 184758 169692 193787 241189 244099 184605 136804 162928 214990 201350 126197 90983 150689
9478 150689 235054 248269 198850 173697 204580 228994 196631 150886 158867 202586 204632 147791
9466 147791 99246 105607 131384 133679 137233 181538 237159 241879 198359 168259 175955 184095 169648
9453A69648j0728J0102N506j3588j967L1052L0971q789l7551l2073j9149r621
9441A13813J6022M5228L2947j6120l9008j3981O566o169q061K4653L6255j0351
9429A81794n2780k5683K7690L0881M646J7791N0741K6447m2842o2715j3089K1605
9417A64486k016k5681q418N558j2238j1527L3244N4281N996l8818m914M8673K1585
9404B30211n3237n6135K3613P0186K4541l6895l7162n426J08j1526n373P375J209
9391A51489o998Q087K5041R911k0438k1863O805K4876J2474q975j5888r350l082
9378A52089p265k0657k4584R25L9887M4118p74m0997k3091K7370M2949J3080j1004
9365A92046n068k372k2377l0813j898L0325K4177m706j6076j1744j8679k8175
$$ plain form
9453 169648 158920 169022 174528 160940 158973 190025 220996 212207 174656 142583 123434 113813
9441 113813 129835 175063 208010 191890 152882 138901 145467 139298 131237 155890 192145 181794
9429 181794 129014 103331 131021 161902 166548 184339 235080 261527 218685 155970 142881 164486
9417 164486 162470 136789 128371 133929 121691 110164 143408 197689 203685 164867 159953 208626 230211
9404 230211 176974 120839 144452 214638 239179 202284 165122 159696 159804 148278 142905 150280 151489
9391 151489 144491 152578 177619 187530 167092 145229 152034 176910 189384 180409 164521 155171 152089
9378 152089 144824 124167 99583 100508 140395 184513 183739 142742 119651 147021 189970 203050 192046
9365 192046 186978 184606 162229 131416 129518 159843 184020 179314 163238 151494 132815 104640
9353A04640r870K3467K6224k317j2112J1297J7850j9191m7281j5860L6306L9067
9341A52220J063j1904J0908J6268j0566j9718P493J9424j0946k8801Q414M6928
9329A80783K0205l5138l3943J8624L7125m530l7490j4961K0554J7203r288j7495
9317A41649m966P151J1714O896j0624k0709N590M4257K9523m0035p2739j3360
9305H4347O1916N2085j8891m7208j0328J6917j623j3645J6198M2165J9556j9785
9293A81704k4364m264k691k0455k0290R699L8831L5969L168k9468l0078L194L0706
9280A71661J2256l3805m3797K829M4844K1500l6840m7392Q336N8323M0215j6206
9268A81924l5882k299K5831K400l9550l5707J5815N0448K9240j0132j7838n775
$$ plain form
9353 104640 94770 118237 144461 142144 130032 141329 159179 139988 92707 76847 113153 152220
9341 152220 153283 141379 152287 168555 157989 138271 145764 165188 154242 125441 133855 180783
9329 180783 200988 165850 131907 150531 187656 183126 145636 130675 151229 168432 159144 141649
9317 141649 136683 143834 155548 162444 151820 131111 136701 180958 210481 170446 97707 84347
9305 84347 146263 198348 179457 132249 121921 138838 137215 123570 139768 181933 201489 181704
9293 181704 157340 153076 150385 129930 109640 119339 158170 194139 197307 167839 137761 140955 171661
9280 171661 183917 150112 106315 109144 153988 175488 138648 91256 99592 157915 198130 181924
9268 181924 146042 143743 169574 171974 132424 96717 112532 162980 192220 182088 164250 158475
9256A58475j3288k9897j2875K8948L6311n325l5403r551L3824L6038L024j6978
9244A73303q878K507J716l375o145o600j343P191N621n095j616K0366K6012m830
9230A98834l5090k4629K641j056k3758j3921K7427M3556J4526j4034r807M76j0747
9217A54418k3226j1821P010Q066J393Q104K0932K2154J6162J3206L682k0519l9445
9204A60116l0710n093J1121J3246J1978Q037k08k223M008k763k9944m1859p733
9191H7973L9455M0383l162l0123j1336J3864O748j3817j0683J2200K2949J1446
9179A65897m542r253j261J3113K0302O554j8505k2416N006K6456O705k8732k4668
9166A34656J9209M1592R178l2102k4533J7106L0749j286l2724k5566J573J2139
$$ plain form
9256 158475 145187 115290 102415 131363 167674 162349 126946 117395 151219 187257 190281 173303
9244 173303 164425 166932 168648 165273 159128 152528 151185 158376 163997 158902 157286 177652 203664 198834
9230 198834 163744 139115 141756 140700 116942 103021 130448 174004 188530 174496 164689 165165 154418
9217 154418 131192 119371 126381 134447 135840 143944 164876 187030 203192 216398 220080 199561 160116
9204 160116 129406 124313 135434 148680 160658 168695 168487 166264 170272 167509 137565 95706 87973
9191 87973 127428 167811 164649 134526 123190 137054 143802 129985 119302 131502 154451 165897
9179 165897 161355 152102 150841 163954 184256 190810 172305 149889 154895 181351 188056 159324 134656
9166 134656 153865 195457 204635 172533 148000 165106 195855 194569 161845 136279 137852 149991
9154A49991M006j106K505K984k572n182k876k082k403K757J1717J5241J0407J772
9140A85159p013j1149k610J4727J8412l302k5935j9493L473M586j7648k2474O700
9127A23433L1831J7774j4718k3093m070J1833R650J478j715j291J820Q604J3923
9114A75459J3153J0225N838r104l2492m0487j9568P399J2328L142M852J5079J3469
9101A59293L692N742J2299k947l1337k9845J1414M4873L0651r030k6911j4290
9089A53604J809M874J547j296m274l457P402K1216J9909l271l1866m0378j9019
9076A06800J5702L6886L4623K1012N928j5290l7492l1755J4205N6988M1026k0615
9064B28018n3967k2502K6604L4636P912q978l079K729m539j5570k2052k2241j0772
$$ plain form
9154 149991 153997 152891 155396 158380 155808 150626 147750 145668 143265 146022 157739 172980 183387 185159
9140 185159 178146 166997 164387 179114 197526 194224 168289 148796 152269 156855 139207 116733 123433
9127 123433 155264 173038 158320 135227 131157 142990 152640 154118 152403 151112 152932 161536 175459
9114 175459 188612 198837 204675 195571 163079 122592 103024 110423 122751 125893 130745 145824 159293
9101 159293 162985 168727 181026 178079 146742 116897 128311 173184 203835 194805 167894 153604
9089 153604 155413 160287 161834 160538 156264 152807 160209 181425 201334 198063 166197 125819 106800
9076 106800 122502 159388 194011 215023 220951 205661 168169 136414 150619 207607 248633 228018
9064 228018 174051 151549 178153 212789 220701 211723 208644 211373 206834 191264 169212 146971 136199
9051A36199J1619K6322J8205K03n390R5O03l858j566M343J406n448m53J2375J2577
9036B07232k213j1041k766Q950R547K369l610q210j3839j6308r459N752J8900
9023A85304J5989n933k7490k2771O948L0528K7238J1045K177k654j2167j6320
9011A91894o550Q95q400j6681l246J5611J3687L077J1397K7015J7775o732q394
8998B31348Q276M47l2468l8735k651K2189o16k9243j2218K9217L7496N875j9939
8985A98978j0346J8009L2003J5012k1012m1351k2054J4349K2426j555j6118l601
8973A84740O987K112R210L1486K2914k7107n0559l398N0615L4446j8846k7224
8961B15376J792j086l1157j9863K8203L1950j8523l3501K1492N9800J9543l1914
$$ plain form
9051 136199 147818 174140 192345 192548 187158 187253 187856 183998 182432 186775 188181 182733 182280 194655 207232
9036 207232 205019 193978 191212 200162 209709 212078 208468 200258 186419 170111 160652 166404 185304
9023 185304 201293 195360 167870 145099 152047 182575 209813 220858 223035 220381 208214 191894
9011 191894 185344 186239 177839 161158 157912 173523 187210 190287 201684 228699 246474 239742 231348
8998 231348 239624 240071 207603 168868 166217 188406 187790 158547 146329 175546 213042 218917 198978
8985 198978 188632 206641 238644 253656 232644 191293 169239 183588 206014 204459 188341 184740
8973 184740 191727 193839 203049 234535 257449 230342 179783 176385 227000 261446 242600 215376
8961 215376 217168 216082 184925 165062 193265 225215 206692 173191 194683 254483 274026 242112
8949B42112j5487K9187K2083k0433k7293j34L777j6078r931J8712J4297k5511
8937B15301l7963k546K4482Q189r215J1543L6259J6192k9315m1862q217L0563
8925B13411L8780J7939j0807k6005j5411R392J6078q886l3784j9626K3339M6016
8913B50436K6573m210j2075m946r200k1777j6595Q233K2850J1943k097J260O408
8900B56803n974j6858J375K9039K2668r725j4670J5106J9171k9861o7338l1869
8888A67867L2485M0209m762k4739J983J7498l955j2497J9256L8900N956k9669
8876B48532p738L7142K8873k4449m2751j942L3264J5909j8384k1627n606k732
8864B38491m762Q542J5636j3347m9175l2695K9867O2900K8783j7746j4738J6904
$$ plain form
8949 242112 226625 255812 277895 257462 230169 230035 233812 217734 207803 226515 240812 215301
8937 215301 177338 174792 199274 207463 198248 209791 246050 262242 232927 191065 182848 213411
8925 213411 252191 270130 259323 233318 217907 227299 243377 234491 200707 181081 204420 250436
8913 250436 277009 272799 260724 255778 246578 224801 208206 216439 239289 251232 249135 250395 256803
8900 256803 250829 233971 235346 264385 287053 277328 262658 277764 296935 267074 199736 167867
8888 167867 200352 240561 235799 211060 213043 230541 226586 214089 233345 272245 278201 248532
8876 248532 240794 277936 306809 282360 239609 237667 270931 286840 268456 246829 241223 238491
8864 238491 233729 242271 257907 244560 195385 162690 192557 255457 284240 266494 251756 268660
8852B68660J7222j4609k7548q083L754r149j2684J1370K8667J3841l205P304J9386
8839B94926l24k7925k2238K202L875q944K069K6635K1323n444l853K1625J3453
8826C17380k9685l6997J2109M3410J1726k1830j68K7932j095m6478l3023J7021
8814B60302K8403N874Q899K4517r101o4130m3071M8421Q3459R558o4268l9882
8802B48981K5144L0278p462r366K0549J9517j0184j1714J4973J4631j8809l2985
8790B83553j3071l1o247K858K8659K3700j8697l7370j212L6857K7090l48K368
8777C28109J8774R723q826J221K1328M086l6915l9893L143K9978Q565j3954O175
8764C31514L5803K1128k2613l3759J917L4328K5878j935j2149n681p235j9768
$$ plain form
8852 268660 285882 271273 243725 235642 239396 230247 217563 228933 257600 271441 268236 275540 294926
8839 294926 294602 266677 244439 246641 250516 241572 243641 270276 291599 286155 282302 303927 317380
8826 317380 287695 250698 262807 306217 317943 296113 295945 323877 322782 276304 243281 260302
8814 260302 288705 294579 303478 327995 318894 254764 211693 260114 343573 353131 288863 248981
8802 248981 274125 304403 296941 287575 308124 327641 317457 305743 320716 335347 316538 283553
8790 283553 270482 270451 264204 267062 295721 319421 300724 263354 262142 298999 326089 325741 328109
8777 328109 346883 356606 347780 349001 370329 374415 337500 297607 300750 330728 339293 325339 331514
8764 331514 367317 388445 365832 332073 333990 368318 394196 392261 380112 374431 367196 347428
8752C47428k0098M772L5614L9672O666l5273m3377p015L4529L5612J737j9158
8740C81109m129J6882J3360L07M371J3248r30k6380k6120M5J5691R878R722K3156
8726D30210K0992n548j9552Q67K1808R183j4986j3573K576k20j6394j3985P616
8713D08994K0279J5679Q162Q23r899r700J0514K3282L708j8244l41L3915K6398
8700E13570j6305k9797Q78K1129O271k261J5180J7176j1582j7280K5110M9278
8688E71367K343n5092l6402L3928N9655J7623k4188j7978J3800L4614L2776P518
8676F39964k6784l2104L734K8621k564m4560k4638L5081M9311J0887l374K7317
8664F60891L3429j1609l4233J1452N7345L2268k2329k7397P236J7130k359l600
$$ plain form
8752 347428 327330 332102 367716 407388 414054 378781 335404 328389 362918 398530 400267 381109
8740 381109 376980 393862 407222 407529 411900 425148 424218 397838 371718 371763 387454 397332 407054 430210
8726 430210 451202 445654 426102 426969 448777 457960 442974 429401 431977 431757 415363 401378 408994
8713 408994 429273 444952 453114 453937 444038 434338 444852 468134 471842 453598 453257 487172 513570
8700 513570 497265 467468 468346 489475 495746 493485 508665 525841 514259 496979 522089 571367
8688 571367 573710 518618 482216 516144 575799 593422 569234 551256 565056 599670 632446 639964
8676 639964 613180 581076 584810 613431 610867 566307 541669 576750 626061 636948 633574 660891
8664 660891 694320 682711 648478 659930 717275 749543 727214 699817 707053 724183 721824 718224
8652G18224J8370K1130m435j9070k070K1649K5564J2183j719k173J3492K5649
8640H26794Q899k3033k2304J9499M6831K3512r210l871J6653J3016O616K8435
8628I31837L9980l591n0389j7908O1077P4564Q623l2616P68L5269J4357j0584
8616A051387J0433L1879N510k1520R795N8580N0241K314j1247J4786K2641J961
8604A226760K220L7639O1593M6041J9545J1449J2953J0094J1846K8099M9338N8858
8592A576435M6982J6265j1100o409K5535M4335L5334L5926O5116P3460K1095l6155
8580A886819j6153N9866R2976N2278O591O224K1326J7535J0986J7230J6607L366
8568B175651N017K2022J3450k5471m0857j2983J498l1949o0068l6974j2130m2912
$$ plain form
8652 718224 736594 757724 753289 734219 732149 753798 779362 791545 789826 787653 801145 826794
8640 826794 835693 812660 790356 809855 856686 880198 870988 867117 883770 896786 903402 931837
8628 931837 971817 968226 917837 899929 961006 1035570 1044193 1011577 1012345 1047614 1061971 1051387
8616 1051387 1061820 1093699 1099209 1077689 1087484 1146064 1196305 1198619 1187372 1202158 1224799 1226760
8604 1226760 1228980 1266619 1328212 1374253 1393798 1405247 1418200 1428294 1440140 1468239 1517577 1576435
8592 1576435 1623417 1639682 1628582 1622173 1647708 1692043 1727377 1763303 1828419 1901879 1922974 1886819
8580 1886819 1870666 1930532 2023508 2075786 2082377 2088601 2109927 2127462 2138448 2155678 2172285 2175651
8568 2175651 2180668 2202690 2216140 2190669 2149812 2136829 2138327 2106378 2046310 2009336 1997206 1954294
8556A954294q2340n2559J3690J5392n1788q5667m0373P336j3002o1300o3942k7204
8544A512537j0484k6992l4820j3114N836j1329m7263n3787j5886K2679J2378l2015
8532A307740m5520n454L0658R034l8433m5477j4333k412k1118k2486P928J9583
8520A179710j6004n1176l3983J4791L8801K4626K351o822p001p759j4078k3087
8508A100369j8118J2063M1554K9778j3562l0037K399L4508K2901r181k3384k5158
8496A124132k6355m572M1622N1251r864o4845k2732P1704R0201J1595n2327l2787
8484A177023R232R368K476L3025N6307J7806l4721j7145N1285P2771K1884k1407
8472A377904J330M7931N1342J4039j0464O559M4955O7884N6363K3903O529K5329
$$ plain form
8556 1954294 1871954 1819395 1833085 1848477 1796689 1711022 1670649 1677985 1664983 1603683 1539741 1512537
8544 1512537 1502053 1475061 1440241 1427127 1432963 1421634 1374371 1320584 1304698 1327377 1339755 1307740
8532 1307740 1262220 1256766 1287424 1296458 1258025 1212548 1198215 1195803 1174685 1152199 1160127 1179710
8520 1179710 1163706 1112530 1078547 1093338 1132139 1156765 1159116 1152294 1145293 1137534 1123456 1100369
8508 1100369 1082251 1094314 1135868 1165646 1152084 1122047 1124446 1158954 1181855 1172674 1149290 1124132
8496 1124132 1097777 1093205 1134827 1186078 1176214 1111369 1088637 1160341 1250542 1262137 1209810 1177023
8484 1177023 1186255 1195623 1198099 1231124 1287431 1305237 1270516 1253371 1304656 1377427 1399311 1377904
8472 1377904 1379234 1427165 1478507 1492546 1482082 1488641 1533596 1601480 1657843 1681746 1688275 1713604
8460A713604N7541O3612M1532K8636M7598Q0594J04092J17144J21270J05256P4327
8449B555206O6764J07614J61862J70812J31084J00857J19284J52424J40873P9585
8439C786365K0763L824J2904J1296q660k9509m4353o1264p8666q4740q3314r3045
8427C351601j14087j23304j14497j13701j34800j49186j28461r2332p7783q0760
8417B222690p1654n5249o4582r6730j07432p9783m9289m3915m6834m1694m6448
8406A519080o8354p0831l0929O737j2025o3867p7379l7085J524m58k0691k7812
8394A117910k4688k1655j3864p491k5342n9987o3031j4928L1732K0935k4250l7319
8382H78022p788J0653j1198l6508k5386N620J5045k230j7453j6172j2635j8653
$$ plain form
8460 1713604 1771145 1834757 1876289 1904925 1952523 2033117 2137209 2254353 2375623 2480879 2555206
8449 2555206 2621970 2729584 2891446 3062258 3193342 3294199 3413483 3565907 3706780 3786365
8439 3786365 3807128 3810952 3823856 3835152 3826492 3796983 3752630 3691366 3612700 3527960 3444646 3351601
8427 3351601 3237514 3114210 2999713 2886012 2751212 2602026 2473565 2381233 2303450 2222690
8417 2222690 2151036 2095787 2031205 1934475 1827043 1747260 1697971 1654056 1607222 1565528 1519080
8406 1519080 1450726 1379895 1348966 1355703 1343678 1279811 1202432 1165347 1166871 1166413 1145722 1117910
8394 1117910 1093222 1071567 1057703 1050212 1024870 964883 901852 886924 918656 939591 915341 878022
8382 878022 870234 880887 869689 833181 807795 813415 828460 826230 808777 792605 779970 761317
8370G61317k4233j7092m823m620j6926k2483q848J0049J0906o370j7057n669J2167
8357F66318J0775j2937l8413m4822k6001P130K7506R954l2776m7083j026N9742
8345E78367N7828j1166o4106m0250J6066K0845l0154n9662k1554L6773M3814j218
8333E25583l5542j9116J9537K8110k077l0347k1764J0699K7466J3515r861k1269
8321D84934k3573k4081j4823P585K1194N891j9645j9767L851J4666L69r525J812
8308D28888O705j6948l8783j9934J8992K3244r877k2995J2173M6694K5285l0318
$$ plain form
8370 761317 737084 719992 715169 710549 693623 671140 662292 672341 683247 676877 659820 654151 666318
8357 666318 677093 664156 625743 580921 554920 562050 589556 599510 566734 519651 518625 578367
8345 578367 636195 625029 560923 520673 536739 557584 527430 467768 446214 482987 526801 525583
8333 525583 490041 470925 490462 518572 516495 486148 464384 475083 502549 516064 506203 484934
8321 484934 461361 437280 422457 430042 451236 457127 437482 417715 421566 436232 436601 427076 428888
8308 428888 435593 418645 379862 359928 378920 402164 392287 369292 381465 428159 453444 423126
$$ [...]
##END NTUPLES=NMR SPECTRUM
##END=
