##TITLE=1H ikalashn
K-300-1
10.12.2024
##JCAMPDX= 6.0         $$ Bruker NMR JCAMP-DX V2.0
##DATA TYPE= NMR SPECTRUM
##DATA CLASS= NTUPLES
##ORIGIN= UXNMR, Bruker Analytische Messtechnik GmbH
##OWNER= root
$$ TOPSPIN		Version 1.3
$$ 2024-12-10 15:20:06.453 +0400  Irina@DPX200
$$ Compression mode = diff/dup
##.OBSERVE FREQUENCY= 200.131300845
##.OBSERVE NUCLEUS= ^1H
##.ACQUISITION MODE= SIMULTANEOUS
##.ACQUISITION SCHEME= undefined
##.AVERAGES= 32
##.DIGITISER RES= 18
##SPECTROMETER/DATA SYSTEM= spect
##.PULSE SEQUENCE= zg
##.SOLVENT NAME= DMSO
##.SHIFT REFERENCE= INTERNAL, DMSO, 1, 17.49637
##AUDIT TRAIL= $$ (NUMBER, WHEN, WHO, WHERE, WHAT)
$$ ##TITLE= Audit trail, TOPSPIN		Version 1.3
$$ ##JCAMPDX= 5.01
$$ ##ORIGIN= Bruker BioSpin GmbH
$$ ##OWNER= Irina
$$ $$ F:/spectra/data/iren/nmr/1H/4/pdata/1/auditp.txt
$$ ##AUDIT TRAIL=  $$ (NUMBER, WHEN, WHO, WHERE, VERSION, WHAT)
(   1,<2024-12-10 15:19:37.859 +0400>,<Irina>,<DPX200>,<TOPSPIN 1.3>,
      <created by zg
	started at 2024-12-10 15:17:29.546 +0400,
	POWCHK disabled, PULCHK disabled
       configuration hash MD5:
       BE 6D 3F 07 2A EA 11 49 91 17 2B D3 AF B3 58 0D
       data hash MD5: 16K
       2D BF E1 DF 88 37 9A 47 52 F4 CC 43 C6 A9 FC B2>)
(   2,<2024-12-10 15:19:41.750 +0400>,<Irina>,<DPX200>,<TOPSPIN 1.3>,
      <Start of raw data processing
       fp BC_mod = 2 FT_mod = 6 PKNL = 1 PHC0 = 122.524 PHC1 = -1.812251 SI = 32K 
       data hash MD5: 32K
       81 A9 DF 11 D6 77 EB 31 97 20 FE 3B CE 2C B5 32>)
(   3,<2024-12-10 15:19:54.140 +0400>,<Irina>,<DPX200>,<TOPSPIN 1.3>,
      <apk 
       data hash MD5: 32K
       C6 B8 AB BD 0C E4 BC 14 59 2F 3D F9 69 89 83 46>)
(   4,<2024-12-10 15:19:56.531 +0400>,<Irina>,<DPX200>,<TOPSPIN 1.3>,
      <abs n ABSG = 5 
       data hash MD5: 32K
       FA 5E 32 25 05 A1 AC 5A 09 C8 EC 35 AA 4F D1 00>)
$$ ##END=
$$ 
$$ $$ hash MD5
$$ $$ 02 01 23 6E 79 8B 85 EC AD 74 CD F7 3A A5 08 24
##$RELAX= 
##$RELAX= 
##$RELAX= 
##$RELAX= 
##$RELAX= 
##$RELAX= 
##$RELAX= 
##$RELAX= 
##$RELAX= 
$$ Bruker specific parameters
$$ --------------------------
##$DU= <F:/spectra>
##$EXPNO= 4
##$NAME= <1H>
##$PROCNO= 1
##$TYPE= <nmr>
##$USER= <iren>
##$AMP= (0..31)
100 100 100 100 100 100 100 100 100 100 100 100 100 100 100 100 100 100 
100 100 100 100 100 100 100 100 100 100 100 100 100 100 
##$ANAVPT= -1
##$AQSEQ= 0
##$AQ_mod= 1
##$AUNM= <au_zg>
##$AUTOPOS= <>
##$BF1= 200.13
##$BF2= 200.13
##$BF3= 200.13
##$BF4= 200.13
##$BF5= 200.13
##$BF6= 200.13
##$BF7= 200.13
##$BF8= 200.13
##$BYTORDA= 1
##$CFDGTYP= 0
##$CFRGTYP= 5
##$CHEMSTR= <none>
##$CNST= (0..63)
1 1 145 1 1 1 1 1 1 1 1 1 1 1 1 1 1 1 1 1 1 1 1 1 1 1 1 1 1 1 1 1 1 1 
1 1 1 1 1 1 1 1 1 1 1 1 1 1 1 1 1 1 1 1 1 1 1 1 1 1 1 1 1 1 
##$CPDPRG= <>
##$CPDPRG1= <>
##$CPDPRG2= <>
##$CPDPRG3= <>
##$CPDPRG4= <mlev>
##$CPDPRG5= <mlev>
##$CPDPRG6= <mlev>
##$CPDPRG7= <mlev>
##$CPDPRG8= <mlev>
##$CPDPRGB= <>
##$CPDPRGT= <>
##$D= (0..63)
0 2 0 0 0 0 0 0 0 0.06 0 0.03 0 0 0 0 0.0002 0 0 0 0 0 0 0 0 0 0 0 0 0 
$$ [...]
##$SW_h= 4401.40845070422
##$TD= 16384
##$TD0= 1
##$TE= 300
##$TE2= 300
##$TE3= 300
##$TEG= 300
##$TL= (0..7)
0 120 120 120 120 120 120 120 
##$TP= (0..7)
150 150 150 150 150 150 150 150 
##$TP07= 0
##$TPNAME0= <>
##$TPNAME1= <>
##$TPNAME2= <>
##$TPNAME3= <>
##$TPNAME4= <>
##$TPNAME5= <>
##$TPNAME6= <>
##$TPNAME7= <>
##$TPOAL= (0..7)
0.5 0.5 0.5 0.5 0.5 0.5 0.5 0.5 
##$TPOFFS= (0..7)
0 0 0 0 0 0 0 0 
##$TUNHIN= 0
##$TUNHOUT= 0
##$TUNXOUT= 0
##$USERA1= <user>
##$USERA2= <user>
##$USERA3= <user>
##$USERA4= <user>
##$USERA5= <user>
##$V9= 5
##$VALIST= <valist>
##$VCLIST= <CCCCCCCCCCCCCCC>
##$VD= 0
##$VDLIST= <DDDDDDDDDDDDDDD>
##$VPLIST= <PPPPPPPPPPPPPPP>
##$VTLIST= <TTTTTTTTTTTTTTT>
##$WBST= 1024
##$WBSW= 25
##$XGAIN= (0..3)
0 0 0 0 
##$XL= 0
##$YL= 0
##$YMAX_a= 2599893
##$YMIN_a= -2270647
##$ZGOPTNS= <>
##$ZL1= 120
##$ZL2= 120
##$ZL3= 120
##$ZL4= 120
##$ABSF1= 17.49637
##$ABSF2= -4.496376
##$ABSG= 5
##$ABSL= 3
##$ALPHA= 0
##$AQORDER= 0
##$ASSFAC= 0
##$ASSFACI= 0
##$ASSFACX= 0
##$ASSWID= 0
##$AUNMP= <proc_1d>
##$AXLEFT= 0
##$AXRIGHT= 0
##$AXTYPE= 0
##$AXUNIT= <>
##$AZFE= 0.1
##$AZFW= 0.1
##$BCFW= 0
##$BC_mod= 2
##$BYTORDP= 0
##$COROFFS= 0
##$CY= 7568.61572265625
##$DATMOD= 1
##$DC= 0
##$DFILT= <>
##$DTYPP= 0
##$F1P= 17.9538593292236
##$F2P= -4.03888763876832
##$FCOR= 0.5
##$FTSIZE= 32768
##$FT_mod= 6
##$GAMMA= 0
##$GB= 0
##$INTBC= 0
##$INTSCL= 5.656564e-011
##$ISEN= 128
##$LB= 0
##$LEV0= 0
##$LPBIN= 0
##$MAXI= 945.577
##$MC2= 0
##$MEAN= 0
##$ME_mod= 0
##$MI= -402.1523
##$NCOEF= 0
##$NC_proc= -3
##$NLEV= 6
##$NOISF1= 8.587773
##$NOISF2= 6.764455
##$NSP= 0
##$NTH_PI= 0
##$NZP= 0
##$OFFSET= 17.49637
##$PC= 1
##$PHC0= 121.3709
##$PHC1= -1.812251
##$PH_mod= 1
##$PKNL= yes
##$PPARMOD= 0
##$PPDIAG= 0
##$PPIPTYP= 0
##$PPMPNUM= 100
##$PPRESOL= 1
##$PSCAL= 0
##$PSIGN= 0
##$REVERSE= no
##$SF= 200.13
##$SI= 32768
##$SIGF1= 16.12182
##$SIGF2= -4.496377
##$SINO= 3.521527
##$SIOLD= 32768
##$SREGLST= <1H.CDCl3>
##$SSB= 0
##$STSI= 32768
##$STSR= 0
##$SW_p= 4401.40845070422
##$SYMM= 0
##$S_DEV= 0
##$TDeff= 16384
##$TDoff= 0
##$TI= <>
##$TILT= no
##$TM1= 0
##$TM2= 0
##$TOPLEV= 0
##$USERP1= <user>
##$USERP2= <user>
##$USERP3= <user>
##$USERP4= <user>
##$USERP5= <user>
##$WDW= 0
##$XDIM= 32768
##$YMAX_p= 323965071
##$YMIN_p= -428780
$$ End of Bruker specific parameters
$$ ---------------------------------
##NTUPLES= NMR SPECTRUM
##VAR_NAME=  FREQUENCY,     SPECTRUM/REAL,   SPECTRUM/IMAG
##SYMBOL=    X,             R,               I
##VAR_TYPE=  INDEPENDENT,   DEPENDENT,       DEPENDENT
##VAR_FORM=  AFFN,          ASDF,            ASDF
##VAR_DIM=   32768,         32768,           32768
##UNITS=     HZ,            ARBITRARY UNITS, ARBITRARY UNITS
##FACTOR=    0.134324425510551, 1,           1
##FIRST=     4401.40845070422, -120026,      -173369
##LAST=      0,             -18870,          -207632
##MIN=       0,             -428780,         0
##MAX=       4401.40845070422, 323965071,    0
$$ Real data points
##PAGE= N=1
##DATA TABLE= (X++(R..R)), XYDATA
$$ [...]
14954e1663K4005K0666l6144p0814j5992N3719M2159j1186k0616m979j9793l1028
14942a21666R779M8668J8923l2468l2991j3468k4849k3719K6597M8061j1372m5275
14930a53780L3440J03475K5521r2793n9432O6953P1608m5546q1046Q837N0682
14919g2081j7701n0693J5193N0132o155l0633L1147M8471l8702q6681r579N5580
14907a11702K347m7639J9109Q3003J1295q2567l2781P8031O0644n2764p5627J4381
14895a34270O8779L5627M186N574j8422n5326k7508M0641M1997k2593m3815J048
14883a04082K0630j3131k5183O812J4829j6740j8973K4745M8328L0370J7404R082
14871e909l7422q1692l6319N8559O6932j4741m3891J8216M2869j9235m0141L8666
$$ plain form
14954 -51663 -27658 -6992 -43136 -113950 -129942 -76223 -34064 -45250 -65866 -70845 -90638 -121666
14942 -121666 -111887 -63219 -44296 -76764 -109755 -123223 -148072 -171791 -145194 -97133 -108505 -153780
14930 -153780 -120340 -16865 8656 -84137 -143569 -76616 -5008 -50554 -131600 -122763 -72081
14919 -72081 -89782 -140475 -125282 -75150 -81305 -111938 -80791 -32320 -71022 -157703 -167282 -111702
14907 -111702 -109355 -156994 -137885 -54882 -43587 -126154 -158935 -80904 -20260 -73024 -148651 -134270
14895 -134270 -65491 -29864 -25678 -20104 -38526 -93852 -121360 -80719 -38722 -61315 -105130 -104082
14883 -104082 -83452 -96583 -121766 -114954 -100125 -116865 -135838 -111093 -62765 -32395 -14991 -5909
14871 -5909 -43331 -125023 -161342 -102783 -35851 -50592 -94483 -76267 -33398 -52633 -92774 -54108
14859e4108P3870k6009j11253l4281Q5173N1091p8386q7322M2601J12214K7170
14848G60p6952o4343K2774P1042M8113q785n7752o1131p483M7780L4578k6272
14836g7671m5662k380K9218M742k5504j0226K2787K4279Q51j0067L88J5268K2358
14823e1619J6207l462j9981j3225P614J4228L773q73M940J922j3724k3905k2530
14810a00635j8197o946J5965K4739o108m4727l3990J8546M6233K6482R227K3498
14798d5913K8403o627l9750k5890O232N646j3612k602L1391L3553n483l1461j2094
14785g8207J6029J1037r371m746J6619J1233k3733l9394j2597J2662o292l8511
14773a45271k4901K7104N4340L5722J3474J1048Q54k5757k9552R96J7100k876
$$ plain form
14859 -54108 19762 -6247 -117500 -151781 -66608 -15517 -93903 -181225 -138624 -26410 760
14848 760 -76192 -140535 -117761 -46719 1394 -7391 -65143 -126274 -133757 -85977 -51399 -77671
14836 -77671 -123333 -125713 -96495 -91753 -117257 -127483 -104696 -80417 -79566 -89633 -89245 -73977 -51619
14823 -51619 -35412 -38874 -58855 -72080 -64466 -50238 -46465 -47338 -42398 -40476 -54200 -78105 -100635
14810 -100635 -118832 -125778 -109813 -85074 -91182 -135909 -169899 -151353 -105120 -78638 -69411 -45913
14798 -45913 -17510 -24137 -63887 -89777 -83545 -77899 -91511 -94113 -62722 -29169 -34652 -66113 -78207
14785 -78207 -62178 -51141 -60512 -65258 -48639 -37406 -61139 -100533 -113130 -100468 -106760 -145271
14773 -145271 -170172 -143068 -88728 -53006 -39532 -28484 -27630 -53387 -82939 -81943 -64843 -67719
14761f7719p380L0713M8801J290m6051k3117J5397j6396p4115n1516L2200O3170
14749i4723K6943J2369K9405l352p3201n9986M4488Q7837M296o7662j7365N8364
14737e2587L7068k3419j4868K0826o988m8880j2048M6999J9653m1008q538P2700
14725a1090N1325n4854p6464J3862N7080j2135o7194k9829Q824j0712k899O9614
14713f4472Q7792q642q1132j9292N9586J3119p2995l7355O8343O6894m0521q4765
14701a13440j2489N5080M6505K4039K2556q733o3451m9872L6771P1039k721p0632
14689f5348l3950L5439K5553l5619m3714J2252N3540L9751M63l1183m2400k3519
14677a08735J4568L2148J4760k23J0567J4378r725k1148O635K3307j3925n2397
$$ plain form
14761 -67719 -75099 -44386 4415 5705 -40346 -63463 -48066 -64462 -138577 -190093 -157893 -94723
14749 -94723 -67780 -55411 -26006 -29358 -102559 -162545 -118057 -30220 -25924 -93586 -110951 -52587
14737 -52587 -15519 -38938 -53806 -32980 -39968 -88848 -100896 -53897 -34244 -75252 -83790 -11090
14725 -11090 40235 -14619 -91083 -77221 -20141 -32276 -99470 -129299 -120475 -131187 -134086 -64472
14713 -64472 23320 14678 -66454 -85746 -26160 -13041 -86036 -123391 -55048 11846 -28675 -113440
14701 -113440 -125929 -70849 -24344 -305 22251 13518 -49933 -99805 -63034 8005 5284 -65348
14689 -65348 -99298 -63859 -38306 -73925 -117639 -105387 -51847 -12096 -11633 -42816 -85216 -108735
14677 -108735 -94167 -62019 -47259 -47482 -36915 -22537 -32262 -53410 -46775 -23468 -37393 -89790
14665h9790k6077K5742K1330k0532j2681M3651N3534j1573o1921l0672K9402L7498
14653d2089k646l2262k2916J1872M5073M3845n422n5957l9773K7923N1216n253
14641b6389n5694k8190K1005R445k7756n719M8713L5406l5678m3898L5356O8134
14629e265k4078j16235o0811P3946R5312k1880r5945j4591R8858P7811l9982q1005
14617a13865J987P5282L8072l6498l3053K8066L8773k0508n9445k7586J5588J0599
14605h2588q689J0201L6517R225m6648m7647J2838M7413Q903m1958l8259o21K1693
14592a19620L4748N6847N0606j4044p0896l5415M8443N5366k2988n4493J9611
14581e1835P8350J2540r0279p7105L0201P3809O921n3031k8521J0081r459l8374
$$ plain form
14665 -89790 -115867 -90125 -68795 -89327 -102008 -58357 -4823 -16396 -78317 -108989 -79587 -42089
14653 -42089 -44735 -76997 -99913 -88041 -42968 877 -4545 -60502 -100275 -72352 -21136 -26389
14641 -26389 -82083 -110273 -89268 -79823 -107579 -113298 -64585 -29179 -64857 -108755 -73399 -5265
14629 -5265 -29343 -145578 -206389 -132443 -37131 -59011 -154956 -169547 -70689 7122 -32860 -113865
14617 -113865 -111878 -36596 1476 -35022 -68075 -40009 -1236 -21744 -81189 -108775 -93187 -82588
14605 -82588 -91277 -81076 -44559 -35334 -81982 -129629 -116791 -69378 -60475 -102433 -140692 -141313 -119620
14592 -119620 -84872 -28025 22581 8537 -62359 -97774 -49331 6035 -16953 -71446 -51835
14581 -51835 26515 39055 -51224 -128329 -98128 -24319 -17398 -70429 -98950 -88869 -98328 -136702
14569a36702j1447K9546J7433j2532J1219N5045K8170m9970n9791K6527Q5207
14558a7295K3930p5921p9937N248N6178J9900k6227j1902K3194J3579j4483R321
14546g4415O5154N4333m0359j01454m2591N0666M1676m5634o2618K5419Q0829
14535d8994J6414o4347m0325L4314L8262p918J869N1041K7464n6403n9314M2885
14523f5052R2450M259q5781m0220N7070M5046n3761q3907p994N9267M6598M630
14511b7395j4933k5399l1425n397L6017L2577j5544l7351r371Q784j3678k5898
14499a29013N561L4092J8882n869R5J5930J3416J0725K0980J3394k0900l1534
14487e4241M718K8617m587m0178j2863M0367M2801K252j9416j8996l5846n3580
$$ plain form
14569 -136702 -148149 -118603 -101170 -113702 -102483 -47438 -19268 -69238 -129029 -102502 -17295
14558 -17295 6635 -69286 -149223 -143975 -87797 -67897 -94124 -106026 -82832 -69253 -83736 -74415
14546 -74415 -9261 45072 4713 -96741 -139332 -88666 -46990 -92624 -155242 -129823 -48994
14535 -48994 -32580 -96927 -137252 -102938 -64676 -72594 -70725 -19684 7780 -48623 -107937 -65052
14523 -65052 27398 31657 -54124 -94344 -37274 7772 -45989 -129896 -137890 -78623 -32025 -27395
14511 -27395 -42328 -67727 -99152 -104549 -68532 -35955 -51499 -88850 -98221 -89437 -103115 -129013
14499 -129013 -123452 -89360 -70478 -76347 -76252 -60322 -46906 -36181 -15201 -1807 -22707 -54241
14487 -54241 -49523 -20906 -25493 -65671 -78534 -38167 4634 6886 -12530 -31526 -67372 -120952
14475a20952k1220M0108N1428l76m1036k1006K5987M6704K6692j9404n8927m9033
14463a41035R967M8009J5571l1102j5481K7618J2512l7967k6621L8161M7655j1591
14451f4304k9955K1502L1295m1238o9129K2643J03453M2681o9535p0674J6203
14440a07058N0411J4247j551P703k6158p2509l7506M4131M5519k5516l3406L7439
14428a04254N1620k0706l6659N2182Q6174k6058j22499m4560R4402R4911r480
14417A5073l8591K1453K5198n4321q4163j3612M8024L0982K683J5676J8612j8709
14405c1695l4815p98J4204k4425m1133J0712N0826R302m4486k1258L1517J7103
14393f4946l7988l4633K2366L7302p115k7882P895L4954J3702q545N302J9854
$$ plain form
14475 -120952 -142172 -102064 -50636 -51012 -92048 -113054 -87067 -40363 -13671 -33075 -92002 -141035
14463 -141035 -131068 -83059 -67488 -98590 -114071 -86453 -73941 -111908 -138529 -100368 -52713 -64304
14451 -64304 -94259 -72757 -41462 -82700 -151829 -129186 -25733 16948 -52587 -123261 -107058
14440 -107058 -56647 -42400 -43951 -36248 -62406 -134915 -172421 -128290 -82771 -108287 -141693 -104254
14428 -104254 -52634 -73340 -109999 -57817 28357 2299 -120200 -164760 -70358 24553 15073
14417 15073 -23518 -2065 23133 -31188 -115351 -128963 -80939 -49957 -47274 -31598 -12986 -31695
14405 -31695 -66510 -67308 -53104 -77529 -118662 -107950 -57124 -47822 -92308 -113566 -82049 -64946
14393 -64946 -102934 -137567 -115201 -77899 -85014 -112896 -105001 -70047 -56345 -64890 -59588 -39734
14381c9734M372j0526P58Q066j0938k1562L022K6255J0805j6093j5126l329j0968
14368g4998j6658Q199L1924J3423j5245L33L2733J4698l2387k2794L7384M1735
14356A8347l4577p1761L455Q0806L2129p6923q3711J4836O4652P385l6619J6702
14344f5279P1478J7241q0787q2232R821O4521K6561k4237j8842J0929J7104J4265
14332c9457K6640K9173l866m2041m3214j9071q020j0161K666K9142L7261J6743
14320b4205n186m148J2235K1303J3040n198k0280k4053j6637k904J0500J4029
14308c1504J556j5084j2932P155J3339o386j3359K1753N4621K3331m5735o3293
14296f6538j1345L0441J2603j6503r260K439j4260j7858K6035N8296J4453n5562
$$ plain form
14381 -39734 -35362 -45888 -45130 -37064 -48002 -69564 -66542 -40287 -29482 -45575 -60701 -64030 -74998
14368 -74998 -91656 -83457 -51533 -38110 -53355 -53022 -20289 -5591 -37978 -60772 -23388 18347
14356 18347 -16230 -87991 -84536 -3730 28399 -48524 -132235 -117399 -52747 -45362 -81981 -65279
14344 -65279 6199 23440 -57347 -139579 -129758 -65237 -38676 -62913 -81755 -70826 -53722 -39457
14332 -39457 -12817 16356 12490 -29551 -72765 -91836 -99856 -110017 -107351 -78209 -40948 -24205
14320 -24205 -29391 -33539 -21304 -1 13039 7841 -12439 -36492 -53129 -56033 -45533 -31504
14308 -31504 -29948 -45032 -57964 -50809 -37470 -43856 -57215 -35462 19159 42490 -3245 -66538
14296 -66538 -77883 -47442 -34839 -51342 -60602 -58163 -72423 -90281 -64246 -5950 8503 -47059
14284d7059n7198L8K9597J2977N349J5442o01k9857j0647L9687L1121l9212o1776
14271a12139O182O2002K3735m1048l5309J8319M0159K2036K155j4804k5780O338
14259d8154O8315O2165m2006j11398l8057O8372L8561p6971q3827L4062Q8800
14248d0138L992o5799l690Q2322N6726k4514l4496J1041J3412k4569k4505J5429
14236c4789L2602K2474K2580J1722m7780r8742n4562M0977N8709j0717m0476K0280
14224g7722O2852M094p4469n8559K5747O8727M0831L008o989q785j6484j6177
14212e3926n708l898j7233l0471k6364M318N3600Q1723M7462k3723m9238l715
14200b7173L1361j0756o7117l7190M9394O6944j0542o4346j3116O5131N5660k7926
$$ plain form
14284 -47059 -104257 -104219 -74622 -61645 -56296 -40854 -41455 -71312 -81959 -42272 -11151 -50363 -112139
14271 -112139 -105957 -43955 -20220 -61268 -96577 -78258 -38099 -16063 -13908 -28712 -54492 -48154
14259 -48154 20161 82326 40320 -71078 -109135 -40763 -2202 -79173 -163000 -128938 -40138
14248 -40138 -36146 -101945 -105635 -23313 33413 8899 -25597 -14556 -1144 -25713 -50218 -34789
14236 -34789 -2187 20287 42867 54589 6809 -91933 -146495 -105518 -46809 -57526 -98002 -77722
14224 -77722 -14870 -10776 -85245 -143804 -118057 -49330 -8499 -5491 -12480 -21265 -37749 -53926
14212 -53926 -59634 -63532 -80765 -111236 -137600 -133282 -79682 2041 49503 25780 -23458 -27173
14200 -27173 4188 -6568 -73685 -110875 -61481 5463 -5079 -69425 -82541 -17410 38250 10324
14188A0324q0253n5264n53L1257L0376K013m0184n4302o496O5874Q3321K8407
14176A4520l1037l8484j5598o461n390J6233M5082L9165m422l7974k4452J6928
14164c1890L6052J0667k8728l5477p770M682k6335n2427j3427N7000O2959o374
14152c1068m8417o899L3465r505o3381j3048R1885R3137k4476r8167l7542M4939
14140f9077K7072l7571l5537J4695J9481j5033o818M1091M1862k0935o4110l9737
14128a44617P130L0940L9818L9728J4950j6000j0386J5967M095l5101k4176L9702
14116c7950N8840n376o0808l6451N361p550k7368J2954O0725L2325k9282k4234
14104e8814K7414K5740k3877k3897K5141J6448n6623n9478N2346J23917L3128
$$ plain form
14188 10324 -69929 -125193 -125746 -94489 -64113 -62100 -102284 -156586 -163082 -97208 -13887 14520
14176 14520 -16517 -55001 -70599 -77060 -82450 -66217 -21135 18030 13608 -24366 -48818 -31890
14164 -31890 4162 14829 -13899 -49376 -57146 -52464 -78799 -131226 -144653 -87653 -24694 -31068
14152 -31068 -79485 -86384 -52919 -62424 -125805 -138853 -46968 46169 21693 -76474 -114016 -69077
14140 -69077 -42005 -79576 -115113 -100418 -80937 -95970 -102788 -61697 -19835 -40770 -104880 -144617
14128 -144617 -137487 -106547 -66729 -27001 -12051 -28051 -38437 -22470 -18375 -53476 -77652 -37950
14116 -37950 20890 15514 -45294 -81745 -76384 -83934 -111302 -98348 -37623 -5298 -34580 -58814
14104 -58814 -31400 -5660 -29537 -53434 -28293 -11845 -68468 -127946 -75600 48317 81445
14093H1445j01762r1549L8312R6391J8564n6952k1448M9857L8498l5067o3066
14082d6777k0546J5454j115k2686J778M1052L3072j3752l0354N283L0782l191
14070a1000m9690l4575K2785L3024k1621n2563k184O1128M5569k3584m6218M70
14058g8459L9487J9536k0959l2343k0949o638J9649N2553M6324j1270m9416q595
14046e1080N3207L2962n7000r6548l3672M5133N5998L4760M6572N8902L052q4720
14034G566r6633j9049M2494K1602k2610j5360K2935L1566Q557r773j9442l3743
14022h1890l3261M710N0566N4607J7777j8409l1814k3998O295M2056L4242k8190
14010g309o8473j8531O4022O6649q119m7754n861L7766J8222k0393j8751J916
$$ plain form
14093 81445 -20317 -111866 -73554 22837 41401 -15551 -36999 12858 51356 16289 -46777
14082 -46777 -67323 -51869 -52984 -75670 -73892 -32840 232 -13520 -43874 -38591 -7809 -11000
14070 -11000 -60690 -95265 -72480 -39456 -61077 -113640 -115824 -54696 -9127 -32711 -78929 -78459
14058 -78459 -38972 -19436 -40395 -72738 -93687 -100325 -80676 -28123 18201 6931 -42485 -51080
14046 -51080 2127 35089 -21911 -118459 -152131 -106998 -51000 -16240 30332 89234 92286 7566
14034 7566 -89067 -108116 -65622 -44020 -66630 -81990 -59055 -27489 -18932 -28705 -48147 -81890
14022 -81890 -115151 -110441 -59875 -5268 12509 -5900 -37714 -61712 -55417 -13361 20881 -7309
14010 -7309 -75782 -94313 -30291 36358 28239 -19515 -25376 12390 30612 10219 -8532 -6616
13998f616k917k1993k5674k1164j7536N265M3187M6081J06l3017j4918J323l1502
13985g9375o0433j8737N3544O8800K6443n138n315p091j4365m364Q513m016j9310
13972f0844l246J5780j592j8351J4172M5075n03o7051l4954P0111R4271m55p3777
13959b1364l6257J9976k347m5096j6519M5149M9317O824r935M905Q382M94K727
13946F256m486l4509l8538J3855N4861J5604n1630n3083m726J1400j175K4621
13934f1550P0594M6379m4227q3460j6854O3055N4859j9991p0877n4589K993M9902
13922f3766M5153m528l6144l886M7438M3189k874j3595J6807J3448m2555p3380
13910g4693l2595K2871L1663J1733K27o685p876K2973O1511K9151p1326j13381
$$ plain form
13998 -6616 -9533 -31526 -57200 -78364 -95900 -90635 -47448 -1367 -1261 -34278 -49196 -47873 -79375
13985 -79375 -139808 -158545 -105001 -36201 -9758 -14896 -20211 -27302 -41667 -46031 -37518 -41534 -60844
13972 -60844 -64090 -48310 -49902 -68253 -54081 -9006 -9509 -76560 -111514 -41403 52868 52413 -21364
13959 -21364 -57621 -37645 -39992 -85088 -101607 -56458 -7141 -317 -10252 -5347 3035 3529 6256
13946 6256 1770 -32739 -71277 -57422 -2561 13043 -38587 -91670 -96396 -84996 -86171 -61550
13934 -61550 9044 55423 11196 -72264 -89118 -26063 28796 8805 -62072 -116661 -113668 -63766
13922 -63766 -18613 -23141 -59285 -63171 -15733 27456 24582 10987 27794 41242 -1313 -74693
13910 -74693 -107288 -84417 -52754 -41021 -40794 -47479 -55355 -32382 29129 58280 -13046 -126427
13898a26427k4815Q2476O8419k5572n1390J3333N2728J5218k0411l035N100m1428
13886e5804o9916o231Q4782P9119k0879q2532k8961N8581O3023q035n0217k0955
13874e8025J1634r353l8771j3144L5764L2981p891m115M9093N9133q359o0536
13862a1589k3104L8009K5277l2564l4281K6097N4489P064n3944o3472l1400N27
13850i8891J5007J2908P4n570Q540K4217K0875J5522K8457L1130q679m9600k5192
13837c1202L8425M6434j3660m5154J765M7287J3888m6713m0317J9241L9631m567
13825B5058m7796m4012j7913J304K3852N2791N2381J928n4431n3837K692M9359
13813h624L8006p479l1407j8573j021k380r195m127N763J1324K0038K8761J2915
$$ plain form
13898 -126427 -151242 -68766 -347 -25919 -77309 -63976 -11248 3970 -16441 -19476 -14376 -55804
13886 -55804 -125720 -131951 -47169 31950 11071 -71461 -100422 -41841 21182 13147 -37070 -58025
13874 -58025 -46391 -55744 -94515 -107659 -71895 -38914 -46805 -50920 -1827 57306 48947 -11589
13862 -11589 -34693 3316 28593 -3971 -38252 -12155 42334 49398 -4546 -68018 -99418 -98891
13850 -98891 -83884 -70976 -70902 -76472 -67932 -43715 -22840 -7318 21139 52269 43590 -6010 -31202
13837 -31202 7223 53657 39997 -5157 -3392 43895 57783 11070 -29247 -10006 29625 25058
13825 25058 -22738 -66750 -84663 -83359 -59507 -6716 45665 47593 -6838 -60675 -57983 -8624
13813 -8624 29382 21903 -9504 -28077 -29098 -31478 -40673 -44800 -39037 -27713 -7675 21086 34001
13800C4001k3027k4087L3184P4092J7422q6457j02902n562P6296L9320n4500q0387
13788a02607k1618L8699M9630L4104J9547K038j9857l1611k9517k2221o494K3182
13776f6725M5149K8834j5748m0928k1133J6281K8682Q303j4991j2789P795J3887
13764b3383p287k6289j2989J5216J9448K494K53J3529M927k7145l3234O259M5132
13751b3069M5556K8535J7532l375l3802k9846J3382K4285l0834o8334j1080P2918
13739A868O4909j8473n5838j2766K5217R612p671J0656K4122L954j3109l174m28
13726B8879k0532k0025J9970M3981Q812m3626n2381k1677Q542K5420L0763J3044
13714B1170k3510m2197k3544N866K0117K4113J7269j4622m7709k8126L6662O6772
$$ plain form
13800 34001 10974 -13113 20071 94163 111585 25128 -77774 -83336 -7040 32280 -22220 -102607
13788 -102607 -124225 -85526 -35896 -1792 17755 19793 -64 -31675 -61192 -83413 -89907 -66725
13776 -66725 -21576 7258 -8490 -49418 -70551 -54270 -25588 -17285 -32276 -45065 -37270 -23383
13764 -23383 -30670 -56959 -69948 -54732 -35284 -32790 -32537 -19008 -14081 -41226 -74460 -68201 -23069
13751 -23069 22487 51022 68554 65179 31377 1531 14913 39198 8364 -59970 -71050 1868
13739 1868 66777 48304 -7534 -20300 4917 14529 6858 17514 41636 45590 32481 29307 28879
13726 28879 8347 -11678 8292 52273 61085 17459 -34922 -56599 -48057 -22637 8126 21170
13714 21170 -2340 -44537 -68081 -62215 -42098 -17985 -716 -15338 -63047 -91173 -54511 12261
13702A2261K7854j7313j8977j4801l5145k8780L3058O7882N564p2587m5435M8547
13690c7872O4265j9496o9050r452O6714N2705j8420m3732l934K8571N807l3212
13678a7106k2959L3240N4830j0620r3942p5784M0762J13043N7333k9648k7895
13667B1254J9901R79o1800n3006K2527M1206k1896m7677J8627P4700M0150j7177
13655C7788j6763J134k4952n4551k9180J0492J644k0910O979N2479M1182q646
13643c304j9653J0336J6535j2118k4725r391n075j5302o87L7455M7273J0992k8856
13630C480l6899k0855J908J9891J4625j4129k3494J3707M5277P803n8303n0978
13618i7967L5544Q9258M0310m3517o2686j8143J5214K146k0433q714K8249L9591
$$ plain form
13702 12261 40115 22802 3825 -10976 -46121 -74901 -41843 26039 31603 -40984 -86419 -37872
13690 -37872 26393 6897 -62153 -71605 -4891 47814 29394 -14338 -18272 10299 16106 -17106
13678 -17106 -40065 -6825 48005 37385 -56557 -132341 -91579 21464 78797 49149 21254
13667 21254 41155 42134 -19666 -72672 -50145 -8939 -30835 -78512 -59885 14815 54965 37788
13655 37788 21025 22159 -2793 -57344 -86524 -76032 -74388 -95298 -88319 -35840 5342 -3304
13643 -3304 -22957 -12621 3914 -8204 -32929 -42320 -47395 -62697 -63384 -25929 21344 32336 3480
13630 3480 -33419 -54274 -52366 -32475 -17850 -31979 -55473 -41766 3511 11314 -46989 -97967
13618 -97967 -62423 26835 67145 23628 -39058 -57201 -41987 -39841 -60274 -68988 -40739 -1148
13606a148k949n7843n3288J7217P6553O5579J6463j2689j9717k1534q04L6980
13594D2820K4849n0224p2382L0266J16088J6150j61983j48362O7661J87883N1168
13583A03934j26210r8173M9440Q3607m671m6404K114L6672K2045J5942J4048l2013
13571B0331p2544k5487M6275K0178n1971j4370R9762R1263o1006j36650k9254
13560a13473Q5616N5175j5342R790N0064j1511q2091k1819Q2931N4377o1326o7163
13548c4772M5899Q8258l372p4109k4518M2506K1807l1479l0207L057J4651J7688
13536C5409K7181O444m4421n0882R898M8779Q216l8542j7919J8909J942k5288
13524b0274M195M4165J8169l0279r452M9631L9757l4719o3388j4370K7842J6294
$$ plain form
13606 -1148 -4097 -61940 -115228 -98011 -21458 44121 60584 47895 28178 6644 5840 42820
13594 42820 67669 17445 -54937 -24671 91417 107567 -54416 -202778 -135117 52766 103934
13583 103934 -22276 -120449 -71009 12598 7927 -38477 -36363 309 22354 38296 52344 20331
13571 20331 -52213 -77700 -31425 -11247 -63218 -77588 22174 113437 52431 -84219 -113473
13560 -113473 -27857 27318 11976 21766 71830 60319 -21772 -43591 39340 93717 32391 -34772
13548 -34772 11127 99385 96013 21904 -2614 39892 61699 30220 13 3070 17721 35409
13536 35409 62590 69034 24613 -26269 -16371 32408 40624 2082 -15837 3072 5014 -20274
13524 -20274 -16079 28086 46255 15976 6524 56155 95912 61193 -2195 -16565 11277 27571
13512B7571j406J213j2727m0181k0268L9434M4737k3095n3811J0440O5058J3927
13500E0892o1995l5049N5919P0129q154o0454l4441l050j0683l738M2184N3966
13488E5526r678o4798k7155M6407M2029l3993o7806j1639N5506N4607J0519o999
13476D2526J3707K9488J5396j0991k5703k4199j3285q76N080K705R44P854J7573
13463F0219J8545Q944o112k3385l4066k0508J7114M2190K2480j4918j1142L5227
13451I4588N5741J2474m0487m0006j2896k5811o5668n4741J6398O0498K5997k2890
13439C197r360L8745M3364K172j9883l985j76l1240m7338o312N2752N8332L977
13426H4245m2966k9246J6212K1466k7629n7623n978P5297P4405j9179q5357m2317
$$ plain form
13512 27571 26165 27378 14651 -25530 -45798 -6364 38373 15278 -38533 -28093 36965 50892
13500 50892 -11103 -46152 9767 79896 71742 11288 -23153 -26203 -36886 -40624 1560 55526
13488 55526 45848 -18950 -46105 302 42331 8338 -59468 -71107 -15601 39006 49525 42526
13476 42526 56233 85721 101117 90126 64423 40224 26939 26063 31143 33848 34792 42646 60219
13463 60219 78764 87708 81596 58211 24145 3637 20751 62941 85421 70503 59361 94588
13451 94588 150329 162803 122316 82310 69414 43603 -22065 -76806 -60408 90 26087 3197
13439 3197 -6163 32582 75946 78118 58235 54250 54074 22834 -24504 -30816 21936 80268 84245
13426 84245 41279 12033 28245 49711 22082 -35541 -41519 33778 108183 89004 3647 -38670
13414c8670L4281L3907j5623o728N5756N6027l4212r6204m9730K5087K8118m037
13402a2028J4387N4642K5997m9971n5743K9400Q1864J9509p1233o3938K5201O9995
13390F8082J6045n6821n8342k838L3709K5761J4606K5366K5175j3710n3013l7450
13378a3430J6241L5553j480l3558r234L9317M9558J3697k9285n2177m7254p277
13366c9329N1164P0974J8590n0049m7066K7658Q2189N3712j9353o0321m3818l389
13354D0962J6768Q96k5555j9405K2631M4161M582m5646k6312M4256O1459r024
13342A09773p0629l5946M4949O2517L949m5410l3152K228N845j9891l2670p300
13330a5737L8322N8985K6170l1948n1285j1444L0558J6874k7308l2801Q272L4448
$$ plain form
13414 -38670 -4389 29518 13895 7167 62923 118950 84738 -11466 -61196 -36109 -7991 -12028
13402 -12028 2359 57001 82998 33027 -22716 6684 88548 108057 36824 -27114 -1913 68082
13390 68082 84127 27306 -31036 -33874 -165 25596 40202 65568 90743 77033 24020 -13430
13378 -13430 2811 38364 36884 3326 -5908 33409 82967 96664 67379 15202 -32052 -39329
13366 -39329 11835 82809 101399 51350 4284 31942 114131 167843 148490 88169 44351 40962
13354 40962 57730 58626 33071 13666 36297 80458 85040 39394 13082 57338 118797 109773
13342 109773 39144 3198 48147 110664 114613 69203 36051 38279 44124 24233 -8437 -15737
13330 -15737 22585 81570 107740 75792 24507 13063 43621 60495 33187 386 8658 43106
13318D3106J2532j6885j0751J2247J2843l321m395Q737R163k518J60J4275M976
13305H0169k6503k5047L0424O7313J0678r0659j09531j6678P3001O3165K811j1272
13293D7871J3765N121l2690k6083K7675M3158j0487n2905j9800M0856N2556J7044
13281A06081j9131m1231m9852k5097K8765N2458J1626l6306k3284K2165K3662
13270D9856j9251l7067l699L2575K8983l654l3244l8561j4294J8521K4323O225
13258A0713R998L9996L2898k8472n3532J4053P2682Q826r8132p9849M6261R3320
13246F8762L417o6734j1487O1611L1460l9980l7883J0874J5419p703J2263M9376
13234H9395K8620k6787l4121p26j441l1892j7252M1985O1106J5169k4972j7538
$$ plain form
13318 43106 55638 38753 28002 40249 53092 49771 45376 54113 63276 60758 60918 75193 80169
13305 80169 53666 28619 59043 126356 137034 46375 -63156 -79834 -6833 56332 59143 47871
13293 47871 61636 66757 34067 7984 35659 78817 68330 15425 -4375 36481 89037 106081
13281 106081 86950 45719 -4133 -29230 -465 51993 63619 27313 4029 26194 49856
13270 49856 30605 -6462 -10161 22414 51397 47743 14499 -24062 -38356 -19835 4488 10713
13258 10713 20711 60707 93605 65133 11601 25654 98336 107162 9030 -70819 -24558 68762
13246 68762 72179 5445 -6042 55569 87029 47049 9166 20040 35459 27756 40019 89395
13234 89395 118015 91228 57107 56381 54940 23048 5796 47781 108887 124056 99084 81546
13222H1546m543j7160k2519K246K4038J6277J176J045M314J580L440P343m155
13209I4628k3590k4207n746J1803K7943M2386K1861m2948p7561j4027Q1666Q3648
13197A75856k691m9717j2873J4057k1270m3705m914J9743k3649n5341k597O0546
13185E3445L7287k3794j8461L3254L8908M613N661K9458J716n4948m5840J7783
13173G9082K4674l7468n0357K6244P2342P830o6790l3172N3522N8998j8884o1133
13161E4888j4676M8042N3272J6716o547O63J2542r23m1361p4185o0921p550M1706
13148B1666O3540O8433M9277j6273q7652p1231L3579Q6413j946j08037n8951R3653
13136G2471J29602j0409j30752p4309N4620P0581j8835o3736j6259L2917K9085
$$ plain form
13222 81546 77003 59843 37324 39570 63608 79885 81061 82106 86420 88000 91440 98783 94628
13209 94628 71038 46831 41085 52888 80831 123217 145078 102130 24569 10542 92208 175856
13197 175856 173165 123448 110575 124632 103362 59657 54743 74486 50837 -4504 -7101 53445
13185 53445 90732 66938 48477 81731 120639 125252 130913 160371 162087 107139 61299 79082
13173 79082 103756 66288 15931 42175 114517 122347 55557 22385 75907 134905 116021 54888
13161 54888 40212 88254 141526 158242 151695 152358 164900 163977 122616 48431 -12490 -20040 21666
13148 21666 85206 153639 202916 186643 98991 27760 61339 147752 145806 37769 -21182 72471
13136 72471 202073 191664 60912 -13397 41223 111804 92969 29233 12974 45891 74976
13125G4976J5913K2066J6057o252l323J8063J89m5428l2718M0232N4643l3496
13113A20922q9900n380J10966R0761k5719n9987J0344K9330n5881r8035m602R4860
13101A17679N5887n0849o5434P834L8152j184j2201L3546M5772j4320n9556k6714
13089F8612J9325N032k4973P773P1706O8959o975n6532k0941L8639L7376j7757
13077A90244n2847l3663J883J0266l292r750k762L736L903n33j3117k6168j0113
13064E7787M0363O8371K2016n0096m8666K2631M7843k0910p7614k9442M8585L5618
13052A16486l4996l6316L5832O1825N539l4100l818K2476m905j9037K6946N5985
13040A91917m27o8571m4688L6895O5509K7053k891J54o425k6833j6679K2567L4986
$$ plain form
13125 74976 90889 112955 129012 122760 119437 137500 137689 92261 59543 99775 154418 120922
13113 120922 31022 25642 136608 227369 201650 141663 152007 181337 125456 27421 22819 117679
13101 117679 173566 122717 57283 65117 103269 102085 89884 123430 169202 154882 95326 68612
13089 68612 87937 92969 67996 75769 147475 216434 209459 152927 131986 170625 208001 190244
13077 190244 137397 103734 105617 115883 112591 102841 100079 103815 107718 107185 94068 67900 57787
13064 57787 98150 166521 188537 138441 89775 112406 160249 139339 61725 32283 80868 116486
13052 116486 81490 45174 81006 142831 148370 114270 110452 132928 128023 108986 135932 191917
13040 191917 191490 122919 78231 115126 180635 207688 204797 204951 198526 171693 155014 177581 212567
13027B12567L441k8172l0709j8008j531J5778J0279k6198l8293J9979Q2441M6295
13015B47869n4994p8824N921N9963p713r1797n7610M8046P9414K0183j1152L4974
13003A94280O7336J2531o6696p1319j0631K4538l632m0808k9611J7922N1390M7003
12991A92303J6789k1456n0479m3683Q788O1080M5510l2607p8298k5216O5679Q1592
12979B20002R906n1874l4759K1902M5172K1380j5566m0094m3838k3494P702K1120
12967A37559Q364p662j0161n588N613L1861N0191J7989m8720o9218j2688M1179
12955A38719J6189l9912k9210L9316O2255K476n8535m7324O194L6452L6070L1980
12943A94670J9693j7425n1721l6377J8311M7454K0829j4814o836K4331J8189k8149
$$ plain form
13027 212567 216008 187836 157127 139119 137588 153366 163645 137447 99154 119133 201574 247869
13015 247869 192875 114051 119972 179935 172222 80425 22815 70861 150275 170458 159306 194280
13003 194280 261616 274147 207451 136132 125501 150039 146407 105599 75988 93910 145300 192303
12991 192303 209092 187636 137157 93474 102262 163342 208852 176245 97947 72731 138410 220002
12979 220002 229908 178034 143275 165177 210349 231729 216163 176069 132231 108737 116439 137559
12967 137559 145923 138261 128100 122512 128125 159986 210177 228166 179446 110228 97540 138719
12955 138719 154908 114996 85786 125102 187357 189833 131298 83974 90168 126620 162690 194670
12943 194670 214363 196938 145217 108840 127151 174605 195434 180620 173784 198115 216304 188155
12931A88155m6785J738O2177N7327k554l7953j7795M132j6278m3812k4944K6646
12919A50054N1429K4752k3008m8135k5957L3181P2717L1408o5886j03370j8219
12908G8966R2279Q7960j7025p5113k2551L8116J0892m6716k9429M2700O3379J2952
12896B36410k1493K092J8107k2867o2297l1942K5303K1270l0108l3558K6184N2963
12884A80064j311n1458j8376L8894K7010j8385J141O1816M8489l6063n5210L1591
12872B08202Q4975J0855p9718n2536L4077M2382j2437j2082M3683M5640j8312
12861B94729m2504L078K6569q994k2272K2684L9280k3146p7059m1103K6079L2578
12849B29919l34Q04K9706L0140K081j3272j1405j0750l776J1623J322l9856m9289
$$ plain form
12931 188155 141370 143108 205285 262612 260058 222105 204310 208442 192164 148352 123408 150054
12919 150054 201483 226235 203227 155092 129135 162316 235033 266441 200555 97185 78966
12908 78966 171245 259205 242180 167067 144516 182632 193524 146808 117379 160079 223458 236410
12896 236410 214917 217009 235116 212249 149952 118010 143313 164583 134475 100917 127101 180064
12884 180064 178753 127295 108919 147813 174823 156438 157579 219395 267884 231821 176611 208202
12872 208202 293177 304032 224314 171778 205855 248237 235800 223718 267401 313041 294729
12861 294729 252225 255303 281872 272878 250606 273290 312570 289424 212365 171262 197341 229919
12849 229919 229585 230389 260095 290235 292316 279044 267639 256889 253113 264736 266058 226202 176913
12836A76913O368N5720K5242l9604m5365O013L8385K6364N927o969j8518q649
12824B21827L2131N0131J415n7898m7986N524K1305L651J7608N2606L9391j2491
12812C27214k6497k182r425l8480n956P0153O1600n5153j30163o1865N1795P6781
12800B57822L2985J2431J4476j3035m6757k9429J2189Q369k7933k3778K6107N2579
12788B76026K5261j1906j9037n683O022J0980J0937R172R266Q37k7760m9722k2541
12775B11852K9060K3225m7189p5516J367Q9134P0917j3704l6826J8293M9464P862
12763C27939m2246m1517r268J7615L2764K9787j131l1777j9626J7842K0850j4255
12751B86977k6714P121L7099K4222l920q057P252J6935J1180p335k6248k2232
$$ plain form
12836 176913 183281 239001 264243 224639 179274 185287 223672 250036 255963 248994 230476 221827
12824 221827 253958 304089 305504 247606 199620 205144 226449 230100 247708 300314 339705 327214
12812 327214 300717 298535 289110 250630 244674 314827 376427 321274 191111 129246 181041 257822
12800 257822 290807 303238 317714 304679 257922 228493 240682 249051 221118 197340 223447 276026
12788 276026 301287 289381 270344 264661 270683 281663 292600 301772 311038 311875 284115 234393 211852
12775 211852 240912 264137 216948 141432 142799 231933 302850 289146 252320 270613 320077 327939
12763 327939 285693 244176 234908 252523 285287 315074 313943 282166 262540 280382 301232 286977
12751 286977 260263 267384 304483 328705 324785 316728 323980 340915 352095 344760 318512 296280
12739B96280P191K3667K538j9004m350R054k2940m9217M665Q7298P2966l6638
12727C71510r9441m7744K2270K4418Q718L7580O0592J4838m7361m1675R023K4871
12715C37599K570k974J3313J3210k749n660j784j0038r572J6898K7235j3876n4537
12702C09635k9114K6022K6777j8333k6046J9853M9869K9646L4r432j3831j1185
12690C53895J9947M9052J5361n7138o4141K1308Q8243M1944n7935q4160j4597
12679C11779N5895N1011m643l8100j9040J6171J8005j1544k3718J859K0246p652
12667C70269m1422j6761M7000O7907K5082j6746j5789n893j6600k0125J861J0926
12655C89709j5456k6668K0256P1206M2905m5407q6528l2168M2595M5076j3810
$$ plain form
12739 296280 303471 327138 329676 310672 306322 315376 292436 243219 247884 335182 408148 371510
12727 371510 272069 224325 246595 271013 279731 317311 377903 392741 345380 303705 312728 337599
12715 337599 340169 337195 350508 363718 360969 355309 353525 343487 333915 350813 378048 364172 309635
12702 309635 280521 306543 333320 314987 288941 308794 358663 388309 388343 378911 365080 353895
12690 353895 373842 422894 438255 381117 316976 338284 426527 468471 410536 326376 311779
12679 311779 367674 418685 414042 375942 356902 373073 391078 379534 355816 357675 377921 370269
12667 370269 328847 312086 359086 426993 452075 435329 419540 413647 397047 376922 378783 389709
12655 389709 374253 347585 367841 439047 481952 436545 350017 317849 360444 405520 391710
12644C91710m4963p356L9665K5720k7363l9105O345L7301J2456j2540J3912M2739
12632D38521Q788m5014l1969K7184L7083n031p412M4148N2986j4979o2999k8491
12620D12815J3355j0095m3878j5266L6855M5714L3608L6564Q737p2351r8931J4432
12608C61559J45241J07653n8499j31959l7159O4614M3459k4064k2615J6674O347
12597D71251l5816l2906J3449L7532K1055K674M39l110j1099m356J9214L5094
12585E13421K2549j2922m3140m0330q639J5667J4055J3286L1572L3086r177m3964
12573D85464j4503L2505J3001m0635j8217P3475R8108Q407o7844l0108M0850K8504
12561F09007l4855m6128m746J6094O502P631J2029r336k3107J2071M7422J4652
$$ plain form
12644 391710 346747 339391 379056 404776 377413 338308 344653 381954 394410 381870 395782 438521
12632 438521 447309 402295 370326 397510 434593 429562 422150 466298 519284 504305 441306 412815
12620 412815 426170 416075 372197 356931 393786 439500 473108 509672 518409 446058 347127 361559
12608 361559 506800 614453 555954 423995 386836 451450 494909 470845 448230 464904 471251
12597 471251 435435 402529 415978 453510 474565 477239 477678 474568 463469 459113 478327 513421
12585 513421 535970 523048 479908 439578 430939 446606 460661 473947 505519 538605 529428 485464
12573 485464 470961 503466 516467 475832 457615 531090 629198 637605 569761 539653 580503 609007
12561 609007 574152 528024 523278 539372 545874 553505 565534 556198 533091 545162 592584 607236
12549F07236m2583l0896K8132K9441l1809m9175J1957N9036L3054m629J993O933
12537F18690l8351q2684n3939K3458O5979M6310J0051K326K1545L1269l74n4222
12525E90058o0851J0098Q0273N4147l2792n5713N493L4361k5209p1212j7636N4478
12513E65495L0455m7694n5369J2901N4436L6672K4453L7441J8105l8261m9220
12502E89414J4425O3517K7363l4674l2465J5518K8004k016j0023J9528K8611p888
12490F99314l3894p148K3503l936n1933k9591N6405Q7516M917q6486o0426M1635
12478F39876O9778p269n9267l406O8698M4249l4053m9620N50K2611o728j7177
12466F68242J5974L2244N891o557K2437L3500j1514n1718k5837K4400K7484M86
$$ plain form
12549 607236 564653 533757 561889 591330 559521 510346 522303 581339 614393 609764 611757 618690
12537 618690 580339 497655 443716 467174 533153 579463 589514 591840 613385 644654 644280 590058
12525 590058 529207 539305 619578 673725 640933 585220 590713 625074 599865 528653 511017 565495
12513 565495 595950 548256 492887 505788 560224 596896 621349 658790 676895 638634 589414
12502 589414 603839 667356 694719 660045 627580 643098 671102 669086 659063 678591 707202 699314
12490 699314 665420 658272 681775 677839 625906 596315 652720 740236 745153 658667 598241 639876
12478 639876 709654 702385 643118 639712 708410 752659 718606 668986 669536 692147 685419 668242
12466 668242 684216 716460 722351 715794 738231 771731 760217 708499 682662 707062 734546 735032
12454G35032P504M0497L5365j0741l0403J039K5895l22m1724m4177j3212R234
12442G13987J0887J2556K4728L4131K6681K760k4870l6433j8855J4496K9773J1059
12430H00900j8110k3691p44K8024M0942L0299l73l2576l7030n536K6895J8488
12418H27488k1356m0869j9479J910j4141l7239r338O2628R9383M6786n0925r7910
12406G46938n2842L0729O5885K2324m5402n6293R957Q9023J02657M4679k0752
12395I36903m0393k3707r024q458o417N860J7497J4850j195j2406J733L4868M6410
12382I56521Q810m1530l9202J7269N3733K2543l1139l9300l016L0465M2830M2169
12370A020153J9303k8853n6178j8630M3963N0334j974l4264r088K3502J8549k571
$$ plain form
12454 735032 742536 783033 818398 807657 777254 778293 804188 803866 762142 717965 704753 713987
12442 713987 724874 737430 762158 796289 822970 825730 800860 764427 745572 760068 789841 800900
12430 800900 782790 759099 758355 786379 827321 857620 857247 824671 787641 782105 809000 827488
12418 827488 806132 765263 745784 747694 733553 696314 686976 749604 848987 895773 844848 746938
12406 746938 694096 724825 790710 813034 767632 711339 721296 810319 912976 957655 936903
12395 936903 896510 872803 863779 855321 848904 854764 872261 887111 885916 873510 875243 910111 956521
12382 956521 965331 923801 884599 901868 955601 978144 947005 907705 904689 935154 977984 1020153
12370 1020153 1039456 1010603 954425 935795 979758 1030092 1028118 993854 984766 1008268 1026817 1024246
12358A024246j1397j9517l0381j3482K9893M1435k179l4494K561O2011O3585J4998
12346A127279j6260j5040j6807j8203J6989O6101N5414k0606p0442l3083L2327
12335A107669L4646j9500m4758m819M0337K5800k4397l0725K8778Q2703O0867
12324A256601j1532n4342m2080j5463M330L6835O9034M8906j3819l1153K2892
12313A270209M9164j7072p7043j8145Q4340P0193m3254p8961J6858R2036L7643
12302A385968m9938m4417J6744K9393J636O409L4019K2776j4155j5319R769K860
12290A385745k5756j4469K9039L5301n22q326K9255M3357m9m0246k2135K2967
12278A434161M0308K8308R392j5194l6823k1267L2564O4141L2766j4768j3116
$$ plain form
12358 1024246 1012849 993332 962951 949469 979362 1020797 1018618 984124 986685 1048696 1112281 1127279
12346 1127279 1111019 1095979 1079172 1060969 1077958 1144059 1199473 1178867 1108425 1075342 1107669
12335 1107669 1142315 1122815 1078057 1073238 1113575 1139375 1114978 1084253 1113031 1195734 1256601
12324 1256601 1245069 1190727 1148647 1133184 1137514 1174349 1243383 1292289 1278470 1247317 1270209
12313 1270209 1319373 1302301 1225258 1207113 1291453 1361646 1318392 1239431 1256289 1348325 1385968
12302 1385968 1336030 1291613 1308357 1337750 1339386 1345795 1379814 1402590 1388435 1373116 1382885 1385745
12290 1385745 1359989 1345520 1374559 1409860 1409338 1401012 1430267 1473624 1473575 1433329 1411194 1434161
12278 1434161 1474469 1502777 1512169 1496975 1460152 1438885 1471449 1535590 1568356 1553588 1540472
12267A540472K1260K2065j7488l7035r107J9295N346k1383o268M5172P3178M7723
12255A683230N331j0414j0028k7953n3085l8245J9203N8771M2466J1269J6100
12244A696645L4263J2544l4340l9668P768M4572L2082O752P474J6100P433K951
12232A794576K5322M1647R942m2940m9358M95M2289K8254j0032j1815K7315N1184
12220A906879K1626k5212k2619L3962P2042L7595k7931m5955j1782J0982j905
12209A947682n544K1853L3155j329k9607L29M7960M1905k882j0442L2104N9910
12197B135094M0739J8205K4962K6886q315m5716l5796O998K9728K1302J6783L1114
12185B261984L7315J7849k423M828K6124K8085J1679J0179K9403K7937j6408n2255
$$ plain form
12267 1540472 1561732 1583797 1566309 1529274 1520167 1539462 1544808 1523425 1517157 1562329 1635507 1683230
12255 1683230 1688561 1678147 1668119 1640166 1587081 1548836 1568039 1626810 1669276 1680545 1696645
12244 1696645 1730908 1743452 1709112 1669444 1677212 1721784 1753866 1760618 1768092 1784192 1791625 1794576
12232 1794576 1819898 1861545 1871487 1828547 1779189 1779684 1821973 1850227 1840195 1828380 1855695 1906879
12220 1906879 1928505 1903293 1880674 1914636 1986678 2024273 1996342 1950387 1938605 1949587 1947682
12209 1947682 1942138 1963991 1997146 1995817 1966210 1966539 2014499 2056404 2053522 2043080 2075184 2135094
12197 2135094 2175833 2194038 2219000 2245886 2237571 2191855 2156059 2163057 2192785 2214087 2230870 2261984
12185 2261984 2299299 2317148 2314725 2319553 2345677 2373762 2385441 2395620 2425023 2452960 2436552 2384297
12173B384297j7501N5480O5169j1250o7279j5446P5226P3376j7229n9845Q815
12162B473813Q2361M7168m5280n5877L7299J10568P0481k8747p6121m8258q854
12151B558553J535R746M1645O5913L9591j9011m5010j0677M1853O0110M2188K0257
12139B806693J0055N454P570K5769N1003N5784K7941j1635k9870j1578K8590N5929
12127C021705M5875J4561N194L0473M9899K8028q593j0026J9319K8963K104k3318
12115C204184j7228P561L2278N5738O6335M0292q849k5902J0948N2477M8512J6842
12103C483188N419K0997L5388L3594J8066o892k0923O774O0512P1557J7604k2971
12091C702313J4618O5331K9945n1106m5887N2873J01995L4038l3324O690P2765
$$ plain form
12173 2384297 2366796 2422276 2487445 2476195 2408916 2393470 2468696 2542072 2524843 2464998 2473813
12162 2473813 2556174 2603342 2558062 2502185 2539484 2650052 2720533 2691786 2615665 2567407 2558553
12151 2558553 2560088 2569834 2611479 2677392 2716983 2697972 2652962 2642285 2684138 2744248 2786436 2806693
12139 2806693 2816748 2822202 2829772 2855541 2906544 2962328 2990269 2978634 2948764 2937186 2965776 3021705
12127 3021705 3067580 3082141 3087335 3117808 3167707 3195735 3187142 3177116 3196435 3225398 3227502 3204184
12115 3204184 3186956 3194517 3226795 3282533 3348868 3389160 3380311 3354409 3365357 3417834 3466346 3483188
12103 3483188 3488607 3509604 3544992 3578586 3596652 3589760 3568837 3575611 3636123 3707680 3725284 3702313
12091 3702313 3716931 3782262 3812207 3761101 3715214 3768087 3870082 3904120 3870796 3877486 3950251
12080C950251L6547n4705n1799M6978Q8460J2316n5031q076P4138O4895j0594
12069D093380k9333L1768P4014L9805j1092p660L4513N8065M6720K1686m232k6514
12057D321120k6808Q894N6411O8170K8050k2978k5961K9517Q4987P5379J2253
12046D609034k5412J485L6396J8521j4643J1603P3051P0416n552m0761K8557J08032
12034D870727Q2194j8543p3075l5923L7780Q9898R6993M9161k1945l1102N2398
12023E098563J23682P4445l2342m7434L2435P0016K3362M314O4692R9040L8061
12012E548834k1583J1930O6112M3713j16L2302R3103P3101K340k241N6618P1903
12000E976016L0154K5060P4945R0554M4603J9839N2712P1803L9487K1981N9102
$$ plain form
12080 3950251 3986798 3932093 3880294 3927272 4015732 4028048 3973017 3964941 4039079 4103974 4093380
12069 4093380 4064047 4095815 4169829 4209634 4198542 4190882 4225395 4283460 4330180 4351866 4347634 4321120
12057 4321120 4294312 4303206 4359617 4427787 4455837 4432859 4406898 4436415 4521402 4596781 4609034
12046 4609034 4583622 4585107 4621503 4640024 4625381 4636984 4710035 4780451 4774899 4734138 4762695 4870727
12034 4870727 4952921 4934378 4861303 4825380 4863160 4953058 5050051 5099212 5077267 5046165 5098563
12023 5098563 5222245 5296690 5264348 5216914 5249349 5319365 5342727 5347041 5411733 5510773 5548834
12012 5548834 5527251 5539181 5605293 5649006 5648890 5681192 5774295 5847396 5849736 5847495 5904113 5976016
12000 5976016 6006170 6031230 6106175 6196729 6241332 6261171 6313883 6385686 6425173 6447154 6506256
11989F506256Q5388N0853J3953L7732Q2356P8175L4450O782J6306N5030J10171
11978G077452J39836R5202R271j4898N0191J07648Q3210K9149K0871M4311N7970
11967G700213P4055R8362Q2289K1267M777P1758J18138O2841L30M5955J27498
11956H407483J02918R374p44P4833R6121L8074K2664P6231P5052j1515l7690O5123
11944H917924J47855Q4724j5367O635J01899J15573M6975K1898O2856P1303K1479
11933I583754K072M9948Q9255P0151M2716M8198M8556K1721K6267R3413J36655
11922A0212706P0011l3022j6587J24483K06882J04119o5664r3480L2448J21207
11912A0663103O4573j4400L1193J40051J48814N3661K508M8415Q2747M1104J0406
$$ plain form
11989 6506256 6591644 6642497 6656450 6694182 6776538 6854713 6889163 6895945 6912251 6967281 7077452
11978 7077452 7217288 7312490 7321761 7306863 7357054 7464702 7547912 7577061 7597932 7642243 7700213
11967 7700213 7774268 7872630 7954919 7976186 7980963 8052721 8170859 8233700 8234030 8279985 8407483
11956 8407483 8510401 8519775 8519031 8593864 8689985 8728059 8750723 8826954 8902006 8890491 8852801 8917924
11944 8917924 9065779 9150503 9135136 9141771 9243670 9359243 9406218 9428116 9490972 9562275 9583754
11933 9583754 9585826 9635774 9725029 9795180 9837896 9886094 9934650 9956371 9982638 10076051 10212706
11922 10212706 10282717 10249695 10233108 10357591 10564473 10668592 10602928 10509448 10541896 10663103
11912 10663103 10727676 10713276 10744469 10884520 11033334 11086995 11089503 11137918 11220665 11261769 11272175
11901A1272175O1141J18337R8450N3341O2356Q4616N0064J0450M9525J08528P0249
11890A2039232j8633O239J51778K23627J12580l7865m2144P6482J57101J33114
11880A2801511P4211M9469O0795R1432J27419J36538J00481O4337Q7187J45866
11870A3739246J57008J02812O4508J03573J71239J81808J32175R1499R5753J16079
11860A4955700J29690J55378J94356J96630J36766Q0993J11869K05255K54033
11851A6420670K13534J51005J36902J60368J81934J99763K19430K18927J93981
11842A8096514J84889K09439K25221K09593K10636K54341K75518K27299J85120
11833B0078570K30602K98211K74563J99939K08347K91508L05598K24255J91586
$$ plain form
11901 11272175 11333316 11451653 11550103 11603444 11665800 11750416 11800480 11810930 11860455 11968983 12039232
11890 12039232 12020599 12026838 12178616 12402243 12514823 12476958 12434814 12511296 12668397 12801511
11880 12801511 12875722 12925191 12985986 13077418 13204837 13341375 13441856 13506193 13593380 13739246
11870 13739246 13896254 13999066 14063574 14167147 14338386 14520194 14652369 14743868 14839621 14955700
11860 14955700 15085390 15240768 15435124 15631754 15768520 15849513 15961382 16166637 16420670
11851 16420670 16634204 16785209 16922111 17082479 17264413 17464176 17683606 17902533 18096514
11842 18096514 18281403 18490842 18716063 18925656 19136292 19390633 19666151 19893450 20078570
11833 20078570 20309172 20607383 20881946 21081885 21290232 21581740 21887338 22111593 22303179
11824B2303179K70797L30647K75207K10400K52299L21987K90919K09899K12343
11815B4677677K74267K64370J88000J83749K80183L42422K94766K31128K43041
11806B6979603K78628K55506K04855K07834K60650K93117K79715K57194K54246
11797B9271348K61524K62312K56549K58764K84142L22982L34152K96722K58409
11788C1806904K81147L43019L61585L20743K94458L21665L46837L31908L36971
11779C4745237M11787M82117M48232L51097L24159L93462M44664M08589L66696
11770C8376040M15026N10856N38509M79591M29766M59027N32348N80124N85653
11761D2906940N75768N68352N63894N65660N78478N99502O28725O73358P25080
$$ plain form
11824 22303179 22573976 22904623 23179830 23390230 23642529 23964516 24255435 24465334 24677677
11815 24677677 24951944 25216314 25404314 25588063 25868246 26210668 26505434 26736562 26979603
11806 26979603 27258231 27513737 27718592 27926426 28187076 28480193 28759908 29017102 29271348
11797 29271348 29532872 29795184 30051733 30310497 30594639 30917621 31251773 31548495 31806904
11788 31806904 32088051 32431070 32792655 33113398 33407856 33729521 34076358 34408266 34745237
11779 34745237 35157024 35639141 36087373 36438470 36762629 37156091 37600755 38009344 38376040
11770 38376040 38791066 39301922 39840431 40320022 40749788 41208815 41741163 42321287 42906940
11761 42906940 43482708 44051060 44614954 45180614 45759092 46358594 46987319 47660677 48385757
11752D8385757P53871P47518P36912P55002P91452Q19727Q44965Q82609R13328
11743E5631141R14972R20055R71518J033623J035360J006355J061717J216134
11735F3790875J326748J293759J215568J241179J351761J419302J427257J480334
11727G4546783J606440J702222J707766J703222J772156J874903J933648J965385
11719H8812525K045147K180105K297525K345831K356163K401840K519444K669967
11711A07628547K779627K829215K881163K989482L119137L210178L283093L396620
11703A32117062L530186L615185L669485L776207L925171M017084M050416M145127
11695A62845923M324282M443024M432380M443493M605640M795270M834148M793542
$$ plain form
11752 48385757 49139628 49887146 50624058 51379060 52170512 52990239 53835204 54717813 55631141
11743 55631141 56546113 57466168 58437686 59471309 60506669 61513024 62574741 63790875
11735 63790875 65117623 66411382 67626950 68868129 70219890 71639192 73066449 74546783
11727 74546783 76153223 77855445 79563211 81266433 83038589 84913492 86847140 88812525
11719 88812525 90857672 93037777 95335302 97681133 100037296 102439136 104958580 107628547
11711 107628547 110408174 113237389 116118552 119108034 122227171 125437349 128720442 132117062
11703 132117062 135647248 139262433 142931918 146708125 150633296 154650380 158700796 162845923
11695 162845923 167170205 171613229 176045609 180489102 185094742 189890012 194724160 199517702
11687A99517702M873385N056875N141351N093523N107484N262291N375795N310352
11679B40738758N206451N250044N370329N361676N206398N076312N049731N011351
11671B82271050M851289M613367M390801M181969L924531L611796L297635L002086
11663C14144524K674301K267164J812868J386402J000509N84724R4579m04024
11655C23561047q18314j170613j575950k072565k558681k932586l222810l525449
11647C05684079l868255m201665m487702m729960m931742n085145n201332n307403
11639B67870875n410784n496689n556056n588917n589151n554111n501396n449685
11631B23724086n391215n307679n202958n094297m981290m851764m711833m582455
$$ plain form
11687 199517702 204391087 209447962 214589313 219682836 224790320 230052611 235428406 240738758
11679 240738758 245945209 251195253 256565582 261927258 267133656 272209968 277259699 282271050
11671 282271050 287122339 291735706 296126507 300308476 304233007 307844803 311142438 314144524
11663 314144524 316818825 319085989 320898857 322285259 323285768 323870492 323965071 323561047
11655 323561047 322742733 321572120 319996170 317923605 315364924 312432338 309209528 305684079
11647 305684079 301815824 297614159 293126457 288396497 283464755 278379610 273178278 267870875
11639 267870875 262460091 256963402 251407346 245818429 240229278 234675167 229173771 223724086
11631 223724086 218332871 213025192 207822234 202727937 197746647 192894883 188183050 183600595
11623A83600595m468118m352751m226222m094674l964188l831947l696510l564521
11615A51401664l443530l333516l227214l119757l019362k939585k872696k786873
11607A26659131k670817k564154k509773k488684k446060k374553k317746k289465
11599A06997879k252254k190488k138237k107098k055375j972022j922849j949363
11591I0410193j977864j909862j768818j671799j668146j688930j663221j608744
11583G6452809j577753j567342j527048j435931j338324j295817j312281j322612
11575F5075701j271513j187569j140782j135451j107302j037551r91821j006184
11567E6197528j013479r50107q68142q53707q84933q71543q03242p51854p40096
$$ plain form
11623 183600595 179132477 174779726 170553504 166458830 162494642 158662695 154966185 151401664
11615 151401664 147958134 144624618 141397404 138277647 135258285 132318700 129446004 126659131
11607 126659131 123988314 121424160 118914387 116425703 113979643 111605090 109287344 106997879
11599 106997879 104745625 102555137 100416900 98309802 96254427 94282405 92359556 90410193
11591 90410193 88432329 86522467 84753649 83081850 81413704 79724774 78061553 76452809
11583 76452809 74875056 73307714 71780666 70344735 69006411 67710594 66398313 65075701
11575 65075701 63804188 62616619 61475837 60340386 59233084 58195533 57203712 56197528
11567 56197528 55184049 54233942 53365800 52512093 51627160 50755617 49952375 49200521 48460425
11558D8460425p17882o74024o64007p01205p16072o62220n84954n44806n40870
11549D2654385n47324n60860n71794n49024m97533m75795n10220n42346n10537
11540C7888952m41203m06158m21550m41573m31932m02201l75364l63394l69318
11531C4236259l86195l94766l78822l42910l09372l00232l17570l35359l23857
11522C1147176k91608k78589k92319k90536k56274k37770k64548k83354k50052
11513B8702126k22546k62113l01557k44558j52187j65833k61482k71246j69659
11504B6650945j29621k25721k94753k12573j12592j58201k62194k41794j34599
11495B4878897j27799k36851k89550k18292j50032j75342k18516j97614j59688
$$ plain form
11558 48460425 47742543 47068519 46404512 45703307 44987235 44325015 43740061 43195255 42654385
11549 42654385 42107061 41546201 40974407 40425383 39927850 39452055 38941835 38399489 37888952
11540 37888952 37447749 37041591 36620041 36178468 35746536 35344335 34968971 34605577 34236259
11531 34236259 33850064 33455298 33076476 32733566 32424194 32123962 31806392 31471033 31147176
11522 31147176 30855568 30576979 30284660 29994124 29737850 29500080 29235532 28952178 28702126
11513 28702126 28479580 28217467 27915910 27671352 27519165 27353332 27091850 26820604 26650945
11504 26650945 26521324 26295603 26000850 25788277 25675685 25517484 25255290 25013496 24878897
11495 24878897 24751098 24514247 24224697 24006405 23856373 23681031 23462515 23264901 23105213
11486B3105213j80408k40279k70807k48537j97615j58628j73139k38233k78615
11477B1118952k34774j62417j58224k11187k34314k20089k35159k72114k53753
11468A9136921j93524j96416k70322k93451k18184j52309j72654k11014k06503
11459A7222544k17914k80090k95401k00355j13842j67235k86001l01718k08683
11450A5151305j43680j57708j74456j57717j61101j99620k10392j72115j50101
11441A3624415j82942k15508j88893j29494j05237j35542j77717j81494j41906
11432A2165682j04898j12835j44442j42955j07909r9712j34374j50497j19091
11423A1048969r9525j27979j42066r5897n8107r4485j39794j07243m8313o5140
$$ plain form
11486 23105213 22924805 22684526 22413719 22165182 21967567 21808939 21635800 21397567 21118952
11477 21118952 20884178 20721761 20563537 20352350 20118036 19897947 19662788 19390674 19136921
11468 19136921 18943397 18746981 18476659 18183208 17965024 17812715 17640061 17429047 17222544
11459 17222544 17004630 16724540 16429139 16228784 16114942 15947707 15661706 15359988 15151305
11450 15151305 15007625 14849917 14675461 14517744 14356643 14157023 13946631 13774516 13624415
11441 13624415 13441473 13225965 13037072 12907578 12802341 12666799 12489082 12307588 12165682
11432 12165682 12060784 11947949 11803507 11660552 11552643 11452931 11318557 11168060 11048969
11423 11048969 10949444 10821465 10679399 10583502 10525395 10430910 10291116 10183873 10135560 10070420
11413A0070420j27814j31568q6927q8995j30660j19269o2128n5539r2108o9187
11403I106225l467l2297j56729j94386p0837M3518J905r8806j07746o3334p6980
11392H347066j09702n7461L3833L3833m6817q0310m1108k7989p4287r7640n4857
11381G824561q003r850l8704o9045j02574j13310o6553q208k5482r5723r2299
11370G194810J5575Q7223R850j24569j43873l7067M1740l895r0775q8695k101
11359F858223M6918m850p5834o1978R806K3774m6243r5352n1884J0592p086p2919
11347F533167q1099k0204K0229o028n0266o3160n2145l3378n530J2416j1952o2401
11335F179649q2166n7775l3375l2140k9470j5634j5640l0709k8550r542j3566
$$ plain form
11413 10070420 9942606 9811038 9724111 9635116 9504456 9385187 9323059 9267520 9175412 9106225
11403 9106225 9102758 9070461 8913732 8719346 8648509 8692027 8693932 8595126 8487380 8424046 8347066
11392 8347066 8237364 8179903 8213736 8247569 8200752 8120442 8079334 8051345 7977058 7879418 7824561
11381 7824561 7816558 7806708 7768004 7698959 7596385 7483075 7416522 7408314 7382832 7287109 7194810
11370 7194810 7210385 7297608 7307458 7182889 7039016 7001949 7043689 7039794 6949019 6860324 6858223
11359 6858223 6905141 6900291 6824457 6762479 6772285 6796059 6749816 6654464 6602580 6613172 6606086 6533167
11347 6533167 6452068 6431864 6452093 6446065 6395799 6332639 6280494 6247116 6241586 6254002 6242050 6179649
11335 6179649 6097483 6039708 6006333 5974193 5944723 5929089 5913449 5882740 5854190 5844648 5831082
11324E831082m3116n2157l0991k4400m2189l7436n554j1467p0847j00014m9441
11313E363470M113j8950o8516n4785k036J835l8729m4550j1320j6221p2577r6122
11301D945612m3323J8370K0317j1572k2326k0741m4874q0189p6780l0029Q727
11290D663192J380l3498n3597m6353l5260l9416m4103k6324r11r576n3918p5995
11278D245621l5975K0928J9597l9713q1793o0294j2214K934k2344n0233n1289
11267C935225k9895j0404j2057l0370m0024k4764j356N4k3939m6001m3816k4712
11255C647941j2200j7148k5302j4829R287J0284k8677o1219l0950L3903M1902
11244C552992k6718p8825m5353J3557R369l4031l3667N652Q560k9959l8660m513
$$ plain form
11324 5831082 5787966 5735809 5704818 5680418 5638229 5600793 5595239 5583772 5512925 5412911 5363470
11313 5363470 5367583 5348633 5280117 5225332 5223296 5225131 5186402 5141852 5130532 5114311 5041734 4945612
11301 4945612 4902289 4920659 4940976 4929404 4907078 4886337 4841463 4761274 4684494 4654465 4663192
11290 4663192 4664572 4631074 4577477 4531124 4495864 4456448 4412345 4386021 4385110 4375534 4321616 4245621
11278 4245621 4209646 4230574 4250171 4210458 4128665 4068371 4056157 4059091 4036747 3986514 3935225
11267 3935225 3905330 3894926 3882869 3852499 3812475 3787711 3786355 3786409 3762470 3716469 3672653 3647941
11255 3647941 3635741 3618593 3593291 3578462 3587749 3598033 3569356 3508137 3477187 3511090 3552992
11244 3552992 3526274 3447449 3402096 3415653 3425022 3390991 3357324 3362976 3371536 3341577 3302917 3298404
11232C298404M892k7943l3959J1191L2201j4060n7165l5915o118l5571p4168l7662
11220C024127L8627M9505q832l7543K63K7694j2160o7478o3646q127L5234L0537
11208C008201r143n2551p1527n3189j2635J8103K0204l513l9603o2389m0951J6011
11196B717018M2249q280p9844p5569K341M8431P921m4681k5004L2879L6235k3052
11184B630644o4609m4094o351l744k2400j8785Q649J9852p806m7493n3489j4747
11172B375627K8485K7266j7500n3892m4662j4162p833k2986j8434J0773J6863
11161B279545k3346n9646l8051J1343J2773l9065o6411k6310K4234K0898p630
11150B088334K393L1070L029p3215r2268r001P8647O4252j6745n0498j4515R515
$$ plain form
11232 3298404 3303296 3275353 3241394 3252585 3284786 3270726 3213561 3177646 3171528 3135957 3061789 3024127
11220 3024127 3062754 3112259 3103427 3065884 3066147 3093841 3081681 3014203 2950557 2942430 2977664 3008201
11208 3008201 2999058 2946507 2874980 2821791 2809156 2827259 2847463 2843950 2804347 2741958 2701007 2717018
11196 2717018 2759267 2750987 2671143 2595574 2597915 2646346 2654267 2609586 2584582 2617461 2653696 2630644
11184 2630644 2566035 2521941 2515590 2511846 2489446 2470661 2479310 2499162 2491356 2443863 2390374 2375627
11172 2375627 2404112 2431378 2413878 2359986 2315324 2301162 2293329 2270343 2251909 2262682 2279545
11161 2279545 2256199 2196553 2158502 2169845 2182618 2143553 2077142 2050832 2075066 2095964 2088334
11150 2088334 2090727 2121797 2124826 2051611 1959343 1950342 2028989 2093241 2076496 2025998 2011483 2020998
11138B020998k1275n1519l0212Q969J1765j1744j7495m045n024k4392k9156m196
11126A842674K4945L0046J2351j2143l6118n4721n1835j5408L3566M8977J1665
11115A833999l8745m6649j0679J7629Q288j1054j0016m869j8133k6036J290L2321
11103A727346J1171m6122o1513j0924L6308J9461l0262m5196j4079K1647L0895
11092A638732J3817j5011l1508j3700K4063L4584J348l2797k9161q375m806n117
11080A572069J6472L4178N488m7146n6438j1059K6183J2032k1718k8006j2270
11069A489785q001j6066o451K8373N1962K6412l3658o6773l5707K0634L4423J176
11057A486109j9245K91J4702q464k8256n219K1353R02l3103k0339J3113j131m2352
$$ plain form
11138 2020998 1999723 1948204 1917992 1926961 1938726 1926982 1909487 1905442 1900418 1876026 1846870 1842674
11126 1842674 1867619 1897665 1910016 1897873 1861755 1807034 1755199 1739791 1773357 1822334 1833999
11115 1833999 1795254 1748605 1737926 1755555 1763843 1752789 1742773 1737904 1719771 1693735 1695025 1727346
11103 1727346 1738517 1692395 1630882 1619958 1656266 1675727 1645465 1600269 1586190 1607837 1638732
11092 1638732 1652549 1637538 1606030 1592330 1616393 1650977 1652325 1619528 1590367 1581992 1577186 1572069
11080 1572069 1588541 1622719 1628207 1581061 1524623 1513564 1539747 1551779 1530061 1502055 1489785
11069 1489785 1481784 1465718 1459267 1487640 1539602 1566014 1532356 1465583 1429876 1450510 1484933 1486109
11057 1486109 1466864 1467155 1481857 1473393 1445137 1439918 1461271 1462173 1429070 1408731 1421844 1420713 1378361
11044A378361k8147L3795M7256l561j9669L5687O1218o590o9165k5147N2599L3778
11032A490415n2684p1023m662L0848o248k5937J5567L2015k9973p4017l419J04199
11020A405081R5132l2518j21510p3276L3625P1935K8121j7822k0515p520o763
11009A353970l250J6010K4948J191k6857j9113R667J3634k647J1108N5370O0190
10997A494221m427o2584l6031L6072N4820P380k7586r507J4062q52k7869k4104
10985A413595N024K5516K0075o882l4849k9081K1666O5791M0964k7914m8967J372
10973A446310L9886R368k9933l187N2737M8701j4707n4175l3698k496k678j4526
10961A441602r603J847L33q617j1620r830q437m773L746J4001J9773J0799j7033
$$ plain form
11044 1378361 1350214 1384009 1431265 1427704 1408035 1443722 1504940 1498350 1429185 1404038 1456637 1490415
11032 1490415 1437731 1366708 1362046 1392894 1386646 1360709 1376276 1408291 1378318 1304301 1300882 1405081
11020 1405081 1500213 1467695 1346185 1272909 1306534 1378469 1406590 1388768 1368253 1360733 1353970
11009 1353970 1350720 1366730 1391678 1392869 1366012 1346899 1356566 1370200 1367553 1378661 1434031 1494221
10997 1494221 1489794 1427210 1391179 1427251 1482071 1489451 1461865 1452358 1466420 1465568 1437699 1413595
10985 1413595 1418619 1444135 1464210 1457328 1422479 1393398 1415064 1480855 1521819 1493905 1444938 1446310
10973 1446310 1486196 1495564 1465631 1462444 1515181 1563882 1549175 1495000 1461302 1458806 1456128 1441602
10961 1441602 1431999 1433846 1434179 1425562 1413942 1404112 1395675 1390902 1394648 1408649 1428422 1439221 1422188
10948A422188l8909j7977L0717L3107m1220j08039o9602L6866P7455Q518o5953
10937A267151n1106R959J8528l2856o6232l6270K4814O6892O9126L0782l3015
10926A267773p7429n4921K1523P3133M2219l3642o7674l6738m388j8267l6232
10915A075357k252M6138K8821l2412k7559N8149R3150L322q7590m0533O8404O1953
10903A244948m8429q0076J6608P8591R212o3700j7270N4471J2540p8044n6484
10892A072367N9562J00764J4167p4898p0915k0124Q468J6985J8735K57k0414J510
10880A106464M4532L1844l5689o1495o706M2866J6096l4089k7638J6865K6718
10869A119768j2838n5772o1728k0472M5750P6293K7193m6664m2646L1617N2533
$$ plain form
10948 1422188 1383279 1365302 1396019 1429126 1387906 1279867 1210265 1247131 1324586 1333104 1267151
10937 1267151 1216045 1226004 1244532 1211676 1145444 1109174 1133988 1200880 1270006 1300788 1267773
10926 1267773 1190344 1135423 1156946 1230079 1272298 1238656 1170982 1134244 1129856 1111589 1075357
10915 1075357 1073105 1119243 1148064 1115652 1088093 1146242 1239392 1242714 1155124 1114591 1182995 1244948
10903 1244948 1196519 1116443 1133051 1211642 1220854 1157154 1139884 1194355 1206895 1128851 1072367
10892 1072367 1131929 1232693 1246860 1171962 1101047 1080923 1089391 1106376 1125111 1125368 1104954 1106464
10880 1106464 1150996 1182840 1147151 1085656 1078950 1121816 1137912 1103823 1076185 1093050 1119768
10869 1119768 1106930 1051158 989430 968958 1014708 1091001 1118194 1071530 1028884 1060501 1113034
10858A113034k3832p8630j9245O5978N2148k2961l8126Q398K2589p814j1675J3972
10846A073836R14m4839l8601K8000O2619K8711j769J1783J0661l9781p3815l9064
10834I78655J0760R393j6880j0626J8148K6643J7018J3286P834r682j4023J1104
10822A041630L2863K2753N749Q725Q709j5697l0493k337L4221K6058j5906l9150
10810A077125k5160N143L0524L2938m45m0758k9984L0371O0191J6593l6616l1460
10798A088462M134J6724K0415L6058J8551n0848p8778N681J00013O2591n4619
10787A168384p9089O448N0575k595l5236J7833N8821J8218k0994J0407L7063q611
10775A221224m6749L611O3953L0254l8306k4567L7942L1935k9251l1424K9900
$$ plain form
10858 1113034 1089202 1010572 991327 1057305 1109453 1086492 1048366 1056764 1079353 1071539 1059864 1073836
10846 1073836 1074750 1029911 991310 1019310 1081929 1110640 1108871 1120654 1131315 1091534 1017719 978655
10834 978655 989415 998808 981928 971302 989450 1016093 1033111 1046397 1054231 1044549 1030526 1041630
10822 1041630 1074493 1097246 1102995 1111720 1120429 1104732 1074239 1071902 1106123 1132181 1116275 1077125
10810 1077125 1051965 1057108 1087632 1120570 1120125 1079367 1049383 1079754 1139945 1156538 1119922 1088462
10798 1088462 1092596 1109320 1129735 1165793 1184344 1133496 1054718 1060399 1160412 1223003 1168384
10787 1168384 1089295 1095743 1146318 1143723 1108487 1126320 1185141 1203359 1182365 1192772 1229835 1221224
10775 1221224 1174475 1178086 1242039 1272293 1233987 1209420 1247362 1279297 1250046 1218622 1248522
10764A248522M5253r239l6736L81K2654j0959l3372k743K2777L81k0939l33K0513
10751A246160O718P7L1507M9198Q189m2096l5643O957K5163J2598l411k1104l5354
10738A248959p440O1867Q7707J5937p1206o3562P908K5918j8733k1449M4849P3206
10726A383961K212p2883m7501K9509M0432j6693l9989N173L9379P580l2937r902
10714A288341M7745N6676N092l8833l4644j7125k1319k2481R847M3821K8021k0690
10702A324451l3235J0318N2897M5250O581j9577k2635j0700J6529M4636L2823
10691A447338k9399q1799n8644K1274P5447N9413N849l1995l4009j0570J5326
10680A378231J7785r167l4270k0807K3228N2696M2128Q789j8844k7317j4027J3539
$$ plain form
10764 1248522 1293775 1284536 1247800 1248181 1270835 1259876 1226504 1223761 1246538 1246919 1225980 1225647 1246160
10751 1246160 1252878 1252955 1284462 1333660 1341849 1299753 1264110 1271067 1296230 1308828 1305417 1284313 1248959
10738 1248959 1241519 1303386 1391093 1407030 1335824 1272262 1280170 1306088 1287355 1265906 1310755 1383961
10726 1383961 1386173 1313290 1265789 1295298 1335730 1319037 1279048 1284221 1323600 1331180 1298243 1288341
10714 1288341 1336086 1392762 1397854 1359021 1324377 1307252 1285933 1263452 1273299 1317120 1345141 1324451
10702 1324451 1291216 1301534 1354431 1399681 1406262 1386685 1364050 1353350 1369879 1414515 1447338
10691 1447338 1417939 1336140 1277496 1298770 1374217 1433630 1439479 1407484 1373475 1362905 1378231
10680 1378231 1396016 1386849 1352579 1331772 1355000 1407696 1449824 1458613 1439769 1412452 1398425 1411964
10668A411964L2347K4072K461l093J1784K6673K9675K2000J066k4739j8563L8176
10656A553823R0059O1877k4657n8112J1138R3119Q0969j067l8216J3086P4791
10645A856810O2562m670l8283L235O3830O2485j627m5252j1632N0323N6325J0026
10633B064132p180L4891P2124N3996J9854K1931L6597J6120j8660j1415L1316
10622B313706M8650K1468o497k131K1068M2317N4795M4525J547m0990l1273K5740
10610B492925O6280N4762K3736R793K536j2774j1095K8245O6275M6403j9402n4295
10598B693389j2775O2194R4165O1375O861k7565m4394n7472m9245J415O3106P4636
10586B865690L1481j552J4660L8168K0753j4073j9099l170J045R284M8860Q0051
$$ plain form
10668 1411964 1444311 1468383 1470844 1467751 1479535 1506208 1535883 1557883 1558949 1534210 1515647 1553823
10656 1553823 1643882 1705759 1681102 1622990 1634128 1727247 1808216 1807149 1768933 1782019 1856810
10645 1856810 1919372 1914702 1876419 1879654 1943484 2005969 2004342 1959090 1947458 1997781 2054106 2064132
10633 2064132 2056952 2091843 2163967 2217963 2237817 2259748 2296345 2312465 2293805 2282390 2313706
10622 2313706 2362356 2383824 2377327 2375196 2396264 2438581 2493376 2537901 2539448 2498458 2467185 2492925
10610 2492925 2559205 2613967 2637703 2647496 2650032 2637258 2626163 2654408 2720683 2767086 2747684 2693389
10598 2693389 2680614 2742808 2836973 2898348 2905209 2877644 2833250 2775778 2726533 2727948 2791054 2865690
10586 2865690 2897171 2895619 2910279 2948447 2969200 2955127 2936028 2932858 2933903 2943187 2992047 3072098
10574C072098M5013j9104j5167O0161R7747L7527m3628m8390J3273O1874N4110
10563C315514P219l3263k0205M9420J00119N7419k6493k0922Q3563J39733O4655
10552C716759k7186m626P8328Q5299J6178j6834K3824P5581J00906J09817Q8890
10541D246936L2733J2544Q1757J49878R9519k986J1296J35494J87728J10108N6012
10530E121019J18377J81608J46927J08613J66047K32424J97467J36275J71616
10521F580373K47481K40078J98441K54267L56966L37789K16325J95694L24193
10512H951607M04020L17601K23558K95438M44799M75393L92424L72035M79513
10503A2356388N92714O04601N58876N47294N73102N75142N38193N24956O00753
$$ plain form
10574 3072098 3117111 3098007 3082840 3143001 3240748 3278275 3234647 3186257 3199530 3261404 3315514
10563 3315514 3322733 3289470 3269265 3318685 3418804 3476223 3449730 3428808 3512371 3652104 3716759
10552 3716759 3689573 3684947 3763275 3848574 3864752 3847918 3871742 3947323 4048229 4158046 4246936
10541 4246936 4279669 4292213 4373970 4523848 4623367 4620381 4631677 4767171 4954899 5065007 5121019
10530 5121019 5239396 5421004 5567931 5676544 5842591 6075015 6272482 6408757 6580373
10521 6580373 6827854 7067932 7266373 7520640 7877606 8215395 8431720 8627414 8951607
10512 8951607 9355627 9673228 9896786 10192224 10637023 11112416 11504840 11876875 12356388
10503 12356388 12949102 13553703 14112579 14659873 15232975 15808117 16346310 16871266 17472019
10494A7472019P47849Q70025Q93890Q53257Q39553Q72950Q75925P91899O73493
10485B4890860O13434O31858O80573P27250P80192Q42253Q89496Q99773Q72653
10476C1828342Q16844P35228O25875M96658L85041L48817M05271M88140N12905
10467C6643121M85433M85270N29788N31422M26202K66054J21997k9737k33059
10458C9226491m17721m58396l58464k62234k63079k99475k85840k58682l17013
10449C6305587m68391o19893p11620p83221q85013r78428r76194q66458p44345
10440B9272024p01345p21651p26478o96557o93199p56014q39050q74801q57037
10431B2405892q28403q20310q34208q49648q25567p33449o17001n69755o14766
$$ plain form
10494 17472019 18219868 19089893 19983783 20837040 21676593 22549543 23425468 24217367 24890860
10485 24890860 25504294 26136152 26816725 27543975 28324167 29166420 30055916 30955689 31828342
10476 31828342 32645186 33380414 34006289 34502947 34887988 35236805 35642076 36130216 36643121
10467 36643121 37128554 37613824 38143612 38675034 39101236 39367290 39489287 39459550 39226491
10458 39226491 38808770 38350374 37991910 37729676 37466597 37167122 36881282 36622600 36305587
10449 36305587 35837196 35217303 34505683 33722462 32837449 31859021 30882827 30016369 29272024
10440 29272024 28570679 27849028 27122550 26425993 25732794 24976780 24137730 23262929 22405892
10431 22405892 21577489 20757179 19922971 19073323 18247756 17514307 16897306 16327551 15712785
10422A5712785o59636o20664n34990m84791m68835m36953m04458m23843m66440
10413A1212175m45901l57805k88911k79464k80594k61216k48160k37227j79218
10404H633679r3473q0201j63590k32518k07129j58091j74554k14780j96012j48375
10394F964956j54164j92683j76093j06391p0681r4175j15251j05999j08657j40916
10384E699946j62295j52838j41865j42296j31821j10765j05231j05678p8340m2299
10374D526518n2444r8568j11159q0713p4314j10295j19729p2035l6307o1541r1315
10363C618098o7095l0464m2278p3782o5549l4750l4087n2091m3328j9357k3479
10352C131838m6575m9635l9945m6287n1562l0957j8672m7055o2282p650N0546
$$ plain form
10422 15712785 15053149 14432485 13897495 13412704 12943869 12506916 12102458 11678615 11212175
10413 11212175 10766274 10408469 10119558 9840094 9559500 9298284 9050124 8812897 8633679
10404 8633679 8540206 8460005 8296415 8063897 7856768 7698677 7524123 7309343 7113331 6964956
10394 6964956 6810792 6618109 6442016 6335625 6264944 6170769 6055518 5949519 5840862 5699946
10384 5699946 5537651 5384813 5242948 5100652 4968831 4858066 4752835 4647157 4568817 4526518
10374 4526518 4474074 4375506 4264347 4183634 4109320 3999025 3879296 3807261 3770954 3709413 3618098
10363 3618098 3551003 3520539 3478261 3404479 3338930 3304180 3270093 3218002 3174674 3155317 3131838
10352 3131838 3085263 3035628 2995683 2949396 2897834 2866877 2848205 2801150 2738868 2731218 2781764
10341B781764J1040p7279p2768K0980M9125l2582p7599n243M9775k8227j18887
10330B500099n9567P0048O8454n6529j04769j2932O0952J5425m5245j8770K5266
10319B442432l758n1211l4525j455k6699n4767m907N1945j34r5866o7814O7307
10307B220548J10674m422j07807p1285N093k162k8814K5856Q3063J5949j00880
10296B145813q9842K9057O0881l9087q8683J4926J21311P0521n9871r8287m4531
10285B022208k5271o2836o1901K183M2636J6578j5557j2341j4474m6003n7546
10274A787676k1552M834k4709o1477m3812k853o693m3550m7996j8314j5368m7932
10262A458254n2365p548J7886k0992o0897k9282K8800J3980o5164r6362l5769
$$ plain form
10341 2781764 2792804 2715525 2642757 2663737 2712862 2680280 2602681 2597438 2647213 2618986 2500099
10330 2500099 2440532 2510580 2579034 2522505 2417736 2404804 2465756 2481181 2435936 2417166 2442432
10319 2442432 2438674 2387463 2352938 2351483 2324784 2270017 2265110 2317055 2316921 2221055 2153241 2220548
10307 2220548 2331222 2326800 2218993 2147708 2152801 2150639 2121825 2147681 2230744 2246693 2145813
10296 2145813 2055971 2085028 2145909 2106822 2018139 2033065 2154376 2224897 2165026 2066739 2022208
10285 2022208 1996937 1934101 1872200 1874383 1917019 1933597 1918040 1905699 1891225 1845222 1787676
10274 1787676 1766124 1770958 1746249 1684772 1640960 1638107 1631414 1587864 1539868 1521554 1506186 1458254
10262 1458254 1405889 1398341 1416227 1395235 1334338 1305056 1333856 1347836 1282672 1186310 1150541
10251A150541K7987J8472j7786j1740L352l4671q1819m8866L3323M4189k8818
10240A054164o2595k942M2946j0637q0213n3547K4638L4536k3585n2700l0630
10229H39435j8778k6010n395K2305j2444p6579n3551N2685Q7327j5895j11740
10218F81360n9883O0313P9949n365n6672j7253K8132J1631k6230k6442P90J2749
10206F83079j090j8863j6451J1108L5296J5127m0333o1619j2247M5606L6093j5945
10194F59761k8180Q947K8697K497k7646l2478k9939k6974m053K6828K1498j8988
10182E79970l6865m325L9414N3637L7354m308o2679q4329j4807R2141J04594m346
10170F95451r7626o1087L8239O1600o287o6185n8995j5324K2011L9763L2706P860
$$ plain form
10251 1150541 1178528 1197000 1179214 1167474 1170826 1136155 1054336 1005470 1038793 1082982 1054164
10240 1054164 991569 988627 1031573 1020936 940723 887176 911814 946350 922765 870065 839435
10229 839435 820657 794647 789252 811557 799113 722534 668983 721668 808995 793100 681360
10218 681360 621477 681790 761739 756374 699702 682449 710581 722212 695982 669540 670330 683079
10206 683079 681989 663126 646675 657783 693079 708206 667873 606254 594007 639613 675706 659761
10194 659761 631581 640528 669225 671722 644076 611598 581659 554685 550632 577460 598958 579970
10182 579970 543105 538780 578194 631831 669185 664877 602198 517869 503062 595203 699797 695451
10170 695451 597825 536738 574977 636577 630290 564105 505110 489786 511797 551560 584266 592126
10158E92126m938J425j2288n6152o2706J1655Q9511P2661l568k7884O631Q479
10146F14952l7636m4280J2169L9325j0738n7261l0546J9399K7047J7122K4512
10135E74065J2654l3639l6200M1660Q5983j456j11503p4142N9183Q0140m1732
10124E55013j06799j2711Q2316L0087o4449l2580O9722O3663m5345p9974R099
10113D68042O8110M119o7051k6190N1565L1746n4895p0534M528N3227J5903l2623
10101D45947k2406J0775J1058l556M706J5315m142k4633m137K5765L119n2559
10089D05252n8428j706L3475O48l1236R106P1770N6828k8118p4177l1520K5676
10077C77570J9989k0882k6161M867J7817P6p470J1067K0877J085j9146j2914o78
$$ plain form
10158 592126 587188 588613 576325 520173 457467 469122 558633 631294 627726 599842 606473 614952
10146 614952 577316 533036 545205 584530 573792 516531 485985 505384 532431 549553 574065
10135 574065 586719 553080 516880 558540 644523 643067 531564 457422 516605 596745 555013
10124 555013 448214 435503 517819 547906 483457 450877 520599 584262 538917 458943 468042
10113 468042 536152 540271 473220 447030 498595 530341 475446 404912 409440 462667 478570 445947
10101 445947 423541 434316 445374 441818 446524 461839 457697 433064 428927 454692 457811 405252
10089 405252 346824 345118 378593 379241 348005 357111 428881 485709 457591 383414 351894 377570
10077 377570 397559 376677 350516 355383 373200 373276 365806 376873 397750 398835 379689 366775 366097
10064C66097j0771k6715j3057K2726L3873n1m2046m2968j392L4666K3542j9525
10052C24379l6684J548N2502N1954K596k5980L217L7996J2859n2244p7763l4272
10040B60108K4491L9300J1068k1389l1371j6407J0689K7438K0034M733Q148K2118
10028C58960R871l2572n6739k5574L0776N0006J1871m4273o4047k5990M0350P3995
10016C26634L9221k7840n3313j6166K6891K3055q144j7745l100K671o350n698
10004B80116P660O908j5876l0048r571K7663L9592J0181l0326l7625m453L0755
9992B74976L5473K4994K6865K6005n601l9104j8977L4442L6436k5572n8658j0716
9980C00563M5550L8819J1816K1327K3168k9471o3815n337O0398J3422p3554l4975
$$ plain form
10064 366097 355326 328611 315554 338280 372153 372102 330056 287088 285696 320362 343904 324379
10052 324379 287695 289243 341745 393699 396295 370315 373532 411528 424387 372143 294380 260108
10040 260108 284599 323899 334967 313578 282207 265800 276489 303927 323961 328694 336842 358960
10028 358960 368831 336259 279520 253946 284722 334728 346599 302326 238279 212289 252639 326634
10016 326634 365855 338015 284702 268536 295427 318482 310338 292593 289493 292164 285814 280116
10004 280116 287776 294684 278808 248760 239189 266852 306444 316625 286299 248674 244221 274976
9992 274976 310449 335443 362308 388313 382712 343608 324631 359073 395509 369937 311279 300563
9980 300563 346113 384932 396748 418075 441243 411772 347957 342620 403018 416440 342886 307911
9968C07911R1067R7965m0562j04577J3236J24663N5207p8507p9224J7387M6467
9957D51033M28p978K1382J515m0082k493P6943O4221k8964n4864J0567L0872l5932
9944D86648o1617Q124M3934l1079q7871j1001R0658N7469n8184q2272L593N5536
9932D13938Q009m5377k3435K6652K6808j3777l1003m281K3626R665l2018m5135
9920C13672p286L0035J1211l4273l3818Q084J6374k2107l4733J057J1304l3178
9908B26342m6889J9944P4869L1515l8871k9562J8546K582m6127j9092O0159O2887
9896C16303j9584n5125N634N4155J6525l4384k4144L452r049k5777j394K6662
9884B53274J5832K171K2062L1561o354l0096K3257R0680O5031l4651q6645m3773
$$ plain form
9968 307911 398978 496943 456381 351804 365040 489703 544910 466403 387179 404566 451033
9957 451033 451461 443483 464865 466380 426298 423805 500748 564969 536005 481141 491708 522580 486648
9944 486648 425031 433155 477089 446010 358139 347138 437796 495265 437081 354809 358402 413938
9932 413938 421947 376570 353135 379787 406595 392818 361815 357534 381160 390825 358807 313672
9920 313672 306386 336421 347632 313359 279541 287625 303999 281892 247159 248216 259520 226342
9908 226342 179453 199397 274266 305781 266910 237348 255894 258476 212349 193257 253416 316303
9896 316303 296719 241594 247228 301383 317908 283524 259380 262832 253783 228006 226612 253274
9884 253274 269106 271277 293339 324900 318546 288450 311707 402387 467418 432767 346122 302349
9872C02349J8002L0120J4177J2325J5082j726k0654p005L4295N9592M0364n46
9860D96375j3091K0109N8940N6337K2704Q419K6409L6492J5135r147j1335j1257
9848F96090k7158l3483p197K0472O541l4020m7884j9940R593J823l3837n2308
9836D78692k6396J0297p699q2059j18044m6587N3427N1074l2994m8350M0175Q2773
9824C54309j0167j08046o7186L5331L7918l5259l3015N0148O8265j5860o7650
9813B08788j4557M0625P666m8019l7549O940J6435P264K0501K6027j3924n3528
9801A66669l0643K6040M2474J0733j9430k3679j2190Q958K7700J4447k8312m7662
9789A35105j9379O673q892k6054j967K8615K2901J5078M4342N9213j447p9690
$$ plain form
9872 302349 320351 350471 364648 376973 392055 390329 369675 362670 396965 456557 496921 496375
9860 496375 483284 503393 562333 618670 641374 649793 676202 712694 727829 718682 707347 696090
9848 696090 668932 635449 628252 648724 655265 621245 573361 553421 563014 564837 531000 478692
9836 478692 452296 462593 454894 372835 254791 208204 261631 312705 279711 231361 271536 354309
9824 354309 344142 236096 168910 204241 242159 206900 173885 224033 292298 276438 208788
9813 208788 194231 234856 242522 194503 156954 163894 180329 187593 208094 234121 220197 166669
9801 166669 136026 162066 204540 215273 195843 172164 159974 168932 196632 211079 182767 135105
9789 135105 115726 122399 113507 87453 85486 114101 137002 152080 196422 255635 254188 174498
9777A74498o8299J8043O1090J8751l1263l2244j7646j7743m500L2767M7523J5545
9765A96522j9729k0524p369m774n35P268r488m4059l8887J9425N5572J2931n2523
9752I3830n2424M553L6480J4236j0526K373K6941K2393o484k2947r302J5485K3237
9739A37845R578o617j2796j5047j4564K574L1891L6803K763k6340j3143O281j4692
9726A24536l9062n789M2313R579p5217p3781L5421R6969J9672p0345l5749M5280
9714G3827J9661p1542o0429N6861J03384O521r1953o4724K6250O3536M6349L2612
9702A40353J6975k7481o2735m1082P714K8548K7673L0037R777m8090p4118q397
9690h26P5064N6691l8513o6585J5591Q5197M4177m2007o0868j5404J1875n576
$$ plain form
9777 174498 106199 124242 185332 204083 172820 140576 122930 105187 100687 133454 180977 196522
9765 196522 176793 156269 148900 144126 143591 150859 141371 97312 58425 77850 133422 146353 93830
9752 93830 41406 45959 82439 96675 86149 88522 115463 137856 131372 108425 99123 114608 137845
9739 137845 147423 140806 128010 112963 98399 100973 132864 169667 172430 146090 132947 139228 124536
9726 124536 85474 79685 121998 131577 56360 -17421 18000 114969 134641 64296 28547 73827
9714 73827 93488 21946 -38483 18378 121762 128283 36330 -28394 -2144 61392 107741 140353
9702 140353 157328 129847 67112 26030 33744 62292 89965 120002 129779 81689 7571 -826
9690 -826 74238 130929 92416 25831 41422 126619 170796 128789 67921 52517 64392 58816
9678E8816k5417k3513j3918J890L5343O4001M6028j2125n2485m0217m82K8141
9666F6062L6553K8184r48m1329n8871l3160J0012K7676R811j7306k5985q391K4764
9653A7072M8358L6730o437m1006l3779q09J6080O503l526n3L21j2422j9832p095
9639A05J0350J2778O270N313O335K077J401P308j774l1862l6976K3264R8792Q9921
9625A93302j1011q8150n5070K1240J9567n1371o3727L1185J14748O4254o7200
9614A07767j18401l7653N9914O2742L781j6974J3432K1626k2515o0100l9949O653
9602a9677K2220N555n609j540j622o456K881K2960K8557J5991O677M562q835k8976
9588C6688k2535J4139L3877O905k6436j2862K9616L4983j1843n0235k8190K9347
$$ plain form
9678 58816 33399 9886 -4032 -2142 33201 97202 143230 131105 78620 38403 37921 66062
9666 66062 102615 130799 129851 88522 29651 -3509 6503 34179 43990 26684 699 -7692 17072
9653 17072 65430 102160 95723 54717 20938 20129 36209 42712 39186 39133 39454 27032 7200 105
9639 105 10455 23233 29503 34816 41151 43228 44629 51937 50163 18301 -18675 4589 103381 193302
9625 193302 182291 94141 39071 60311 79878 28507 -35220 -4035 110713 174967 107767
9614 107767 -10634 -48287 11627 74369 78150 61176 74608 96234 73719 13619 -26330 -19677
9602 -19677 2543 8098 2489 949 -673 -7129 -4248 18712 47269 63260 69937 74499 65664 36688
9588 36688 14153 28292 62169 69074 42638 29776 59392 94375 82532 32297 4107 33454
9576C3454N7679L1370j7187m2681k9172M812K6131J5113j4256k5846l320K6122
9564F2219K4586n652k5696j5621P01j315q381j542p43l0846n7090j8802O2683
9551a5499Q3578O002o4038k0449P6103P8760k3260q7083l6468K9515P731m6307
9539a1415k7622L4909L4299k5160l7213J7690L7416j9941n5198N479P8168N0803
9527H2215l7547n9126P520N8982K8934l5436o6595n5748j8650L6754P8014N6118
9515G5435j4403m7736n700L7177O921m8687l3171M2654P4499K4492l1716l3249
9503D6516j4197j7180j5049J9173L8296j996m7817k3399L4417K5442m4909o4304
9491f5007L613N5429J5767m2008k2525L4769L0135k6203l6327J9978N8488L0867
$$ plain form
9576 33454 91133 122503 105316 62635 33463 38275 64406 79519 65263 39417 36097 62219
9564 62219 86805 81153 55457 39836 40537 39222 30841 29299 28556 -2290 -59380 -78182 -15499
9551 -15499 68079 74081 10043 -10406 65697 144457 121197 34114 -2354 27161 34892 -11415
9539 -11415 -39037 -4128 30171 5011 -32202 -14512 22904 2963 -52235 -46756 31412 82215
9527 82215 44668 -14458 -6938 52044 80978 45542 -21053 -76801 -95451 -58697 19317 75435
9515 75435 61032 13296 7596 44773 51694 3007 -30164 12490 86989 111481 79765 46516
9503 46516 32319 15139 90 19263 57559 55563 7746 -15653 18764 44206 -703 -65007
9491 -65007 -61394 -5965 9802 -32206 -54731 -19962 10173 -16030 -52357 -32379 26109 56976
9479E6976j2752k1241j1125p377M053K6380K4714q923k5504J217K3207k972l9723
9466F930k9802J0556K4709Q234J341J0914P220j1980j6587j900L863p744j3462
9453g708k377J1113J9399K5804J9527r158l2558j5283J9986J3753l5412n8593
9441e1507j9088L2474L6867O748j0915o592K312J4441K8508J7720k7145n6713
9429c2890k3385L7346M9794J1474p822J5918K2208k5569o6093l0718M3080O0303
9417E3646O316l7877j8134K4780L1172P373m441N01m746k2723k9377j9089r074
9404b1673k423J2211K4495J0202j8648j7982J8558M0203J3433k8395m1433l3705
9392d5157k9331j2146L7540P9809N6961j2750n0102k5356R807J1033p09P269K3055
$$ plain form
9479 56976 44224 22983 11858 4481 8534 34914 59628 50705 25201 26418 49625 46653 6930
9466 6930 -22872 -12316 12393 20627 21968 32882 40102 28122 11535 9635 13498 5754 -7708
9453 -7708 -10085 1028 20427 46231 65758 56600 24042 8759 28745 42498 7086 -51507
9441 -51507 -70595 -38121 -1254 5494 -5421 -12013 -9701 4740 33248 50968 23823 -32890
9429 -32890 -56275 -18929 30865 42339 34517 50435 72643 47074 -19019 -49737 -6657 53646
9417 53646 59962 22085 3951 28731 59903 67276 62835 63336 58590 35867 6490 -12599 -21673
9404 -21673 -24096 -11885 12610 22812 4164 -13818 4740 44943 58376 29981 -11452 -45157
9392 -45157 -74488 -86634 -49094 30715 87676 74926 24824 -532 9275 20308 19599 26868 49923
9379D9923K0371L388j1283k3667l2135j8205J8988M0764J4870l5964o0366l8308
9367g1624P239M2080M5242J9405o178j781K1282J9579j9448n3952m4530l695L0565
9354a5816L9027K0947j4460l7019j7017K1934K0772k0122k6842K8148O4570J6684
9342H0806n1454m0627K7170N0229J0195j8365o855n586l1389l2978P222L5603
9330B3971K2904P306J0109k235l5096l5786P276K4946j7214n0263j4998L7329
9318b1751L4709K104K508K1518N198l2230l3279Q63K0162J3394P659N118o145
9305A9828p684J0235M964m1983n5172K4103J06356O4652n4878q6909o003L8164
9293A5673k4759p2543p532P4176M7602l4621m0930K2385M0729j2608n1236k8387
$$ plain form
9379 49923 70294 73682 62399 38732 6597 -11608 7380 48144 63014 27050 -33316 -71624
9367 -71624 -64385 -22305 22937 42342 36164 34383 55665 75244 55796 1844 -42686 -46381 -15816
9354 -15816 23211 44158 29698 -7321 -24338 -2404 18368 -1754 -28596 -448 64122 80806
9342 80806 29352 -11275 15895 66124 76319 57954 51099 45513 14124 -18854 -11632 23971
9330 23971 46875 54181 64290 62055 26959 -8827 -1551 23395 6181 -44082 -59080 -21751
9318 -21751 12958 15062 17570 39088 44286 12056 -21223 -20360 -198 13196 20855 25973 19828
9305 19828 12144 22379 27343 -14640 -69812 -45709 60647 125299 70421 -16488 -22491 15673
9293 15673 -9086 -81629 -89161 -14985 32617 -2004 -42934 -20549 20180 7572 -43664 -72051
9281g2051R026K0709K3593L0700K4005K254j1071j4255k3730k7958n009K2718
9269b1069J6342o397L477L5018K9227j7336m1106j3717K1578K9609K3893J2643
9257G2162j6900m1578j4563L9341L1803m5892q2335q244Q8845Q9407Q650m7855
9245G2841l8007m027J6789J7074q931m1514k4400M5196O9921r190q8379m1778
9233c4405O4161N7996n5430q9017K3451J13299M7901o2852n8417K0809L3379j9544
9221D1331k8588J1925J0252l2758k0121M9655N8580k8215r1505m8221K4554L0541
9209b2570j04N315L2107K9461J2903J7808J5221k8470o3245k7637L6233M3168
9197E0190L605o300J4496r86n0073n3083L790L6641N806k0806P681L9875K2671
$$ plain form
9281 -72051 -63025 -42316 -18723 11977 35982 38236 27165 12910 -10820 -38778 -43787 -21069
9269 -21069 -4727 -11124 -7647 27371 56598 39262 -1844 -15561 6017 35626 59519 72162
9257 72162 55262 13684 -879 38462 70265 24373 -57962 -66206 22639 112046 120696 72841
9245 72841 34834 30807 47596 64670 55739 14225 -10175 35021 104942 95752 7373 -34405
9233 -34405 29756 87752 32322 -56695 -33244 80055 127956 65104 6687 27496 60875 41331
9221 41331 12743 24668 34920 2162 -17959 31696 90276 62061 -29444 -77665 -53111 -22570
9209 -22570 -22674 -17359 14748 44209 57112 74920 90141 61671 -1574 -29211 7022 50190
9197 50190 53795 47495 61991 61005 10932 -42151 -38361 -1720 4086 -16720 -9039 30836 53507
9184E3507l934J2278L5527P159m6406n7586k6838l173R397L7120N4538J3652n4060
9171C1181o2517n395L0200N995q978L3662O8510K4904m4091l8572K4177L2571
9159I1647l7303p4785p099P7975N7623m0615p8033q699O0704L6571l0732m0305
9147F949N685K6074q40j7944m22P927j3349k0693O128J6470j8503l8244J1217
9134b9545P2914N6482k0439o1087l5735j855J1454L4574O3301M1329k8438n5255
9122D7700J864N6002K2444m8651n6172o477J2387j8284k8247J4083N1281L3615
9110H1545j1292l3746k6815q524J0135J4780q260l5517k1755K6123M3854P832
9098C8360k0643O292L9119J1247m2931l5335L2389O5309K0378l3174k7313Q611
$$ plain form
9184 53507 49573 61851 97378 104537 58131 545 -26293 -29466 -20069 17051 71589 85241 31181
9171 31181 -31336 -36731 -6531 -536 -9514 24148 92658 117562 73471 34899 59076 91647
9159 91647 54344 -20441 -27540 50435 108058 67443 -10590 -19289 41415 77986 47254 6949
9147 6949 12634 38708 37868 19924 19502 27429 14080 -6613 -485 15985 -2518 -40762 -29545
9134 -29545 43369 99851 79412 18325 -17410 -19265 -7811 26763 90064 131393 102955 47700
9122 47700 49564 105566 128010 79359 23187 16710 29097 10813 -17434 -3351 47930 81545
9110 81545 70253 36507 9692 1168 11303 26083 17823 -17694 -39449 -13326 30528 38360
9098 38360 17717 24009 63128 74375 31444 -3891 28498 93807 114185 81011 53698 62309
9086F2309J2474j1603j8682m586K023K009J5941K7077n69m9198n5794m740M4594
9073B1255M1060K137l0072m3264l6950M45N5904P4892K9141k9111l2297O755K0367
9060H0262q331k8534j1075Q483l996k3334o665L8216O0516L0703k5953n7966l9901
9047A2425L457K5816J2316r356j5272j5766k0918r103L2225O2621L7277j7755
9035I7967l6314r311R523o477k4904j9319l950Q459K3179K6428m551m2537l2155
9022a3962J4712K5483j0609j9630K2735L8024j6280n9834k2093L6127L2447L820
9010C0940K0710M2091m859o4007k7568O3165O3693l4484q1882j2066N9516L0978
8998H6227l6820m1017J0341M5692L9403N239m1315o1005j2522N9353N0844l8908
$$ plain form
9086 62309 74783 63180 44498 39912 41935 43944 59885 86962 86393 37195 -18599 -23339 21255
9073 21255 62315 64452 34380 -8884 -45834 -45389 10515 85407 114548 85437 53140 59895 80262
9060 80262 71931 43397 32322 40805 36809 13475 6810 45026 105542 136245 110292 52326 12425
9047 12425 15882 41698 54014 44658 29386 13620 -7298 -16401 15824 78445 115722 97967
9035 97967 61653 52342 61865 55388 30484 11165 7215 15674 38853 65281 60730 18193 -13962
9022 -13962 750 26233 15624 -4006 18729 56753 40473 -19361 -41454 -5327 27120 30940
9010 30940 51650 93741 88882 24875 -2693 60472 124165 89681 7799 -4267 55249 86227
8998 86227 49407 8390 18731 64423 103826 109065 67750 6745 -5777 53576 104420 65512
8986F5512q0422r445O5753L7186l4170l1616K8175M3469j083l4159k5524n008
8974A8668J2082K5365J2754k3634k4902K8405N3015p691o6088k1866O1031N2188
8962A19327k9005n5371j0513O792k2117j4801L4372L3531k6345m3409O894K6913
8950B6268j3322j6099M9758P1043n937o3851j5979M0884M452m9098r422O6022
8938H4719N8876l411j7696J122k8785p6301m7759K7147L7916p615n423M0189K1826
8925H4805n4982n5157M6401R6226Q720q6252m8310N7679P7997M224m4935k0742
8913F5674P401j1954l6155j0625M0942M6137j7753q2186o0745L5939R5102M4847
8901A16624l9060l6752L6448N3049k6231q8648m2501M9778P5191K4958k8495m6851
$$ plain form
8986 65512 -14910 -24355 41398 78584 44414 12798 40973 84442 83359 49200 23676 18668
8974 18668 30750 56115 68869 45235 20333 48738 101753 94062 27974 6108 67139 119327
8962 119327 90322 34951 24438 31230 9113 -5688 28684 62215 35870 -7539 -645 26268
8950 26268 12946 -3153 46605 117648 111711 47860 31881 72765 77217 28119 18697 84719
8938 84719 143595 140184 122488 123610 94825 18524 -29235 -2088 35828 28213 22790 62979 84805
8925 84805 29823 -25334 21067 117293 126013 39761 -8549 49130 127127 131351 86416 65674
8913 65674 73075 61121 24966 14341 55283 101420 83667 1481 -59264 -23325 71777 116624
8901 116624 77564 40812 77260 130309 104078 15430 -27071 22707 97898 122856 94361 47510
8889D7510l9918j0368L6457N6266J3349m9575n3757P536N7752L7973k2415m7486
8877C3324n116N4894N4542j5700p1990m0101L6933N3246n622m3929p517L5890
8865G8854J3478l8071m0969N792M8661O5974N9624J0774p5160j20896o3024M0898
8853a4065P6193K4675k7347k2075J1060K7450K1227R59k4240l0330n230J6240
8841E4517J5k1281K988M5975L8264j2907l1379j70J5911q751j7125J9855M4565
8828A30477J4331k1764q913J9709L482m2948n6723k3282J5213K7321J8664N283
8816H0850j742L388J1700N433j2754j9831r398L667J8772M4422N3320M212p4291
8803A07748r1780k2513M3820K6495l1623l4669K7258P5774N4609j2990o3006n1273
$$ plain form
8889 47510 7592 -2776 33681 89947 103296 53721 -36 7500 65252 103225 80810 33324
8877 33324 28208 83102 137644 121944 49954 9853 46786 100032 94410 50481 42964 78854
8865 78854 92332 54261 13292 19084 67745 133719 193343 204117 128957 8061 -54963 -14065
8853 -14065 62128 86803 59456 37381 48441 75891 97118 98077 73837 43507 38277 54517
8841 54517 54532 33251 36239 82214 120478 107571 76192 76022 91933 83182 66057 85912 130477
8828 130477 144808 123044 114131 133840 137322 94374 37651 14369 29582 56903 75567 80850
8816 80850 79108 82496 94196 99629 86875 67044 57646 61313 80085 124507 177827 182039 107748
8803 107748 15968 -6545 37275 63770 32147 -2522 24736 100510 155119 142129 79123 27850
8791B7850P408M3506R125m4168k4385N3378O8716j8193q7827m0216M9775N8892
8779A03861Q464K090L5965K0077m3694n7019J263L7468R97m2735l0016J5120M6227
8766I8068N5093L9462n190m1929k5367J1028n168n2654l6985M1939P3282J9866
8754A71445j9306J2575L0785k8630q0934l6635M0218M1726p680j4370J8878K2190
8742A50262l000l718J0088o682k9731p224K9778J7354j6722k274L4097J3036m1992
8729A43272l7423J8319K7514j5451j5506L7203M0080k8066n3892J0391N5517N689
8717A87647m9542j5755M6529L8561j2029k4926j1064j9987k4410J8864O1034L5770
8705B30692j8149k5536o195j7531k8052J7808O3842K1203n6030l6501O4349R4335
$$ plain form
8791 27850 35258 78764 87889 43721 19336 72714 141430 123237 35410 -4806 44969 103861
8779 103861 112325 114415 150380 170457 126763 69744 71007 108475 109472 66737 36721 51841 98068
8766 98068 153161 192623 187433 145504 120137 131165 125997 73343 36358 78297 151579 171445
8754 171445 152139 164714 195499 166869 85935 49300 89518 131244 123564 109194 128072 150262
8742 150262 147262 143544 153632 146950 117219 109995 139773 157127 140405 138131 172228 185264 143272
8729 143272 105849 124168 151682 136231 120725 157928 198008 169942 116050 126441 181958 187647
8717 187647 138105 122350 168879 207440 195411 170485 159421 139434 115024 133888 194922 230692
8705 230692 212543 187007 180812 163281 135229 153037 216879 238082 182052 145551 209900 304235
8693C04235P869o6470l7791K1019J7265k4050l6781j9739J572K8432M7372K2052
8681B64985k5765k0524L5770M2307l2776p7828j1859P5016N8553l1185p1748l1289
8669A73657K3314M9980N4690L1128k1715n3360k3266K5328L3640K1479K6994J4635
8657C56504m8990q9821k8312O3933N8237j7665k6717L6164L7770m4953o9105K5074
8645B52119R9706M6903l9125l5733J1197K503k8516k077L5684n104p2637m3180
8633B21740O3069J04779M3608j5751j3927q942l3943l1219K1454M8333N759l3598
8621C71362j86N8630O2513K3612Q251K7770M4190M4341L8145J5152l0647n7635
8609F05498k3617L8499N3756J0031k5741l696M2706M6667k500m4629k2153M5609
$$ plain form
8693 304235 312104 245634 207843 228862 246127 222077 185296 165557 167129 195561 242933 264985
8681 264985 239220 218696 254466 296773 263997 186169 174310 249326 307879 276694 204946 173657
8669 173657 196971 246951 301641 332769 311054 257694 234428 259756 293396 314875 341869 356504
8657 356504 307514 217693 189381 253314 311551 293886 267169 303333 341103 296150 227045 252119
8645 252119 351825 398728 359603 323870 335067 337570 309054 306977 342661 337557 264920 221740
8633 221740 284809 389588 433196 417445 403518 394576 360633 329414 350868 399201 404960 371362
8621 371362 371176 429806 492319 515931 524182 551952 596142 640483 678628 693780 663133 605498
8609 605498 581881 620380 674136 684167 658426 654730 697436 744103 741603 696974 674821 720430
8597G20430P9973M2020j2951j2414K7147K9774j3495k7098K1191N9836L0466j0920
8585I33959J5320P7650Q1203J8226k7297j7421n166k5958l5370L707M4317K4450
8573A087620l2823n0857j1538K1102p020o6401q3324l4691K1446J6688m2563q4781
8561G32858o6799k3369o306j2124q638k115k0527m5435k8597J9672K8982k2384
8549E45218o4424l9847Q360P869l2105m6684k0727L203P554J7405L3657J9257
8537D38736l0134o3354m8303j5789P46J5038L8181L4317j5690n2797j8106L8655
8525C21500K1135n3514o3652K5533R1622L7772n4046n1507K0392K8673m5612p8848
8513A99448j0015O3726M7905j1304k6907j1362k1278l7278q892L1195J3670l5469
$$ plain form
8597 720430 800403 842423 829472 817058 844205 873979 860484 833386 854577 914413 944879 933959
8585 933959 949279 1026929 1108132 1126358 1099061 1081640 1076474 1050516 1015146 1018853 1063170 1087620
8573 1087620 1054797 1003940 992402 1013504 1006484 940083 856759 822068 843514 860202 817639 732858
8561 732858 666059 642690 636384 624260 615622 613507 592980 547545 518948 538620 567602 545218
8549 545218 480794 440947 449307 457176 425071 378387 357660 360863 368417 385822 419479 438736
8537 438736 408602 345248 296945 281156 281902 296940 335121 369438 353748 300951 282845 321500
8525 321500 342635 289121 225469 251002 342624 380396 326350 274843 295235 323908 278296 199448
8513 199448 189433 253159 301064 289760 262853 251491 230213 192935 184043 215238 228908 193439
8501A93439k7889L2210M8282k065k4926K5968O1014Q32q4924p7420J5067P6394
8489B35982M5113k7774o8217n3439l476M0189L2028k7774o8291k6439N7416Q2263
8477B17581K2883m1690m5613j4395R09M373K2934L8801J3958l6206n0665q991
8465A23879L3753J7876m0760o7559k0846N5406Q1432L3996k9868m4768j2476J2694
8453A42759J265j8500j0340J5432J9634o199k6263j1422J9679K8098Q773q657
8441A54259q336m837m796R297L4575K7975k7357p1442m3065J9184K8009j2293
8429A01173j1756M6547O2676j5501q7817m7470N0076P0454j557o1552n1686j2174
8417D1413J9815M9133N9861K2886k5309j8464J6742p493p1231n2016N8295R8887
$$ plain form
8501 193439 165550 197760 246042 243977 219051 245019 306033 306865 221941 144521 159588 235982
8489 235982 281095 253321 185104 131665 128189 168378 200406 172632 104341 77902 135318 217581
8477 217581 240464 198774 153161 138766 139675 144048 166982 205783 219741 183535 132870 123879
8465 123879 157632 175508 134748 67189 46343 101749 183181 217177 187309 142541 130065 142759
8453 142759 144024 125524 115184 130616 150250 144051 117788 106366 126045 154143 162916 154259
8441 154259 145923 141086 136290 145587 180162 208137 180780 109338 66273 85457 113466 101173
8429 101173 89417 135964 198640 183139 95322 47852 97928 168382 166825 105273 53587 41413
8417 41413 61228 110361 170222 193108 167799 149335 166077 158584 87353 35337 93632 192519
8405A92519j0810j17622o1377P0778Q4428j6374n7093J2885N5955p830p6429m7408
$$ plain form
8405 192519 181709 64087 2710 73488 157916 141542 84449 97334 153289 145459 69030 21622
$$ [...]
##END NTUPLES=NMR SPECTRUM
##END=
