##TITLE=1H ikalashn
K-1112
28.12.2024
##JCAMPDX= 6.0         $$ Bruker NMR JCAMP-DX V2.0
##DATA TYPE= NMR SPECTRUM
##DATA CLASS= NTUPLES
##ORIGIN= UXNMR, Bruker Analytische Messtechnik GmbH
##OWNER= root
$$ TOPSPIN		Version 1.3
$$ 2024-12-28 11:08:11.796 +0400  Irina@DPX200
$$ Compression mode = diff/dup
##.OBSERVE FREQUENCY= 200.13180117
##.OBSERVE NUCLEUS= ^1H
##.ACQUISITION MODE= SIMULTANEOUS
##.ACQUISITION SCHEME= undefined
##.AVERAGES= 32
##.DIGITISER RES= 18
##SPECTROMETER/DATA SYSTEM= spect
##.PULSE SEQUENCE= zg
##.SOLVENT NAME= DMSO
##.SHIFT REFERENCE= INTERNAL, DMSO, 1, 19.99637
##AUDIT TRAIL= $$ (NUMBER, WHEN, WHO, WHERE, WHAT)
$$ ##TITLE= Audit trail, TOPSPIN		Version 1.3
$$ ##JCAMPDX= 5.01
$$ ##ORIGIN= Bruker BioSpin GmbH
$$ ##OWNER= Irina
$$ $$ F:/spectra/data/iren/nmr/1H/4/pdata/1/auditp.txt
$$ ##AUDIT TRAIL=  $$ (NUMBER, WHEN, WHO, WHERE, VERSION, WHAT)
(   1,<2024-12-28 11:05:32.812 +0400>,<Irina>,<DPX200>,<TOPSPIN 1.3>,
      <created by zg
	started at 2024-12-28 11:03:24.859 +0400,
	POWCHK disabled, PULCHK disabled
       configuration hash MD5:
       BE 6D 3F 07 2A EA 11 49 91 17 2B D3 AF B3 58 0D
       data hash MD5: 16K
       6B 8F D0 B0 34 36 84 B9 5A 84 40 78 06 97 3B 9F>)
(   2,<2024-12-28 11:07:43.281 +0400>,<Irina>,<DPX200>,<TOPSPIN 1.3>,
      <Start of raw data processing
       efp BC_mod = 2 LB = 0.02 FT_mod = 6 PKNL = 1 PHC0 = 338.5493 PHC1 = 10.24457 SI = 32K 
       data hash MD5: 32K
       3A 0A 1F A6 F3 FE E2 0E 31 11 70 40 71 A5 30 EC>)
(   3,<2024-12-28 11:07:45.531 +0400>,<Irina>,<DPX200>,<TOPSPIN 1.3>,
      <apk 
       data hash MD5: 32K
       1D 70 1D 57 F4 2D 1D 23 C4 76 D2 CF 0C BE 52 D2>)
(   4,<2024-12-28 11:07:56.515 +0400>,<Irina>,<DPX200>,<TOPSPIN 1.3>,
      <pk fgphup PHC0 = 9.065259 PHC1 = -8.8 
       data hash MD5: 32K
       D7 2B 84 88 36 9C 20 98 D9 0B BE 32 01 C5 27 FB>)
(   5,<2024-12-28 11:07:58.406 +0400>,<Irina>,<DPX200>,<TOPSPIN 1.3>,
      <abs n ABSG = 5 
       data hash MD5: 32K
       F5 21 6C BF EA 44 33 15 2E 1A 7B EF 13 AD 34 D0>)
$$ ##END=
$$ 
$$ $$ hash MD5
$$ $$ 79 18 BC 69 1C 2F C6 A7 2D F9 75 AC 91 53 58 2C
##$RELAX= 
##$RELAX= 
##$RELAX= 
##$RELAX= 
##$RELAX= 
##$RELAX= 
##$RELAX= 
##$RELAX= 
##$RELAX= 
$$ Bruker specific parameters
$$ --------------------------
##$DU= <F:/spectra>
##$EXPNO= 4
##$NAME= <1H>
##$PROCNO= 1
##$TYPE= <nmr>
##$USER= <iren>
##$AMP= (0..31)
100 100 100 100 100 100 100 100 100 100 100 100 100 100 100 100 100 100 
100 100 100 100 100 100 100 100 100 100 100 100 100 100 
##$ANAVPT= -1
##$AQSEQ= 0
##$AQ_mod= 1
##$AUNM= <au_zg>
##$AUTOPOS= <>
##$BF1= 200.13
##$BF2= 200.13
##$BF3= 200.13
##$BF4= 200.13
##$BF5= 200.13
##$BF6= 200.13
##$BF7= 200.13
##$BF8= 200.13
##$BYTORDA= 1
##$CFDGTYP= 0
##$CFRGTYP= 5
##$CHEMSTR= <none>
##$CNST= (0..63)
1 1 145 1 1 1 1 1 1 1 1 1 1 1 1 1 1 1 1 1 1 1 1 1 1 1 1 1 1 1 1 1 1 1 
1 1 1 1 1 1 1 1 1 1 1 1 1 1 1 1 1 1 1 1 1 1 1 1 1 1 1 1 1 1 
##$CPDPRG= <>
##$CPDPRG1= <>
##$CPDPRG2= <>
##$CPDPRG3= <>
##$CPDPRG4= <mlev>
$$ [...]
##$SW_h= 4401.40845070422
##$TD= 16384
##$TD0= 1
##$TE= 300
##$TE2= 300
##$TE3= 300
##$TEG= 300
##$TL= (0..7)
0 120 120 120 120 120 120 120 
##$TP= (0..7)
150 150 150 150 150 150 150 150 
##$TP07= 0
##$TPNAME0= <>
##$TPNAME1= <>
##$TPNAME2= <>
##$TPNAME3= <>
##$TPNAME4= <>
##$TPNAME5= <>
##$TPNAME6= <>
##$TPNAME7= <>
##$TPOAL= (0..7)
0.5 0.5 0.5 0.5 0.5 0.5 0.5 0.5 
##$TPOFFS= (0..7)
0 0 0 0 0 0 0 0 
##$TUNHIN= 0
##$TUNHOUT= 0
##$TUNXOUT= 0
##$USERA1= <user>
##$USERA2= <user>
##$USERA3= <user>
##$USERA4= <user>
##$USERA5= <user>
##$V9= 5
##$VALIST= <valist>
##$VCLIST= <CCCCCCCCCCCCCCC>
##$VD= 0
##$VDLIST= <DDDDDDDDDDDDDDD>
##$VPLIST= <PPPPPPPPPPPPPPP>
##$VTLIST= <TTTTTTTTTTTTTTT>
##$WBST= 1024
##$WBSW= 25
##$XGAIN= (0..3)
0 0 0 0 
##$XL= 0
##$YL= 0
##$YMAX_a= 155501
##$YMIN_a= -191738
##$ZGOPTNS= <>
##$ZL1= 120
##$ZL2= 120
##$ZL3= 120
##$ZL4= 120
##$ABSF1= 19.99637
##$ABSF2= -1.996376
##$ABSG= 5
##$ABSL= 3
##$ALPHA= 0
##$AQORDER= 0
##$ASSFAC= 0
##$ASSFACI= 0
##$ASSFACX= 0
##$ASSWID= 0
##$AUNMP= <proc_1d>
##$AXLEFT= 0
##$AXRIGHT= 0
##$AXTYPE= 0
##$AXUNIT= <>
##$AZFE= 0.1
##$AZFW= 0.1
##$BCFW= 0
##$BC_mod= 2
##$BYTORDP= 0
##$COROFFS= 0
##$CY= 7568.61572265625
##$DATMOD= 1
##$DC= 0
##$DFILT= <>
##$DTYPP= 0
##$F1P= 17.9538593292236
##$F2P= -4.03888763876832
##$FCOR= 0.5
##$FTSIZE= 32768
##$FT_mod= 6
##$GAMMA= 0
##$GB= 0
##$INTBC= 0
##$INTSCL= 5.656564e-011
##$ISEN= 128
##$LB= 0.02
##$LEV0= 0
##$LPBIN= 0
##$MAXI= 945.577
##$MC2= 0
##$MEAN= 0
##$ME_mod= 0
##$MI= -402.1523
##$NCOEF= 0
##$NC_proc= -7
##$NLEV= 6
##$NOISF1= 8.587773
##$NOISF2= 6.764455
##$NSP= 0
##$NTH_PI= 0
##$NZP= 0
##$OFFSET= 19.99637
##$PC= 1
##$PHC0= 345.0515
##$PHC1= -5.414046
##$PH_mod= 1
##$PKNL= yes
##$PPARMOD= 0
##$PPDIAG= 0
##$PPIPTYP= 0
##$PPMPNUM= 100
##$PPRESOL= 1
##$PSCAL= 0
##$PSIGN= 0
##$REVERSE= no
##$SF= 200.13
##$SI= 32768
##$SIGF1= 16.12182
##$SIGF2= -4.496377
##$SINO= 3.521527
##$SIOLD= 32768
##$SREGLST= <1H.CDCl3>
##$SSB= 0
##$STSI= 32768
##$STSR= 0
##$SW_p= 4401.40845070422
##$SYMM= 0
##$S_DEV= 0
##$TDeff= 16384
##$TDoff= 0
##$TI= <>
##$TILT= no
##$TM1= 0
##$TM2= 0
##$TOPLEV= 0
##$USERP1= <user>
##$USERP2= <user>
##$USERP3= <user>
##$USERP4= <user>
##$USERP5= <user>
##$WDW= 1
##$XDIM= 32768
##$YMAX_p= 391336975
##$YMIN_p= -1186398
$$ End of Bruker specific parameters
$$ ---------------------------------
##NTUPLES= NMR SPECTRUM
##VAR_NAME=  FREQUENCY,     SPECTRUM/REAL,   SPECTRUM/IMAG
##SYMBOL=    X,             R,               I
##VAR_TYPE=  INDEPENDENT,   DEPENDENT,       DEPENDENT
##VAR_FORM=  AFFN,          ASDF,            ASDF
##VAR_DIM=   32768,         32768,           32768
##UNITS=     HZ,            ARBITRARY UNITS, ARBITRARY UNITS
##FACTOR=    0.134324425510551, 1,           1
##FIRST=     4401.40845070422, 16542,        -1561852
##LAST=      0,             145591,          -1582538
##MIN=       0,             -1186398,        0
##MAX=       4401.40845070422, 391336975,    0
$$ Real data points
##PAGE= N=1
##DATA TABLE= (X++(R..R)), XYDATA
$$ [...]
11192c7600K043P5546P5081j558n5690k3434L6456L3186k5700n9532m0433j4281
11180c5916m619J6027M5843L5841j4345l0771J4949M5430K830m7589k4221L2571
11168C6030L1143j8449l5441j3023j1832l0909r428M5370N3671K65l7090j9460
11156i153Q20r845q917K6556M2985K858m5139m3191p222J4025P353j2853k9113
11143g0836j6795K7534M9178J842n2448j3041Q4558R3705j4303r1295m2220L3912
11131a0209K2921k6511k1115P856p878k5776J6020N1672m197p8163m3806N2848
11119f6338O1379j7226m1287J6135K8306m5193q0675j0651N9805L8719r342l15
11107f6683K7665J3751m572J9403L3855j5663o8614m4329J6994K6036j596J3691
$$ y = [-37600, -35557, 39989, 115070, 113512, 57822, 34388, 70844, 104030, 78330, 18798, -21635, -35916, -40535, -24508, 21335, 57176, 42831, 12060, 27009, 72439, 75269, 27680, 3459, 36030, 67173, 48724, 13283, 260, -11572, -42481, -51909, -6539, 47132, 47397, 10307, -9153, -8333, -18178, -27095, -539, 42446, 45304, 165, -43026, -50248, -36223, -28870, -41723, -70836, -87631, -60097, -10919, -9077, -61525, -74566, 9992, 103697, 89394, -1901, -44121, -10209, 12712, -13799, -34914, -27058, -34936, -60712, -44692, 6980, 2783, -75380, -119186, -66338, -4959, -22185, -63472, -47337, -19031, -64224, -144899, -155550, -95745, -57026, -66368, -66683, -39018, -25267, -29839, -10436, 23419, 7756, -60858, -105187, -88193, -62157, -63753, -50062]
11095e0062O1666N6922p452m1318l471L5832P896n5390p3323k1033M7819O1245
11083A9331K643o3277n2360L2164Q5468L0779o9248q7150J544Q9602P9388n409
11071F3475o7854n4611K107L7236K3461r426j8091m47P011j4678l9715l7195j1691
11058a20418J2520K4524K7021K4992K6624L1824J6212l5267p6110l9701M8311
11047e9468P3495o495q0279l5615O9598Q8455J2p0211m2047J7345J4835l4649
11035f5024m9374n69O3205Q4067M7507j8151o8216p3882m1279K634L6455M7368
11023c5259K6671j2932l2482j0824K1134K3647P239P176J7677N058k3744k5738
11011c2377L394J7935l658k7642k3739n521N770J1530J1528n471k6290j3779L1886
$$ y = [-50062, 11604, 68526, 61074, 19756, 16285, 52117, 60013, 4623, -68700, -89733, -41914, 19331, 21974, -41303, -93663, -61499, 23969, 54748, -14500, -101650, -100106, -10504, 68884, 63475, -4379, -58990, -56883, -19647, 3814, -5612, -23703, -24150, -17139, -31817, -71532, -108727, -120418, -107898, -83374, -56353, -31361, -4737, 27087, 43299, 8032, -68078, -107779, -59468, 14027, 7532, -72747, -108362, -38764, 49691, 49703, -20508, -62555, -45210, -30375, -65024, -114398, -114967, -51762, 32305, 79812, 61661, -6555, -80437, -121716, -119082, -82627, -35259, -8588, -21520, -54002, -64826, -43692, -20045, -12806, -5630, 12047, 17105, -6639, -32377, -28983, -11048, -14706, -42348, -66087, -71608, -65838, -54308, -42780, -48251, -74541, -88320, -56434]
10998e6434N5062J9396l4840m3175r29L9077L6288R47k9517l1788j5031m431o955
10985g2330m591R616J2836n686j2871J6396M2878J5913l6835m1983N782L8674
10973c2201K6288R934J4685J1637q861j0629J0654P496k5585k8131J1587J6471
10961C345m2051o9462Q91P8567N1429k9368l3876L3222N2313m630m0715j2109
10949a2444Q246k2430m0393j187L4184J0478j9641J1547O3427M7377l2471q4087
10937c7394n5548J1270N0905M4181J3477j2451j7915n273R954J2419l722l1113
10925b1210m5315k0440K9440M5746k1m8300k4373M3915N5816r527n5621j6543
10913f6433M1871K9825k5729l1923J8792M2043P9m0933j7590L3478L2470k4999
$$ y = [-56434, -1372, 18024, -16816, -59991, -60920, -21843, 14445, 15392, -14125, -45913, -60944, -65375, -72330, -76921, -67305, -54469, -60155, -73026, -56630, -13752, 2161, -34674, -76657, -70875, -32201, -5913, 4021, 18706, 30343, 21482, 10853, 21507, 29003, 3418, -24713, -13126, 3345, -38706, -108168, -107277, -28710, 22719, -6649, -40525, -7303, 45010, 40380, -335, -12444, -4198, -26628, -67021, -68208, -34024, -23546, -43187, -31640, 31787, 79164, 46693, -37394, -92942, -81672, -30767, 13414, 26891, 14440, -3475, -8748, 1206, 13625, 9903, -21210, -66525, -86965, -57525, -11779, -11800, -60100, -84473, -40558, 15258, 5731, -49890, -66433, -24562, 5263, -20466, -52389, -33597, 8446, 8525, -32408, -49998, -16520, 15950, -9049]
10901i049o1003k5291L4001L6942j6538m7509j2374L5502K9115j2411k1927O885
10889f3657J7814q634k6483n625K3479K6938J2560k821j7192j6746J5529M6690
10877A852J8286n1005o6723k734M2509l594o5323l5540N1697P3730P112m7951
10865g7684k2743L7283N5191J3756m8319p7545m1822L0759O4203K8598j2055L3
10853e0345K0134j3080m8895J713R5526R8284l557p3645l5949K2425J0327l1887
10841h949k9745k258o386l2828l7160j4699J6548M6732M5282j7935q2774l9400
10829a63572Q4223J09708k4262j29053m2993R8958P0620p6925r8949L8010J06730
10818b7505J50j03953n1064N2226M9074j2386o977L4111R067m1961r363O7155
$$ y = [-9049, -70052, -95343, -61342, -24400, -40938, -88447, -100821, -65319, -36204, -48615, -70542, -63657, -45843, -54477, -80960, -86585, -63106, -36168, -23608, -26429, -43621, -60367, -44838, 1852, 20138, -30867, -97590, -100324, -57815, -61409, -126732, -162272, -110575, -36845, -29733, -77684, -100427, -63144, -7953, 5803, -42516, -120061, -161883, -131124, -66921, -38323, -50378, -50345, -30211, -43291, -92186, -90473, 5053, 103337, 99780, 26135, -9814, 12611, 22938, -8949, -38694, -40952, -47338, -80166, -117326, -132025, -115477, -68745, -23463, -41398, -124172, -163572, -79349, 30359, 6097, -122956, -165949, -66991, 3629, -73296, -172245, -134235, -27505, -27355, -131308, -182372, -130146, -81072, -93458, -100435, -66324, -57257, -99218, -108581, -41426]
10806d1426N2336m1522o1399L0402R2903L8725l9123m0007p734j8722m0313j0105
10794h5985L4687K4429j0767M264M4365J8309o4497q6166j138Q4441O4756j8870
10782G828n1709r265L1770K0531r173j2650o56k618r499M041K4676J5332j9138
10769a0530k8469O668L7819J9608j7300j2334K6202L0969j3298l7025N048N3371
10757F0729K8938m1829o0675l105M5532J5248n1324o3925n272N7029O0155J0187
10745E1688l9215m6151j5158J5716J8772M064l727l407q756j2039N562K7184J2127
10732F660l2831m7047p793K6865R638j6343Q190N0541L3943l3140o6692l9056
10720a07065p918n200N719L5363L0285k0945l8414K0556O7778J4047p3997o2884
$$ y = [-41426, 10910, -30612, -92011, -61609, 31294, 70019, 30896, -9111, -16845, -35567, -75880, -85985, -51298, -26869, -37636, -33372, 10993, 29302, -35195, -121361, -122499, -38058, 26698, 7828, -43881, -53146, -21376, -845, -10018, -22668, -23324, -25942, -35441, -31400, -6724, 8608, -10530, -38999, -32331, 5488, 25096, 7796, -4538, 21664, 52633, 39335, 2310, 7358, 60729, 89667, 47838, -12837, -15942, 29590, 44838, -6486, -70411, -75683, -18654, 41501, 51688, 12473, -33678, -48836, -33120, -14348, -10284, -14011, -17418, -26174, -38213, -32651, -5467, 6660, -26171, -73218, -81011, -54146, -44508, -60851, -52661, -2120, 31823, -1317, -68009, -107065, -114983, -120183, -114464, -79101, -48816, -69761, -108175, -87619, -19841, -5794, -79791, -142675]
10708a42675M0393R7048M5872k3301k8895r067k0148k9639P080M1353J957p2909
10696i2931p6212Q061P8055N7835j0521m5505l2676j1783k541P410K1341K4605
10684g4862J3999M746N148O397J674k051K240R165R884M620p00l464l443K37L960
10669b2450p50j1942j0775J2650L3806K0035j7244k8858J346K7523R870k2182
10657h971j7349J2221J0543k6389m0688r511J5730j478j7558J4701N5068L2345
10645A8664l6064o0205j0554M0814L0517j1317k2241j206P824o349j3804k297
10633f6218K490j7887m1963l5649L704M2976M9237K4835L843J0134K5631J6150
10621A7283j4696k5794j638J8543k3k9509k0784J7161K9960N034j0365R368K4463
$$ y = [-142675, -102282, -5234, 40638, 17337, -11558, -20625, -40773, -70412, -63332, -21979, -20022, -92931, -169143, -161082, -83027, -25192, -35713, -81218, -113894, -125677, -128218, -120808, -99467, -74862, -60863, -56117, -50969, -44572, -42898, -44949, -42709, -33544, -23660, -19040, -19740, -23204, -26647, -26410, -22450, -23200, -35142, -45917, -33267, 539, 20574, 3330, -25528, -24182, 3341, 13211, -8971, -26320, -14099, -3556, -29945, -70633, -80144, -64414, -65892, -83450, -68749, -13681, 18664, -17400, -77605, -88159, -47345, -16828, -28145, -50386, -51592, -43768, -50117, -63921, -66218, -63728, -81615, -123578, -159227, -155523, -112547, -63310, -38475, -34632, -24498, 1133, 17283, 2587, -23207, -24845, -6302, -6325, -35834, -56618, -39457, -9497, -4463, -14828, -5460, 19003]
10608A9003j507l6085k7119J4717L4827J7756l232j1043k1314l0766j0046L2240
10596b2569L7037j7502o5293l8057L4413O5574L0274j7263l1129j8234L642L0529
10584h578M3902J6236l3842m5072O4M1178K4907k1746m1264k5924m099J3764K4937
10571a5537P195m0769o5220k8238J8835Q579k5438o92O1379N2376l9544r0062
10559a57136l0836M1425K7673j4591J1889O0940K2262p0754p5965K4025Q4362
10548g6706K3510o0771n9526o832J5306J5909L8617N2656J0982m3501m0070k579
10536a33005l31j6788J1951N4928J9835p1504q5059J5098R5311N2873l4354m3806
10524a34851J0279L5045J7571Q575M057l3618o7725k4328O9010R8761L2859l4146
$$ y = [19003, 17496, -18589, -45708, -30991, 3836, 21592, 18360, 7317, -13997, -44763, -54809, -22569, 14468, -3034, -68327, -106384, -71971, -6397, 23877, 6614, -24515, -42749, -39107, -8578, 35324, 51560, 17718, -27354, -27290, 13888, 38795, 17049, -24215, -50139, -54238, -40474, -15537, -8342, -49111, -114331, -142569, -123734, -115155, -140593, -141285, -79906, -27530, -67074, -157136, -187972, -146547, -118874, -133465, -121576, -60636, -38374, -109128, -185093, -161068, -76706, -53196, -113967, -173493, -180325, -165019, -149110, -110493, -57837, -46855, -90356, -130426, -133005, -133336, -150124, -138173, -83245, -63410, -134914, -219973, -204875, -109564, -56691, -91045, -134851, -124572, -89527, -71956, -63381, -59324, -92942, -160667, -184995, -115985, -17224, 15635, -18511]
10512a8511k9892J054o733l5596l3759l182J9704K5235K3564J3427l204j0224
10500e8117r085j9725k9272J188N1810M2625l6047p6920j3272N9899K6396n9294
10488a19814n5368L3193O1336j4570o5584o881O5574M1293k6837k6293K4433K1932
10476f7586l7723n7785j0021K3170n982l3336N601O9810P4702Q580o3097p9305
10464a72972l3727L1464N7201J9128l3685k5081M3615P9381K2137o1436o3962
10453a37937J2973O4845L3106k4587l2728k481N700j8513k9855o265K0396J8921
10441i6425K017l289J629q07q153l723P867K445j9180j8254K5902O6441L6233
10428g297n1998r8097l8611N6451O6543j3768o5268j7132N1371L9424j5080j689
$$ y = [-18511, -48403, -47349, -54082, -89678, -123437, -126619, -106915, -81680, -58116, -44689, -47893, -58117, -67202, -86927, -116199, -115011, -63201, -20576, -56623, -133543, -146815, -86916, -60520, -119814, -175182, -141989, -80653, -95223, -160807, -167688, -102114, -60821, -87658, -113951, -89518, -67586, -105309, -163094, -173115, -149945, -155927, -189263, -183662, -113852, -39150, -30570, -93667, -172972, -206699, -175235, -118034, -98906, -132591, -157672, -114057, -34676, -12539, -73975, -137937, -124964, -60119, -27013, -51600, -84328, -86809, -81109, -99622, -129477, -135742, -115346, -96425, -94408, -97697, -96068, -96875, -105028, -108751, -100884, -98439, -117619, -135873, -109971, -43530, -7297, -59295, -157392, -196003, -139552, -73009, -86777, -152045, -169177, -117806, -78382, -93462, -95151]
10416i5151P2613Q3380r630q6007m6880L4762L6631k3673l8662J963Q069m0407
10404a02992n5255K419M8696J4971m1690l8462L082J1023j0645k071L8447N1677
10392h0800K0215p172k553j77k7644n1149k6306K8734N1049J6540k6117j8690
10380a24070K6501L9596p691n3581l0748L2407N2655J6599j0150J452N754j9001
10368g0277k6070L735J3577k1762l2441K2335N8560J025p0791m1496M2415M7651
10356g3539j7464k5051L5747L5807n2929q7641J849P9310K3172p1672n3622M2979
10344a63054P3083J7754j8182p76M73l5366m0512J1222N3062L6712J433l951O213
10331f1889l592k9618m2702k7998N429K9735J6071k4968l8168L459M5736K4428
$$ y = [-95151, -22538, 60842, 51212, -34795, -81675, -46913, -10282, -33955, -72617, -70654, -62585, -102992, -158247, -155828, -107132, -92161, -133851, -172313, -169231, -158208, -168853, -170924, -132477, -80800, -60585, -67757, -70310, -70487, -98131, -149280, -175586, -146852, -95803, -79263, -105380, -124070, -97569, -57973, -65664, -119245, -149993, -117586, -64931, -48332, -58482, -57030, -51276, -70277, -96347, -92612, -79035, -100797, -133238, -110903, -52343, -51318, -122109, -163605, -121190, -73539, -91003, -116054, -80307, -44500, -97429, -185070, -183221, -103911, -80739, -152411, -206033, -163054, -89971, -72217, -90399, -91175, -90702, -126068, -166580, -155358, -102296, -65584, -64151, -68102, -61889, -65481, -95099, -137801, -165799, -160370, -130635, -114564, -139532, -177700, -174241, -128505, -104077]
10319a04077l4570m9023J29M9482M8706J2708k1589l3280j2499K9606M9282J8887
10307d6238k3189k3943J660J975j9320j8221j21q670l4367k6370O761N894k4718
10294b08867j6815L3989M9556N286k6349o206J0242r274r616L4666N1459o78m4662
10281a37269j6701J8345j0501m3328j837N1006J3929n8365l2736O8177Q8446n794
10269f6628p0486j8945M9623K5336m5279n9098j9793J62q593P89L0588L4159L07
10256a47858k7260j7151J0520J9879M930r945m027J1561P104j9432k9638m24L1487
10243a70254J9734j6860k1911P686K0454Q26n648K5017M8755K1237l3693n6738
10231a61395k5066L1366O2688L8893j8824m8454j9489J8437M183l6658k9218K5146
$$ y = [-104077, -138647, -187670, -187541, -138059, -89353, -76645, -98234, -131514, -144013, -114407, -65125, -46238, -69427, -93370, -91710, -89735, -109055, -127276, -127397, -136067, -170434, -196804, -190043, -184149, -208867, -225682, -191693, -142137, -136851, -163200, -169406, -159164, -168438, -178054, -143388, -91929, -92607, -137269, -153970, -135625, -146126, -189454, -191291, -140285, -126356, -184721, -217457, -149280, -60834, -66628, -137114, -156059, -106436, -81100, -126379, -185477, -205270, -205108, -213701, -212912, -182324, -148165, -147858, -175118, -192269, -181749, -161870, -156940, -166885, -170912, -159351, -152247, -171679, -201317, -201741, -170254, -150520, -167380, -189291, -181605, -161151, -160325, -165973, -140956, -92201, -70964, -104657, -161395, -186461, -155095, -92407, -53514, -72338, -120792, -140281, -121844, -117661, -154319, -183537, -158391]
10219a58391M4991n04m4947l4031K819K4076L6412M2305J1829m2293m6135J7229
10207a46640N5560Q356m4573j0694N4802L5065n2989q0621o381P2053P1898K1248
10195b2916j9699l8833m3887l1233j3120j4807k4372m108L4995L5323j3858n1267
10183b07782l5407J831K0717L0384M4644L8551m777m6106l6568J1859M0468J5454
10171a26732l8696o8721m5365N371K9878J7863J7925N1623N6937j5765r1666n8826
10159b66174M6728O9910k7531r5792k5828P8514O3481l8594p2384j732N6527K8525
10147a84350k1529j5683K7300M8868L7955J4477j6189m7677n2920j9194K3984
10136b04958L9571K3633m935k9552l6178j5892J6428K9603J5512j990o167o499
$$ y = [-158391, -113400, -113904, -158851, -192882, -190063, -165987, -129575, -87270, -75441, -117734, -163869, -146640, -91080, -82724, -127297, -137991, -83189, -48124, -101113, -181734, -188115, -116062, -44164, -22916, -42615, -81448, -125335, -156568, -169688, -184495, -208867, -212975, -177980, -142657, -156515, -207782, -243189, -241358, -220641, -190257, -145613, -107062, -111839, -157945, -194513, -182654, -142186, -126732, -165428, -234149, -279514, -274143, -244265, -226402, -208477, -156854, -99917, -115682, -207348, -266174, -219446, -149536, -177067, -272859, -298687, -220173, -156692, -195286, -267670, -269402, -212875, -184350, -205879, -221562, -194262, -145394, -107439, -92962, -109151, -156828, -209748, -228942, -204958, -165387, -141754, -146689, -176241, -212419, -228311, -211883, -182280, -166768, -168758, -174925, -181424]
10124a81424p972L531K4838K0220k4271n9544l1139L5777O0022J7167k3852l499
10112a70146L5796J4069n4046o7372Q705P5185L7680n0056o3310Q137N4015K0282
10100a51061j9217n92K7236K920l4187j9592J6766P820k4516j1404K8333J6822
10088a60672l3196k6254M6191P4382P912n8023l7873J2927P604k3518j132N1331
10076a40321M2834k7553o1268j0440N6544N9410N411m1213m0565n229K3601J7507
10064a21282o080m498K0288J1205m6097o7418J3268J12652R0128l9730j08455
10053a46019l4444N8803L1890o7033q9565r586O0783N1772J4996J0119J4828r385
10041a12841l6568k1422J7794K2615j5274m0505j5550K5463K5120j8281m8663
$$ y = [-181424, -189396, -185865, -161027, -140807, -165078, -224622, -255761, -219984, -159962, -142795, -166647, -170146, -134350, -120281, -174327, -241699, -232994, -157809, -120129, -170185, -233495, -225358, -171343, -151061, -170278, -170870, -143634, -140714, -174901, -194493, -177727, -169907, -194423, -205827, -177494, -160672, -193868, -220122, -173931, -99549, -91637, -149660, -187533, -174606, -167002, -190520, -191652, -140321, -97487, -125040, -186308, -196748, -140204, -80794, -75383, -116596, -157161, -162390, -138789, -121282, -127362, -131860, -111572, -100367, -146464, -213882, -200614, -87962, 2166, -37564, -146019, -180463, -121660, -89770, -156803, -246368, -255954, -195171, -143399, -128403, -118284, -103456, -112841, -149409, -170831, -153037, -130422, -145696, -186201, -201751, -176288, -151168, -169449, -218112]
10030b18112k6781J9677L6163J4284l945P222K0927M708k5409k8804j990J9475
10018a82585J6377P137P849M874j5709l6450k9529L725L4529M1024K4757j532
10006a25533k5232l3227j6428J6551L7679K2404k2106n6654m6480j13L6712L2009
9994a80418L628n899J6798M1642L1732j7534p2019q1786k3502O1471Q8457K2120
9982a15310o3933o5673J5120O9778L1636l8231n0666j1674J4961J9131L6767N6489
9970a01605K6453m1786o4543r048M9251L4573k3606m3747o777L7260M8558L0881
9958f4136O78l0586m7365l8490j4595M519J4315K1526K7189K7851K0536o00l1235
9945a10393l9449K86M9677L7860l0216o1815j0631M7198K9861k5887l7051j0522
$$ y = [-218112, -244893, -225216, -189053, -174769, -178714, -171492, -150565, -145857, -171266, -200070, -202060, -182585, -166208, -159071, -151222, -146348, -162057, -198507, -228036, -224311, -189782, -148758, -124001, -125533, -150765, -183992, -200420, -183869, -146190, -123786, -145892, -202546, -249026, -249139, -212427, -180418, -176790, -182689, -165891, -124249, -92517, -110051, -182070, -263856, -287358, -225887, -137430, -115310, -179243, -244916, -229796, -160018, -128382, -166613, -217279, -228953, -213992, -194861, -158094, -101605, -75152, -116938, -181481, -190529, -141278, -106705, -130311, -174058, -180835, -143575, -95017, -64136, -63458, -94044, -141409, -179899, -194494, -189975, -175660, -154134, -126945, -99094, -78558, -79158, -110393, -149842, -149556, -99879, -62019, -92235, -154050, -164681, -117483, -87622, -113509, -150560, -161082]
9933a61082p724k0121M842M2432K0732l8196l8235K3707M6842M342j2550K9060
9921a05951L5716l1981o3423J1396P6810J6047p9357n2486N5970P5369j6133p4734
9909a52757l7166P482O574K0091O4906N5488l0700q1118k5600M7925M5215P995
9897g1665N087K103m2247n9970Q305P1806K1103p0583m9787N8125Q0143k0935
9885f8515q6853k4559N5266L6545k4676k8581o463l4849p0846k2207P2457Q3324
9873a19957o771p5300m7591J2155K8380K1147L2973M1393J3642j9743j8910j0665
9861a49247l5557n9078j9213N8035P7310J1188n8494n5637j574L5979L2125R207
9849a54956p899p688R027K2417J0867j3392j9717j5398l5101o3193l7384L9326
$$ y = [-161082, -168806, -188927, -184085, -141653, -120921, -159117, -197352, -173645, -126803, -122461, -135011, -105951, -70235, -102216, -165639, -154243, -77433, -61386, -140743, -193229, -137259, -61890, -78023, -152757, -189923, -182441, -175867, -155776, -90870, -35382, -66082, -147200, -172800, -124875, -79660, -71665, -66578, -64475, -106722, -166692, -158387, -86581, -65478, -136061, -185848, -127723, -47580, -68515, -155368, -179927, -124661, -88116, -112792, -141373, -147836, -182685, -253531, -275738, -203281, -119957, -126728, -202028, -249619, -237464, -209084, -187937, -154964, -113571, -99929, -119672, -138582, -149247, -184804, -243882, -263095, -205060, -127750, -116562, -175056, -230693, -232267, -196288, -164163, -154956, -162855, -170543, -161516, -139099, -128232, -141624, -161341, -176739, -211840, -275033, -312417, -273091]
9837b73091P1393J2254m7701j7803M2874K5191l7933k2808O4207P8759k4333j02577
9825b31568m1573P3406R5621K3563l7116m2482k9871j8331M016K1341J0123m315
9813a77186R167J6087k8201p9299n4921K9264P2424L7506o506l302J7586J0142
9801a57239k0490m6842n4714l0942K5480O7992M2806k3320m6504j1663O117k7709
9789b77028m4772P362O6048M6014k8464o4204l5184N54L092k706J4111M0717M5382
9776b29078K1302p752j4051M112J8475O640j3700r997J1547J3638j1429l1472
9764b41765k7754j1708J3725N1594O5722J2057o7308o7186K6294R2927M7178l6503
9752a42727m4659P533K7818M531r86J6925M581l6582m0400J0967N5350M6212N893
$$ y = [-273091, -201698, -189444, -237145, -254948, -212074, -186883, -224816, -247624, -183417, -104658, -128991, -231568, -273141, -199735, -104114, -80551, -117667, -160149, -190020, -208351, -204335, -182994, -172871, -177186, -168019, -151932, -180133, -259432, -314353, -285089, -212665, -175159, -181665, -184967, -167381, -157239, -177729, -224571, -279285, -310227, -284747, -216755, -173949, -197269, -243773, -255436, -249319, -277028, -321800, -314438, -248390, -202376, -230840, -295044, -330228, -329674, -326582, -329288, -315177, -274460, -229078, -207776, -215528, -229579, -225467, -206992, -200352, -214052, -224049, -212502, -198864, -210293, -241765, -269519, -281227, -267502, -215908, -150186, -138129, -205437, -272623, -246329, -153402, -106224, -142727, -187386, -179853, -152035, -147504, -148490, -131565, -126984, -163566, -203966, -192999, -137649, -91437, -85544]
9739h5544k5673l0274n77M5579N1506o535n5226j8525M9244L6031l9009m7747
9727a26750K7398N4342k1428p2739m547P6122L4448o5596o7508K1894N4735j2537
9715a02166o4733k7356L0695L3380J0745J6212K7455k5m5732n6751k7184O690
9703a98770K2086K1262J1080J226L085J0761M697j4837k6054k4616k7518l0002
9691b47600n267L6968M4452K616l1567j3790K0137J8649k254k70J0865o228k8896
9678b02185p812L2513K0132l6308m5545J7916O3750K8958k4694k2221L957p483
9666a79022k4644J0668N1621J2797o2972m8790N3733R4601M304r7741q8148p538
9654b81131M0938M9655N9775N0160q112n5931k6380L1989L0846p188P41L8610
$$ y = [-85544, -111217, -141491, -142068, -96489, -44983, -51518, -106744, -125269, -76025, -39994, -79003, -126750, -99352, -45010, -66438, -139177, -143724, -67602, -33154, -98750, -166258, -144364, -89629, -102166, -166899, -194255, -163560, -130180, -119435, -103223, -75768, -75793, -121525, -178276, -205460, -198770, -176684, -155422, -144342, -143116, -140031, -129270, -124573, -139410, -165464, -190080, -217598, -247600, -252867, -215899, -171447, -168831, -200398, -214188, -194051, -175402, -177656, -177926, -167061, -173289, -202185, -209997, -177484, -157352, -193660, -239205, -221289, -157539, -128581, -153275, -175496, -171539, -179022, -203666, -192998, -141377, -128580, -191552, -240342, -186609, -92008, -87704, -185445, -273593, -281131, -240193, -190538, -130763, -80603, -88715, -144646, -171026, -139037, -108191, -115379, -114638, -76028]
9642g6028K3137l1559l0284K8603M6333J409j8900J1053J1031l6220l2779N0305
9630e3899R2773K1201n7909l1900L8511L8645j1786k4883o823j3979k3792R667
9618b4174L7183n456n7347k1841N2538L8952n2005q6812k7484K5402J5087L26
9606a05631K1698L6816K1875J4178K2083O315k4817j4829K6604K6089j7970k6027
9594a3616J5339K8374o292j3963K3260K4913k9174m6972N667L1839k2009o5178
9582f7812k6898K1250R189n489L0485M6320j0621m6526J7298P9386K0685p9411
9570a2144p2623O354J5345l9680l4221L2648L8705l1353n9493p867L0134J4180
9558a20015J3116M4653L1117l9176o6776j1842L6126J5756j5598n258J1396P679
$$ y = [-76028, -52891, -84450, -114734, -86131, -39798, -38389, -57289, -46236, -35205, -71425, -104204, -53899, 38874, 60075, 2166, -29734, 8777, 47422, 35636, 10753, 3930, -10049, -33841, -24174, 13009, 7553, -49794, -71635, -19097, 19855, -32150, -118962, -146446, -121044, -105957, -105631, -83933, -47117, -25242, -11064, 11019, 17334, -7483, -22312, 4292, 30381, 12411, -13616, 1723, 30097, 23805, 9842, 33102, 58015, 28841, -18131, -12464, 19375, -2634, -67812, -94710, -73460, -64271, -69760, -39275, 7045, -3576, -50102, -32804, 46582, 67267, -12144, -84767, -78413, -63068, -102748, -136969, -104321, -65616, -96969, -156462, -164329, -134195, -120015, -106899, -62246, -31129, -70305, -137081, -148923, -112797, -97041, -112639, -117897, -106501, -98822]
9546i8822J9017M3425J5739n9352p6769M57O8004M6713k081m079R632l561p161
9533d8838J9429J4603l8857m2363N1880J22873O0101m8098n2368K3481M5515l108
9521A04250k3813J1229L3533J7940O442O090j0791k2396N767K5639k4320q3241
9509D6329m3512N7086P5569m851m9235m88L3965j9485p3098l5541L3339L1091
9497E1169k1619l4306N95J4950j2522l4005j8601J0790K4620K1499J4459J1964
9485B8993J2656P334o419j2754J592K2804L1249L2047L2068J1947l0686m0217
9473I0614K5281J04511J00297K5326j4919J4229L6248N967j9253N277K9146L495
9461D06219k8271j1808J7424l318n2849n9809j6270J6295J178l0984l1542Q150
$$ y = [-98822, -79805, -36380, -20641, -79993, -156762, -156305, -88301, -41588, -43669, -47748, -38116, -41677, -48838, -29409, -14806, -53663, -96026, -44146, 78727, 138828, 90730, 38362, 61843, 107358, 104250, 80437, 91666, 125199, 143139, 149581, 155671, 144880, 122484, 128251, 153890, 129570, 46329, 2817, 59903, 135472, 130621, 81386, 80898, 114863, 95378, 22280, -13261, 20078, 51169, 29550, -4756, -4161, 10789, -1733, -35738, -54339, -43549, -18929, 2570, 17029, 28993, 41649, 48983, 42564, 29810, 31402, 54206, 85455, 117502, 149570, 161517, 130831, 90614, 115895, 220406, 320703, 346029, 331110, 345339, 381587, 387554, 368301, 373578, 402724, 406219, 377948, 366140, 383564, 380246, 327397, 267588, 251318, 267613, 268791, 237807, 206265, 214415]
9449B14415M5952K7954m3612q9302m1835N1863Q1394K4125l3043l1645r323n859
9437A91084o85J4848P42m3786n1447l972K1300j1810k3336L5334P0732j633r3899
9424A03472p0210L9493R4434N9002J8198J3520R426M460L3981O6382L0606m7940
9412C54824o4959j313M9590L2285o868k2816k8701l0764j1590L820l1133q3325
9400A59050o8181M611L0106k2290n9249k2665K0145K1m5037m6401n140L7726N7897
9387D0593L8231k1725o4895l2417K8719K0286l7919k8698N3296P4879n863n9462
9375E025j3916J8871l9854p3061K0370J12656M1644j04855j15988J0936Q6730
9364e1442L7186j9725P71M0567L6489P994j8745m2595l2987L1962P8401K0975
$$ y = [214415, 260367, 288321, 244709, 155407, 113572, 165435, 246829, 270954, 237911, 206266, 196943, 191084, 190399, 205247, 205989, 162203, 110756, 106784, 128084, 116274, 92938, 128272, 199004, 197371, 103472, 33262, 72755, 167189, 226191, 244389, 257909, 267335, 271795, 305776, 372158, 402764, 354824, 289865, 288552, 338142, 370427, 363559, 340743, 312042, 281278, 269688, 273508, 242375, 159050, 90869, 95480, 125586, 103296, 44047, 21382, 41527, 41548, -3489, -49890, -55030, -17304, 40593, 78824, 57099, -7796, -40213, -11494, 8792, -29127, -57825, -4529, 70350, 64487, 5025, -8891, 9980, -29874, -102935, -82565, 30091, 71735, -33120, -149108, -138172, -51442, -14256, -33981, -33210, 7357, 43846, 51840, 33095, -9500, -42487, -10525, 67876, 88851]
9352H8851p7162p6565J3420M6494j6174n1674J200M4595R189l0144q669J1207
9340d5432k6033n3819q923M3892K1488m0452o1565l9944q768L8661Q6962N9591
9328c4342n1658j13613l0943Q6739P4333m0982r1854k7096L9498K5069k1777l1731
9316b18357p434K0168L6797K7395j1224l5646o304L4402J5143m3317n3062k625
9304b44064K5748n274l5308k0603k267j5000j6672K9292P1681M3521k8978n9323
9292b57247j9929L0873L4857J596j6836O064M0551L7229p616l9178j3441L8650
9280a64427M9618P940l0210k3601K979N654j4401j8053J5385N6571N2850j0677
9268g0372p9738q2484j8774L5955L2912J1085K2798M8691M2696J7927J5156J7569
$$ y = [88851, 11689, -64876, -51456, -4962, -21136, -72810, -71610, -27015, -17826, -47970, -56639, -45432, -71465, -125284, -134207, -90315, -68827, -109279, -170844, -210788, -219556, -180895, -93933, -34342, -86000, -199613, -230556, -143817, -69484, -110466, -202320, -229416, -189918, -164849, -186626, -218357, -225791, -205623, -168826, -141431, -152655, -188301, -194605, -160203, -145060, -188377, -241439, -244064, -218316, -223590, -258898, -279501, -281768, -296768, -313440, -284148, -212467, -168946, -197924, -257247, -277176, -246303, -211446, -209850, -226686, -220622, -180071, -142842, -150458, -189636, -203077, -164427, -114809, -106869, -137079, -160680, -157701, -152047, -166448, -184501, -169116, -112545, -59695, -70372, -150110, -232594, -251368, -215413, -182501, -171416, -148618, -99927, -57231, -39304, -24148, -6579]
9256f579j8804o7404n6115R708M1527J844m2654l2221P61M31k3562k5703J272
9243b17499K6576K7320N138k0029k0238Q997K8221K660l7268l5755j148J0779
9231b22246m176K375L0633K2468k9610n6224k3644J6387K2636K0062K4547Q055
9219a88737k0693m959M3492L2620m4675o4339K3653Q3031P077q5795l5195Q9815
9207a64705R6925j9147q1525k2004M0314K5363K582K8292M3984M987l1624j9753
9195i6311l827j8262k0255J0741J6403k6662m3592Q108M6699j125o5707m0536
9183b34326M4237O8178K349o0570m5577J8673N5297K5454m1934p7344l9850K8399
9171b57014M9411J6167m712J2984J7446j6711l5681o438J8747l24j6005J2369
$$ y = [-6579, -25383, -92787, -148902, -139194, -97667, -95823, -138477, -170698, -169937, -169506, -193068, -218771, -217499, -190923, -163603, -158465, -178494, -198732, -189735, -161514, -158854, -196122, -231877, -233025, -222246, -226422, -224047, -193414, -170946, -200556, -256780, -280424, -264037, -241401, -221339, -196792, -188737, -209430, -214389, -170897, -138277, -182952, -247291, -223638, -140607, -133530, -219325, -254520, -164705, -67780, -86927, -168452, -190456, -150142, -124779, -122197, -93905, -49921, -44934, -76558, -96311, -100138, -118400, -138655, -127914, -111511, -138173, -181765, -173657, -126958, -128083, -193790, -234326, -190089, -121911, -119562, -180132, -225709, -207036, -151739, -126285, -168219, -245563, -285413, -257014, -207603, -191436, -196148, -183164, -165718, -182429, -218110, -224548, -205801, -206125, -222130, -209761]
9159b09761L2679m679m5179k1568K5025K0966q979j39K3864M753k3988J477L6390
9146a69139j324n9813k0959P9931Q5879k0221p7375j3151M2646q820o8375k2879
9134b53600N6559M5483k1383k6532K2102K0838l7121n3726J274M5947K5017j8826
9122a93968l2192j8920J69K0411K7572K872l1795l0184P598L3925K6756Q903o180
9109a85033k6562l6616p469L5890K9739k3541m0374J4954N9509J4016o2825n1287
9097b79599M4534R0389J7361p0553m6088M9545O2140m4283j23078n4829P3611
9086b80850R2874l329o0861n055N8137K6264l8744k6914L4112L2888l4555n8818
9074b64851L459O4979M7097j5559m9063l9140j2355J6252L1601R833l4523m2024
$$ y = [-209761, -177082, -181761, -226940, -248508, -223483, -202517, -211496, -211635, -187771, -183018, -207006, -205529, -169139, -170463, -230276, -251235, -171304, -85425, -105646, -183021, -196172, -153526, -162346, -230721, -253600, -197041, -151558, -172941, -199473, -177371, -156533, -193654, -247380, -246106, -200159, -175142, -193968, -226160, -245080, -244911, -224500, -196928, -194056, -225851, -256035, -248437, -214512, -187756, -178853, -185033, -211595, -248211, -255680, -219790, -190051, -213592, -253966, -239012, -179503, -165487, -228312, -279599, -235065, -144676, -127315, -197868, -243956, -194411, -132271, -176554, -299632, -354461, -280850, -187976, -191305, -252166, -257221, -199084, -172820, -211564, -238478, -204366, -171478, -206033, -264851, -261392, -196413, -149316, -164875, -213938, -253078, -265433, -249181, -217580, -207747, -242270, -284294]
9062b84294O922M8053K3120l0193l6089M988K5090l981l5589k4031J3851K7472
9050b64681m346m8628m7110K1161R8309R6647R077o7146n3540L750R384l4419
9038b81542l9919J7377N8092K9590j4363j3797j081k5913m7348J83P0138M9558
9026a99025n6677j05091j8796R1394Q7408L553k1027L6564N7015k1334r9115o6030
9014c11161L6791Q4461M4445k215M519L0722K0407k3233n5920n3437k7075J710
9002b49986K0689K8749K9686K3896R960k294M919K8481L6761J1493k0400k3050
8990a01096k643J0054J1810K1217L1537J6044k0216l9061k4713j16J5802K4414
8978e6967J8328j3797m4592k5287L5174O2920J9227m2513n3628j7664J6753K6710
$$ y = [-284294, -277372, -229319, -206199, -236392, -272481, -267493, -242403, -246384, -281973, -306004, -292153, -264681, -269027, -317655, -364765, -343604, -245295, -148648, -139571, -206717, -260257, -256507, -247123, -281542, -321461, -304084, -245992, -216402, -230765, -244562, -245643, -271556, -318904, -318721, -248583, -199025, -255702, -360793, -379589, -288195, -200787, -197234, -218261, -181697, -124682, -146016, -245131, -311161, -274370, -189909, -145464, -147679, -143160, -112438, -92031, -115264, -171184, -224621, -251696, -249986, -229297, -200548, -170862, -146966, -137006, -139300, -134381, -105900, -69139, -57646, -78046, -101096, -103739, -93685, -81875, -60658, -29121, -13077, -33293, -72354, -97067, -97183, -81381, -56967, -38639, -52436, -97028, -122315, -87141, -24221, -4994, -47507, -101135, -118799, -102046, -75336]
8966g5336J5799j5927n4095n5327k351N1094M1857j4481m6254k2882J7647L0560
8954a29696J2044j1770j3691J0075K7116L018l7203k6988L4139N2500k4598j07619
8942b12673q1748K2900P9725N3716K4642L0009J2880m6945p1206j1367N8375M9145
8930i2547j3141m0978j4975J2998J1154m917j6797k1387j5697p94J0393J1410
8918a75278R012L77k2079l4056J215N9366O3000m546n8355l0029L5141N3642J9099
8905h3491j9363m1301m9689k8306K3944N5880L1134o367k043K0180J3315p43J4942
8892g1908J9766l2804p7003j9327Q6052R2715j0030p5793k9021L6563L1630j629
8880e0789k505K65k4550l1789M695K2787j3006l1214J7060N4633J4132k8170J4248
$$ y = [-75336, -59537, -75464, -129559, -184886, -187237, -136143, -94286, -108767, -155021, -177903, -160256, -129696, -117652, -129422, -143113, -133038, -105922, -102904, -140107, -167095, -132956, -80456, -105054, -212673, -294421, -271521, -191796, -138080, -113438, -83429, -70549, -117494, -188700, -200067, -141692, -92547, -105688, -146666, -161641, -148643, -137489, -142406, -159203, -180590, -196287, -197081, -186688, -175278, -166266, -165889, -187968, -222024, -220809, -161443, -98443, -102989, -161344, -191373, -156232, -102590, -83491, -102854, -144155, -193844, -222150, -198206, -142326, -111192, -117559, -119602, -99422, -86107, -86850, -71908, -52142, -84946, -161949, -181276, -95224, -2509, -12539, -88332, -117353, -80790, -49160, -50789, -53294, -53029, -77579, -109368, -104673, -81886, -94892, -126106, -109046, -54413, -40281, -68451, -54203]
8867e4203O9047K4196o5090o4464M238J0208l7569m084J03267J07068l9963j42890
8855i0239o1127O9958N8897n1114q3563j4438K9754K377j7229O088J1886j9286
8843a58036j9831L4493O5777J9682m2427l8224J6981M8076L0583O025J1398L6804
8831A1301M4250Q349n0832p4022k7290M2387N5528N629l3624j6816J5978J6672
8819b490M318J5872K9686Q26n3087o6255k0267L1068M0179K1771J2966J5109L215
8806C2911k5906m3491k6823R292K8552J7429R30M609J3738l605l5994l1183K3248
8793c6293O2175K5388m9295o7390m210O4063O4783J5244j8740j1178J1187K0243
8781G5977J4475M343j571J991R116O91k9512n1449k7745K9927O0076K3680m0964
$$ y = [-54203, 14844, 39040, -26050, -90514, -86276, -76068, -113637, -117721, -14454, 92614, 52651, -90239, -151366, -81408, -22511, -73625, -157188, -171626, -141872, -139495, -156724, -150636, -138750, -158036, -177867, -143374, -77597, -57915, -100342, -138566, -121585, -73509, -42926, -36901, -25503, 11301, 55551, 63900, 13068, -60954, -88244, -45857, 9671, 15300, -18324, -35140, -19162, -2490, 1828, 17700, 47386, 48212, -4875, -71130, -91397, -60329, -20150, 1621, 14587, 29696, 32911, 7005, -36486, -63309, -54017, -25465, -8036, -7106, -2497, 11241, 7636, -28358, -59541, -36293, 25882, 51270, 1975, -65415, -69625, -5562, 59221, 74465, 55725, 44547, 55734, 75977, 90452, 94795, 93224, 95215, 104331, 105022, 75510, 24061, -3684, 26243, 86319, 109999, 69035]
8768F9035o0451j7429K8690K1036k0461k9488J4450N9009N0512J208l5135l2335
8756D8641r586O452P119o393k7452l7186j8576J5579K9490P802k3880k9362n89
8743c7941L7276M8275J5743l5440n2924j3749M0320N0019J2772k3395l0830k2651
8731a2525o691K3977M6745K0444l6949m8934N048M5164J3562k9481p061L9439
8719E2738J7909n2391o3812M042N0862J7039l1615k2225J7639K7543J1579M745
8707C4053M514n1J5364N7559O6972j571q2171o6161M1571J13412O1247n2860r8368
8694I3510l3052N6595O5391o181n9786l0658K8607L2757n463n212L6934L5426
8682B08868k8531n3485J8394Q9314N1825l9533n8656n282J9358p064j3706J2483
$$ y = [69035, 8584, -8845, 19845, 40881, 20420, -9068, 5382, 64391, 114903, 116111, 80976, 48641, 39055, 45507, 52626, 46233, 18781, -18405, -36981, -21402, 8088, 15890, -7990, -37352, -37941, -665, 47610, 63353, 27913, -25011, -38760, 1560, 51579, 64351, 40956, 10126, -12525, -19216, 4761, 51506, 71950, 35001, -13933, -8885, 36279, 49841, 20360, 13299, 52738, 70647, 18256, -45556, -41514, 9348, 26387, -5228, -27453, -9814, 17729, 29308, 34053, 38567, 38516, 53880, 111439, 178411, 176840, 94669, 28508, 70079, 183491, 244738, 191878, 93510, 60458, 117053, 182444, 176263, 116477, 85819, 114426, 147183, 141720, 136508, 173442, 208868, 180337, 126852, 145246, 234560, 286385, 246852, 188196, 182914, 202272, 195208, 181502, 193985]
8670A93985O531l2455j9491O0192J02440M6197k8692l1578Q622J5997j1101k6949
8658B83698k2367j3027J989J4006n838m2860l2130L3610O8096K5212j8445O274
8646B98218L8623Q0n3039j9578O2191O6497j2065n0974J0N2586L6692m687j6678
8633C97876j5520k1618q085K9252L6278p679l7908l934M4807L5954j6676m4296
8621C88451k3762J0457K6582K0849M299k969J1994K5756J472m4409n0012m340
8609C64368K6027R15k7871l879M2149M8564J9353j404p669j5918j1255J9052L4073
8596D86505j345l7643p311N4197N1884j4306m4873k215L2165l79l7978p856M7311
8583E18156L7987k7583n7980j7659L2672L7775J7178J1519J7472J1507k0M446
$$ y = [193985, 200516, 168061, 148570, 208762, 311202, 357399, 328707, 297129, 305751, 321748, 310647, 283698, 261331, 248304, 250293, 264299, 258461, 215601, 183471, 217081, 285177, 310389, 291944, 298218, 336841, 336921, 283882, 264304, 326495, 392992, 380927, 329953, 329963, 382549, 419241, 414554, 397876, 382356, 360738, 352653, 381905, 418183, 410504, 372596, 368662, 413469, 449423, 432747, 388451, 364689, 375146, 401728, 422577, 426876, 423907, 435901, 461657, 463129, 418720, 368708, 364368, 390395, 391310, 363439, 359560, 401709, 450273, 469626, 468222, 460553, 444635, 433380, 452432, 486505, 485160, 447517, 440206, 494403, 546287, 531981, 487108, 484893, 517058, 516679, 478701, 470845, 518156, 556143, 528560, 470580, 452921, 485593, 523368, 540546, 552065, 569537, 581044, 581024, 585470]
8571E85470J7404J2304r267j7026j647Q960m887k2840j7864L929K1236L2556M3349
8558F51677M0106J5503P2K0685M2293J1759m5572m7209J6188N3822J3739l3331
8546G39732j0573L6954J8751m5432n1106K3484P8081L8183m1032n8486k27N6311
8534G84640M5177j5536n1092j8702L7567L8681j9811n2683o714N4278M2627j9320
8522H19112l8694O10K4752J948j0722K3352N2554K2889l5254n4630j8588L7370
8510H24699P1269N3846j3623p4274n6369L1600R4224O8466J038k7308m888K5203
8498I93883L8185L8912L0996J6037K848o950j7175j2287K2184M9037J3797n5944
8486A113523o6256m55M6426K3402P757N7144Q6227P687r2225o6952N3899J01372
$$ y = [585470, 602874, 615178, 605911, 588885, 587238, 596198, 591311, 568471, 550607, 554536, 575772, 608328, 651677, 691783, 707286, 707358, 728043, 770336, 782095, 736523, 689314, 705502, 759324, 773063, 739732, 729159, 766113, 784864, 739432, 688326, 711810, 789891, 828074, 787042, 728556, 728329, 784640, 829817, 814281, 763189, 744487, 782054, 820735, 800924, 748241, 741527, 795805, 838432, 819112, 780418, 781028, 805780, 807728, 797006, 820358, 872912, 895801, 860547, 805917, 787329, 824699, 895968, 949814, 936191, 861917, 805548, 837148, 931372, 999838, 1000876, 973568, 968680, 993883, 1032068, 1070980, 1101976, 1118013, 1120861, 1113911, 1096736, 1084449, 1106633, 1155670, 1169467, 1113523, 1047267, 1046812, 1093238, 1116640, 1124397, 1181541, 1267768, 1275455, 1183230, 1116278, 1170177, 1271549]
8474A271549K4811m6537j7444M6954N6814L0456K1139J3442k3774n2349j6992
8463A308069N8023R4133N9607l905m0858l3109k887J4131O374q86J4952L5419
8451A509063L1805J5026J2445J6541Q878R229L5164M2316j0329o3166l0254M7613
8439A624331N2286j2768k4052L9878N0690l3950o9765K7642J09213K7908r7133
8428A694280n8667R4147J25350j0545j03265k6148Q2412N9693m1185p0170r389
8417A736513M4919M7947L4805K8277J6473J003m200n152p630J0177N7153Q9272
8405B049557O1269j728l2186p347L1966M1155J6735j3816k2915p011R149L131
8393B127959r140O146M1642M9659J4817j7930j1317J1550J4319O682J6007L2824
$$ y = [1271549, 1296360, 1249823, 1232379, 1279333, 1336147, 1366603, 1387742, 1401184, 1377410, 1325061, 1308069, 1366092, 1460225, 1519832, 1515927, 1475069, 1441960, 1439073, 1453204, 1459578, 1458692, 1473644, 1509063, 1540868, 1555894, 1568339, 1584880, 1593758, 1602987, 1638151, 1680467, 1670138, 1606972, 1576718, 1624331, 1676617, 1663849, 1639797, 1679675, 1730365, 1696415, 1626650, 1654292, 1763505, 1791413, 1694280, 1635613, 1729760, 1855110, 1844565, 1741300, 1715152, 1797564, 1857257, 1816072, 1745902, 1736513, 1781432, 1829379, 1864184, 1892461, 1908934, 1909937, 1905737, 1900585, 1892955, 1903132, 1960285, 2049557, 2110826, 2109098, 2076912, 2069565, 2101531, 2142686, 2159421, 2145605, 2122690, 2115679, 2124828, 2127959, 2118819, 2124965, 2166607, 2216266, 2231083, 2213153, 2201836, 2213386, 2227705, 2234387, 2250394, 2283218]
8381B283218K9693J1052J292J376k523l489J3830L9503N3034N5938N4651L3712
8369B571287r555k8039J7864Q0199P1800k644m0363J0850P2697N3504j6542l7205
8357B743853J2129N5063M1319Q251L251J3902J1165P528K3441L5300J2882j7435
8345B950649p848K7250K9987j293n042L6621O1936L3844L101J3899K0629k4207
8333C139526o2509j2623Q1808J01702L7032k079K9946M6695q822n6400j0504P5467
8321C359239R2283L5781j2577j8367r824O280M4784P3580M1558k4307l8487J5697
8309C565640O0705M5092R349K218P131k433Q07M5193Q7525O1281k0125o9602l8218
8296C754563K7674N5382L5545J6880K9906M8614L4704l541k0573L283L5464L8655
$$ y = [2283218, 2312911, 2323963, 2325255, 2326631, 2324108, 2320619, 2334449, 2373952, 2426986, 2482924, 2537575, 2571287, 2561732, 2533693, 2551557, 2631756, 2703556, 2700912, 2660549, 2671399, 2744096, 2797600, 2781058, 2743853, 2755982, 2811045, 2852364, 2860615, 2863866, 2877768, 2888933, 2896461, 2919902, 2955202, 2968084, 2950649, 2942801, 2970051, 3000038, 2998745, 2993703, 3030324, 3092260, 3126104, 3129205, 3143104, 3163733, 3139526, 3077017, 3064394, 3146202, 3247904, 3284936, 3282857, 3312803, 3359498, 3350676, 3294276, 3283772, 3359239, 3451522, 3487303, 3474726, 3456359, 3446535, 3452815, 3497599, 3571179, 3612737, 3588430, 3549943, 3565640, 3626345, 3671437, 3680786, 3683004, 3690135, 3687702, 3688509, 3733702, 3821227, 3882508, 3862383, 3792781, 3754563, 3782237, 3837619, 3873164, 3890044, 3919950, 3968564, 4003268, 3999727, 3979154, 3982437, 4017901, 4056556]
8284D056556K1894K2386M8401O6057M5363K622j3664K0479O7523O4274M863l6843
8272D369911l91O8887P7661K4660L706N1655Q5298L9383k0628m679N4139O0606
8260D810208J7457Q183M4112N1587J3763M279N3345R1181O8450L4191L8347M5676
8248E280779J5963n176M0410J09741J06643K2963m4666k1569N6436R5892N7102
8237E714518n281j1519M2242P8239M7961N986K2854O6814N7653J1859K0914Q3972
8225F136212R2070J3676l6858J6345Q2084N3354j9060k0319M3070P5935N4062
8214F490571K9388J9155N890J1320N7051Q6275M0415j9302R406R6891J20378O0073
8202G007511J7035L7059N9574N4688O7567R9385Q5981L4190L9075J13937J43139
$$ y = [4056556, 4078450, 4100836, 4149237, 4215294, 4260657, 4263279, 4249615, 4270094, 4337617, 4401891, 4406754, 4369911, 4369520, 4438407, 4516068, 4540728, 4544434, 4596089, 4681387, 4720770, 4700142, 4695463, 4749602, 4810208, 4827665, 4835848, 4879960, 4931547, 4945310, 4949589, 5002934, 5094115, 5162565, 5196756, 5235103, 5280779, 5296742, 5291566, 5331976, 5441717, 5548360, 5571323, 5526657, 5505088, 5561524, 5657416, 5714518, 5709237, 5697718, 5739960, 5818199, 5866160, 5872146, 5895000, 5961814, 6019467, 6031326, 6052240, 6136212, 6228282, 6241958, 6205100, 6221445, 6303529, 6356883, 6337823, 6317504, 6360574, 6436509, 6490571, 6519959, 6539114, 6545004, 6556324, 6613375, 6699650, 6740065, 6720763, 6730169, 6827060, 6947438, 7007511, 7024546, 7061605, 7121179, 7175867, 7243434, 7342819, 7428800, 7462990, 7502065, 7616002, 7759141]
8191G759141P1968P991M7886J28102J47011J24208J28625J44565J24732R5760
8181H779989R7291R0298M0314J7863Q9443J74276J50171N3283K4084Q4898J24930
8170I726840R6738P1447Q4425P8515L9687M7155J26608J77636J26826N0841N6358
8159A0683076J17431J31461Q3296N1608P5350J07010J02861Q6313R7926J29260
8149A1665592J37010J03912O1703N3651Q5781J23972J36964J27438J15061J08597
8139A2719681J09962J25239J48981J56175J35415J12259J13491J29648J40984
8130A3891835J52565J68775J66857J41146J36842J81577K19990J89846J31997
8121A5381430J35662J94179K17124J82910J69498K14759K54254K36254K02019
$$ y = [7759141, 7831109, 7839100, 7886986, 8015088, 8162099, 8286307, 8414932, 8559497, 8684229, 8779989, 8877280, 8967578, 9007892, 9025755, 9115198, 9289474, 9439645, 9492928, 9517012, 9601910, 9726840, 9823578, 9895025, 9979450, 10057965, 10097652, 10144807, 10271415, 10449051, 10575877, 10626718, 10683076, 10800507, 10931968, 11015264, 11066872, 11142222, 11249232, 11352093, 11438406, 11536332, 11665592, 11802602, 11906514, 11968217, 12021868, 12107649, 12231621, 12368585, 12496023, 12611084, 12719681, 12829643, 12954882, 13103863, 13260038, 13395453, 13507712, 13621203, 13750851, 13891835, 14044400, 14213175, 14380032, 14521178, 14658020, 14839597, 15059587, 15249433, 15381430, 15517092, 15711271, 15928395, 16111305, 16280803, 16495562, 16749816, 16986070, 17188089]
8112A7188089K03431K25357K38780K51389K58487K27455J81386K05704L06797
8103A9286875L60382K86811J87901K02106K98068L36705K86984K46116K68149
8094B1760097L02683L07210L06068L19730L28627L25365L24907L15108K74326
8085B4564121K38338K63691L22565L29258K80535K65221L10969L33256K82719
8076B7190673K35291K65717L24472L27402K94257K99561L37117L38712L02643
8067B9915845L00270L52910L93978L76670L44576L55806L91304L90619L51564
8058C3173542L38117L85047M41066M38867L96784L99350M71348N29062M96411
8049C7069594M22206M15110M87232N44893N36230N20479N59650O19015O30666
$$ y = [17188089, 17391520, 17616877, 17855657, 18107046, 18365533, 18592988, 18774374, 18980078, 19286875, 19647257, 19934068, 20121969, 20324075, 20622143, 20958848, 21245832, 21491948, 21760097, 22062780, 22369990, 22676058, 22995788, 23324415, 23649780, 23974687, 24289795, 24564121, 24802459, 25066150, 25388715, 25717973, 25998508, 26263729, 26574698, 26907954, 27190673, 27425964, 27691681, 28016153, 28343555, 28637812, 28937373, 29274490, 29613202, 29915845, 30216115, 30569025, 30963003, 31339673, 31684249, 32040055, 32431359, 32821978, 33173542, 33511659, 33896706, 34337772, 34776639, 35173423, 35572773, 36044121, 36573183, 37069594, 37491800, 37906910, 38394142, 38939035, 39475265, 39995744, 40555394, 41174409, 41805075]
8040D1805075O02743O02634O58145P27701P58226P39716P11428P27761P98354
8031D8131783Q61396Q56965Q24532Q59797R62636J019349R78462R44750J019508
8022E6459178J137185J171215J134545J142706J217382J271739J281970J323659
8014F6139579J414097J463185J436573J437679J545173J674974J704659J658703
8006G8474622J662721J761103J882540J961264K000131K024307K054539K125397
7998I3946624K258717K413922K525320K592101K673983K794904K914300L008636
7990A15128507L121037L298341L520812L727621L888355M026834M191708M415239
7982A45318454M681739M932620N128918N310928N558771N883908O203457O446866
$$ y = [41805075, 42407818, 43010452, 43668597, 44396298, 45154524, 45894240, 46605668, 47333429, 48131783, 48993179, 49850144, 50674676, 51534473, 52497109, 53516458, 54494920, 55439670, 56459178, 57596363, 58767578, 59902123, 61044829, 62262211, 63533950, 64815920, 66139579, 67553676, 69016861, 70453434, 71891113, 73436286, 75111260, 76815919, 78474622, 80137343, 81898446, 83780986, 85742250, 87742381, 89766688, 91821227, 93946624, 96205341, 98619263, 101144583, 103736684, 106410667, 109205571, 112119871, 115128507, 118249544, 121547885, 125068697, 128796318, 132684673, 136711507, 140903215, 145318454, 150000193, 154932813, 160061731, 165372659, 170931430, 176815338, 183018795, 189465661]
7974A89465661O647729O890670P196326P508421P784282Q047511Q339362Q655785
7966B50535747Q956696R218435R450392R660343R823177R898749R876724R782860
7958C27203123R624872R347097Q872813Q194992P386630O499474N489247M284187
7950C86902435K906203J469332N9005j330864k723050m073116n301200o375072
7942C71533673p315172q131353q797938r290480r613526r790046r851007r835467
7934B98908684r771674r652914r455717r184973q879164q572177q274242p985287
7926B27132536p695929p381755p037529o712426o458185o240179n967598n630528
7918A74008407n329721n128952m958134m731358m486811m310976m178148l988470
$$ y = [189465661, 196113390, 203004060, 210200386, 217708807, 225493089, 233540600, 241879962, 250535747, 259492443, 268710878, 278161270, 287821613, 297644790, 307543539, 317420263, 327203123, 336827995, 346175092, 355047905, 363242897, 370629527, 377129001, 382618248, 386902435, 389808638, 391277970, 391336975, 390006111, 387283061, 383209945, 377908745, 371533673, 364218501, 356087148, 347289210, 337998730, 328385204, 318595158, 308744151, 298908684, 289137010, 279484096, 270028379, 260843406, 251964242, 243392065, 235117823, 227132536, 219436607, 212054852, 205017323, 198304897, 191846712, 185606533, 179638935, 174008407, 168678686, 163549734, 158591600, 153860242, 149373431, 145062455, 140884307, 136895837]
7910A36895837l744608l557350l460939l353161l167004k984269k899788k864753
7902A10863965k763887k590538k443230k375159k338920k276318k186756k096389
7894I1792768k015711j943485j878664j819191j765897j721022j673162j608635
7886G7367001j549873j539065j559802j531241j423389j318642j296734j315650
7878F5832605j287363j221334j192816j203446j186602j136151j111304j111558
7870E6382031j069265r86042r51852r88813r98338r23432q47042q48594q68546
7861D7900107q17745p35712p21900p67487p77003p25648o79790o72118o60834
7852D1341870o18681n75578n60317n67065n84966o02413n87687n26773m70280
$$ y = [136895837, 133151229, 129593879, 126132940, 122779779, 119612775, 116628506, 113728718, 110863965, 108100078, 105509540, 103066310, 100691151, 98352231, 96075913, 93889157, 91792768, 89777057, 87833572, 85954908, 84135717, 82369820, 80648798, 78975636, 77367001, 75817128, 74278063, 72718261, 71187020, 69763631, 68444989, 67148255, 65832605, 64545242, 63323908, 62131092, 60927646, 59741044, 58604893, 57493589, 56382031, 55312766, 54326724, 53374872, 52386059, 51387721, 50464289, 49617247, 48768653, 47900107, 47082362, 46346650, 45624750, 44857263, 44080260, 43354612, 42674822, 42002704, 41341870, 40723189, 40147611, 39587294, 39020229, 38435263, 37832850, 37245163, 36718390, 36248110]
7843C6248110m75781n14532n09702m58627m32907m55473m68095m38435m11018
7834C2083540m19244m25725l93102l49538l39058l58242l80551l96555l97240
7825B8624285l65239l14965k95112l20704l47880l41910l20123l03956k88021
7816B5726375k84228l26421l91193l89729k96062k12229k33192l08999l24987
7807B2959335k68252k21075k24368k45349k62326k86533l03491k79669k31990
7798B0636282k13378k24529k14973j78036j67801k06847k48374k49935k22361
7789A8710048j89354j59444j49961j74091j93924j58702j00914j08913j83070
7780A7291675k18012j69316j31115j76718k25086j72811p8702q1219j73452k07807
$$ y = [36248110, 35772329, 35257797, 34748095, 34289468, 33856561, 33401088, 32932993, 32494558, 32083540, 31664296, 31238571, 30845469, 30495931, 30156873, 29798631, 29418080, 29021525, 28624285, 28259046, 27944081, 27648969, 27328265, 26980385, 26638475, 26318352, 26014396, 25726375, 25442147, 25115726, 24724533, 24334804, 24038742, 23826513, 23593321, 23284322, 22959335, 22691083, 22470008, 22245640, 22000291, 21737965, 21451432, 21147941, 20868272, 20636282, 20422904, 20198375, 19983402, 19805366, 19637565, 19430718, 19182344, 18932409, 18710048, 18520694, 18361250, 18211289, 18037198, 17843274, 17684572, 17583658, 17474745, 17291675, 17073663, 16904347, 16773232, 16596514, 16371428, 16198617, 16119915, 16038696, 15865244, 15657437]
7770A5657437j27460n1125q3825j64960j80933j37685j22428j47806j43232q9865
7760A4408118o2250j09037j71258j68885j16388r1157j15151j34441j13124q3613
7750A3242814q5203j05746j14996j13308j10938r6737p0046o8809j13429j52239
7740A2211363j26587o9654o6248j21172j49377j08534n9086o2382r3783j01612
7730A1252928r0086r1417j02771j02473r3485q8445q4698q6632j10967j39315
7720A0262639j19849n5415k6743p4779j26499j07875o5338q3961j39351j40445
7710I322384q6480o3462r4753j11564q0919n2855n6955n3973k5376j8371n7351
7699H620325r1130p7292m9446n0801o2770n2378l7938n2370p8547p0552j7514
$$ y = [15657437, 15529977, 15478852, 15395027, 15230067, 15049134, 14911449, 14789021, 14641215, 14497983, 14408118, 14345868, 14236831, 14065573, 13896688, 13780300, 13689143, 13573992, 13439551, 13326427, 13242814, 13157611, 13051865, 12936869, 12823561, 12712623, 12615886, 12545840, 12477031, 12363602, 12211363, 12084776, 12015122, 11948874, 11827702, 11678325, 11569791, 11510705, 11448323, 11354540, 11252928, 11162842, 11071425, 10968654, 10866181, 10772696, 10684251, 10599553, 10512921, 10401954, 10262639, 10142790, 10087375, 10060632, 9985853, 9859354, 9751479, 9686141, 9602180, 9462829, 9322384, 9235904, 9172442, 9077689, 8966125, 8885206, 8832351, 8775396, 8721423, 8696047, 8677676, 8620325, 8529195, 8451903, 8402457, 8351656, 8288886, 8236508, 8198570, 8146200, 8067653, 7997101, 7979587]
7688G979587M4598O6921K5256m7318p2646j9792L1099j0090r4120q8752J1450
7677G826193O1165j0893r0178o6145n371k3770r1622j00399m9272k3557l6522
7666G389629l3950k6482p4443j47239j36114k6392O1978L8413n0257j08052j04597
7655F782494p0257m3439m8227p4713p6518l5586r211m6427r0136n6436J5484J0594
7643F257622p3362j15888o6856j5219k8551n4856m0258k3640m4032o0976m2207
7632E691777l2862o0370o5257j0513L0221j3198q4992r2167m6061j8632k0087
7621E277859j6575j3112k5623k5531l31n470o3786q9587k2841M2110l100q7614
7609D966399p0902J3157J1555p5886q8197J6558Q1234J0899p6105n4261J3703
$$ y = [7979587, 8024185, 8091106, 8116362, 8069044, 7996398, 7976606, 8007705, 7997615, 7903495, 7814743, 7826193, 7887358, 7876465, 7786287, 7720142, 7714771, 7691001, 7599379, 7498980, 7449708, 7426151, 7389629, 7355679, 7329197, 7254754, 7107515, 6971401, 6945009, 7006987, 7045400, 6995143, 6887091, 6782494, 6712237, 6668798, 6620571, 6545858, 6469340, 6433754, 6424543, 6378116, 6287980, 6231544, 6247028, 6257622, 6184260, 6068372, 6001516, 5986297, 5957746, 5902890, 5862632, 5838992, 5794960, 5733984, 5691777, 5658915, 5598545, 5533288, 5522775, 5552996, 5539798, 5454806, 5362639, 5316578, 5297946, 5277859, 5261284, 5248172, 5222549, 5197018, 5196687, 5191217, 5127431, 5037844, 5015003, 5057113, 5054013, 4966399, 4895497, 4908654, 4920209, 4844323, 4756126, 4772684, 4853918, 4864817, 4788712, 4734451, 4748154]
7598D748154O431n8394q3071n2126j5187J7275M8582L2090n4218j22830p9677
7587D387029K6498O6485J3823m0925m0784j9811j1076J342K0577J2282l0427o2240
7575D322773n2577k6578j8295k7099l8525m8002m6867k1452J5906K6220p011n1668
7563D026825o6032m5493j6680k62M988O809K041j6614l7650l1952N893L2823O940
7550C871636m6128o0834k7268m891k5982m5734k1687J4108J0914j8377k6583j0680
7538C608494n566k2466m2117m9386l5659M596M2023J9434o0516j03569m5385M1685
7526C351568M4504k7150o8457m5203k3315l7138l8787P47L7611L4081R858j4969
7514C223350n0126p9356n5505J1546M0462l153m7461k4802K7084L3656m641l3395
$$ y = [4748154, 4754585, 4696191, 4613120, 4560994, 4545807, 4563082, 4611664, 4643754, 4589536, 4466706, 4387029, 4413527, 4480012, 4493835, 4452910, 4412126, 4392315, 4381239, 4382581, 4403158, 4415440, 4385013, 4322773, 4270196, 4243618, 4225323, 4198224, 4159699, 4111697, 4064830, 4043378, 4059284, 4085504, 4078493, 4026825, 3960793, 3915300, 3898620, 3898358, 3903346, 3910155, 3912196, 3895582, 3857932, 3825980, 3831873, 3864696, 3871636, 3825508, 3764674, 3737406, 3732515, 3706533, 3660799, 3639112, 3653220, 3664134, 3645757, 3619174, 3608494, 3602928, 3580462, 3538345, 3488959, 3453300, 3457896, 3499919, 3519353, 3458837, 3355268, 3309883, 3351568, 3396072, 3368922, 3300465, 3255262, 3231947, 3194809, 3156022, 3156769, 3194380, 3228461, 3238319, 3223350, 3173224, 3093868, 3038363, 3049909, 3090371, 3087218, 3039757, 3014955, 3042039, 3075695, 3071054, 3037659]
7502C037659l2767k3558j7089j1943j4794k3465j7050N018R341j6448l6907k6727
7490B831270q447k975K438O034k2217o7531n9868J2121N9639L1119m76K7085M1683
7477B849875l0851j00442l7721R2244J03088k3234j08243n8541J2074R48k1874
7466B677323K7577P8216L0218n6782n0707M0339Q4945K9741m3725n9161l2934
7455B725050q256P875J7898J1213p082j2507j236N314J084P33K265j3631m2289
7442B686431n3589l8605k0540j2793l156J1845J4518J545k604J2449J6474j9991
7430B591984p4423q9509m0501L1982O3477L4285j2393k3833J980K3178J1137k3701
7418B493663n7566p1606m5511K2388Q0169O2252j2763m5154O484N6111K2377l8240
$$ y = [3037659, 3004892, 2981334, 2964245, 2952302, 2937508, 2914043, 2896993, 2902011, 2911352, 2894904, 2857997, 2831270, 2822823, 2819848, 2822286, 2828320, 2806103, 2738572, 2678704, 2690825, 2750464, 2781583, 2781107, 2808192, 2849875, 2819024, 2718582, 2680861, 2773105, 2876193, 2852959, 2744716, 2686175, 2698249, 2699197, 2677323, 2704900, 2783116, 2813334, 2756552, 2705845, 2746184, 2831129, 2860870, 2817145, 2757984, 2725050, 2716794, 2724669, 2742567, 2753780, 2746698, 2734191, 2732955, 2738269, 2739353, 2740086, 2742351, 2728720, 2686431, 2632842, 2594237, 2573697, 2560904, 2557748, 2569593, 2584111, 2585656, 2583052, 2595501, 2611975, 2591984, 2517561, 2428052, 2387551, 2419533, 2483010, 2517295, 2504902, 2481069, 2483049, 2506227, 2517364, 2493663, 2436097, 2364491, 2318980, 2341368, 2421537, 2483789, 2471026, 2425872, 2432356, 2488467, 2510844, 2472604]
7406B472604k4394L6214K9340m9064p7692j1194M1733r91o0572l3484L7889M2413
7394B402802j9913n4514k9843k312r64K984J3144k747l1265j7511L2920M9185
7382B341966J3823q605J0097J5881j2025p225N5056Q0242O57r0887p2053J4860
7370B341787L6397j1881j4029N1750P2284Q30n6828k0283L7002K2373k6430k6682
7358B406290N565N626j6147r685J1340P328L319L3465M5726j6235q1325m2392
7346B352875N0849M9942m7570q5851q017N6310K2009j4127L1152O2957j7327j11168
7334B342034p0633N0401Q0107L977l5749Q813L3068j3478m3045j0L9994J0248
7322B405727l5435k7098R974K2949K0694K3947Q256l2190m0410J0368N0243J5003
$$ y = [2472604, 2448210, 2484424, 2513764, 2464700, 2387008, 2375814, 2417547, 2416556, 2355984, 2322500, 2360389, 2402802, 2382889, 2328375, 2298532, 2296220, 2295256, 2298240, 2311384, 2308637, 2277372, 2259861, 2292781, 2341966, 2355789, 2347184, 2357281, 2373162, 2361137, 2353912, 2408968, 2489210, 2489867, 2398980, 2326927, 2341787, 2378184, 2366303, 2352274, 2404024, 2476308, 2477138, 2420310, 2400027, 2437029, 2459402, 2432972, 2406290, 2411855, 2417481, 2401334, 2391649, 2402989, 2410317, 2413636, 2447101, 2492827, 2476592, 2395267, 2352875, 2403724, 2453666, 2406096, 2320245, 2312228, 2368538, 2390547, 2376420, 2407572, 2470529, 2453202, 2342034, 2271401, 2321802, 2401909, 2405886, 2370137, 2378950, 2412018, 2398540, 2355495, 2355485, 2395479, 2405727, 2370292, 2343194, 2353168, 2376117, 2396811, 2420758, 2429014, 2396824, 2356414, 2366782, 2417025, 2432028]
7310B432028m9724o3262k8105N216L0938N9426N2827j2661o5612k5348O2201Q0949
7298B478873J6768l4356k1157R251J7723K5656M0110K5368j7608k9256J3456N4031
7286B578859M4561R417j1655j7808j2992J4513M5782L4403r307j2315M2691P5574
7274B781723L8964K386L1159O4861J7650o3989o2051K8768R6059P8861L0888Q748
7262C054027J217p477M091L8416N5437L8970K4025L0037K9684J1893J0338L5340
7250C325998M2548J0782j1378J3895M4923L0362l186k05K6875K2615j4554l3048
7238C455627j5209K724l057j5765j9889k0769j7688k484J2018N621o364R886M4402
7225C429053M8495J1066k0877j3977P836J3439J2377K3169L2992K3873R974J4555
$$ y = [2432028, 2382304, 2319042, 2290937, 2296153, 2327091, 2386517, 2439344, 2426683, 2361071, 2335723, 2397924, 2478873, 2495641, 2461285, 2440128, 2449379, 2467102, 2492758, 2532868, 2558236, 2540628, 2511372, 2524828, 2578859, 2623420, 2632837, 2621182, 2603374, 2590382, 2604895, 2650677, 2685080, 2675773, 2663458, 2706149, 2781723, 2820687, 2823073, 2854232, 2919093, 2936743, 2872754, 2810703, 2839471, 2935530, 3014391, 3045279, 3054027, 3055244, 3047767, 3051858, 3090274, 3145711, 3184681, 3208706, 3238743, 3268427, 3280320, 3290658, 3325998, 3368546, 3379328, 3367950, 3381845, 3426768, 3457130, 3453944, 3453739, 3480614, 3503229, 3488675, 3455627, 3440418, 3443142, 3440085, 3424320, 3404431, 3383662, 3365974, 3363490, 3375508, 3381129, 3374765, 3384651, 3429053, 3477548, 3488614, 3467737, 3453760, 3461596, 3475035, 3487412, 3510581, 3543573, 3567446, 3577420, 3591975]
7213C591975L1183L8337L5700L8507M9134N6974N5639M4590K7714K1098M1775
7202D032626P8702J00625J02430J08806J19346R7980M4934K5199P5469J27958
7192D914075R3502p951p2949n7593k0220j9096m1115n1718n2007n4899n2257l8152
7180D539620k9800l8989n1050n0508l8681j4676K4251N2053K9837k7125m7295
7169D347637N93N4767M5775m140j7339K8424P7128P4150K8545m376J9541Q7068
7157D737773J29948R6480K8050K1697R7740J61745J37770P8228P6956J26649J49691
7146E842727J35227J43311J82228J86607J33211Q3100P8767Q5512P2369O6718
7136G009777P7180M3242o6102j67037j60169p6630l9139r5087j69623j84225j48580
$$ y = [3591975, 3623158, 3661495, 3697195, 3735702, 3784836, 3841810, 3897449, 3942039, 3969753, 3990851, 4032626, 4111328, 4211953, 4314383, 4423189, 4542535, 4640515, 4685449, 4710648, 4786117, 4914075, 5007577, 4999626, 4926677, 4869084, 4848864, 4829768, 4788653, 4736935, 4684928, 4630029, 4577772, 4539620, 4509820, 4470831, 4419781, 4369273, 4330592, 4315916, 4340167, 4392220, 4422057, 4394932, 4347637, 4348230, 4402997, 4448772, 4444632, 4427293, 4455717, 4532845, 4606995, 4635540, 4631164, 4650705, 4737773, 4867721, 4964201, 4992251, 5013948, 5111688, 5273433, 5411203, 5489431, 5566387, 5693036, 5842727, 5977954, 6121265, 6303493, 6490100, 6623311, 6706411, 6785178, 6870690, 6943059, 7009777, 7086957, 7130199, 7064097, 6897060, 6736891, 6660261, 6621122, 6526035, 6356412, 6172187, 6023607]
7125F023607j18598j20452j40667j53867j39941r8706n8635n0427o9928q8736
7115D983650r4811r1700o7090r506M1136J7568p4043j29868p2759L4802O2782
7104D600161j6347r7493r1282l2245r59k72K0576N4644M2033j4164l2780J2692
7092D444564L9875k094k8126M6105J33966Q5353o4225j14948L206J20253Q2972
7081D746901k5673m1275K5570M0608j8352m5919o674J3696k8782o4948m4002j4768
7069D536382k2478l0277o315L957l4316o3996k4935L5926L0388l5045p3445m5541
7057D270305L158K4665K1507J4755J0528O535K18j0728j7495m171K1352K8551
7045D369180J5837J9686M3633L2622l2659p3109j7533P2846P8417m961o5629m3406
$$ y = [6023607, 5905009, 5784557, 5643890, 5490023, 5350082, 5251376, 5192741, 5142314, 5072386, 4983650, 4888839, 4797139, 4730049, 4720543, 4761679, 4779247, 4705204, 4575336, 4502577, 4537379, 4600161, 4583814, 4486321, 4395039, 4362794, 4361835, 4361563, 4382139, 4436783, 4478816, 4464652, 4431872, 4444564, 4484439, 4482345, 4454219, 4500324, 4634290, 4719643, 4655418, 4540470, 4543676, 4663929, 4746901, 4721228, 4679953, 4705523, 4746131, 4727779, 4681860, 4675186, 4688882, 4660100, 4595152, 4551150, 4536382, 4513904, 4483627, 4477312, 4481269, 4446953, 4382957, 4358022, 4393948, 4424336, 4389291, 4315846, 4270305, 4273463, 4298128, 4319635, 4334390, 4344918, 4351453, 4351671, 4340943, 4323448, 4319277, 4340629, 4369180, 4385017, 4404703, 4448336, 4480958, 4448299, 4375190, 4357657, 4430503, 4508920, 4503959, 4438330, 4394924]
7033D394924O597K9886M6423P1510O0958l994n3978k4844M2464O5384L7731J1916
7021D684977o4k7053n8088m3721J6089N4949L1404j5088k4993L413K5541J5599
7009D662965p826j4224m21R138L72l426K6275O6496N7581o761m9261j0481N8669
6996D789096O6194J3891j3512J4091L3256M298j9224J5109O6164O5520K5226Q236
6984E068345K4498K9714J0777J441J6333L2877M1603N5602O5514M4947R757R470
6972E410878M3223M9621P154k1682J2411O6340P6132N2175L8529K6224j2618m0199
6960E708188K454Q0188R3899L5953J3851Q2575J48060J03468r658n9013J66Q6263
6948F286394J13251P7031K1329j7233j8575J4752M6863M4256K8956N1023J00504
$$ y = [4394924, 4401521, 4431407, 4477830, 4549340, 4610298, 4606304, 4552326, 4527482, 4569946, 4635330, 4673061, 4684977, 4684913, 4657860, 4599772, 4556051, 4572140, 4627089, 4658493, 4643405, 4618412, 4621825, 4647366, 4662965, 4655139, 4640915, 4640494, 4649632, 4650004, 4646578, 4672853, 4739349, 4796930, 4790169, 4740908, 4730427, 4789096, 4855290, 4869181, 4855669, 4869760, 4903016, 4907314, 4888090, 4903199, 4969363, 5034883, 5060109, 5068345, 5092843, 5122557, 5133334, 5134775, 5151108, 5183985, 5225588, 5281190, 5346704, 5391651, 5401408, 5410878, 5454101, 5503722, 5510876, 5489194, 5501605, 5567945, 5644077, 5696252, 5734781, 5761005, 5748387, 5708188, 5710642, 5790830, 5884729, 5920682, 5934533, 6017108, 6165168, 6268636, 6258978, 6199965, 6200131, 6286394, 6399645, 6476676, 6498005, 6480772, 6462197, 6476949, 6523812, 6568068, 6597024, 6648047, 6748551]
6937F748551J03106K9343m6731m2329K2852O6285O3189N8148O7835N2862O256
6926G129367o733N3679J22488J15328N5295L6050P7046J04571Q2607O8037J00535
6915G938270J26190R3231N0865P1449J28142J42733J18616J23923J60262J57947
6905I111628J06989Q4859J28566J78568J86925J86581K05275K00778J43599Q5386
6895A0619154P8580R7839J05437J20412J50568J34625M2328l9372k2883L9927
6885A1326615M5338O733Q951M1719K4189l0154k7083L2397M4438j1516l1804K8566
6873A1458389P9106N5358K0457L6245N8537L9937K3782N1182P6811O1653N2788
6862A2014245Q6639J09535Q1106N7559Q0223Q6611L6919J8706R9272J79522J43061
$$ y = [6748551, 6851657, 6881000, 6834269, 6791940, 6814792, 6881077, 6944266, 7002414, 7070249, 7123111, 7129367, 7122634, 7176313, 7298801, 7414129, 7469424, 7505474, 7582520, 7687091, 7769698, 7837735, 7938270, 8064460, 8157691, 8208556, 8280005, 8408147, 8550880, 8669496, 8793419, 8953681, 9111628, 9218617, 9303476, 9432042, 9610610, 9797535, 9984116, 10189391, 10390169, 10533768, 10619154, 10697734, 10795573, 10901010, 11021422, 11171990, 11306615, 11348943, 11309571, 11286688, 11326615, 11371953, 11378686, 11387637, 11429356, 11453545, 11423391, 11396308, 11428705, 11473143, 11461627, 11429823, 11458389, 11537495, 11592853, 11613310, 11649555, 11708092, 11748029, 11771811, 11822993, 11899804, 11961457, 12014245, 12100884, 12210419, 12291525, 12349084, 12429307, 12515918, 12552837, 12571543, 12670815, 12850337, 12993398]
6851A2993398N7617O1653J28939J30656P4446Q1493J54453J73098J19914J07847
6841A4083514J62373J74623J13526R0785J51841J88199J39820J07476J62135K08885
6831A5583177J63245J13994J69108K62613K65492J93834J59274J86409K17740
6822A7314886K37810K62364K61639K18544K04572K72737L37675K99091K23647
6813A9632965K47430L42541L54525K55789J84870K20075K81481K93465K89461
6804B2102602L01718K87396K32921K11120K59494L04719K83321K45364K60485
6795B4489140L02502L09092K89314K91471L17156L39692L61838L90025L96529
6786B7486759L70091L59453M03640M62743M82980M86632N23858N72478N69372
$$ y = [12993398, 13051015, 13112668, 13241607, 13372263, 13446709, 13528202, 13682655, 13855753, 13975667, 14083514, 14245887, 14420510, 14534036, 14624821, 14776662, 14964861, 15104681, 15212157, 15374292, 15583177, 15746422, 15860416, 16029524, 16292137, 16557629, 16751463, 16910737, 17097146, 17314886, 17552696, 17815060, 18076699, 18295243, 18499815, 18772552, 19110227, 19409318, 19632965, 19880395, 20222936, 20577461, 20833250, 21018120, 21238195, 21519676, 21813141, 22102602, 22404320, 22691716, 22924637, 23135757, 23395251, 23699970, 23983291, 24228655, 24489140, 24791642, 25100734, 25390048, 25681519, 25998675, 26338367, 26700205, 27090230, 27486759, 27856850, 28216303, 28619943, 29082686, 29565666, 30052298, 30576156, 31148634, 31718006]
6777C1718006N22463N08899N62123O31378O63759O69962O92579P48877Q19161
6768C7537207Q69332Q83651Q88969R28866R95919J024921R88418R57569J008958
6759D6083810J102167J127065J063485J011017J044941J119281J150248J136066
6751E4838080J140931J192747J248317J252690J199923J134136J104597J116211
6743F4227632J122906J086207J037977J050682J134238J205127J190040J123312
6735G3178121J091058J101545J076794R75211Q54011P80573P41599O91630O46734
6726H1137276O57874P09856P26119O83428O48863O74691P20158P19344O74283
6717H7351892O32840O19013O36635O99701Q00574Q87340R37335J014607J181316
$$ y = [31718006, 32240469, 32749368, 33311491, 33942869, 34606628, 35276590, 35969169, 36718046, 37537207, 38406539, 39290190, 40179159, 41108025, 42103944, 43128865, 44117283, 45074852, 46083810, 47185977, 48313042, 49376527, 50387544, 51432485, 52551766, 53702014, 54838080, 55979011, 57171758, 58420075, 59672765, 60872688, 62006824, 63111421, 64227632, 65350538, 66436745, 67474722, 68525404, 69659642, 70864769, 72054809, 73178121, 74269179, 75370724, 76447518, 77422729, 78276740, 79057313, 79798912, 80490542, 81137276, 81795150, 82505006, 83231125, 83914553, 84563416, 85238107, 85958265, 86677609, 87351892, 87984732, 88603745, 89240380, 89940081, 90740655, 91627995, 92565330, 93579937, 94761253]
6708I4761253J392753J569417J732917J955578K204115K378021K504216K729948
6700A11228218L082142L402616L602399L814007M166406M558905M830369N040902
6692A43725964N381449N864074O317468O681506P097479P668627Q319389Q964242
6684B00020198R654059J0454538J1302346J2087777J2786621J3405301J3863762
6677B83574602J4030558J3829088J3236026J2226713J0795102Q980750O814019
6670C63486858M295620J502352j356095m079794o619619q972528j0998510j2491609
6662C24766675j3424594j3977423j4292498j4329018j4012905j3416530j2703130
6655B28610577j1965892j1208413j0436701r684155q965737q279444p646488p093284
$$ y = [94761253, 96154006, 97723423, 99456340, 101411918, 103616033, 105994054, 108498270, 111228218, 114310360, 117712976, 121315375, 125129382, 129295788, 133854693, 138685062, 143725964, 149107413, 154971487, 161288955, 167970461, 175067940, 182736567, 191055956, 200020198, 209674257, 220128795, 231431141, 243518918, 256305539, 269710840, 283574602, 297605160, 311434248, 324670274, 336896987, 347692089, 356672839, 363486858, 367782478, 369284830, 367928735, 363848941, 357229322, 348256794, 337258284, 324766675, 311342081, 297364658, 283072160, 268743142, 254730237, 241313707, 228610577, 216644685, 205436272, 194999571, 185315416, 176349679, 168070235, 160423747, 153330463]
6647A53330463o601105o130431n693082n339233n061362m774448m427296m083338
6639A11220168l835763l671017l484453l231120k989555k840988k742904k588491
6631H5835877k366271k180780k100656k058597j949818j780774j651260j604503
6623G0143218j568847j469387j339252j269925j276282j269648j177307j044470
6615E9728100r78895j009866j048558j002147q90082q11518q15398q48175q36195
6606E1487266p78774p33160p30706p42447p27235o87558o61507o66900o73142
6597D5085837o42022n85327n53817n64868n76258n52372n18693n11121n05312
6588D0076047m56397l88778l71483m03715m05196l41608k80428k81357l04105
$$ y = [153330463, 146729358, 140598927, 134905845, 129566612, 124505250, 119730802, 115303506, 111220168, 107384405, 103713388, 100228935, 96997815, 94008260, 91167272, 88424368, 85835877, 83469606, 81288826, 79188170, 77129573, 75179755, 73398981, 71747721, 70143218, 68574371, 67104984, 65765732, 64495807, 63219525, 61949877, 60772570, 59728100, 58749205, 57739339, 56690781, 55688634, 54798552, 53987034, 53171636, 52323461, 51487266, 50708492, 49975332, 49244626, 48502179, 47774944, 47087386, 46425879, 45758979, 45085837, 44443815, 43858488, 43304671, 42739803, 42163545, 41611173, 41092480, 40581359, 40076047, 39619650, 39230872, 38859389, 38455674, 38050478, 37708870, 37428442, 37147085, 36842980]
6579C6842980k83908k38194k25370k40034k28559j85809j58602j59607j48520
6570C4974377j04696n8813m0407m1740m5745n0129n3725n1430m8398n1636n0019
6559C4377639l2014j5708k7302n7758p6360p7706p7280p2249n0613k9323l6055
6548C3825271o0186o9080o3867o8005p2385n2085k8049m1424o9233m6237J9022
6537C3273742L7021k5494q4740o1600R353M7969M3161L5590L4969K4314J6257
6526C3350542L8128P3752P6230L8353R707L6737J06067J53786J33650Q1005Q4787
6515C4182744J68068K36242K07717J54390K03148L17487L27907K07512J46505
6506C6151720K64590M11985L99283K91198K85558L91356M43095L98151L93456
$$ y = [36842980, 36559072, 36320878, 36095508, 35855474, 35626915, 35441106, 35282504, 35122897, 34974377, 34869681, 34810868, 34770461, 34728721, 34682976, 34632847, 34579122, 34527692, 34479294, 34427658, 34377639, 34345625, 34329917, 34302615, 34244857, 34168497, 34090791, 34013511, 33941262, 33890649, 33861326, 33825271, 33765085, 33696005, 33632138, 33564133, 33491748, 33439663, 33411614, 33370190, 33300957, 33254720, 33273742, 33310763, 33285269, 33200529, 33138929, 33148282, 33196251, 33239412, 33275002, 33309971, 33334285, 33350542, 33388670, 33462422, 33538652, 33577005, 33586712, 33623449, 33729516, 33883302, 34016952, 34097957, 34182744, 34350812, 34587054, 34794771, 34949161, 35152309, 35469796, 35797703, 36005215, 36151720, 36416310, 36828295, 37227578, 37518776, 37804334, 38195690, 38638785, 39036936, 39430392]
6497C9430392M85486N48046N00555M53487N19079O23851O37749N83647N82473
6488D4364765O56112P15115P12513O98906P29286P96895Q62331Q93324Q80209
6479E1309456Q50886Q54788R02130R49954R77397J024823J113306J182514J177070
6470F0342324J148475J189651J297949J387979J424073J455303J523906J621060
6462G1390720J737231J876970K013934K110210K196197K349552K570070K763672
6454H9008556K893906L058385L341536L668466L907102M068849M290324M624796
6446A18861920M971057N239072N480951N795723O184585O583098O985982P448214
6438A67550602P983947Q552957R145675R797515J0504966J1206275J1867411J2503754
$$ y = [39430392, 39915878, 40463924, 40964479, 41417966, 41937045, 42560896, 43198645, 43782292, 44364765, 45020877, 45735992, 46448505, 47147411, 47876697, 48673592, 49535923, 50429247, 51309456, 52160342, 53015130, 53917260, 54867214, 55844611, 56869434, 57982740, 59165254, 60342324, 61490799, 62680450, 63978399, 65366378, 66790451, 68245754, 69769660, 71390720, 73127951, 75004921, 77018855, 79129065, 81325262, 83674814, 86244884, 89008556, 91902462, 94960847, 98302383, 101970849, 105877951, 109946800, 114237124, 118861920, 123832977, 129072049, 134553000, 140348723, 146533308, 153116406, 160102388, 167550602, 175534549, 184087506, 193233181, 203030696, 213535662, 224741937, 236609348, 249113102]
6430B49113102J3076312J3450903J3525507J3326239J2897857J2166606J1018274
6423C38574800R469335P642011N592218L294394Q03817j702351m086423o332121
6415C53255680q412938j0200607j1588728j2608890j3331871j3742242j3815117
6408B69555287j3633937j3303942j2810646j2107560j1302679j0591425j0001707
6401A85803391r369684q610632p863759p291806o863510o440648n990128n587487
6393A27785737n258258m938710m592675m271060m029745l847908l656633l418687
6385I3772061l162280k948477k806834k696762k546848k343261k154349k045468
6377G3067782j995168j927774j808920j670827j555184j471892j413592j374355
$$ y = [249113102, 262189414, 275640317, 289165824, 302492063, 315389920, 327556526, 338574800, 348044135, 355686146, 361278364, 364572758, 365376575, 363674224, 359587801, 353255680, 344842742, 334642135, 323053407, 310444517, 297112646, 283370404, 269555287, 255921350, 242617408, 229806762, 217699202, 206396523, 195805098, 185803391, 176433707, 167823075, 159959316, 152667510, 145804000, 139363352, 133373224, 127785737, 122527479, 117588769, 112996094, 108725034, 104695289, 100847381, 97190748, 93772061, 90609781, 87661304, 84854470, 82157708, 79610860, 77267599, 75113250, 73067782, 71072614, 69144840, 67335920, 65665093, 64109909, 62638017, 61224425, 59850070]
6369E9850070j344242j308297j258493j194881j120409j050735j015970j024134
6361E0532909j031408r85325q99103q43686q53354q77847q53814p92044p55928
6352D2640400p70851p97430p92705p58228p17929o83088o57473o48809o51304
6343C6162583o39022o02967n75203n85761o12931o12834n83444n55349n30606
6334C0864466m87606m45923m57622n14113n31075m65984l87989l76970m08351
6325B6788833m06251l66549l45622l53909l47876l19284l07408l17193l05340
6316B3719401k63773k43102k69278l02480l04634k86690k63143k22439j74565
6307B1389297j67422k15817k65893k68580k40181k15226j92637j69405j72913
$$ y = [59850070, 58505828, 57197531, 55939038, 54744157, 53623748, 52573013, 51557043, 50532909, 49501501, 48516176, 47617073, 46773387, 45920033, 45042186, 44188372, 43396328, 42640400, 41869549, 41072119, 40279414, 39521186, 38803257, 38120169, 37462696, 36813887, 36162583, 35523561, 34920594, 34345391, 33759630, 33146699, 32533865, 31950421, 31395072, 30864466, 30376860, 29930937, 29473315, 28959202, 28428127, 27962143, 27574154, 27197184, 26788833, 26382582, 26016033, 25670411, 25316502, 24968626, 24649342, 24341934, 24024741, 23719401, 23455628, 23212526, 22943248, 22640768, 22336134, 22049444, 21786301, 21563862, 21389297, 21221875, 21006058, 20740165, 20471585, 20231404, 20016178, 19823541, 19654136, 19481223]
6298A9481223k10025k32738k06968j70969j72536j93715j95919j94057k17710
6289A7686586k38172k10679j61480j54805j90826k12875k03981j98850k04731
6280A5910187j89282j53932j44205j69951j82259j53458j22072j29017j56012
6271A4509999j58899j30264j02914j09333j48874j81107j57704q3054k8457n3636
6261A3355757j29900j78987j69603j31103r3064o6869o9662j04017j25547r4492
6251A2192513m6902m5145p3397o6903l5368n5016j27410j54636q9572j1496l818
6240A1482850m5030p5171q8799j01192r5961o9816o3840q9383q9226l5076N752
6229A0735108k6901q3224q4629m8353m2979o9390p7452o1978n3037m4676j9084
$$ y = [19481223, 19271198, 19038460, 18831492, 18660523, 18487987, 18294272, 18098353, 17904296, 17686586, 17448414, 17237735, 17076255, 16921450, 16730624, 16517749, 16313768, 16114918, 15910187, 15720905, 15566973, 15422768, 15252817, 15070558, 14917100, 14795028, 14666011, 14509999, 14351100, 14220836, 14117922, 14008589, 13859715, 13678608, 13520904, 13437850, 13409393, 13355757, 13225857, 13046870, 12877267, 12746164, 12653100, 12586231, 12516569, 12412552, 12287005, 12192513, 12145611, 12100466, 12027069, 11960166, 11924798, 11869782, 11742372, 11587736, 11498164, 11486668, 11482850, 11437820, 11362649, 11273850, 11172658, 11076697, 11006881, 10943041, 10853658, 10764432, 10729356, 10735108, 10708207, 10624983, 10540354, 10492001, 10449022, 10379632, 10302180, 10240202, 10187165, 10142489, 10123405]
6218A0123405p680m1069p2890m4884O610O904k8202k7536J505m762k9819L139
6206I884721P6721Q6148J9508j1617L8183O8712Q630o1250m6711Q073R146l3833
6194A0046431n0557m2834o6318j19039j46370j36445j29523j44178j57185j46749
6184H907233j12492p2310o6142j20153j81725j58558o2281k4319j03202j76004
6174G830047j22710k1884k2726r8814j04245l4954l4676j30274j64514n6742N3117
6163G091625K6213o2865o8323q269l836o2206q0868l1477R823O580K152Q649j9013
6150F808185p4788q3061k7163Q351k5241n8026k2846K5146k661q0016j03936n1120
6138F312824k417j6081n8498p3524n5342l2023k5311m4255p8121q4472k8622N0938
$$ y = [10123405, 10115725, 10074656, 10001766, 9956882, 9963492, 9970396, 9942194, 9914658, 9916163, 9911401, 9881582, 9884721, 9961442, 10047590, 10067098, 10055481, 10093664, 10162376, 10171006, 10109756, 10063045, 10071118, 10080264, 10046431, 9995874, 9953040, 9886722, 9767683, 9621313, 9484868, 9355345, 9211167, 9053982, 8907233, 8794741, 8722431, 8656289, 8536136, 8354411, 8195853, 8133572, 8109253, 8006051, 7830047, 7707337, 7685453, 7662727, 7563913, 7459668, 7424714, 7390038, 7259764, 7095250, 7038508, 7091625, 7117838, 7054973, 6986650, 6978381, 6974545, 6912339, 6831471, 6799994, 6809817, 6816397, 6818549, 6827198, 6808185, 6733397, 6650336, 6623173, 6631524, 6606283, 6548257, 6525411, 6550557, 6547896, 6467880, 6363944, 6312824, 6310407, 6294326, 6235828, 6162304, 6106962, 6074939, 6049628, 6005373, 5927252, 5842780, 5814158, 5865096]
6126E865096O4986j3334j01973j11126n4568j7274l6824o6581n3727j2055r25
6115E461695m7639j05999j02091k7352L4223N428p2097q5003j2819L4216j8753
6104E063809r0523o8096J4223L0292l6237p1491j7931M1786K6318k6212m2317
6093D823621k8049k7012l1317j2087J0222N1k6789l6597l8936m9719l8204J3495
6081D558679M3327n952p1732n0343K9875L8396m9644j06824n2199K8847L1365
6070D393795j1687j2674J4233o675o4449p0544l988N3872M0074j4496m7903m0944
6058D228614r296K3679K7618j3839o5317o7129j6739K1360N257l1127l9016k3187
6046D040878j4917j5312p259L549Q34q625j0581j4644l4061n2475m7978l1572
$$ y = [5865096, 5930082, 5916748, 5814775, 5703649, 5649081, 5631807, 5594983, 5528402, 5474675, 5462620, 5461695, 5414056, 5308057, 5205966, 5178614, 5212837, 5218265, 5146168, 5061165, 5048346, 5082562, 5063809, 4973286, 4905190, 4919413, 4949705, 4913468, 4841977, 4824046, 4865832, 4892150, 4865938, 4823621, 4795572, 4768560, 4737243, 4725156, 4735378, 4735429, 4708640, 4672043, 4633107, 4583388, 4545184, 4558679, 4602006, 4596054, 4524322, 4473979, 4503854, 4542250, 4492606, 4385782, 4333583, 4362430, 4393795, 4382108, 4369434, 4383667, 4376992, 4312543, 4241999, 4238011, 4291883, 4331957, 4317461, 4269558, 4228614, 4219318, 4242997, 4270615, 4256776, 4191459, 4124330, 4107591, 4128951, 4134208, 4103081, 4064065, 4040878, 4025961, 4010649, 4003390, 4006939, 4007773, 3999148, 3988567, 3973923, 3939862, 3887387, 3839409, 3807837]
6034C807837k2726r857J7291K2765k3049o6834l2030M9428O2684j5742p5257m4419
6022C670091M074p289k6396J7028O0954J2882o6528m7352L8433L4389p0905j09578
6010C509803j5766N7369l125p7642k1878Q5964Q1283j5446n5446j6558k898k9945
5998C495715j2298M1425K2755o2596o9813L9287J08383L1442p7820p4025K08J6583
5986C459246k2415j6443M7429Q2595M7893j0215m6528n5501l3923J4430M8136
5975C514704L0830q476j5684R760L1951M3514N3222M2226n95l0650m076M6986
5963C713712O3902N3351N6274O1735L7825J5736M4917Q7393O4637N22K043Q6309
5951D288356J41321R3242J1274m408M1574P1570M4149j6964o2558n5430m736K4105
$$ y = [3807837, 3785111, 3775254, 3792545, 3815310, 3792261, 3725427, 3693397, 3742825, 3805509, 3789767, 3714510, 3670091, 3674165, 3666876, 3640480, 3657508, 3718462, 3731344, 3664816, 3617464, 3655897, 3690286, 3619381, 3509803, 3494037, 3551406, 3548281, 3470639, 3448761, 3534725, 3616008, 3600562, 3545116, 3528558, 3525660, 3495715, 3483417, 3524842, 3547597, 3485001, 3415188, 3454475, 3562858, 3594300, 3516480, 3442455, 3442663, 3459246, 3436831, 3420388, 3467817, 3550412, 3598305, 3588090, 3541562, 3486061, 3452138, 3466568, 3514704, 3545534, 3537058, 3521374, 3531134, 3563085, 3606599, 3659821, 3702047, 3701452, 3670802, 3666726, 3713712, 3777614, 3830965, 3887239, 3948974, 3986799, 4002535, 4047452, 4134845, 4199482, 4200004, 4202047, 4288356, 4429677, 4522919, 4534193, 4529785, 4571359, 4642929, 4687078, 4670114, 4607556, 4552126, 4547390, 4571495]
5939D571495k1395r8642j15874o2998k4263m9065r0117r3920p3794o0383n3044
5928C828000n3796p7209r5846n6277J5597J6994p3955j38680q6535P688K2872
5917C308853l0820n7468l7277k7707l9296k6039J1532J6691k4900o1179n6522
5906B975868k9212k560J7649J6534j6543m7212k9370J8859L0951j2851o1981p1019
5894B789113m4679l341M0854O2597K9830m7196j06966r4168j1428Q3075J16066
5883B813757N8426l4092o8396k6631J1871o363k7205R881N5666K7648m6853p1425
5871B696284l2807Q1P761K9158M8552O543o6235o3394K0075O1744Q905l6432K212
5858B682447M5959P517n0469k4342N2432O8418J1985l2940l0011j6793j3494n680
$$ y = [4571495, 4550100, 4451458, 4335584, 4272586, 4248323, 4199258, 4109141, 4015221, 3941427, 3881044, 3828000, 3774204, 3696995, 3601149, 3544872, 3560469, 3577463, 3503508, 3364828, 3278293, 3285981, 3308853, 3278033, 3220565, 3183288, 3155581, 3116285, 3090246, 3101778, 3118469, 3093569, 3032390, 2975868, 2946656, 2944096, 2961745, 2978279, 2961736, 2914524, 2885154, 2904013, 2934964, 2922113, 2860132, 2789113, 2744434, 2741093, 2781947, 2844544, 2874374, 2827178, 2720212, 2626044, 2614616, 2697691, 2813757, 2872183, 2838091, 2769695, 2743064, 2754935, 2748572, 2721367, 2731248, 2786914, 2814562, 2767709, 2696284, 2663477, 2663558, 2671319, 2700477, 2749029, 2755572, 2689337, 2625943, 2646018, 2707762, 2716667, 2680235, 2682447, 2728406, 2735923, 2685454, 2661112, 2713544, 2781962, 2793947, 2761007, 2730996, 2714203, 2700709, 2695029]
5846B695029Q24n221N550N1985P8686L3785k6214j4390L6143K3572l7851k6858
5834B815040P5710J32555N8213m6677n0489K2471N7934L0147P085J9269K9103
5823C150361K0326K7025O2321Q8796Q0532O1294N7656N7110M0636K4178L4664
5812C704899O3981P9278O9750N2453L6096J3789m534O767L7591L4382k1987p1503
5800D000962n9251k6353m4510q9973q2131l7758o0744j50777j63212l6793P2104
5789C321564P550j39887j65879o1811n150o2636j01323l0789M8859K3254n8073
5778B775679q4336n5637m3398n8277o2240n4338n0644k8164K4475M8847k264o9894
5766B339809o6937j2158J0498p473o924J2054j0342o5144o5607N011M6863m843
$$ y = [2695029, 2695853, 2690632, 2696182, 2748167, 2826853, 2860638, 2834424, 2820034, 2856177, 2879749, 2841898, 2815040, 2890750, 3023305, 3081518, 3034841, 2984352, 3006823, 3064757, 3094904, 3101989, 3121258, 3150361, 3170687, 3197712, 3260033, 3348829, 3429361, 3490655, 3548311, 3605421, 3646057, 3670235, 3704899, 3768880, 3848158, 3917908, 3970361, 4006457, 4020246, 4015712, 4022479, 4060070, 4094452, 4072465, 4000962, 3941711, 3915358, 3870848, 3780875, 3698744, 3660986, 3600242, 3449465, 3286253, 3249460, 3321564, 3329114, 3189227, 3023348, 2961537, 2956387, 2893751, 2792428, 2761639, 2810498, 2833752, 2775679, 2691343, 2635706, 2592308, 2534031, 2471791, 2417453, 2366809, 2338645, 2363120, 2411967, 2409703, 2339809, 2272872, 2260714, 2271212, 2263739, 2256815, 2268869, 2258527, 2193383, 2127776, 2132787, 2179650, 2174807]
5754B174807p5506o5934J951L3597O860j6565l186J0241p722l2064l0209j4828
5742A981442j2983j2104J9092O3277N6872j9503r1730p7594j753L2881r921n1358
5730A876618k2874K8328K0046k9583l2667K2629M9954J258n8841n3805n127J2558
5718A808494j6015l8595k1699R606K0180J1726O889J1376J0864k279j5136j2174
5706A773237K24q30k3212m6839m9477l1951p863J5085K8700J9123r146k2946l309
5693A640796J8982O845k0038j2156K7002L8965j684m9494n6368l0938n499J3446
5681A569859K9530K7455j353k8060k0609M404P80l8566o2747k3690N7675J00962
5669A615640N1865m4813q3516k6036M1994K4171m8604o3634K282M9074J1203m5844
$$ y = [2174807, 2099301, 2033367, 2035318, 2068915, 2075775, 2059210, 2056024, 2066265, 2058543, 2026479, 1996270, 1981442, 1968459, 1956355, 1975447, 2038724, 2095596, 2076093, 1984363, 1906769, 1905016, 1937897, 1927976, 1876618, 1853744, 1882072, 1902118, 1872535, 1839868, 1862497, 1912451, 1913709, 1854868, 1801063, 1795936, 1808494, 1792479, 1753884, 1732185, 1741791, 1761971, 1773697, 1780586, 1791962, 1802826, 1800547, 1785411, 1773237, 1773461, 1772631, 1749419, 1702580, 1653103, 1621152, 1613289, 1628374, 1657074, 1676197, 1667051, 1644105, 1640796, 1659778, 1666623, 1646585, 1634429, 1661431, 1700396, 1698712, 1649218, 1592850, 1561912, 1556413, 1569859, 1599389, 1626844, 1625491, 1597431, 1576822, 1581226, 1582006, 1543440, 1480693, 1457003, 1514678, 1615640, 1667505, 1622692, 1539176, 1513140, 1555134, 1579305, 1530701, 1467067, 1469349, 1518423, 1529626, 1483782]
5657A483782l9099N766J7632K484J1065L1319J4471j9151p002L3411K1126l9490
5645A516314m4202L7531Q8023J4433r5547r2633J6114Q2213L0764n0888n9298
5634A442824j4245P19k7444l7731j408L6374K9909k058j1905N595J2876r026l3742
5621A390738l1521r816N064O987Q495J2192P928m737j2076n575P990J4522R76
5608A391167l4915o9120o0403P86O4586P3417L3408q86o884j3793l7416m6900
5596A293047j9496J5696K1694O448m495j6720m3930n9966k8075K9085M3833j564
5584A235557m2474j9527L7029M7337r317o4434m6600K8455P6715M7896j7222m3551
5572A229864j4849J8048J4039j0658k0791j1989j10J0283J8341J1645r612j4327
$$ y = [1483782, 1444683, 1450449, 1468081, 1470565, 1481630, 1512949, 1527420, 1508269, 1501267, 1534678, 1555804, 1516314, 1472112, 1509643, 1597666, 1612099, 1516552, 1423919, 1440033, 1522246, 1553010, 1502122, 1442824, 1428579, 1429298, 1401854, 1364123, 1362715, 1399089, 1428998, 1426940, 1415035, 1420630, 1433506, 1424480, 1390738, 1359217, 1349401, 1354465, 1361452, 1369947, 1382139, 1390067, 1385330, 1373254, 1367679, 1375669, 1390191, 1391167, 1356252, 1287132, 1226729, 1227515, 1292101, 1365518, 1398926, 1398040, 1391156, 1377363, 1339947, 1293047, 1273551, 1289247, 1310941, 1317389, 1312894, 1296174, 1252244, 1192278, 1164203, 1193288, 1237121, 1235557, 1193083, 1173556, 1210585, 1257922, 1248605, 1184171, 1137571, 1166026, 1242741, 1290637, 1273415, 1229864, 1215015, 1233063, 1247102, 1236444, 1215653, 1203664, 1203554, 1213837, 1232178, 1243823, 1234211, 1219884]
5560A219884J6560M7369L1876j3878l4480k3003k3784m2344k5119M0829P7371
5549A271281K1703o6708p7591k929N6599L5115k0561l5250o714J4446O378o583
5537A189186k635P676K147k1055l7369k0677K1620M5103J7535l2464m3750l876
5525A121441L0860J1917l6590n4497k1902L0469O6721O8857L1430k8281o2931
5514A157494l7911J7633L8490O445k9290k2934J1503L0227J6142j4331l7433l5482
5502A100553l665L6976M9551K2579j2801k3209j5021j6574l1664l4754r520K6428
5490A088879L9440J6346j8377k6089j057J7076l676l6192l0448P182K0207p622
5478A065669k6620p310R508j1079l0151n80M6689N0172J6323k651k128j6768l7666
$$ y = [1219884, 1236444, 1283813, 1315689, 1301811, 1267331, 1244328, 1220544, 1178200, 1153081, 1193910, 1271281, 1292984, 1226276, 1148685, 1145756, 1202355, 1237470, 1216909, 1181659, 1174945, 1189391, 1195769, 1189186, 1186551, 1194227, 1196374, 1175319, 1137950, 1117273, 1138893, 1183996, 1201531, 1169067, 1125317, 1121441, 1152301, 1164218, 1127628, 1073131, 1051229, 1081698, 1148419, 1217276, 1248706, 1220425, 1157494, 1119583, 1137216, 1175706, 1182151, 1152861, 1129927, 1141430, 1171657, 1187799, 1173468, 1136035, 1100553, 1096888, 1133864, 1183415, 1205994, 1193193, 1169984, 1154963, 1138389, 1106725, 1071971, 1062451, 1088879, 1128319, 1144665, 1126288, 1100199, 1099142, 1116218, 1112542, 1076350, 1045902, 1053084, 1073291, 1065669, 1039049, 1031739, 1041247, 1030168, 1000017, 999437, 1046126, 1096298, 1112621, 1109970, 1107842, 1091074, 1053408]
5465A053408k4068R226O524k3735j4097L6404M3560k0387o7862l4737J6374P719
5453I88329k0708J3142Q2610Q5668L765p2301p2298k0134K7134M3910L0959L452
5441A093528p367J3718L3985J7266j2802q817J5945P967k7697k8227J6640L6146
5429A150285r548o1376n0054M509L4023K0614J624J168O224J542q388j1133m50
5416A079040J7209K2560L022k3380k4426J228K0756J4602k109j3356k3888l4341
5404A036917k9189q582j170k2437m4899l3118P939L6992K0081l3256o8577l6386
5392H24315L5879N3112k0808q4039k4679R8625J17698J800q8985m3090M4788M3338
5380I57954r607J289O1105O0853o383m0379j1172N325k0309k1424K8569N4976
$$ y = [1053408, 1029340, 1038566, 1045090, 1021355, 1007258, 1043662, 1087222, 1066835, 998973, 964236, 980610, 988329, 967621, 980763, 1063373, 1149041, 1152806, 1080505, 1008207, 988073, 1015207, 1059117, 1090076, 1093528, 1086161, 1099879, 1133864, 1151130, 1138328, 1129511, 1145456, 1153423, 1125726, 1097499, 1114139, 1150285, 1140737, 1079361, 1029307, 1033816, 1067839, 1088453, 1090077, 1091245, 1097469, 1099011, 1090623, 1079490, 1079040, 1096249, 1118809, 1121831, 1098451, 1074025, 1075253, 1096009, 1110611, 1108502, 1095146, 1071258, 1036917, 1007728, 999146, 997976, 975539, 930640, 897522, 905461, 942453, 962534, 929278, 860701, 824315, 860194, 913306, 892498, 808459, 783780, 882405, 1000103, 1001903, 912918, 869828, 914616, 957954, 948347, 949636, 1010741, 1071594, 1065211, 1024832, 1013660, 1018985, 998676, 977252, 1005821, 1060797]
5368A060797R021m7210m3102k453J6347J2426J5134K1653J5416P97j9195n0548
5356I89083o6156k1105N7846P5671P631m7753j5360M0792K9119k0250k0367J9186
5344A028337K1439j2795j1996K7439L0343k1426n3978k6144R708M513j7552k3562
5332I54326k7047l7732k8240O069K0831q13j2165J1439K1801j1962l4581L083
5320H65009M9304L5062m856L928L3979j121q1426q9701n72O7472L4291k4202j1346
5307H75821L7683L3444j2996k3431N599R727j4681m523M3612N2923p78l9207j0810
5294I52383K3734m15m0328k4468J9555J4209l0729l5206J2371L8359J2136r692
5282I31909P208J5947j6733m1143j1818K5094N549m2292m2310Q154M3029L5762
$$ y = [1060797, 1069818, 1022608, 979506, 977053, 993400, 1005826, 1020960, 1042613, 1058029, 1058826, 1039631, 989083, 922927, 901822, 959668, 1035339, 1042970, 995217, 979857, 1020649, 1049768, 1029518, 1009151, 1028337, 1049776, 1036981, 1024985, 1052424, 1082767, 1061341, 1007363, 981219, 990927, 995440, 977888, 954326, 927279, 889547, 861307, 867376, 888207, 887394, 875229, 886668, 908469, 896507, 861926, 865009, 914313, 949375, 944519, 948447, 982426, 981305, 899879, 810178, 809606, 877078, 911369, 887167, 875821, 913504, 946948, 933952, 910521, 916120, 925847, 911166, 906643, 950255, 1003178, 1002400, 963193, 952383, 976117, 975702, 935374, 910906, 930461, 944670, 913941, 878735, 891106, 929465, 941601, 931909, 939117, 955064, 938331, 897188, 885370, 910464, 916013, 873721, 831411, 839565, 882594, 918356]
5270I18356K0868J1858j8507o1836n7711J1778P5898O9280K1986L183J3349l392
5258A005110n5179p8084l0500L8849N1292J511l7860j3827L8032M3091j0939n6317
5246H95179l5949K0920M2013J0970j8728q101J4359N440k2717k3804P171K3070
5234I09823m487l9549l0473J7173M7678L0511m386j7277j3292j9015k7064o950
5222H42692L3188M3377M469l8364l9438j2307N579J1982K2038K2856j437k1039
5210H73596L281M6377M4529n157l6111j2749K4786L4098K4711J3294j0444l8046
5198I62165k7060K3190M4471M876k3881K0244P0627K9340n7813n1392O0037J23162
5186A177966M4773o8701p3501N192L3938k0058n8902j9819L8787M1946L773j7003
$$ y = [918356, 939224, 951082, 932575, 870739, 813028, 824806, 900704, 969984, 991970, 995153, 1008502, 1005110, 949931, 871847, 841347, 880196, 931488, 932999, 895139, 881312, 919344, 962435, 951496, 895179, 859230, 880150, 922163, 933133, 914405, 906304, 920663, 926103, 903386, 879582, 886753, 909823, 905336, 865787, 835314, 852487, 900165, 930676, 926290, 909013, 895721, 876706, 849642, 842692, 875880, 919257, 923726, 885362, 845924, 833617, 839196, 851178, 873216, 896072, 894635, 873596, 876877, 923254, 967783, 962626, 926515, 913766, 938552, 972650, 997361, 1010655, 1000211, 962165, 935105, 958295, 1002766, 1007642, 983761, 1004005, 1074632, 1103972, 1046159, 994767, 1054804, 1177966, 1222739, 1154038, 1080537, 1085729, 1119667, 1099609, 1040707, 1020888, 1059675, 1101621, 1105394, 1088391]
5174A088391r247k960l475J2737M4949N6047K2008l3709o5351m9475j552L6940
5162A095303K7354k9922q2424p0912r82N0952K3883n1443q9262n2363J2282M0043
5150H72509J7528k2917m6248l6692k261K4695J2986k4892l9105r167K4078J8953
5138G89467m788k403K2088K8019J0767P695L0984M7794L7969K2296J7083Q954
5126A015925k790J1371N2805O6513J9542l0611p332O6995R2544L0809m4353n2910
5114A218508q612K1256J3022r21O335K5802L6793K8261r51l5554m2315n289L9405
5101A295740L8365m890k7971L876M7878M7076Q723j9486k4198k6943k5274O709
5089A319605N5990O8861L1247k789P254K7395J0574k3833k4508P807K8253K1955
$$ y = [1088391, 1079144, 1076184, 1072709, 1085446, 1130395, 1186442, 1208450, 1174741, 1109390, 1059915, 1058363, 1095303, 1122657, 1092735, 1010311, 939399, 938417, 989369, 1013252, 961809, 872547, 820184, 832466, 872509, 890037, 867120, 820872, 784180, 781919, 806614, 819600, 794708, 755603, 746436, 770514, 789467, 784679, 782276, 804364, 832383, 843150, 850845, 881829, 929623, 967592, 989888, 1006971, 1015925, 1013135, 1024506, 1077311, 1143824, 1163366, 1132755, 1125423, 1192418, 1284962, 1315771, 1271418, 1218508, 1209896, 1231152, 1244174, 1243253, 1249588, 1275390, 1312183, 1340444, 1339493, 1303939, 1261624, 1256335, 1295740, 1334105, 1329215, 1301244, 1305120, 1352998, 1400074, 1408797, 1389311, 1365113, 1338170, 1312896, 1319605, 1375595, 1444456, 1475703, 1472914, 1480168, 1507563, 1518137, 1494304, 1469796, 1477603, 1505856, 1527811]
5077A527811J2892Q486n879j9325l362K5637J4435l7634n9607j4135L4321R018
5065A492658o0765p6035r257N5162L5552m0873p9807m2536J4760K6752M924O531
5053A327066L8227M2769p664n7774m5590Q528M0743M0277M3350N0195K4428k4304
5041A480251l4810J0194N3060N1656L5823M2076N4548M8552L5880K8471J3369
5030A819070N56L1491R6124J13430N2769J62K7916P1119L1883n3984p2749j8242
5018B099545O027l9086p6601n0668n000M890j5410m4401p9402r7089n9379J1131
5006A654557L8003K759k6798r763Q715r468k5955k149K7571J7195j5845l0954
4994A627868k5911j1270J9847N1067L4838k4848m8824O62M8917K3274k9452k3315
$$ y = [1527811, 1540703, 1549189, 1543310, 1523985, 1520623, 1546260, 1560695, 1523061, 1463454, 1449319, 1483640, 1492658, 1431893, 1355858, 1346601, 1401763, 1437315, 1396442, 1316635, 1274099, 1288859, 1315611, 1320535, 1327066, 1365293, 1408062, 1400398, 1342624, 1297034, 1305562, 1346305, 1386582, 1429932, 1480127, 1504555, 1480251, 1445441, 1455635, 1508695, 1560351, 1596174, 1638250, 1692798, 1741350, 1777230, 1805701, 1819070, 1819626, 1851117, 1947241, 2060671, 2113440, 2113602, 2141518, 2212637, 2244520, 2190536, 2117787, 2099545, 2105572, 2066486, 1989885, 1939217, 1934217, 1939107, 1923697, 1879296, 1799894, 1702805, 1643426, 1654557, 1692560, 1695319, 1668521, 1658758, 1667473, 1658005, 1632050, 1629901, 1657472, 1674667, 1658822, 1627868, 1601957, 1590687, 1610534, 1661601, 1696439, 1671591, 1622767, 1623429, 1672346, 1695620, 1666168, 1642853]
$$ [...]
##END NTUPLES=NMR SPECTRUM
##END=
