##TITLE=1H ikalashn
IG-stear
19.9.2024
##JCAMPDX= 6.0         $$ Bruker NMR JCAMP-DX V2.0
##DATA TYPE= NMR FID
##DATA CLASS= NTUPLES
##ORIGIN= UXNMR, Bruker Analytische Messtechnik GmbH
##OWNER= root
$$ TOPSPIN		Version 1.3
$$ 2024-09-19 11:14:41.796 +0400  Irina@DPX200
$$ Compression mode = diff/dup
##.OBSERVE FREQUENCY= 200.131392401
##.OBSERVE NUCLEUS= ^1H
##.DELAY= (6, 6)
##.ACQUISITION MODE= SIMULTANEOUS
##.ACQUISITION SCHEME= undefined
##.AVERAGES= 8
##.DIGITISER RES= 18
##SPECTROMETER/DATA SYSTEM= spect
##.PULSE SEQUENCE= zg
##.SOLVENT NAME= CDCl3
##.SHIFT REFERENCE= INTERNAL, CDCl3, 1, 17.95386
##AUDIT TRAIL= $$ (NUMBER, WHEN, WHO, WHERE, WHAT)
$$ ##TITLE= Audit trail, TOPSPIN		Version 1.3
$$ ##JCAMPDX= 5.01
$$ ##ORIGIN= Bruker BioSpin GmbH
$$ ##OWNER= Irina
$$ $$ F:/spectra/data/iren/nmr/1H/4/audita.txt
$$ ##AUDIT TRAIL=  $$ (NUMBER, WHEN, WHO, WHERE, VERSION, WHAT)
(   1,<2024-09-19 11:14:28.156 +0400>,<Irina>,<DPX200>,<TOPSPIN 1.3>,
      <created by zg
	started at 2024-09-19 11:13:51.921 +0400,
	POWCHK disabled, PULCHK disabled
       terminated by command 'halt'
       configuration hash MD5:
       BE 6D 3F 07 2A EA 11 49 91 17 2B D3 AF B3 58 0D
       data hash MD5: 16K
       E0 BB 2D 4D AD D9 77 2A F7 96 0E 42 85 9E 33 92>)
$$ ##END=
$$ 
$$ $$ hash MD5
$$ $$ F9 D7 19 7B 1C 08 56 AC 6A 17 CB FA 5B 5B 29 6D
##$RELAX= 
##$RELAX= 
##$RELAX= 
##$RELAX= 
##$RELAX= 
##$RELAX= 
##$RELAX= 
##$RELAX= 
##$RELAX= 
$$ Bruker specific parameters
$$ --------------------------
##$DU= <F:/spectra>
##$EXPNO= 4
##$NAME= <1H>
##$PROCNO= 1
##$TYPE= <nmr>
##$USER= <iren>
##$AMP= (0..31)
100 100 100 100 100 100 100 100 100 100 100 100 100 100 100 100 100 100 
100 100 100 100 100 100 100 100 100 100 100 100 100 100 
##$ANAVPT= -1
##$AQSEQ= 0
##$AQ_mod= 1
##$AUNM= <au_zg>
##$AUTOPOS= <>
##$BF1= 200.13
##$BF2= 200.13
##$BF3= 200.13
##$BF4= 200.13
##$BF5= 200.13
##$BF6= 200.13
##$BF7= 200.13
##$BF8= 200.13
##$BYTORDA= 1
##$CFDGTYP= 0
##$CFRGTYP= 5
##$CHEMSTR= <none>
##$CNST= (0..63)
1 1 145 1 1 1 1 1 1 1 1 1 1 1 1 1 1 1 1 1 1 1 1 1 1 1 1 1 1 1 1 1 1 1 
1 1 1 1 1 1 1 1 1 1 1 1 1 1 1 1 1 1 1 1 1 1 1 1 1 1 1 1 1 1 
##$CPDPRG= <>
##$CPDPRG1= <>
##$CPDPRG2= <>
##$CPDPRG3= <>
##$CPDPRG4= <mlev>
##$CPDPRG5= <mlev>
##$CPDPRG6= <mlev>
##$CPDPRG7= <mlev>
##$CPDPRG8= <mlev>
##$CPDPRGB= <>
##$CPDPRGT= <>
##$D= (0..63)
0 2 0 0 0 0 0 0 0 0.06 0 0.03 0 0 0 0 0.0002 0 0 0 0 0 0 0 0 0 0 0 0 0 
0 0 0 0 0 0 0 0 0 0 0 0 0 0 0 0 0 0 0 0 0 0 0 0 0 0 0 0 0 0 0 0 0 0 
##$DATE= 1726730065
##$DBL= (0..7)
120 120 120 120 120 120 120 120 
##$DBP= (0..7)
150 150 150 150 150 150 150 150 
##$DBP07= 0
##$DBPNAM0= <>
##$DBPNAM1= <>
##$DBPNAM2= <>
##$DBPNAM3= <>
##$DBPNAM4= <>
##$DBPNAM5= <>
##$DBPNAM6= <>
##$DBPNAM7= <>
##$DBPOAL= (0..7)
0.5 0.5 0.5 0.5 0.5 0.5 0.5 0.5 
##$DBPOFFS= (0..7)
0 0 0 0 0 0 0 0 
##$DE= 6
##$DECBNUC= <off>
##$DECIM= 32
##$DECNUC= <off>
##$DECSTAT= 4
##$DIGMOD= 1
##$DIGTYP= 9
##$DL= (0..7)
0 120 120 120 120 120 120 120 
##$DP= (0..7)
$$ [...]
##$SW= 21.9925939549014
##$SWIBOX= (0..15)
0 0 2 0 0 0 0 0 0 0 0 0 0 0 0 0 
##$SW_h= 4401.40845070422
##$TD= 16384
##$TD0= 1
##$TE= 300
##$TE2= 300
##$TE3= 300
##$TEG= 300
##$TL= (0..7)
0 120 120 120 120 120 120 120 
##$TP= (0..7)
150 150 150 150 150 150 150 150 
##$TP07= 0
##$TPNAME0= <>
##$TPNAME1= <>
##$TPNAME2= <>
##$TPNAME3= <>
##$TPNAME4= <>
##$TPNAME5= <>
##$TPNAME6= <>
##$TPNAME7= <>
##$TPOAL= (0..7)
0.5 0.5 0.5 0.5 0.5 0.5 0.5 0.5 
##$TPOFFS= (0..7)
0 0 0 0 0 0 0 0 
##$TUNHIN= 0
##$TUNHOUT= 0
##$TUNXOUT= 0
##$USERA1= <user>
##$USERA2= <user>
##$USERA3= <user>
##$USERA4= <user>
##$USERA5= <user>
##$V9= 5
##$VALIST= <valist>
##$VCLIST= <CCCCCCCCCCCCCCC>
##$VD= 0
##$VDLIST= <DDDDDDDDDDDDDDD>
##$VPLIST= <PPPPPPPPPPPPPPP>
##$VTLIST= <TTTTTTTTTTTTTTT>
##$WBST= 1024
##$WBSW= 25
##$XGAIN= (0..3)
0 0 0 0 
##$XL= 0
##$YL= 0
##$YMAX_a= 701849
##$YMIN_a= -642245
##$ZGOPTNS= <>
##$ZL1= 120
##$ZL2= 120
##$ZL3= 120
##$ZL4= 120
##$ABSF1= 10
##$ABSF2= 0
##$ABSG= 5
##$ABSL= 3
##$ALPHA= 0
##$AQORDER= 0
##$ASSFAC= 0
##$ASSFACI= 0
##$ASSFACX= 0
##$ASSWID= 0
##$AUNMP= <proc_1d>
##$AXLEFT= 0
##$AXRIGHT= 0
##$AXTYPE= 0
##$AXUNIT= <>
##$AZFE= 0.1
##$AZFW= 0.1
##$BCFW= 1
##$BC_mod= 2
##$BYTORDP= 1
##$COROFFS= 0
##$CY= 7568.61572265625
##$DATMOD= 1
##$DC= 2
##$DFILT= <>
##$DTYPP= 0
##$F1P= 17.9538593292236
##$F2P= -4.03888763876832
##$FCOR= 0.5
##$FTSIZE= 32768
##$FT_mod= 4
##$GAMMA= 1
##$GB= 1
##$INTBC= 1
##$INTSCL= 1
##$ISEN= 128
##$LB= 0.02
##$LEV0= 0
##$LPBIN= 0
##$MAXI= 945.577
##$MC2= 0
##$MEAN= 0
##$ME_mod= 0
##$MI= -402.1523
##$NCOEF= 0
##$NC_proc= 0
##$NLEV= 6
##$NOISF1= 8.587773
##$NOISF2= 6.764455
##$NSP= 1
##$NTH_PI= 0
##$NZP= 0
##$OFFSET= 17.95386
##$PC= 1
##$PHC0= 201.925
##$PHC1= -7.023463
##$PH_mod= 0
##$PKNL= yes
##$PPARMOD= 0
##$PPDIAG= 0
##$PPIPTYP= 0
##$PPMPNUM= 100
##$PPRESOL= 1
##$PSCAL= 0
##$PSIGN= 0
##$REVERSE= no
##$SF= 200.13
##$SI= 32768
##$SIGF1= 18.5376
##$SIGF2= -6.396296
##$SINO= 400
##$SIOLD= 32768
##$SREGLST= <1H.CDCl3>
##$SSB= 3
##$STSI= 0
##$STSR= 0
##$SW_p= 4401.40845070423
##$SYMM= 0
##$S_DEV= 0
##$TDeff= 0
##$TDoff= 0
##$TI= <>
##$TILT= no
##$TM1= 0
##$TM2= 0
##$TOPLEV= 0
##$USERP1= <user>
##$USERP2= <user>
##$USERP3= <user>
##$USERP4= <user>
##$USERP5= <user>
##$WDW= 1
##$XDIM= 8192
##$YMAX_p= 0
##$YMIN_p= 0
$$ End of Bruker specific parameters
$$ ---------------------------------
##NTUPLES= NMR FID
##VAR_NAME=  TIME,          FID/REAL,        FID/IMAG
##SYMBOL=    X,             R,               I
##VAR_TYPE=  INDEPENDENT,   DEPENDENT,       DEPENDENT
##VAR_FORM=  AFFN,          ASDF,            ASDF
##VAR_DIM=   8192,          8192,            8192
##UNITS=     SECONDS,       ARBITRARY UNITS, ARBITRARY UNITS
##FACTOR=    0.0002272,     1,               1
##FIRST=     0,             0,               0
##LAST=      1.8609952,     7,               -49
##MIN=       0,             -642245,         -642245
##MAX=       1.8609952,     701849,          701849
$$ Real data points
##PAGE= N=1
##DATA TABLE= (X++(R..R)), XYDATA
0 0 0 0 0 0 0 0 0 -8 0 -8 8 -16 16 -16 24 -32 40 -48 56 -72 81 -97 118 -137 161 -185 217 -257 292 -336 384
31 384 -436 498 -561 634 -714 799 -895 999 -1116 1242 -1378 1528 -1694 1874 -2067 2281
47 2281 -2515 2773 -3054 3364 -3705 4088 -4511 4983 -5521 6132 -6835 7650 -8620 9787
61 9787 -11220 13032 -15414 18683 -23479 31191 -45614 81656 -353650 -340934 701849 177708
73 177708 -577769 -90796 605609 -56460 -608691 74518 602266 -108604 -491409 167033
83 167033 412556 -296195 -386675 367326 425313 -361881 -401414 314279 327264 -317574 -233740
94 -233740 367947 215876 -394729 -217372 358094 184854 -308795 -78151 323224 -16699
104 -16699 -392845 54045 444986 -45382 -430616 74913 391769 -158641 -396548 236912
114 236912 433343 -257171 -437975 241436 363348 -269560 -266046 352150 207451 -437384
124 -437384 -200494 454246 167393 -436644 -85008 439250 -13280 -488715 52648 517680
134 517680 -43869 -478847 49250 393688 -112188 -336909 189655 329805 -219093 -320362
144 -320362 205132 264570 -203718 -180126 257175 140328 -315514 -152226 327743 170631
154 170631 -286727 -134224 262283 70511 -281137 -29071 316929 34515 -306468 -29607
164 -29607 259740 -25820 -230043 112148 251305 -167584 -286652 172222 277216 -174714
174 -174714 -225850 215602 181366 -280815 -181436 306309 183225 -285606 -143571 256980
184 256980 56742 -275047 12077 313844 -35501 -324649 37650 284786 -74205 -243544
194 -243544 139169 240314 -183791 -259986 176205 248787 -148864 -189402 156529 129203 -196775
205 -196775 -107231 227047 115324 -211270 -97737 184863 45499 -188240 8534 228758
215 228758 -17071 -251925 1510 233525 -5412 -194432 51183 184370 -99348 -203268
225 -203268 112706 209000 -102648 -173102 114012 120408 -163837 -98404 211763 105922 -222428
236 -222428 -105740 200680 63221 -197047 -8934 221507 -19851 -245642 14565 227188
246 227188 -21463 -183667 63104 155840 -118698 -164183 141847 173057 -131068 -147500 125928
257 125928 99160 -152257 -69120 189444 75539 -193585 -81865 166789 56754 -144396
267 -144396 -5988 158653 -23714 -182735 22018 182455 -14588 -149748 40409 126164
277 126164 -85879 -133928 113740 154564 -106321 -147001 94592 108056 -112534 -74132 150839
288 150839 70381 -172285 -80013 157603 61802 -139183 -16135 146329 -25620 -175797
298 -175797 31715 184221 -24965 -159493 38681 125578 -81609 -120244 115526 134100
308 134100 -116335 -131775 100161 95853 -105214 -54195 137360 41811 -161186 -50974 152692
319 152692 47378 -126185 -11184 122096 -27355 -142169 39510 158069 -26694 -139719
329 -139719 29131 107860 -59405 -94718 95403 108995 -102517 -116876 87855 94687 -85005
340 -85005 -57521 110190 39662 -139837 -48377 140888 51105 -120633 -26193 109528 -14740
351 -14740 -127347 33633 146534 -28251 -140449 24130 109576 -49408 -90978 85727
361 85727 97609 -102471 -109108 91158 93581 -82508 -56796 99992 31702 -128702 -33510
372 -33510 137016 41317 -117048 -23214 100611 -13088 -108062 38593 128958 -34126 -127220
383 -127220 26187 101552 -39673 -76704 73483 79190 -92999 -92231 85814 86687 -72239 -55944
395 -55944 81422 28415 -108771 -27030 122795 36998 -110324 -29782 90384 -2865 -93821
406 -93821 30327 113063 -33809 -121736 22268 100875 -30039 -75432 59273 69699 -86414
417 -86414 -83451 85799 84360 -72098 -59256 74042 27910 -98248 -18491 118550 28680
428 28680 -111037 -27479 89868 2050 -82493 30395 98735 -38766 -109299 29721 96060
439 96060 -28029 -67255 52473 56142 -79718 -65783 86036 74315 -71297 -57626 65401
450 65401 28590 -81845 -14628 102392 21962 -101857 -27480 81420 8414 -70454 21808
461 21808 80712 -38655 -97826 31675 92588 -27558 -70864 42839 54721 -71029 -62014
472 -62014 81636 72010 -71110 -62530 59705 33106 -70041 -11309 91677 11445 -98243
483 -98243 -16938 83567 4838 -68234 24985 74822 -44029 -90716 41171 92880 -29116
494 -29116 -70635 36565 49832 -58540 -46953 74319 57010 -66413 -51408 54133 26842
505 26842 -58826 -2981 80711 1255 -93958 -12176 84317 10174 -68023 10550 66546 -31602
517 -31602 -81164 31183 85110 -21588 -68638 23824 43719 -48349 -37982 70221 46888
528 46888 -73383 -50845 61863 32786 -62608 -10117 79575 3528 -94257 -13257 86504 15279
540 15279 -64764 4830 54874 -30999 -63085 41883 72561 -34418 -61286 34159 40544 -50865
552 -50865 -30473 73569 41757 -75610 -50664 60954 41120 -49373 -16975 58172 4288
563 4288 -72052 -8465 71075 12373 -54808 2336 45101 -28401 -55965 41232 71870 -35416
575 -35416 -72875 26324 55205 -35582 -42696 53408 44715 -62092 -52489 51207 41797 -42174
587 -42174 -16531 49599 -4926 -69810 6054 78166 -353 -68505 7060 56296 -27195 -58797
599 -58797 41256 70619 -35543 -68969 24470 49191 -26689 -26224 46204 21832 -59673 -27646
611 -27646 57243 26701 -46553 -8518 50705 -7069 -66701 6104 77122 7460 -66846 -9974
623 -9974 49329 -5079 -44126 22438 52725 -25425 -57128 18357 44083 -22545 -27127 41810
635 41810 23130 -62127 -35303 62949 41080 -52628 -30555 47670 10984 -58540 -4231 67342
647 67342 8494 -60792 -8066 42620 -10559 -34457 34602 42918 -44566 -52799 38710 47706 -33841
660 -33841 -30737 44115 22648 -57397 -28281 57921 35220 -42030 -24113 31650 2878 -37027
672 -37027 11480 51388 -7883 -53170 2880 42715 -10398 -35138 27730 43601 -35175 -56946
684 -56946 26162 56386 -15793 -40655 19919 25896 -36263 -26441 44848 31376 -40474 -26032
696 -26032 33662 6578 -42057 7430 58278 -6781 -66483 -2104 56441 -927 -43379 16061
708 16061 40947 -29206 -47548 27717 45645 -20522 -28950 24588 11445 -40810 -7729 54125
720 54125 16115 -50545 -17566 40213 6537 -37534 7307 47540 -6795 -52359 -1818 43376
732 43376 3801 -27134 10280 22861 -25943 -31358 29376 38513 -22354 -31969 21619 19611 -33990
745 -33990 -17596 46613 26584 -46106 -32426 34375 21986 -29854 -5242 37733 -3638 -48514
757 -48514 -60 45774 66 -34648 11923 28810 -29766 -36673 35643 44786 -28628 -39882
769 -39882 22502 24124 -28918 -13553 40970 15897 -42663 -19418 32871 11673 -24551 5870
781 5870 30652 -15358 -41742 11510 44118 -3327 -32926 7371 23978 -19632 -26761 26616
793 26616 35720 -20068 -34464 12147 21334 -16201 -9867 30164 11191 -38900 -19239 34133 17927
806 17927 -27313 -5733 30238 -5699 -42306 4018 46863 2356 -38916 -588 26837 -13702
818 -13702 -25821 25795 32621 -26328 -34461 20066 23614 -21707 -10619 33378 8170 -42509 -14420
831 -14420 38979 15936 -28118 -4934 25268 -7808 -32138 10954 38295 -4154 -31758 2879
843 2879 20246 -12267 -16075 24518 23565 -25398 -29260 17595 23739 -13916 -11782 21969 7514
856 7514 -32367 -13707 32382 18038 -24007 -11115 19728 -2470 -27451 7850 36574 -3523
868 -3523 -36104 -456 25666 -7510 -20092 20298 24473 -25955 -31254 20335 27198 -15900 -14570
881 -14570 21765 5964 -32956 -8424 36223 13519 -28305 -8691 21191 -3914 -23826 12677
893 12677 32637 -9253 -33084 3594 23647 -6304 -14022 18065 15925 -24719 -23082 20633 23804
906 23804 -12866 -13617 14578 4216 -24562 -5245 30560 12168 -25602 -12347 17233 1695
918 1695 -18280 8136 27166 -8238 -32694 1587 26359 -2319 -17426 12194 16011 -22366
930 -22366 -23207 21537 25725 -15109 -17838 14263 6262 -23276 -3174 31476 8228 -29397 -9782
943 -9782 21177 1570 -18131 9920 24864 -12262 -30296 6879 26399 -3637 -15526 11106
955 11106 11132 -20641 -15433 22631 20462 -15527 -15287 11899 4833 -17689 15 26649 4924 -27200
969 -27200 -9936 19200 5214 -14343 5100 18764 -10247 -26690 5365 25584 -1379 -17083
981 -17083 5980 10613 -17160 -14591 21657 20509 -17330 -18956 12107 8725 -16278 -1744 25399
994 25399 3920 -28550 -8917 22188 6227 -15164 4594 17313 -11874 -24203 10161 25932
1006 25932 -4415 -17547 6915 9756 -15952 -9870 22764 16514 -18880 -16819 12367 8732 -12376
1019 -12376 236 20489 87 -25446 -6037 20916 6708 -12996 1480 12081 -10466 -19360
1031 -19360 10127 23528 -4534 -18951 3150 10052 -11438 -9057 19222 14715 -19143 -18570 12131
1044 12131 12236 -10629 -2953 17032 -141 -24319 -4494 22751 6647 -15383 94 12640
1056 12640 -9804 -17893 12916 23889 -7695 -20759 4980 12413 -9787 -7411 18488 11375 -19517
1069 -19517 -14864 13943 11159 -9358 -1092 14026 -3765 -21314 630 22504 3955 -15855
1081 -15855 -869 10901 -7632 -14206 11435 20209 -7365 -20016 1983 11601 -5128 -5606 13323
1094 13323 7043 -18324 -12816 14220 11527 -10155 -4087 12589 -2291 -20916 -312 23883 5589
1107 5589 -18634 -4867 11807 -3433 -12183 10247 17796 -8996 -18898 4959 12489 -6323 -4812
1120 -4812 15125 5439 -20956 -10742 18983 12862 -12149 -6121 11492 -972 -16564 1863 20557
1133 20557 3150 -15931 -3547 8420 -3583 -6695 11936 12456 -12850 -17199 7470 13840 -5601
1146 -5601 -7207 10599 5356 -17190 -10863 15745 13852 -9433 -9308 5932 -123 -11393 3453
1159 3453 17749 -465 -18044 -2321 12169 -2712 -9964 10573 14714 -12849 -20276 7842 18460
1172 18460 -3560 -10079 7125 4877 -13965 -6213 16501 9558 -11711 -5721 8717 -2222 -12070
1185 -12070 7332 19517 -3659 -20568 -1062 14955 324 -8975 6363 10118 -9865 -14227
1197 -14227 6646 13457 -2337 -6210 4476 -15 -12511 -1685 17130 7062 -14709 -8513 9618
1210 9618 2689 -10938 1797 16327 -324 -19086 -4950 13614 4128 -7155 3253 6521 -10676
1223 -10676 -11970 10778 14408 -7225 -10098 7892 4338 -14295 -4442 19486 9821 -16578 -11325
1236 -11325 10123 5763 -7520 2429 12050 -4124 -15399 1303 12910 -316 -6423 6513 5431
1249 5431 -13160 -10452 13505 15141 -7574 -12369 4007 5531 -7323 -2746 12325 5916 -12038
1262 -12038 -8732 6350 4305 -4099 3227 8694 -6683 -15866 2531 16424 1053 -11705 1190
1275 1190 8241 -7781 -11582 9716 15651 -5827 -13890 2211 6134 -5600 -719 13052 2263
1288 2263 -16289 -5850 13140 4506 -9395 2130 11870 -5826 -16898 3348 17871 1576
1300 1576 -11433 -290 5447 -5818 -5100 10625 9212 -8530 -9309 4857 4099 -5934 852 12047
1314 12047 682 -15670 -6185 12325 7609 -6801 -2929 5967 -2557 -10699 1890 13142 1673
1327 1673 -9879 -1798 4346 -4716 -4701 10683 9767 -10742 -13305 6279 9843 -5420 -4268 10052
1341 10052 3119 -14587 -6668 12916 7929 -7458 -2512 5854 -4579 -10006 6835 14535 -3283
1354 -3283 -12598 1676 7286 -5311 -4884 10953 8580 -10888 -11522 6043 8830 -2669 -1985 5802
1368 5802 -1087 -10904 -1667 11442 4812 -6983 -2546 4154 -3391 -7595 5488 12729 -1987 -13159
1382 -13159 -2177 7837 95 -4289 5588 6124 -8745 -10551 5759 9802 -2850 -4327 5184 -58
1396 -58 -11564 -1741 14339 5709 -11016 -5063 6853 -640 -7636 5319 12218 -3882 -13207 546
1410 546 8706 -1204 -3259 7079 3637 -11002 -7393 9403 8619 -4838 -3974 4752 -778 -8958 534
1425 534 12041 3550 -9257 -4679 4295 234 -3720 4493 7765 -4422 -11050 280 8393 693
1439 693 -3950 3303 3090 -8297 -7411 7811 9936 -3986 -7201 2581 1665 -6873 -324 11497 3482
1454 3482 -11085 -5493 6754 2001 -4944 3861 8487 -5442 -12089 2473 10783 -197 -5207 3671
1468 3671 2685 -8780 -4954 10105 8172 -6134 -6016 3486 722 -5713 2187 10246 535 -10526
1482 -10526 -3691 6131 2111 -2780 3024 4658 -5667 -9023 2789 9231 446 -5146 709 1605
1496 1605 -5975 -3721 8291 7726 -5783 -8200 2031 3370 -3408 384 8201 655 -10848 -4255
1510 -4255 7947 3905 -4187 1173 5011 -5384 -9302 4528 11303 -837 -7542 1056 3100 -5404
1524 -5404 -2553 9433 6186 -7734 -6984 4005 3147 -3223 1998 7359 -2148 -10376 -1195 8539 2724
1539 2724 -4050 754 2954 -5069 -6330 4876 8894 -1255 -6813 -609 1995 -2955 -981 7023
1553 7023 3933 -7337 -6919 3517 4619 -2176 -273 5173 -1296 -9499 -1943 9173 4267 -5245
1567 -5245 -1858 3085 -3185 -5639 5058 9291 -2322 -8333 307 4021 -2635 -1137 7740 3527
1581 3527 -8899 -6354 5958 5447 -2826 -344 4761 -2298 -8491 563 9332 2534 -5336 -1235 2092
1596 2092 -3394 -3339 6028 7008 -3868 -7652 391 3666 -1317 -493 5328 1519 -7876 -5460 5140
1611 5140 5732 -1848 -2095 2092 -1785 -6429 624 8561 2561 -6295 -3012 2556 -1215 -2927 5020
1626 5020 6745 -4288 -8802 1029 6111 -425 -1812 4460 1619 -7796 -4487 7020 6177 -3065 -2591
1641 -2591 2468 -1742 -5523 2721 8884 435 -7309 -1740 3493 -1095 -2081 5218 4999 -5341 -7590
1656 -7590 1911 5696 -39 -1510 2444 -308 -6334 -2403 6255 4564 -3211 -3088 1183 -1334 -4019
1671 -4019 2403 7498 157 -7786 -3045 4037 1329 -2017 2608 3861 -4259 -7043 1835 6512 403
1686 403 -2491 1690 5 -5937 -1618 7873 4909 -5143 -4217 2749 569 -3771 2268 7465 -354
1701 -354 -7916 -2143 4691 1549 -1083 2942 1967 -5650 -5046 4264 5850 -1391 -2706 1815 -342 -5407
1717 -5407 -800 7294 4041 -5089 -4932 1238 1356 -1257 1890 4186 -1673 -6448 -1379 4206 1533
1732 1533 -1280 1738 1361 -5204 -5109 4338 7289 -1044 -5291 -69 1635 -2801 -907 5841 3505 -4966
1748 -4966 -4621 2028 1940 -1023 2536 4383 -3235 -7470 786 7024 1278 -3445 991 2134 -4233 -4088
1764 -4088 4626 6401 -1481 -4569 -350 371 -1784 1676 5412 232 -6146 -2730 3380 1584 -1722
1779 -1722 1574 3418 -2848 -6640 23 6342 2535 -3078 -1784 299 -2131 -1694 3745 4280 -2141
1794 -2141 -4391 104 1264 -1704 723 5442 1044 -6997 -4123 4720 4378 -1780 -1003 2329 -1526
1809 -1526 -4952 840 5999 1528 -3140 -593 419 -3088 -908 6037 4243 -4722 -5302 1951 2988
1824 2988 -1519 -7 4236 350 -5798 -2916 3794 3393 -484 -286 60 -3220 -3137 2944 5267 -400
1840 -400 -4096 -737 1151 -1813 -1291 4162 4002 -3435 -6022 77 3906 1027 -457 1388 -616 -4532
1856 -4532 -1617 4377 3114 -1940 -1112 1249 -2187 -3881 2815 6902 -61 -6109 -1813 2922 291
1871 291 -904 3226 2560 -3865 -4359 1809 3290 -155 427 2223 -2041 -5471 122 6136 2480 -3439
1887 -3439 -1928 1168 -1101 -2217 2413 4557 -530 -4545 -1792 1375 726 775 2547 385 -4383 -3390
1903 -3390 2565 3783 -441 -1534 1006 -438 -3980 -975 5095 3569 -3008 -3593 419 527 -894
1918 -894 2171 3769 -1485 -5054 -520 3295 454 -768 2675 1377 -4776 -3883 3712 5008 -872
1933 -872 -2468 523 -466 -2896 735 4838 1433 -3513 -2028 852 -451 -509 3219 3026 -2917 -4944
1949 -4944 160 3518 1000 -739 804 17 -3339 -2319 2726 3787 -242 -2355 -850 -726 -1544 1166
1965 1166 4177 1062 -4087 -2911 1624 1538 -641 1285 2629 -1896 -4952 -144 4455 1765 -1564
1980 -1564 -16 133 -3049 -1633 4063 3866 -2032 -3128 537 313 -1743 1395 4472 210 -4847 -2171
1996 -2171 2459 1572 -294 1373 1146 -2973 -3487 1465 3763 590 -1424 -243 -727 -2501 -362 3655
2012 3655 2675 -2126 -3236 -349 823 -113 1071 2523 -293 -3931 -2087 2295 2334 -254 6 631
2028 631 -2148 -3148 1410 4455 790 -2777 -945 520 -1396 -483 3637 2739 -2862 -3555 841 1784
2044 1784 -396 936 2749 -961 -4499 -942 3605 1927 -1027 -6 372 -2509 -2216 2530 3739
2059 3739 -415 -2622 -733 -75 -1096 636 3222 1167 -3148 -2967 669 1798 433 535 1006 -1295
2075 -1295 -3342 -764 3012 2290 -830 -1214 -364 -1433 -1390 2154 3660 -331 -3475 -1151 1283 96
2091 96 79 2588 1433 -3195 -3242 1549 2945 189 -188 1024 -1339 -3353 379 4137 1549 -2131 -1052
2108 -1052 375 -1393 -1010 2871 3149 -1606 -3567 -487 1307 293 700 1901 -322 -3367 -1842 1885
2124 1885 2163 42 -341 -60 -1695 -2262 809 3423 1242 -2218 -1988 -33 -31 -106 1821 2137 -1295 -3340
2142 -3340 -669 2003 1082 186 1121 -78 -3044 -1832 2738 3115 -616 -1512 264 -600 -1936 990
2158 990 3842 896 -2975 -1698 857 207 37 2272 1635 -2508 -3169 729 2335 341 -94 934
2174 934 -813 -3089 -828 2924 2243 -959 -1592 -553 -887 -789 1530 2591 -168 -2727 -1638 580
2190 580 714 514 1409 690 -2269 -2808 585 2809 1008 -839 -259 -449 -1926 -596 2842 2577 -1182
2207 -1182 -2305 -225 225 -369 1476 2751 -394 -3411 -1159 2001 1150 -99 1137 681 -2539 -2556
2223 -2556 1677 3165 249 -1287 -303 -720 -1732 447 3036 1267 -2072 -1917 -33 76 30 1675
2239 1675 1698 -1446 -3137 -703 1874 1308 2 103 -348 -1962 -1505 1435 2619 380 -1543 -1057 -474
2256 -474 -667 685 2566 1136 -2227 -2297 536 1278 149 792 1545 -922 -3067 -577 2711 1774 -564
2273 -564 -358 -135 -1683 -1060 2209 2637 -658 -1987 -292 10 -844 833 2774 501 -2947 -2048 1079
2290 1079 1383 220 562 469 -1618 -2283 246 2184 1029 -496 -522 -875 -1660 -263 2316 2039 -1034
2307 -1034 -2373 -695 587 193 601 1591 301 -2258 -1967 831 1956 730 74 -57 -1433 -1855 768
2324 768 2907 939 -1535 -868 157 -834 -485 2235 2400 -1216 -2852 -429 1312 626 682 1250 -602
2341 -602 -2615 -908 1873 1405 -238 34 59 -1762 -1799 1365 2912 368 -2006 -1304 -53 -86 454 1609
2359 1609 819 -1488 -1975 -243 888 726 860 677 -1148 -2458 -599 2209 1940 -528 -1160 -259 -528
2376 -528 -912 870 2390 639 -1898 -1533 155 468 691 1604 677 -2088 -2151 853 1964 232 -248
2393 -248 707 -480 -2321 -630 2510 1979 -794 -1421 -523 -595 -223 1640 1805 -781 -2092 -557 535
2410 535 23 514 1607 236 -2358 -1992 925 2117 643 -540 -568 -912 -1110 249 1838 1170 -719
2427 -719 -1253 -639 -410 174 1675 1779 -826 -2605 -809 1531 1157 31 431 260 -1566 -1700 941
2444 941 2309 619 -783 -566 -860 -1161 782 2623 819 -1983 -1498 461 291 -172 1262 1551 -1075
2461 -1075 -2574 -526 1581 1141 291 112 -831 -1871 -540 1748 1574 -354 -951 -459 -733 -777 949
2478 949 2168 494 -1926 -1757 154 1038 746 709 278 -1126 -1739 -78 1568 1109 -34 -206 -591 -1501
2496 -1501 -565 1948 2159 -534 -1922 -535 391 -89 630 1750 353 -2004 -1468 706 1067 445 757
2513 757 329 -1720 -1923 781 2226 548 -851 -362 -381 -1253 -183 1895 1499 -885 -1652 -640 50
2530 50 359 1171 1145 -702 -2035 -870 938 1069 385 217 -182 -1330 -1349 651 2091 901 -954 -1153
2548 -1153 -448 -244 381 1584 1178 -1026 -1838 -294 835 479 676 1047 -481 -2231 -915 1683 1611
2565 1611 -96 -405 -194 -1139 -1050 1171 2141 164 -1460 -780 -175 -393 567 1820 595 -1815 -1741 253
2583 253 986 476 566 359 -1121 -1776 -145 1556 1159 -163 -623 -749 -992 -248 1348 1606 -131 -1579
2601 -1579 -1040 166 505 680 1079 279 -1445 -1555 359 1530 765 30 -35 -787 -1461 40 2031 1333
2619 1333 -802 -1064 -213 -393 -208 1364 1642 -574 -1910 -651 630 417 536 1044 -227 -1975 -1142
2636 -1142 1062 1372 124 -197 -207 -1066 -1156 547 1785 644 -931 -1070 -580 -243 482 1348 771 -942
2654 -942 -1586 -422 745 792 518 408 -415 -1458 -875 1053 1744 388 -780 -637 -498 -443 672 1762
2672 1762 646 -1256 -1240 69 342 349 1198 923 -1158 -1987 -16 1509 788 -27 115 -527 -1489 -488
2690 -488 1501 1363 -311 -877 -590 -768 -390 1181 1578 -268 -1723 -950 260 468 522 795 68 -1294
2708 -1294 -1350 188 1290 911 52 -500 -914 -898 250 1490 1142 -428 -1164 -540 56 214 875 1289 -13
2727 -13 -1620 -1109 729 1194 500 284 -32 -1136 -1176 682 1688 498 -580 -389 -522 -940 192 1786
2745 1786 1008 -1143 -1432 -181 227 210 855 813 -778 -1678 -510 790 743 392 242 -605 -1456 -654 1063
2764 1063 1379 146 -769 -713 -502 -257 572 1259 549 -911 -1296 -298 642 816 747 298 -773 -1349 -254
2783 -254 1263 1164 65 -292 -362 -862 -547 1092 1720 121 -1296 -744 13 81 564 1268 285 -1432 -1227
2802 -1227 288 768 410 552 244 -1176 -1535 220 1520 721 -423 -533 -620 -847 -18 1253 1027 -426
2820 -426 -1157 -700 -113 376 934 861 -382 -1376 -799 518 997 559 96 -254 -830 -854 334 1472 924
2839 924 -497 -974 -452 -97 342 1117 916 -562 -1362 -407 587 522 503 678 -271 -1542 -815 1045 1276
2858 1276 133 -358 -296 -801 -745 672 1406 302 -912 -752 -383 -272 461 1245 429 -1171 -1280 -37
2876 -37 637 456 440 223 -684 -1198 -335 929 1067 238 -471 -751 -699 -57 900 1117 109 -938 -811 -40
2896 -40 302 527 854 375 -910 -1306 3 1202 835 61 -199 -549 -917 -118 1171 1047 -253 -703 -433
2915 -433 -468 -190 1014 1306 -294 -1493 -722 402 470 428 619 -71 -1195 -955 374 953 482 87 -312
2934 -312 -980 -831 492 1308 558 -615 -847 -396 -109 289 868 714 -361 -1131 -681 389 894 672 139
2953 139 -491 -941 -502 695 1097 322 -396 -456 -411 -466 345 1295 724 -847 -1182 -182 442 444 648 447 -682
2974 -682 -1169 -207 756 566 216 201 -441 -1221 -504 1094 1172 -102 -769 -506 -353 -163 596 979 81 -868
2994 -868 -797 -200 267 640 749 16 -1020 -989 144 947 666 -4 -276 -472 -574 -113 797 996 72 -810
3014 -810 -774 -138 340 738 743 -78 -1023 -758 327 711 343 289 105 -768 -1077 177 1292 706 -352 -588
3034 -588 -491 -481 162 1024 683 -547 -872 -291 -68 164 765 780 -448 -1290 -536 611 764 367 66 -406
3054 -406 -821 -458 511 886 394 -300 -602 -631 -198 557 1013 398 -684 -974 -256 456 560 420 211 -378
3074 -378 -905 -430 631 955 315 -298 -508 -603 -249 703 1069 94 -855 -587 -60 -25 321 838 348 -889
3094 -889 -1049 4 639 448 338 53 -721 -946 31 905 539 -103 -286 -463 -661 -70 876 867 -144 -817
3114 -817 -581 -92 339 635 547 -158 -799 -613 111 620 605 211 -211 -663 -612 172 962 735 -218 -683 -415
3135 -415 -133 200 674 696 -164 -923 -521 256 492 451 411 -200 -993 -668 520 874 245 -197 -308 -603 -568
3156 -568 337 998 376 -531 -627 -368 -173 351 841 381 -644 -894 -226 365 471 465 151 -484 -822 -260 578
3177 578 784 314 -248 -570 -503 -41 591 803 236 -555 -684 -136 320 487 522 228 -523 -868 -130 708 683
3198 683 160 -180 -441 -655 -154 756 787 -109 -579 -398 -281 -120 551 801 -50 -913 -625 107 328 405 430
3219 430 -98 -811 -669 203 635 359 80 -190 -607 -597 181 822 530 -188 -533 -438 -79 317 610 452 -168
3240 -168 -638 -456 171 557 544 219 -258 -634 -463 320 847 450 -253 -419 -300 -239 158 708 543 -362 -772
3261 -772 -321 146 302 517 339 -461 -936 -297 494 447 149 49 -309 -744 -409 510 775 133 -386 -482 -427
3282 -427 -102 526 699 81 -555 -545 -155 175 458 551 141 -532 -668 -70 574 658 203 -280 -484 -371 58
3303 58 515 686 151 -444 -511 -165 186 504 587 74 -700 -677 117 540 354 122 -48 -488 -650 9 711
3324 711 490 -113 -365 -425 -451 65 702 526 -338 -673 -302 -15 139 464 457 -202 -735 -411 226 522 404
3345 404 129 -300 -594 -292 353 650 354 -84 -372 -383 -133 310 661 415 -246 -667 -367 270 501 366
3365 366 108 -223 -561 -360 325 617 260 -150 -323 -460 -309 387 757 199 -543 -502 -153 -18 215 540
3385 540 252 -533 -714 -134 297 357 322 44 -534 -685 -57 593 479 58 -173 -352 -443 -20 596 607 66
3406 66 -449 -491 -167 267 524 424 -72 -504 -443 1 435 484 221 -148 -445 -422 38 600 584 -52 -484 -375
3428 -375 -91 119 419 502 -76 -630 -455 111 324 320 261 -166 -702 -512 297 589 215 -123 -180 -393 -380 191
3450 191 655 331 -264 -462 -325 -106 279 568 253 -369 -522 -176 193 342 411 189 -283 -566 -237 322
3470 322 577 293 -158 -424 -334 10 315 487 236 -252 -506 -238 129 353 404 180 -339 -661 -185 399 447
3491 447 100 -108 -254 -422 -182 389 598 71 -327 -369 -288 -50 429 554 -13 -550 -399 19 203 274 374
3512 374 43 -496 -533 29 456 436 157 -205 -485 -338 165 520 359 -58 -318 -320 -175 191 463 371 -63 -499
3534 -499 -439 75 463 401 66 -218 -386 -303 102 471 353 -85 -324 -336 -226 156 553 384 -284 -570 -241
3555 -241 136 173 308 259 -191 -578 -285 247 393 254 58 -270 -551 -222 396 524 88 -242 -244 -289 -86 293
3577 293 497 187 -296 -456 -199 142 422 360 11 -359 -417 -64 265 398 195 -81 -322 -321 -103 329 520
3598 520 150 -382 -454 -128 145 318 326 59 -392 -433 -46 304 280 175 29 -365 -504 -9 534 415 -62 -251
3620 -251 -270 -258 -1 454 420 -83 -379 -298 -123 141 419 363 -131 -545 -309 110 303 276 145 -132 -406 -278
3642 -278 141 430 354 -1 -357 -386 -95 254 418 250 -132 -411 -280 82 306 278 144 -115 -448 -304 208
3663 208 486 236 -125 -254 -275 -178 234 465 180 -282 -356 -188 -23 176 403 225 -346 -485 -135 231 250
3684 250 212 84 -278 -428 -104 331 365 126 -75 -253 -333 -36 371 454 38 -290 -345 -123 151 336 295 7
3706 7 -273 -364 -78 263 372 191 -140 -327 -296 -42 357 415 35 -327 -294 -135 40 260 368 19 -436 -387
3728 -387 3 236 241 191 -39 -423 -386 90 368 220 1 -132 -301 -308 74 468 286 -123 -302 -239 -92 176
3750 176 411 263 -202 -387 -198 98 261 351 154 -176 -347 -173 182 401 301 -56 -286 -287 -68 202 384
3771 384 227 -164 -360 -213 70 264 278 146 -205 -455 -237 233 350 132 -58 -214 -319 -187 235 422
3791 422 97 -253 -260 -191 -60 272 414 70 -363 -330 -26 134 215 280 50 -286 -342 -27 278 313 156 -65 -297
3814 -297 -237 97 378 324 55 -199 -249 -107 150 289 261 8 -293 -332 -24 303 298 93 -145 -282 -273 6 315
3837 315 277 -28 -245 -235 -201 13 306 311 -93 -413 -250 3 134 227 191 -121 -383 -257 135 249 214 122 -130
3860 -130 -377 -217 222 419 171 -92 -222 -191 -56 192 368 189 -128 -251 -181 50 296 323 89 -212 -300
3881 -300 -123 184 325 196 -51 -211 -250 -112 163 346 191 -209 -385 -203 54 212 261 43 -291 -385 -103
3902 -103 161 218 117 19 -213 -378 -129 310 330 29 -166 -209 -171 -11 279 336 -6 -206 -214 -70 87 305 286
3925 286 -27 -299 -218 46 253 269 142 -88 -251 -170 70 286 270 29 -186 -297 -126 128 297 223 -40 -273
3947 -273 -271 19 188 206 81 -86 -295 -306 15 298 228 -59 -217 -254 -173 90 335 200 -143 -259 -152 -55 126
3970 126 293 215 -171 -347 -173 104 225 229 97 -166 -276 -81 205 268 182 -16 -176 -253 -54 240 345 109
3992 109 -165 -275 -156 77 245 203 52 -163 -291 -124 138 286 159 -69 -241 -236 -70 203 297 44 -205
4013 -205 -259 -129 5 172 279 74 -269 -328 -63 139 203 167 -22 -248 -281 14 258 199 68 -59 -199 -224
4035 -224 37 335 281 -34 -191 -189 -101 122 274 182 -63 -237 -164 -2 176 248 145 -112 -292 -174 68 249
4057 249 210 -34 -204 -226 -56 105 213 204 -47 -271 -245 13 170 203 124 -123 -289 -200 116 230 154 3 -88
4080 -88 -227 -181 130 310 142 -88 -199 -181 -34 180 310 112 -170 -200 -79 53 165 248 74 -193 -257 -57
4102 -57 179 218 152 -53 -237 -203 -24 179 232 71 -101 -251 -157 54 223 218 24 -188 -280 -76 193 201 75 -87
4126 -87 -183 -202 -68 207 255 53 -176 -201 -149 13 242 253 -4 -247 -198 -14 77 191 199 -6 -280 -222 31 211
4150 211 190 98 -75 -240 -164 99 235 130 -26 -109 -182 -114 105 251 154 -81 -227 -153 23 173 181 56 -115
4173 -115 -196 -124 58 203 181 3 -175 -215 -88 110 230 164 -102 -253 -130 27 76 180 123 -117 -267 -112
4195 -112 117 179 151 46 -144 -230 -76 175 233 55 -81 -161 -138 -53 167 264 61 -173 -210 -91 43 193 204
4218 204 1 -193 -188 -18 98 177 146 -46 -193 -181 -15 193 225 94 -145 -221 -94 75 148 174 22 -172 -215
4241 -215 -66 111 169 118 -24 -202 -208 -9 228 171 7 -127 -180 -137 -1 219 174 -31 -192 -134 -38 79 214
4264 214 174 -74 -251 -138 56 165 147 103 -90 -204 -108 81 191 148 11 -147 -191 -51 148 202 100 -61
4286 -61 -165 -138 12 154 151 69 -93 -199 -131 76 192 124 -7 -154 -164 -72 89 194 101 -119 -167 -114 -52 95
4310 95 180 93 -155 -225 -62 73 138 109 0 -169 -210 -35 146 141 72 -26 -138 -162 0 207 197 60 -115 -148 -64
4335 -64 38 217 155 -16 -143 -144 -38 107 210 129 -74 -172 -140 -8 139 175 38 -113 -165 -64 25 132 165 8
4359 8 -180 -213 -44 118 149 102 -67 -223 -156 39 151 112 30 -84 -168 -144 48 213 134 -54 -120 -128 -34 105 208
4384 208 117 -82 -143 -70 40 100 180 92 -108 -193 -82 80 164 112 3 -130 -144 -22 112 134 91 -82 -166 -130 -13
4409 -13 112 114 31 -127 -195 -99 80 141 68 -24 -123 -172 -72 75 152 81 -69 -145 -107 -34 114 205 37 -120 -140 -17
4435 -17 44 128 149 45 -133 -153 -9 128 145 85 6 -140 -127 56 169 129 22 -61 -137 -88 37 144 134 -11 -136
4460 -136 -136 -52 87 145 70 -89 -117 -130 -6 115 130 26 -110 -174 -85 8 127 123 -31 -166 -147 -28 79 124 106
4485 106 -15 -164 -108 68 118 138 56 -49 -176 -102 82 199 85 0 -43 -89 -53 99 177 77 -26 -101 -78 -5
4509 -5 106 137 35 -110 -140 -82 52 95 84 -27 -116 -140 -69 34 131 63 -78 -165 -112 20 96 81 30 -97 -132 -74
4535 -74 58 117 95 26 -95 -155 -44 130 142 54 -13 -73 -68 -6 128 146 47 -40 -87 -39 18 134 132 19 -130 -95 10
4562 10 94 103 66 -14 -126 -99 25 97 108 42 -79 -142 -87 48 120 94 -36 -96 -120 -53 38 88 35 -27 -131 -118 -3
4589 -3 106 108 20 -81 -122 -81 43 134 95 -10 -84 -81 -36 38 135 109 -36 -138 -33 19 76 97 63 -48 -116 -82 46
4616 46 95 96 16 -59 -103 -46 107 131 51 -51 -70 -95 -5 64 124 38 -68 -84 -73 22 113 79 -26 -97 -108 -27 66 92 59
4645 59 -34 -108 -76 0 60 107 57 -80 -127 -49 47 90 81 23 -76 -92 -29 65 98 57 -5 -68 -108 0 100 94 -7 -39 -89
4674 -89 -51 2 109 95 22 -74 -101 -28 60 96 81 -38 -121 -84 9 82 87 34 -74 -120 -78 15 90 87 38 -84 -129 -26 61
4703 61 94 54 0 -95 -82 13 81 93 42 -15 -119 -101 31 105 81 1 -68 -71 -35 55 129 69 -35 -93 -69 -5 57 96 66
4732 66 -60 -109 -66 64 69 62 -12 -65 -127 -46 67 82 69 -14 -70 -108 -17 88 105 41 -39 -100 -68 17 95 78 24 -34 -91
4761 -91 -36 47 107 59 -34 -61 -58 -25 82 124 45 -62 -85 -9 -3 75 90 48 -54 -83 -14 56 72 45 11 -95 -96 4 82
4790 82 68 21 -43 -75 -82 30 85 67 -4 -79 -85 -39 35 77 70 -12 -91 -69 -20 50 89 46 -33 -71 -47 9 78 122 2 -51 -91
4821 -91 -45 42 79 88 -2 -90 -106 -4 56 93 34 -32 -68 -76 29 92 73 4 -40 -73 -65 39 119 58 -28 -77 -73 -26 73 106 39
4852 39 -37 -75 -55 16 69 82 10 -48 -79 -32 45 91 85 -3 -80 -81 -17 67 67 35 -47 -73 -40 -3 50 51 5 -54 -77 -41 37 62
4884 62 45 -15 -53 -92 -36 58 103 26 -44 -73 -59 12 60 93 15 -61 -87 -42 41 60 76 8 -56 -75 5 56 72 50 -9 -77
4914 -77 -71 23 74 56 14 -46 -77 -41 17 68 65 4 -72 -92 -53 49 94 12 -10 -66 -64 -10 46 92 4 -76 -58 -18 22 101 91
4945 91 -23 -97 -75 28 74 74 52 -5 -84 -40 54 63 61 45 -34 -94 -36 69 97 30 -20 -36 -46 -21 61 97 49 -30 -94 -60
4975 -60 -22 82 78 14 -63 -114 -25 40 67 42 -28 -78 -88 -30 23 63 49 -25 -101 -57 30 39 67 -2 -47 -94 -24 46 94 66 28
5006 28 -70 -82 -20 82 108 52 -7 -55 -53 23 72 99 24 -41 -45 -2 57 85 93 2 -76 -57 0 56 71 34 -35 -80 -59 -2 65
5037 65 63 1 -43 -121 -53 -7 61 35 -5 -80 -94 -16 61 58 26 -27 -72 -103 -9 57 104 22 -51 -43 -37 51 106 78 12 -42 -36 1 50
5070 50 87 78 -4 -71 -46 15 45 91 63 -34 -106 -40 58 84 60 5 -55 -102 -30 58 83 5 -63 -81 -72 6 62 67 11 -52 -70 -46
5102 -46 10 62 53 -21 -86 -53 -29 40 81 42 -19 -57 -38 14 70 83 40 -50 -86 -14 52 97 97 25 -30 -81 21 92 84 27 -25
5133 -25 -47 -72 4 89 85 4 -34 -63 -45 -15 70 48 -7 -66 -69 -6 24 66 64 -30 -106 -74 12 27 54 9 -45 -70 -31 40 101 62
5165 62 6 -81 -62 -18 59 87 65 -17 -69 -30 16 79 84 37 -3 -52 -45 30 104 82 6 -70 -37 -44 36 92 63 -51 -79 -41 -4
5196 -4 40 70 35 -69 -96 -44 35 55 45 2 -57 -110 -25 62 78 53 -20 -79 -60 -31 70 73 15 -45 -81 -1 33 96 64 0
5226 0 -68 -69 -8 93 105 52 -35 -44 -49 3 80 64 37 -44 -64 -16 39 55 50 1 -58 -72 -22 48 33 16 -38 -58 -104 8 82 45
5258 45 8 -34 -56 -57 43 64 46 -10 -53 -49 -10 56 92 49 -24 -39 -25 15 61 89 31 -42 -71 -36 32 100 101 6 -64 -65 6 58
5290 58 72 37 -5 -71 -52 21 78 48 39 -34 -77 -71 25 87 44 -19 -67 -65 -53 43 85 20 -51 -68 -49 -5 60 83 5 -83 -73 -38
5322 -38 31 75 51 -3 -45 -62 -3 77 84 50 -18 -88 -51 21 95 70 4 -32 -56 -26 39 95 40 5 -44 -79 8 51 101 30 -36
5353 -36 -54 -82 -18 72 76 4 -84 -54 -41 47 51 95 1 -80 -79 -17 45 67 47 -19 -69 -60 34 75 63 9 -29 -73 -39 61 60 47
5385 47 -10 -61 -72 -11 59 92 23 -42 -48 -57 20 83 68 21 -51 -63 -26 39 121 55 12 -73 -67 -18 31 92 39 -56 -124 -59 12 61
5417 61 45 28 -38 -87 -31 32 91 39 17 -57 -91 -38 63 98 18 -47 -60 -54 14 62 69 -1 -66 -69 -58 2 48 60 -26 -53 -79
5448 -79 -10 38 65 51 -55 -64 -48 9 55 50 11 -40 -105 -38 25 71 63 16 -73 -82 4 47 73 36 -4 -50 -84 10 93 90 6 -50
5480 -50 -69 -43 38 58 52 -8 -66 -61 -2 45 67 31 -14 -71 -59 20 79 50 10 -69 -98 -54 15 44 48 -31 -71 -78 -19 49 54 25 -1
5513 -1 -65 -59 24 80 47 18 -34 -62 -34 34 103 56 0 -69 -55 -4 52 100 21 -50 -92 -35 19 56 88 38 -42 -89 -38 20 86
5544 86 27 0 -88 -85 -48 38 47 25 -19 -90 -66 7 71 62 5 -66 -47 -44 21 62 65 -3 -68 -82 -42 28 78 19 -43 -83 -64 42
5576 42 68 81 11 -63 -52 -28 48 94 57 11 -52 -68 12 51 80 61 -21 -74 -51 31 86 66 -31 -48 -90 -24 17 69 68 -40
5606 -40 -66 -79 -43 16 85 31 -44 -94 -55 -3 52 51 -9 -44 -78 -45 27 81 44 -11 -76 -58 16 53 83 44 -4 -56 -15 25 65
5637 65 83 33 -30 -72 -16 59 124 81 -36 -41 -61 -28 42 90 37 -14 -66 -36 -4 51 83 18 -76 -83 -13 49 56 33 -4 -78 -92
5668 -92 -26 51 40 43 -33 -72 -64 2 83 70 -4 -8 -42 -39 46 91 78 -1 -44 -55 -20 70 65 33 -10 -59 -6 15 90 85 -14 -24 -37
5701 -37 -14 37 98 89 -17 -60 -39 -15 54 81 43 -30 -71 -60 -1 42 45 -17 -44 -101 -74 33 68 15 -32 -79 -74 -35 59 67 35
5732 35 -33 -64 -46 -4 91 85 31 -23 -40 -21 49 88 75 25 -55 -68 19 53 88 53 -5 -70 -61 41 67 52 22 -50 -90 -33 38
5763 38 61 53 1 -64 -69 -18 62 93 10 -63 -82 -68 -32 40 45 -8 -86 -67 -29 -3 65 55 -23 -96 -57 -14 48 60 53 -13 -74 -37
5795 -37 26 89 65 12 -45 -84 -14 49 65 47 -17 -58 -67 5 69 81 44 -42 -67 -74 -22 40 79 15 -59 -91 -52 13 80 51 -42
5826 -42 -112 -74 -1 25 69 34 -53 -110 -46 13 46 62 14 -34 -81 -33 32 56 47 -1 -54 -73 -19 51 78 47 -18 -67 -34 44 60
5857 60 75 10 -38 -43 -26 32 69 48 -21 -68 -57 -19 44 105 23 -30 -81 -44 -1 55 47 15 -57 -75 -24 37 47 51 -7 -70 -84 -16
5889 -16 57 72 7 -19 -71 -75 1 53 64 -8 -52 -79 -55 36 69 52 0 -74 -26 -8 58 82 29 -22 -68 -47 24 70 79 13 -68
5920 -68 -66 -32 29 67 50 2 -77 -81 -3 68 61 38 -36 -99 -81 17 66 18 14 -25 -65 -47 41 95 46 -25 -36 -54 -18 24 62 31
5952 31 -53 -61 -55 29 63 68 15 -41 -59 -11 31 71 39 -2 -75 -77 9 73 44 -1 -49 -52 -41 33 62 47 9 -42 -60 -39 20 41 55
5985 55 -21 -68 -48 -30 49 72 13 -52 -60 -36 11 46 56 -5 -71 -74 -20 47 51 42 -7 -61 -51 23 48 70 33 -16 -74 -66 17 84 51
6018 51 -18 -66 -81 -44 54 76 52 -1 -48 -50 -5 41 85 43 -43 -66 -38 13 71 77 7 -41 -37 -13 37 85 54 8 -67 -72 8 61
6050 61 50 34 -6 -77 -48 42 78 49 7 -40 -72 -33 29 46 29 -20 -60 -46 -32 52 75 17 -57 -69 -48 -3 53 48 -4 -64 -61
6081 -61 -14 39 55 50 -2 -52 -50 20 62 59 44 -25 -60 -57 25 97 77 -4 -27 -67 -16 51 46 39 -18 -59 -38 -3 85 79 -2 -33 -65 -61
6115 -61 1 56 48 -7 -75 -67 -15 -2 63 68 -36 -69 -73 2 16 60 21 -50 -72 -36 18 58 69 -8 -29 -75 -51 48 85 35 14 -54
6147 -54 -44 2 80 87 53 -13 -58 -42 28 106 67 18 -55 -43 -18 53 65 74 -13 -69 -56 -14 25 49 29 -48 -79 -58 16 40 52
6178 52 10 -74 -64 -33 18 60 4 -30 -57 -62 -21 39 59 -3 -25 -56 -28 7 76 61 -24 -73 -59 16 11 71 54 -12 -61 -34 23
6209 23 63 86 35 -41 -44 -56 2 78 70 17 -56 -42 -24 59 71 47 -19 -95 -51 -14 40 56 28 -36 -56 -55 -19 52 49 -21 -75 -79 -23
6242 -23 9 51 40 -54 -72 -43 -25 38 41 30 -15 -75 -24 40 58 95 28 -17 -56 0 55 74 58 -2 -52 -36 25 84 68 32 -17
6273 -17 -73 -61 32 90 60 -7 -44 -49 -24 69 52 30 -36 -61 -65 -15 41 29 18 -58 -80 -34 -10 82 48 25 -61 -83 -37 38 36 29
6305 29 -25 -71 -68 9 68 77 41 -22 -57 -35 41 74 61 3 -14 -43 4 62 97 41 8 -76 -49 -4 59 75 33 -52 -55 -11 25 36
6337 36 27 -11 -61 -87 -27 23 38 41 -9 -97 -49 4 50 42 24 -39 -62 -67 30 59 32 -5 -52 -43 -45 49 81 42 -13 -52 -50 16 54 90
6371 90 44 -55 -56 -21 45 74 69 15 -69 -58 -30 59 40 25 -37 -66 -49 -8 35 54 -20 -58 -77 -62 15 54 39 -6 -58 -71 -39
6402 -39 49 85 24 -46 -57 -42 -3 45 99 -29 -79 -56 -24 37 76 92 -1 -76 -37 35 48 46 45 -26 -54 -46 8 89 56 21 -29
6433 -29 -31 -35 44 57 50 17 -40 -65 -15 66 68 14 -20 -55 -68 -4 46 73 -7 -64 -63 -3 15 48 64 -25 -71 -56 -17 2 50 42 -27
6466 -27 -86 -38 19 53 65 11 -33 -69 -16 64 73 44 -2 -56 -67 -13 60 94 30 -25 -62 -61 -7 67 82 9 -53 -46 -62 3 49 28
6498 28 -17 -70 -47 -26 45 66 43 -42 -83 -60 5 40 45 21 -54 -72 -39 29 62 36 17 -69 -43 7 55 42 11 -29 -50 -73 -11
6529 -11 61 50 2 -59 -32 -16 30 82 79 -10 -42 -36 6 38 84 47 -32 -59 -65 16 59 53 11 -49 -47 -29 53 78 38 -7 -44 -48 -5
6562 -5 51 48 20 -15 -70 -74 9 64 50 -9 -51 -46 -39 11 55 34 -23 -54 -65 0 22 65 41 -23 -53 -42 21 50 22 29 -34 -79 -26
6595 -26 17 63 32 -2 -50 -62 -12 65 70 34 4 -56 -56 28 61 53 4 -29 -74 -20 35 69 30 5 -41 -49 18 44 62 43 -38 -68
6627 -68 -51 10 65 63 12 -51 -34 -7 35 41 37 -18 -65 -62 -21 33 39 14 -35 -54 -58 34 83 44 -19 -56 -74 -11 13 79 60 -28 -62
6660 -62 -32 1 56 67 46 -30 -57 -10 25 55 53 13 -26 -64 1 40 80 68 -1 -86 -59 19 24 63 48 -34 -61 -42 21 63 38
6691 38 -24 -70 -85 -38 30 72 43 -22 -59 -73 -38 49 68 8 -34 -71 -22 12 33 64 0 -50 -74 -1 38 40 53 1 -76 -40 18
6722 18 74 72 38 -27 -65 -35 15 39 36 -4 -41 -47 -39 47 53 59 2 -54 -40 -6 56 42 6 -48 -41 -33 -15 56 57 -32 -74 -74 -3 18 33
6757 33 33 -47 -77 -43 2 38 34 20 -41 -83 -37 16 103 67 -5 -49 -43 -9 59 52 59 -11 -52 -30 -1 59 57 44 -29 -51 -24 8 61
6790 61 25 -25 -61 -53 -8 38 58 33 -26 -80 -53 7 20 45 8 -54 -59 -27 43 44 26 -5 -35 -91 -43 22 58 3 -12 -41 -38 2
6822 2 52 71 10 -41 -41 -14 25 43 60 -12 -61 -51 -24 35 91 50 -6 -68 -53 67 39 50 11 -16 -27 -31 38 52 43 -2 -44 -43
6854 -43 -14 50 27 12 -42 -57 -63 -15 28 12 -10 -64 -54 -36 11 36 37 -1 -48 -49 -22 32 66 53 -27 -54 -34 -27 40 47 32 -35 -46
6887 -46 12 16 66 38 -1 -35 -44 12 29 76 44 -26 -57 -39 9 53 37 5 -48 -72 -47 3 46 17 -23 -70 -82 -32 15 50 -2
6918 -2 -60 -74 -48 2 8 37 15 -41 -75 -30 2 65 32 -6 -68 -71 -32 36 47 7 -20 -41 -63 22 59 67 15 -21 -46 -28 33 39 46
6951 46 -15 -41 -42 0 51 68 12 -49 -79 -34 -8 25 65 0 -64 -52 -53 12 17 40 3 -90 -55 -33 -4 46 -1 -9 -67 -65 11 31 23
6984 23 18 -48 -40 -44 33 60 6 13 -26 -28 -4 36 78 70 -25 -64 -19 -14 67 47 6 -76 -56 -3 3 57 27 -21 -65 -25 -5 23 62 21
7018 21 -26 -57 -51 4 31 26 -2 -42 -62 -27 28 37 21 -12 -36 -30 -29 19 37 -15 -32 -66 -28 -5 38 51 15 -48 -51 5 7 47 63 -6
7052 -6 -38 -37 -2 42 62 27 -3 -62 -43 18 31 7 -20 -41 -58 -12 36 50 37 -1 -41 -37 6 15 32 2 -36 -29 -39 -36 51 39 1
7085 1 -40 -69 -24 16 48 5 -27 -55 -53 -18 21 44 34 -19 -63 -34 -6 30 32 17 -25 -62 -15 33 42 24 -19 -56 -36 -14 35 36 -1
7118 -1 -27 -50 -21 7 55 47 2 -19 -43 -11 19 63 47 -20 -75 -56 21 28 59 -2 -14 -52 -30 -1 50 32 -3 -55 -93 -33 42 32
7150 32 20 1 -39 -43 -18 22 37 5 -7 -49 -33 28 52 20 13 -31 -47 -20 23 53 25 3 -72 -28 -2 35 35 35 -21 -43 -27 17
7182 17 58 41 10 -16 -50 -29 21 48 36 -9 -28 -33 -1 47 55 8 -24 -44 -34 2 21 46 -10 -29 -46 -27 19 29 14 -23 -55
7213 -55 -49 -4 8 43 8 -33 -49 -11 1 55 45 9 -43 -54 -17 60 58 42 20 -52 -56 8 62 56 -7 -15 -30 -47 17 66 38 -20 -35
7246 -35 -27 -23 27 81 43 -21 -64 -42 11 55 62 7 -61 -60 -16 26 44 22 -23 -58 -48 -18 11 6 16 -26 -40 -73 -17 31 25 0 -24
7279 -24 -61 -41 16 55 37 4 -33 -46 -6 45 39 43 -10 -38 -11 25 27 57 12 -23 -56 -20 25 62 39 25 -22 -41 0 13 49 19
7311 19 -12 -66 -53 -3 31 32 27 -22 -63 -24 7 39 39 -20 -59 -49 -42 3 36 4 -30 -34 -57 -10 50 41 28 -44 -63 -17 -9 54 55 17
7345 17 -28 -50 -15 25 53 48 -5 -44 -32 25 34 54 22 -4 -69 -26 18 39 37 0 -56 -46 -35 27 53 23 -17 -52 -48 -25 48 55 -14
7378 -14 -48 -45 -41 10 -10 22 -47 -92 -39 2 19 47 29 -39 -67 -16 29 9 44 12 -15 -67 -19 24 50 26 37 -45 -15 -19 61 61
7410 61 37 -3 -40 -27 -8 51 54 36 -38 -63 5 15 30 26 14 -28 -41 -4 3 42 3 -39 -58 -40 -35 27 24 -24 -33 -74 -24 0 36
7443 36 8 13 -33 -70 -17 29 66 19 16 -43 -25 7 73 50 9 -25 -18 -2 20 42 50 6 -24 -25 15 44 57 30 -29 -54 -18 -3 13
7476 13 24 13 -43 -70 -31 13 20 10 2 -49 -82 -14 37 22 17 -46 -44 -74 -4 6 21 5 -26 -58 -15 -1 29 34 -7 -18 -42 19 29
7509 29 57 31 9 -32 -17 44 38 66 20 -24 -42 8 28 51 43 9 -32 -40 -30 29 21 14 -23 -48 -44 -12 28 28 -10 -42 -60 -43 -9 47
7543 47 14 -10 -34 -58 -16 17 17 31 -7 -38 -41 -7 39 27 24 -15 -34 -4 20 51 41 -9 -36 -30 -5 36 40 34 16 -42 -41 1 31 62
7577 62 32 -16 -41 -18 -3 68 22 -5 -14 -52 -7 21 12 7 -50 -48 -34 -31 31 29 -9 -48 -53 -22 -7 14 1 -35 -64 -55 12 7 43 20 -7
7612 -7 -44 -26 15 43 59 -10 -13 -21 -28 -5 38 45 -12 -27 -6 8 41 34 50 -4 -50 -24 -1 37 44 5 -36 -47 9 20 19 28 -16 -16 -29
7647 -29 -7 42 8 35 -27 -54 -41 -11 39 25 -13 -41 -52 -37 25 58 18 -20 -43 -54 -20 22 40 27 -27 -51 -29 -1 18 14 -4
7678 -4 -34 -41 -16 9 37 46 -22 -30 -58 -10 -3 54 39 -16 -54 -38 -1 57 23 20 -24 -37 1 -5 52 3 13 -29 -20 -20 22 51 29 -8 -33
7713 -33 -30 1 51 32 14 -32 -17 -11 19 47 26 -7 -45 -54 11 42 29 3 -27 -51 -27 29 19 4 -27 -28 -53 -21 14 41 24 -32
7745 -32 -33 -16 -3 29 48 15 -24 -35 -25 6 48 21 0 -14 -18 -4 11 34 36 -7 -27 -12 14 39 52 12 -39 -36 -26 9 28 22 6
7778 6 -20 -45 -27 24 28 7 -30 -22 -23 -28 22 28 9 -46 -48 -18 2 20 34 3 -35 -32 -12 8 27 36 -21 -35 -42 19 35 45 23 -3 -35
7813 -35 -4 11 28 38 5 -33 -50 -28 35 61 1 7 -27 -24 -25 20 32 3 -26 -36 -37 3 41 24 -19 -13 -40 -29 14 48 32 -28 -39
7846 -39 -57 -31 20 46 22 -46 -18 -16 35 22 35 7 -25 -29 7 46 49 39 6 -22 -22 14 60 61 22 5 -29 -25 3 36 52 10 -32
7879 -32 -7 6 16 66 13 -14 -19 -28 -9 30 25 27 -39 -60 -24 -17 28 20 -11 -32 -49 -34 6 17 17 -39 -58 -40 -7 43 39 14 -34 -39 -24
7914 -24 38 28 6 0 -6 -16 -7 37 53 42 21 -22 -2 5 42 29 30 -12 -15 -16 -12 8 24 32 -29 -59 -3 38 45 26 -20 -14 -38 -30 28 46
7950 46 -12 -21 -41 -29 -15 23 7 -3 -28 -23 -1 5 42 11 -27 -31 -8 -13 44 34 19 2 -41 4 29 45 36 11 -22 -35 12 28 48
7983 48 26 -6 -35 -18 15 23 29 8 -15 -37 -46 17 40 17 -9 -40 -63 -22 -19 12 1 -26 -24 -19 -11 20 26 6 -32 7 -34 -20 27 20 0
8018 0 -46 -49 -12 31 34 26 -20 -52 -38 10 43 43 19 -6 -22 5 9 55 39 -16 -2 -34 -24 55 20 47 -7 -35 -26 -13 16 24 -2 -35
8052 -35 -51 -36 25 33 4 -19 -46 -65 -7 -1 40 26 -32 -43 -14 -28 51 47 -9 -47 -38 -29 50 16 41 -22 13 -8 -9 51 43 28 -15 -12
8086 -12 -7 14 48 41 7 -28 -25 -18 13 36 49 21 -31 -14 0 3 21 37 -29 -54 -12 -1 -4 22 -16 -22 -48 -23 -13 9 -6 -15 -33 -33 -15
8121 -15 12 24 14 -28 -27 -22 0 44 20 3 -22 -31 -33 35 45 52 -1 -35 -10 -11 46 46 52 -15 -32 17 -2 26 32 23 -18 -42 -32 6 6 21
8157 21 -7 -25 -35 3 16 40 0 -11 -40 -36 28 -2 15 1 -19 -26 -43 1 56 2 -27 -56 -36 -18 38 37 45 -30 -48 -16 4 29
8189 29 26 7
8191G
$$ Imaginary data points
##PAGE= N=2
##DATA TABLE= (X++(I..I)), XYDATA
0 0 0 0 0 0 0 0 0 0 0 0 0 0 8 -8 8 -8 12 -16 16 -17 24 -32 32 -40 48 -56 64 -76 89 -103 116 -132 155 -174
34 -174 197 -222 253 -284 317 -354 397 -442 491 -544 603 -668 737 -812 897 -989 1090 -1197
52 -1197 1320 -1456 1604 -1771 1957 -2171 2412 -2691 3017 -3403 3868 -4437 5151 -6069 7246
67 7246 -8650 9146 8561 651200 274132 -642245 -134493 576943 11191 -614009 75012
78 75012 610821 -88319 -557074 128445 440980 -230984 -393132 341648 403068 -374862
88 -374862 -425369 336215 368375 -307404 -276630 340683 215776 -388474 -217955 383846 210590
99 210590 -328148 -135863 307617 26111 -353250 45677 428050 -48395 -443353 53908
109 53908 411153 -110690 -385266 204980 416242 -253342 -442952 250136 410146 -246019
119 -246019 -311955 306713 229355 -399972 -201653 454261 190217 -446631 -132527 430944
129 430944 31511 -462158 40703 508760 -52389 -509021 38619 435661 -76175 -359998
139 -359998 152160 327668 -213660 -330827 213236 297783 -199634 -222232 224245 151455
149 151455 -290290 -142029 329537 165544 -309959 -159102 269567 103215 -265731 -42764
159 -42764 302428 29512 -317594 -35843 286023 10027 -237712 70424 236576 -145318
169 -145318 -270132 175620 290451 -168940 -253141 190505 199759 -248510 -176491 301104 185755
180 185755 -300172 -170624 267712 102347 -260421 -17348 294370 -30086 -326685 34291
190 34291 307976 -51375 -261984 104551 235369 -168581 -251829 184713 259847 -162109
200 -162109 -224139 145823 155103 -175570 -113156 216064 110472 -224363 -112061 196274 74807
211 74807 -180689 -14613 207062 -18187 -244725 10192 248546 2547 -212230 25471
221 25471 185236 -77133 -191299 112105 211717 -106849 -194967 104127 146383 -134930 -103459
232 -103459 191699 100863 -222340 -109639 212806 89274 -194565 -34813 206579 -10778
242 -10778 -237314 18659 241516 -14566 -206703 37427 164484 -93204 -157654 134958
252 134958 170624 -139577 -165989 124275 122867 -136040 -80189 171890 68606 -197375 -81828
263 -81828 181939 73834 -152240 -31820 147477 -13311 -171780 26207 187686 -15579
273 -15579 -167627 23452 134993 -62275 -125540 104976 146217 -112580 -154961 98983 130391
284 130391 -98509 -87278 131980 69065 -165435 -75851 168681 75931 -146133 -40690 138718
295 138718 -8021 -160807 32686 184336 -27917 -175670 27147 140312 -58847 -119246
305 -119246 101529 126201 -120772 -137778 107123 116444 -99130 -73617 118965 43055 -153209
316 -153209 -46167 160696 52658 -139325 -32529 119879 -10292 -130425 37781 153412
326 153412 -33729 -152660 24461 123622 -41006 -96901 79840 100553 -102679 -115392 96598
337 96598 110197 -82353 -75100 95359 45227 -126441 -41684 145033 53034 -131295 -42041
348 -42041 111998 5410 -115650 28216 138926 -32986 -147828 23369 125753 -33597
358 -33597 -97353 67824 91188 -98679 -105734 98383 104856 -84915 -76536 87413 40315 -115629
370 -115629 -30297 136437 38673 -129482 -36397 106089 5448 -101238 29173 119175 -39182
381 -39182 -131915 28713 116478 -29060 -86330 56392 75091 -86249 -85861 92701 93700 -77021
393 -77021 -72541 73890 40210 -94077 -23934 119644 32968 -118912 -36601 99307 15489
404 15489 -88439 19294 103076 -35311 -120740 27590 114024 -22841 -87055 42655 68806
415 68806 -75772 -76406 89054 86656 -79243 -75099 69207 41665 -85032 -20199 110490 22369
427 22369 -118752 -31569 99936 17049 -83229 15385 88838 -38227 -106550 35042 106056
438 106056 -25879 -81277 37993 58686 -67253 -58911 86850 72784 -79164 -68612 66208
449 66208 43440 -70739 -17909 94086 17188 -105009 -26424 92957 21441 -72863 7241
460 7241 73477 -33151 -90341 37063 98536 -27657 -82684 32261 60053 -57544 -56379
471 -56379 79243 67974 -78639 -71049 63056 48287 -62569 -20227 80573 8446 -98583
482 -98583 -15790 92192 13417 -74505 9001 68418 -37601 -83350 44950 94791 -34341
493 -34341 -83722 29924 58597 -46684 -45502 69235 52470 -72390 -56754 59653 41185
504 41185 -53041 -12441 69568 -229 -89369 -6193 92159 14462 -74853 -914 65071 -22442
516 -22442 -72926 34384 86018 -25944 -79108 19930 55282 -34429 -38026 60948 41412 -74874
528 -74874 -51495 67415 43663 -60172 -20946 69294 3473 -89490 -8200 92815 16214
539 16214 -76306 -8136 56689 -19246 -57788 38924 69129 -39404 -69787 31935 50654 -40579
551 -40579 -32806 63398 34574 -77531 -47769 69614 48977 -52744 -28828 52010 8656 -65446
563 -65446 -4356 74700 12588 -63135 -7018 48202 -14966 -47836 37968 65218 -39682 -74776
575 -74776 29856 65382 -28393 -46973 44627 41923 -60202 -49680 58047 49704 -45405 -30359
587 -30359 43070 3363 -60043 7291 76008 -3197 -75583 916 60724 -16999 -55926 35870
599 35870 64486 -40981 -72832 28921 60470 -23318 -36639 35286 21421 -54939 -24521 60510
611 60510 29340 -51195 -18734 46522 -561 -57764 9392 74480 1004 -73800 -10609 58118
623 58118 4593 -43938 15420 48110 -25555 -56296 22275 52874 -17828 -34484 31089 22925
635 22925 -53256 -28238 65205 40138 -58200 -37963 48142 20209 -52080 -5768 64062 5402
647 5402 -66729 -10607 51375 291 -36758 22774 36669 -42577 -49503 42349 52071 -35232 -39832
660 -39832 36956 24366 -51829 -24375 59907 32994 -50979 -32092 35052 13775 -32105 6564
672 6564 44722 -11078 -54135 4713 49117 -4258 -36858 19463 37991 -33171 -50489 32619
684 32619 59501 -19424 -49209 16012 32191 -27396 -24133 42666 29602 -43833 -30654 36101
696 36101 17125 -35866 2076 50022 -9182 -64708 1772 62894 2360 -49471 7278 40028
708 40028 -24485 -44577 29819 48124 -24104 -39056 20173 18744 -32242 -7720 48792 11241
720 11241 -54564 -18739 45062 13262 -37127 1347 41883 -8927 -51432 2797 49826 4931
732 4931 -34620 2033 23207 -18695 -25799 29932 36614 -25824 -36533 20641 25757 -26250 -16394
745 -16394 41701 21674 -48107 -30826 40777 29229 -30257 -13302 32568 -965 -44061 2517
757 2517 48917 1296 -40609 4200 29856 -21573 -31781 34473 41444 -33441 -44640 24003
769 24003 32074 -24443 -17573 35000 13209 -43958 -18780 38360 17146 -27529 -3199 25850
781 25850 -12500 -36580 14927 44880 -6642 -39370 3749 27407 -13057 -23561 24967 31825
793 31825 -24343 -36684 15494 29064 -12032 -14052 23100 9169 -35837 -15229 38067 20527
805 20527 -29830 -12490 27249 -1076 -35985 6460 46254 -577 -44343 -3278 32122 -5849
817 -5849 -24851 20740 28734 -27855 -35252 22806 30034 -19592 -16680 26601 7495 -39463 -11248
830 -11248 42145 16440 -33661 -11856 25018 -2264 -28031 10978 36291 -7945 -36517 2182
842 2182 25896 -6306 -16402 19284 19165 -26446 -27301 22083 28244 -14165 -17393 16985 8349 -27602
856 -27602 -9594 34232 17188 -28348 -15898 20668 4326 -22330 6826 32778 -6425 -37963
868 -37963 468 31271 -2152 -21692 13960 21055 -24823 -28719 23822 30649 -17366 -21455 17250
881 17250 8726 -27788 -6255 35948 11353 -33343 -12807 23642 2547 -21262 9530 28302
893 28302 -12239 -34432 5888 29217 -3409 -17801 11932 13663 -22611 -19446 24096 25126 -16064
906 -16064 -19373 12398 8166 -18961 -3088 29054 8996 -29071 -13542 21073 8040 -16110
918 -16110 4267 22413 -9512 -31134 4906 30802 -566 -21489 6417 15222 -18289 -19423
930 -19423 23236 25552 -18458 -23172 13176 11394 -18227 -3521 28097 5090 -32037 -10381 25122
943 25122 6619 -18529 4523 20614 -12652 -28546 9969 29704 -4180 -20958 6318 12043
955 12043 -16228 -12357 23175 18883 -19399 -19031 12789 10255 -13479 -872 22824 1894 -28108
968 -28108 -8025 23882 9124 -15488 110 15629 -8786 -23038 8695 27607 -2493 -21729
980 -21729 2391 12752 -11618 -11589 20646 17910 -20426 -21249 13792 14082 -13187 -4403 20682 1543
994 1543 -28519 -7093 25941 8686 -18135 -1427 14855 -9493 -20968 11941 26256 -7011
1006 -7011 -22612 4314 12871 -11032 -8547 20521 13249 -21869 -17795 15447 13743 -10923 -3313
1019 -3313 16252 -1090 -23780 -2782 24524 7844 -16363 -3205 11473 -6492 -15099 11743
1031 11743 22644 -7279 -22231 2747 14251 -6438 -8276 16053 11422 -20483 -17751 15615
1043 15615 16401 -10368 -7443 12883 -5 -21595 -1951 24536 6298 -19423 -4537 12664
1055 12664 -5508 -14713 12380 21377 -10967 -23699 5310 16586 -6507 -8906 14417 8644 -20209
1068 -20209 -13751 17246 14279 -10628 -6086 10836 -2263 -17763 3214 23308 2463 -19453
1080 -19453 -3303 12796 -3062 -11354 10857 17718 -9978 -21108 4259 16483 -2235 -7614
1092 -7614 9206 5387 -16831 -10168 17068 13297 -11703 -8315 10160 -99 -16855 1813 23341
1105 23341 3040 -22284 -6605 14477 944 -11177 7386 14645 -10780 -19594 6502 16260
1117 16260 -4741 -8238 10179 3903 -19023 -8022 20981 12816 -15451 -10231 10858 2136 -13490
1130 -13490 2611 19524 697 -19068 -4171 12156 966 -6143 8566 9283 -13280 -15377 10600
1143 10600 16767 -5353 -10166 7544 5410 -14282 -7518 17696 13290 -12687 -12599 6677 4446 -7867
1157 -7867 2791 14938 -2573 -19090 -1815 15126 547 -10368 6644 11410 -13033 -18267
1169 -18267 10650 20286 -5226 -14771 4149 6444 -10843 -4997 16080 8183 -14680 -8709 9455
1182 9455 1845 -9510 5753 15994 -6264 -21012 1049 18490 1845 -11194 2997 8867
1194 8867 -8748 -12069 9206 15076 -3788 -10077 2579 2600 -8081 349 15903 4592 -16581
1207 -16581 -8606 11914 6173 -9293 242 13534 -1914 -18668 -2542 17048 5484 -10086
1219 -10086 -1164 5679 -7787 -9190 11438 13810 -9156 -13168 6446 6581 -10907 -3639 17455
1232 17455 6787 -19160 -11647 13152 9203 -7969 -1407 9230 -4267 -14359 2953 15054
1244 15054 32 -9470 2889 5089 -10159 -7275 14565 13648 -10626 -14535 5228 9145 -4710
1257 -4710 -3074 10344 4030 -12928 -7791 9544 7575 -4247 -349 5719 -5883 -12566 5257
1270 5257 17123 -227 -14420 -847 9197 -4596 -9324 9487 13853 -8420 -15945 3227 10117
1283 10117 -3151 -2836 9145 524 -15774 -4508 15091 5928 -10928 -1585 9758 -4833 -14584
1296 -14584 5264 18284 -588 -15195 -1825 7933 -2401 -4320 9057 7254 -10142 -9919 6594
1309 6594 7326 -4372 -840 8959 -777 -14473 -3271 14938 7929 -9186 -5701 5647 -146 -7932
1323 -7932 3081 12680 -60 -12176 -2607 6764 -991 -3662 8184 6868 -11684 -12398 8471 12209
1337 12209 -5194 -6999 7067 2692 -13005 -4827 14438 7848 -10375 -6110 5716 -1416 -7569
1350 -7569 6521 12698 -5430 -14456 1797 9944 -2841 -5311 8473 6293 -11745 -10512 8849
1363 8849 11118 -3566 -5296 3671 -235 -8458 398 12160 3857 -9367 -4324 5047 -290 -5073
1377 -5073 5350 10489 -4206 -13720 -526 10876 1991 -5439 2629 4472 -7953 -8615 7706 10936
1391 10936 -3953 -7497 3131 1368 -8446 -259 13613 3780 -13378 -6327 8426 2400 -6578
1404 -6578 3489 9825 -5366 -13555 1955 11458 -118 -5561 3838 2682 -9626 -5381 10968
1417 10968 8768 -6911 -6707 4155 1318 -6463 1547 11225 1598 -11215 -4692 6726 3106 -3129
1431 -3129 2633 5516 -5153 -9900 2467 10448 973 -5987 805 2783 -6211 -4993 8768 9212
1445 9212 -6080 -9336 2488 4177 -4328 -359 9462 1493 -12182 -5199 8908 4285 -5316 1002
1459 1002 6114 -5497 -10777 4198 12126 -850 -8120 1304 3267 -6398 -3310 10226 6963 -8413
1473 -8413 -7778 4351 3544 -3891 1524 8293 -1217 -11045 -2355 8760 3757 -3808 456 3182 -4915
1488 -4915 -6857 4823 9929 -747 -7457 -567 2893 -3261 -2028 7793 5823 -7592 -8768 3475
1502 3475 6056 -2070 -1139 5583 -611 -10295 -2694 9817 4683 -5884 -1840 3772 -3895 -7151 5539
1517 5539 10874 -2685 -10029 178 4980 -2945 -2166 7889 4280 -9218 -7184 5835 5640 -2866
1531 -2866 -196 5053 -2710 -9258 735 10257 2686 -6061 -1359 2950 -3081 -4158 5785 8216 -3094
1546 -3094 -8402 -172 4405 -596 -748 5275 2091 -7858 -5921 5535 6368 -2298 -2428 3129 -1256
1561 -1256 -7684 -92 9901 3449 -7476 -3820 3469 -847 -3994 4656 7609 -4158 -9613 779
1575 779 6235 -982 -2125 5209 1802 -9037 -5265 7793 6577 -3949 -2998 3274 -1487 -6662 2041
1590 2041 9686 1343 -7544 -2431 3415 -799 -1969 5413 5402 -5286 -7858 2017 6102 -90 -1541
1605 -1541 3278 488 -7126 -3523 7043 6263 -3229 -4271 1317 -335 -4162 1744 7972 933 -8043
1620 -8043 -3547 4071 1152 -2249 3406 4534 -5402 -8494 2498 7843 -255 -3894 2029 1011 -6625
1635 -6625 -2983 7962 5838 -5059 -4919 2151 205 -3670 2913 7658 -1261 -8625 -1473 5467 888
1650 888 -2116 3507 3318 -5776 -6559 3955 7413 -316 -3485 876 128 -4464 -602 6985 3937 -4800
1666 -4800 -4342 1705 886 -2126 2439 5970 -1498 -8306 -2029 6026 2660 -2680 505 2386 -4116
1681 -4116 -5767 3223 7222 -481 -4798 -78 627 -3973 -503 7375 3368 -6966 -5245 3548 2492
1696 2492 -2793 1304 5634 -1763 -8260 -1078 6665 2500 -2471 619 1043 -4658 -3391 5523 6116
1711 6116 -2521 -4449 1181 976 -3396 425 6995 2570 -6555 -4953 3063 3560 -561 659 2565
1726 2565 -2300 -5740 141 5740 1964 -2628 -282 679 -3931 -3178 5243 6607 -2847 -6885 -188
1741 -188 3239 -1175 -890 4498 1910 -6079 -4659 3393 3651 -1059 378 2310 -3500 -6265 2199 7795
1757 7795 663 -5286 -578 2368 -2707 -2742 5043 5646 -3165 -5927 225 2677 -78 1311 3859 -964
1773 -964 -6199 -1608 5095 2746 -2050 57 2231 -2633 -5110 1810 7095 1579 -4889 -2687 1249
1788 1249 -136 -577 3345 3031 -3360 -4935 775 2912 -504 55 3436 -442 -6853 -2863 6093 4654
1804 4654 -3100 -3016 1471 -713 -3712 1538 5906 446 -4926 -1605 1505 -1061 -110 5022 2563 -5829
1820 -5829 -5186 3344 4587 -1178 -1147 2807 -206 -5310 -1511 5333 3758 -1892 -2067 -152 -1665 -1311
1836 -1311 3690 4635 -1674 -5050 -574 2575 -191 -759 3270 2463 -4324 -5467 1742 5360 873 -2191
1852 -2191 -281 -683 -3339 -413 4796 2614 -3339 -2645 1026 -753 -2345 2920 5584 -1702 -7086
1867 -7086 -1282 4563 1463 -1494 1564 1419 -4008 -3651 3060 4322 -563 -1408 839 -1610 -3875 1523
1883 1523 6428 1475 -4937 -2571 2074 591 -1194 2230 3552 -1716 -4960 -815 3221 1797 106
1898 106 880 -607 -3890 -1984 3784 4021 -1352 -2945 219 140 -2557 13 4876 2293 -4468 -4154
1914 -4154 1401 2228 -258 1071 2217 -2295 -4867 361 4426 873 -1830 912 609 -4066 -2608
1929 -2608 4669 4912 -2218 -4015 313 851 -1451 1142 4252 348 -4497 -2033 2165 1187 -153 2163
1945 2163 1647 -3457 -4250 1658 4688 857 -2017 -382 -34 -2285 -958 3441 3349 -1570 -3501 -732
1961 -732 666 -80 1343 3001 -319 -4638 -2390 2878 2559 -805 -155 1245 -2090 -4068 1018 5072
1977 5072 1212 -3139 -1316 451 -1616 -568 3993 2940 -3217 -3849 1004 1833 -703 969 3257
1992 3257 -868 -5063 -1285 3933 2374 -1017 -106 400 -2502 -2330 2593 4091 -205 -2767 -794 116
2008 116 -1032 598 3474 1577 -3217 -3375 695 2179 485 383 1193 -1093 -3629 -990 3343 2531
2024 2531 -1176 -1453 -58 -1396 -1874 2058 4062 -320 -3966 -1322 1475 -64 -157 2801 1538 -3604
2040 -3604 -3491 1856 3009 -232 -218 1443 -1304 -3824 145 4469 1842 -2210 -1208 406 -1348 -1006
2056 -1006 2962 3296 -1469 -3480 -447 1303 171 790 2359 68 -3560 -2325 1992 2728 212 -618
2072 -618 -32 -1343 -2355 399 3491 1696 -2079 -2164 -177 -210 -311 2106 2596 -1495 -4029 -760 2421
2089 2421 944 -328 1249 365 -3287 -2533 2577 3476 -443 -1642 93 -899 -2199 1184 4143 751
2105 751 -3316 -1639 1114 28 -298 2515 2190 -2445 -3622 484 2722 823 -42 742 -818 -2876
2121 -2876 -732 2945 2374 -781 -1467 -421 -941 -1007 1600 3120 178 -3174 -2013 935 1129 261 1070
2138 1070 913 -1980 -3116 219 2883 1116 -890 -265 -560 -2323 -801 3151 2700 -1711 -2633 91
2154 91 362 -907 1149 3135 -97 -3700 -1542 1963 1292 -6 1244 648 -2661 -2505 1823 3179
2170 3179 152 -1159 83 -645 -2077 283 3413 1784 -2032 -2212 -48 393 195 1575 1803 -1050
2186 -1050 -2983 -947 1731 1452 219 303 -271 -2228 -1926 1547 3096 351 -2013 -1051 -170 -920 105
2203 105 2637 1629 -2319 -2848 218 1324 211 863 1546 -1242 -3390 -467 2905 1533 -820 -104
2219 -104 129 -2081 -1543 2445 3223 -560 -2385 -539 192 -519 991 2714 495 -2784 -1855 1027 1271
2236 1271 408 1041 752 -1850 -2647 407 2811 1324 -885 -828 -537 -1232 -504 1966 2296 -606 -2428
2253 -2428 -1094 386 325 814 1717 19 -2757 -2040 1317 1979 31 -208 475 -1218 -2520 237 3165
2270 3165 1423 -1680 -1313 -91 -728 -255 2289 2068 -1522 -2582 12 1077 60 761 1960 -280
2286 -280 -3099 -1349 2221 2093 -115 -354 -63 -1300 -1432 1177 2582 594 -1431 -1047 -438 -548 543
2303 543 2272 1222 -1914 -2550 -19 1508 666 168 606 -479 -2271 -1302 1647 2198 38 -1136 -790
2320 -790 -1072 -969 1335 2608 105 -2469 -1218 669 110 -58 1747 1427 -1964 -2888 360 2331 893
2337 893 -72 265 -862 -2078 -55 2568 1516 -912 -823 -72 -1011 -762 1899 2630 -496 -2719 -1092
2354 -1092 1016 846 579 1004 85 -1849 -1599 635 1657 736 24 -270 -1364 -1755 348 2558 1406
2371 1406 -1465 -1865 -179 202 -229 894 1736 -267 -2489 -1363 1027 1230 495 616 -221 -2155 -1545
2388 -1545 1606 2319 -114 -1129 77 -302 -1560 150 2760 1513 -1723 -1908 26 502 458 1446 1098
2405 1098 -1375 -2144 50 1480 607 241 785 -356 -2240 -1172 1835 2323 -41 -1450 -908 -403 -278
2422 -278 755 1647 457 -1507 -1548 -152 473 634 1181 705 -1575 -2488 -89 2205 1221 -663 -555 -196
2440 -196 -1196 -931 1472 2253 -70 -1713 -873 -136 -125 1140 2125 44 -2508 -1341 1253 1135 -30
2457 -30 672 806 -1404 -2198 407 2393 1120 -574 -683 -779 -1100 325 2072 1232 -1124 -1502 -281 48
2475 48 10 1081 1547 -391 -2341 -1351 1018 1590 470 -227 -493 -1231 -1159 595 1863 737 -902 -928
2493 -928 -556 -707 178 1968 1481 -1358 -2293 -160 1211 482 373 996 -260 -2104 -989 1519 1598 99
2511 99 -128 -208 -1416 -1112 1484 2399 23 -1627 -642 81 -362 364 1806 890 -1588 -1827 33 986
2529 986 704 710 333 -1206 -1821 -139 1619 1148 -241 -611 -612 -1030 -575 1162 1886 123 -1737 -1323 118
2548 118 537 639 1071 334 -1548 -1731 337 1511 666 43 190 -812 -1774 -147 2239 1554 -821 -1173
2566 -1173 -231 -396 -244 1447 1832 -511 -1983 -640 662 426 663 1231 -121 -2060 -1320 1098 1575
2583 1575 322 -208 -256 -1097 -1216 567 1859 768 -948 -1202 -581 -271 405 1349 961 -947 -1870 -642
2601 -642 879 926 436 284 -430 -1514 -1034 1015 1792 338 -837 -632 -589 -709 608 1979 764 -1498
2619 -1498 -1372 161 423 270 1122 1030 -1037 -1948 -92 1478 809 133 275 -584 -1664 -448 1747 1498
2637 1498 -378 -921 -403 -610 -446 1024 1664 38 -1576 -1121 80 522 700 890 12 -1404 -1404 203
2655 203 1282 779 -81 -371 -765 -1096 -212 1415 1481 -347 -1482 -771 56 236 820 1254 -56 -1705
2673 -1705 -1114 661 1014 409 529 179 -1374 -1549 682 2022 619 -718 -475 -433 -843 207 1803
2690 1803 1096 -948 -1287 -303 74 286 1200 1034 -882 -1890 -472 1033 879 300 124 -453 -1304 -793
2708 -793 843 1495 441 -744 -945 -710 -245 708 1366 483 -1151 -1405 -171 676 561 553 528 -650 -1648
2727 -1648 -600 1320 1364 12 -524 -429 -844 -538 1061 1646 24 -1235 -599 -43 -161 631 1609 449
2745 449 -1614 -1374 488 1007 429 457 261 -1011 -1396 160 1395 805 -144 -385 -718 -978 29 1449
2763 1449 1159 -516 -1285 -664 -6 318 718 823 -155 -1340 -1160 262 1086 689 51 -416 -967 -979 314
2782 314 1482 864 -600 -918 -406 -320 39 1215 1269 -532 -1697 -564 700 623 513 681 -219 -1503
2800 -1503 -804 999 1258 241 -81 -196 -1007 -913 876 1758 370 -1036 -791 -218 -125 474 1233 579 -1006
2819 -1006 -1317 -248 589 699 647 156 -884 -1326 -308 1020 1062 49 -578 -651 -653 -312 708 1309 284
2838 284 -1157 -1178 -99 500 563 718 249 -1012 -1303 47 1135 677 87 51 -557 -1209 -202 1484 1283
2857 1283 -377 -906 -316 -232 -91 939 1265 -132 -1262 -648 261 389 639 877 -81 -1387 -979 611
2875 611 1133 379 -83 -289 -761 -813 199 1214 799 -424 -970 -715 -175 442 931 621 -538 -1250 -641
2894 -641 429 683 417 261 -216 -1042 -941 532 1435 546 -612 -655 -444 -331 416 1257 685 -805 -1007
2913 -1007 -177 171 318 963 867 -717 -1542 -230 1087 801 175 88 -348 -1038 -450 910 1131 139 -502
2932 -502 -579 -679 -244 882 1214 20 -1139 -895 13 403 458 543 127 -822 -1122 -244 840 912 164 -502
2952 -502 -797 -696 12 949 939 -175 -926 -567 -83 65 544 1017 194 -1204 -1072 340 997 539 202
2971 202 -55 -756 -879 317 1183 590 -218 -263 -457 -725 82 1323 962 -613 -1130 -302 216 286 622 604
2991 604 -338 -1068 -584 326 648 513 228 -452 -1082 -590 639 1063 288 -527 -644 -410 -205 286 843 609
3011 609 -443 -1094 -553 383 694 581 204 -529 -1027 -390 788 913 135 -186 -213 -643 -537 619 1353
3030 1353 388 -862 -781 -138 145 528 932 273 -905 -919 74 508 372 498 281 -769 -1193 -72 1069
3049 1069 804 -95 -494 -554 -572 -45 795 770 -94 -768 -674 -273 232 722 689 -140 -1002 -789 202 822 576
3070 576 16 -276 -543 -629 29 909 874 -104 -713 -511 -155 248 842 799 -315 -1051 -437 412 434 354 507
3091 507 -52 -1010 -778 507 985 374 -152 -332 -699 -550 444 1050 330 -587 -603 -342 -222 260 875 464
3111 464 -661 -1024 -333 374 555 433 63 -532 -840 -297 511 763 280 -250 -514 -571 -177 509 946 342
3131 342 -635 -787 -151 375 468 523 296 -506 -925 -189 708 710 206 -55 -432 -778 -215 880 931 -76 -593
3152 -593 -366 -273 -91 590 905 16 -888 -663 7 278 474 562 -50 -912 -787 191 696 450 62 -279 -636
3173 -636 -629 110 804 621 -156 -648 -593 -177 314 675 510 -208 -803 -542 234 647 493 167 -202 -637 -588
3194 -588 283 945 540 -268 -496 -375 -266 294 855 550 -450 -793 -219 173 246 541 517 -383 -1004 -373
3214 -373 548 589 222 51 -348 -759 -367 572 765 143 -361 -417 -491 -241 467 767 166 -625 -688 -229 234
3235 234 477 425 33 -493 -659 -178 469 660 256 -175 -497 -482 -91 608 799 139 -601 -509 -66 157 368
3256 368 618 219 -610 -747 29 574 420 280 -3 -597 -756 118 803 490 -147 -300 -351 -473 -34 711
3276 711 662 -231 -700 -448 -96 222 549 462 -304 -779 -421 191 411 395 181 -274 -694 -489 260 731 452
3297 452 -207 -562 -465 -60 337 574 382 -214 -647 -384 184 472 452 239 -250 -723 -389 503 759 240 -203
3318 -203 -262 -382 -284 342 817 288 -454 -532 -222 -11 354 682 240 -609 -705 -48 355 307 292 144 -422 -717
3340 -717 -146 521 572 140 -247 -515 -482 6 538 511 2 -453 -493 -215 151 460 464 22 -551 -623 -55 543
3362 543 515 135 -250 -398 -404 -34 572 601 0 -430 -372 -193 75 540 638 -89 -703 -444 212 335 292 315 -17
3385 -17 -631 -550 218 599 364 19 -225 -539 -450 281 739 277 -311 -434 -304 -138 210 600 353 -338 -666
3406 -666 -372 138 447 423 60 -387 -563 -257 279 563 323 -123 -438 -399 -165 313 641 329 -387 -633 -183
3427 -183 255 366 358 193 -278 -627 -182 435 500 210 -25 -296 -541 -164 585 669 4 -400 -291 -209 -81 379
3449 379 600 90 -565 -499 -78 201 380 391 -90 -595 -506 53 390 315 112 -160 -472 -450 21 517 479 -45
3471 -45 -455 -469 -126 250 424 326 -75 -471 -451 8 421 393 195 -78 -454 -436 134 671 447 -153 -324 -241
3493 -241 -174 104 567 484 -171 -508 -265 24 242 447 346 -272 -656 -263 322 371 203 78 -222 -526 -344
3514 -344 279 560 263 -181 -412 -398 -111 368 500 125 -378 -450 -261 68 325 380 102 -334 -515 -217 356
3535 356 559 223 -209 -351 -283 -29 340 514 191 -306 -396 -138 147 339 489 143 -465 -516 42 428 300
3556 300 151 0 -326 -482 -29 450 417 -5 -215 -316 -328 30 543 431 -179 -457 -269 -70 88 334 324
3577 324 -84 -517 -408 3 337 364 130 -256 -457 -252 161 438 313 -11 -302 -299 -131 173 414 360 -73
3598 -73 -474 -349 141 410 306 128 -115 -404 -286 212 488 257 -22 -183 -374 -246 206 589 253 -331
3618 -331 -404 -170 -2 152 403 203 -320 -494 -173 154 271 300 92 -367 -543 -118 336 380 92 -156 -321
3639 -321 -351 -55 302 410 145 -261 -405 -238 139 376 359 26 -334 -375 -44 317 393 193 -77 -251 -287 -50
3661 -50 426 505 61 -321 -330 -120 73 309 393 -4 -446 -374 23 192 249 214 -28 -490 -422 87 395 236 -36
3684 -36 -175 -368 -335 94 420 253 -142 -308 -260 -134 188 453 296 -186 -444 -241 83 305 302 120 -190 -345
3706 -345 -199 146 423 337 -1 -303 -274 -81 226 455 291 -179 -388 -205 101 247 255 191 -161 -465 -229 221
3728 221 369 206 -32 -209 -379 -215 266 427 60 -236 -260 -247 -147 210 420 118 -336 -369 -109 120 256
3749 256 308 26 -363 -361 -19 293 312 150 -54 -305 -297 32 369 397 83 -246 -329 -113 176 377 293 19 -279
3772 -279 -351 -39 285 354 167 -45 -296 -319 9 402 374 -45 -253 -252 -158 27 325 318 -119 -409 -267 -52 119
3795 119 293 263 -124 -490 -284 163 293 163 63 -149 -349 -212 164 381 200 -98 -243 -300 -106 259 370
3816 370 200 -155 -301 -187 71 274 284 97 -151 -325 -193 170 382 266 -39 -249 -223 -54 181 348 178
3837 178 -167 -308 -146 14 175 311 142 -273 -418 -115 244 250 146 -6 -218 -362 -95 294 293 62 -111
3858 -111 -229 -286 -67 330 385 -3 -307 -231 -87 97 286 257 -9 -288 -272 -4 190 296 177 -110 -321 -226
3880 -226 55 325 302 23 -194 -280 -103 123 273 279 -4 -334 -295 3 268 281 118 -90 -344 -261 76 338
3902 338 186 -12 -165 -261 -223 75 410 237 -156 -326 -179 -30 128 286 181 -181 -329 -143 85 175 258
3923 258 107 -194 -374 -142 200 310 150 -94 -228 -237 -45 205 300 129 -126 -290 -173 58 263 272 66 -207
3945 -207 -301 -97 194 292 139 -57 -157 -224 -104 215 367 129 -206 -264 -143 49 222 293 42 -282 -251 -28
3967 -28 130 186 209 56 -288 -355 -25 280 230 36 -100 -242 -253 12 305 220 -32 -182 -242 -156 73 288 210
3990 210 -71 -301 -242 9 206 239 93 -127 -262 -190 30 274 296 40 -218 -237 -89 126 303 239 -57 -284
4012 -284 -178 59 161 218 150 -91 -339 -246 118 275 171 17 -148 -277 -168 153 316 115 -132 -199 -188 -102
4034 -102 154 298 125 -222 -315 -138 51 196 223 35 -213 -282 -73 128 221 164 -31 -214 -240 -27 228 257
4056 257 96 -134 -256 -113 98 194 215 92 -189 -295 -109 176 266 155 -26 -195 -221 -26 245 270 21 -146
4078 -146 -177 -137 -55 216 287 15 -275 -242 -68 79 197 190 -46 -282 -234 17 141 137 100 -70 -260 -222 64 251
4102 251 191 -32 -191 -224 -77 144 268 158 -32 -207 -219 -7 197 256 124 -100 -241 -158 112 293 205 -28
4124 -28 -151 -160 -99 109 269 175 -76 -261 -170 5 125 220 121 -173 -288 -116 97 167 120 28 -140 -296 -132 157
4148 157 241 88 -100 -210 -210 -59 189 213 6 -183 -166 -106 18 174 213 5 -204 -236 -59 134 216 131 -58
4171 -58 -167 -182 13 164 207 109 -123 -204 -106 63 188 216 66 -209 -201 -14 161 162 105 -13 -176 -231 -24 203
4195 203 169 21 -101 -226 -196 41 214 153 -109 -214 -160 -69 66 194 159 -71 -248 -163 19 134 203 106 -91
4218 -91 -213 -99 109 223 168 32 -122 -190 -54 106 260 151 -63 -214 -175 23 190 180 47 -99 -178 -136
4240 -136 83 227 120 -25 -156 -205 -120 112 244 105 -152 -217 -130 -48 113 186 77 -167 -256 -100 60 118 146
4263 146 32 -211 -260 -44 169 181 74 -30 -163 -165 3 190 213 56 -99 -159 -79 62 201 178 -16 -139 -165
4286 -165 -28 144 187 111 -56 -168 -139 -13 157 220 20 -142 -174 -87 38 154 153 -4 -190 -194 -44 81 140 123
4310 123 -13 -202 -167 23 177 135 26 -103 -212 -150 46 176 119 -16 -114 -118 -65 87 232 161 -72 -173 -75
4333 -75 35 126 194 100 -95 -176 -83 64 170 146 31 -153 -159 -22 118 165 93 -54 -179 -118 22 145 116 53 -113
4358 -113 -213 -151 89 171 103 -11 -124 -217 -119 110 199 47 -80 -155 -144 -70 111 187 42 -145 -169 -67 31 147
4382 147 150 34 -161 -142 14 132 165 111 -18 -125 -153 48 179 147 49 -75 -147 -84 78 173 93 6 -145 -128 -42
4407 -42 81 136 73 -63 -152 -136 -13 164 147 11 -93 -126 -100 -1 130 135 -46 -158 -147 -50 40 132 107 -75 -164 -139
4433 -139 45 115 110 69 -43 -160 -110 60 168 87 -7 -98 -150 -44 93 192 81 -67 -114 -84 -8 82 138 54 -74
4458 -74 -165 -82 46 150 101 -7 -137 -114 -35 70 144 87 -56 -114 -111 12 115 159 78 -108 -163 -60 92 109 90
4483 90 20 -117 -139 -45 121 162 55 -12 -118 -149 -18 144 151 -3 -114 -94 -43 15 98 137 8 -121 -120 -22 62 129
4509 129 87 -39 -148 -110 41 101 124 22 -65 -118 -75 41 114 125 7 -116 -144 -24 88 90 43 -59 -98 -125 9
4534 9 119 125 20 -66 -106 -110 30 146 112 -57 -121 -84 -12 27 112 98 -60 -158 -91 26 76 108 62 -66 -154 -65 72
4561 72 123 51 19 -88 -137 -36 68 114 59 -41 -89 -92 3 109 116 13 -85 -101 -61 55 105 96 18 -89 -88 -46 71 151
4589 151 98 -57 -82 -73 19 72 123 54 -49 -124 -80 33 71 93 42 -106 -154 -29 58 103 41 -23 -111 -99 -31 85 93 26
4617 26 -80 -104 -87 4 116 83 -38 -120 -65 -16 53 94 90 -22 -91 -85 10 97 113 59 -63 -90 -61 53 114 114 13 -84
4645 -84 -76 0 79 71 60 -6 -107 -79 -15 102 77 16 -64 -108 -81 12 108 45 -17 -71 -109 -66 45 124 64 -50 -103 -71 -21
4674 -21 36 69 20 -69 -101 -75 44 77 99 38 -56 -109 -16 70 81 35 -21 -88 -70 -7 98 98 51 -26 -85 -85 23 106 55 14
4704 14 -75 -102 -42 62 100 70 -36 -77 -77 -27 77 108 48 -96 -134 -65 26 60 63 17 -101 -122 -38 39 72 59 2 -105
4732 -105 -113 34 115 86 37 -25 -86 -51 30 117 96 13 -40 -38 -25 63 104 104 -15 -83 -45 3 80 94 39 -39 -62 -69 2 60 81
4763 81 17 -102 -75 -58 34 89 44 -33 -104 -96 -10 43 58 24 -29 -113 -84 0 81 67 16 -64 -100 -75 38 121 70 -19 -65 -37
4793 -37 -18 75 116 55 -38 -68 -27 63 71 103 30 -27 -75 -44 40 100 62 -5 -73 -78 -5 61 84 57 -46 -115 -74 14 41 46 7
4824 7 -62 -113 -91 37 80 45 -38 -84 -92 -41 64 113 39 -4 -71 -17 8 78 112 30 -88 -99 -25 28 79 78 2 -71 -81 2
4854 2 88 126 66 -17 -85 -48 30 78 62 13 -55 -79 -49 30 88 38 -22 -55 -74 -11 60 65 34 -31 -94 -103 -11 56 74 -16 -67 -89
4886 -89 -59 7 70 84 -14 -74 -40 -20 58 77 67 -35 -80 -44 59 96 48 58 -23 -103 -35 70 80 48 22 -24 -59 13 85
4915 85 124 43 -40 -69 -37 -7 75 66 37 -71 -62 -59 12 78 50 -27 -71 -60 -39 30 77 22 -42 -97 -63 -16 60 63 34 -63 -129 -40
4947 -40 52 80 53 43 -50 -79 -12 68 101 19 -16 -64 -53 -5 86 121 24 -80 -81 -29 47 71 80 14 -63 -73 -28 43 93 39 -32
4978 -32 -127 -73 1 73 44 3 -73 -83 -49 25 47 37 -13 -100 -105 -17 66 47 34 -28 -54 -87 5 59 63 -2 -66 -43 -56 32 81
5009 81 72 -13 -55 -43 -9 64 83 73 -34 -81 -24 31 56 77 12 -43 -113 -46 44 88 46 -23 -89 -96 -38 62 70 30 -66 -98 -98
5040 -98 -23 63 61 6 -63 -84 -84 32 50 69 -1 -69 -52 -49 41 106 57 -50 -62 -41 -6 65 96 4 -52 -73 -14 28 81 96 21
5071 21 -36 -73 -30 58 82 21 -23 -66 -87 14 85 64 15 -63 -70 -57 -3 78 85 -28 -85 -58 -16 39 83 56 -46 -79 -68 1
5101 1 60 96 14 -28 -83 -48 6 64 60 -23 -96 -76 -6 63 56 61 34 -89 -70 13 63 76 26 -32 -74 -34 54 64 64 -11 -50 -24
5133 -24 -39 29 60 51 -21 -102 -53 2 34 62 23 -60 -90 -40 33 64 54 16 -74 -65 -16 59 65 34 -26 -84 -63 13 62 62 44 -44
5165 -44 -72 -60 42 81 48 13 -68 -85 -46 78 86 37 -21 -59 -60 0 43 80 19 -58 -74 -26 16 61 54 12 -72 -64 6 37 40 56
5197 56 -11 -52 -109 -11 58 69 24 -49 -78 -52 19 82 66 9 -52 -64 3 52 80 45 -21 -83 -76 -12 62 71 18 -38 -76 -28 18
5228 18 52 47 -9 -94 -73 -13 39 72 20 -2 -80 -25 49 57 62 18 -27 -75 -60 29 81 57 -16 -60 -101 -36 76 100 40 -31 -73
5259 -73 -37 1 51 96 39 -20 -51 -23 53 88 62 -1 -84 -57 -5 46 75 57 -20 -80 -56 17 72 40 28 -59 -88 -36 19 42
5289 42 23 -17 -64 -83 -46 34 66 21 -38 -76 -76 -19 60 98 22 -78 -42 -10 28 98 77 5 -71 -63 -8 64 90 55 7 -101
5319 -101 -64 24 73 56 10 -20 -78 -24 40 80 86 9 -62 -78 -12 46 63 27 -34 -92 -82 -27 57 48 0 -65 -81 -56 1 100 64
5350 64 -31 -58 -63 -17 28 72 64 -16 -84 -33 33 48 95 71 -45 -70 -33 64 67 72 23 -36 -36 -16 76 77 44 -30 -78 -72 30 70 89
5383 89 15 -38 -62 -42 27 64 63 5 -64 -62 -15 34 61 44 -61 -82 -60 -25 38 71 30 -70 -74 -36 26 50 50 9 -66 -81 -8
5414 -8 76 77 75 -8 -46 -54 46 102 82 38 -21 -29 -22 42 105 100 -7 -53 -71 -1 32 54 37 -37 -75 -40 7 60 59 23 -57 -88 -66
5447 -66 23 50 28 2 -82 -100 -42 29 50 26 -55 -68 -72 7 64 39 -12 -60 -84 -28 50 92 64 1 -40 -45 7 74 95 66 -32
5478 -32 -63 -16 33 64 83 -7 -55 -76 5 52 53 72 -14 -76 -85 -25 47 40 23 -29 -84 -64 -33 69 60 -25 -53 -97 -32 15 58 40
5510 40 -9 -84 -95 -24 35 64 11 -40 -55 -69 -18 58 55 38 -27 -45 -16 34 87 77 20 -45 -63 26 41 67 56 6 -67 -58 26
5541 26 76 84 30 -58 -76 -43 42 76 49 -7 -68 -75 -44 35 62 7 -64 -110 -91 -21 45 68 -8 -80 -104 -65 16 58 54 -14 -81 -59
5573 -59 -11 40 74 43 -32 -93 -55 20 70 92 24 -16 -58 -36 32 99 40 20 -43 -60 -3 73 98 28 -46 -44 -50 -5 51 84 23
5604 23 -81 -76 -23 32 44 65 -18 -100 -82 -29 59 57 18 -51 -79 -81 8 67 74 15 -34 -92 -32 31 81 82 20 -53 -58 -16 72 77 42
5637 42 -3 -73 -47 9 59 104 24 -72 -58 -2 40 84 66 -6 -89 -56 -19 34 72 39 -13 -100 -80 25 78 58 12 -50 -78 -64
5667 -64 8 76 51 0 -71 -86 -23 38 56 13 -30 -83 -29 0 89 56 23 -63 -62 -9 39 89 53 8 -64 -72 -8 67 98 54 -34
5698 -34 -78 -39 44 53 70 30 -32 -62 -30 51 64 51 12 -57 -70 -20 58 58 16 -28 -56 -77 -4 83 59 -2 -66 -66 -14 9 41 25
5730 25 1 -60 -62 -21 34 83 39 -19 -75 -68 33 87 60 35 -32 -61 -45 37 57 31 0 -62 -88 -23 62 94 23 -12 -88 -51 3
5761 3 70 60 -14 -34 -90 -63 14 89 49 -4 -69 -83 -5 29 78 53 -38 -75 -31 -6 66 61 25 -41 -67 -51 44 85 58 -10 -69
5792 -69 -41 -8 63 80 42 -40 -72 -42 36 54 48 20 -53 -71 -56 25 76 52 -31 -73 -40 -31 38 76 27 -69 -78 -46 25 68 55 17
5824 17 -44 -78 -16 34 64 45 15 -63 -79 2 56 58 38 -31 -78 -53 14 65 60 6 -27 -54 -19 28 78 53 -15 -66 -50 -16 68
5855 68 56 23 -59 -86 -51 0 43 78 -1 -67 -68 -25 44 67 41 12 -73 -66 9 55 57 6 -11 -61 -64 26 79 70 7 -32 -70 -43 39
5888 39 73 66 -17 -31 -32 -6 67 98 47 -37 -51 -31 -4 60 58 56 -68 -74 -22 7 36 43 -1 -75 -85 -13 70 61 17 -56 -78 -71 22 67
5922 67 79 -9 -63 -65 -13 54 80 42 -26 -30 -51 10 56 96 39 -43 -35 -23 32 67 90 23 -57 -56 19 38 77 46 -11 -84 -50 15
5954 15 50 44 16 -40 -73 -67 15 68 48 -14 -40 -98 -65 56 50 25 0 -66 -86 -33 40 66 22 -49 -69 -43 14 83 82 17 -47 -61
5986 -61 -3 54 96 46 -6 -54 -52 2 66 81 44 -17 -82 -46 50 76 87 37 -34 -63 -35 41 99 49 8 -60 -57 -36 32 68 6
6017 6 -49 -82 -54 -18 51 75 -33 -83 -72 -31 9 39 28 -16 -83 -65 -26 58 79 29 -15 -65 -34 43 82 64 30 -32 -71 -17
6047 -17 68 89 72 34 -31 -34 10 51 103 41 -18 -35 -19 9 81 74 -4 -61 -60 -27 27 61 55 -40 -84 -65 10 29 41 13 -43 -100
6079 -100 -62 0 39 46 -9 -75 -66 -34 33 55 70 24 -61 -53 -5 71 71 60 -21 -56 -34 34 75 63 49 -44 -24 -20 21 95 65 -14
6111 -14 -51 -56 10 60 51 48 -33 -95 -22 34 57 54 24 -69 -80 -35 26 49 39 -47 -74 -63 -33 50 50 20 -46 -79 -47 -7 37 55 -2
6144 -2 -42 -67 -24 42 73 54 -14 -57 -27 21 79 108 59 -9 -34 -5 32 108 98 21 -55 -89 15 44 71 34 -3 -49 -69 7
6174 7 69 49 23 -42 -72 -55 1 67 61 -19 -48 -70 -26 -5 79 52 -45 -87 -64 -5 43 34 33 -38 -78 -40 31 71 54 42 -43 -75
6206 -75 -26 40 58 64 -8 -68 -37 14 77 91 9 -50 -23 -49 40 93 56 14 -55 -65 -55 54 80 32 -19 -51 -52 -29 70 64 8
6237 8 -48 -103 -36 -10 73 50 9 -56 -65 -41 31 74 29 -16 -65 -66 8 69 76 23 -39 -63 -48 39 81 60 12 -42 -54 -32 41 80
6269 80 64 -28 -71 -55 4 51 71 8 -76 -86 -29 18 54 55 0 -78 -89 -12 22 46 29 -28 -101 -67 15 44 49 1 -43 -74 -50
6300 -50 3 75 25 -2 -72 -65 -43 53 45 9 -45 -75 -44 -2 64 86 26 -55 -55 -15 38 85 81 -3 -55 -64 -12 54 61 45 -49 -60 -62 2
6334 2 51 37 9 -57 -93 -44 39 39 17 -30 -61 -81 -9 72 64 13 -9 -75 -59 1 54 72 22 -22 -52 -26 -14 44 71 6 -68 -97
6366 -97 -10 42 47 60 -20 -74 -39 -5 56 39 23 -34 -58 -42 41 65 53 -8 -70 -71 -8 51 53 45 -10 -65 -64 24 78 83 4 -46 -49 -49
6400 -49 22 63 79 -2 -47 -71 9 31 58 76 -23 -68 -18 13 68 58 33 -52 -66 -43 47 78 43 23 -65 -54 -41 33 46 19
6430 19 -38 -52 -69 -8 37 41 -11 -51 -80 -38 17 53 45 -19 -55 -53 -44 35 50 58 -47 -76 -49 -6 41 89 32 -48 -73 -13 34 73
6462 73 42 -3 -56 -58 -16 73 50 24 -13 -69 -51 8 85 50 22 -56 -66 -36 27 88 30 -49 -66 -74 -45 27 78 29 -7 -103 -56
6493 -56 -3 46 77 22 -52 -82 -18 37 92 51 4 -58 -65 3 67 63 54 -13 -44 -28 39 92 57 17 -30 -75 -12 38 88 57 -28 -52
6525 -52 -42 -31 40 46 32 -42 -73 -49 0 71 67 16 -101 -93 -15 38 46 34 0 -56 -71 -5 34 47 20 -28 -75 -41 19 77 73 8
6557 8 -24 -54 -26 50 66 63 4 -27 -30 -1 69 92 47 -12 -48 -12 30 83 69 5 -40 -72 -14 -6 65 40 19 -67 -53 -5 48 37
6589 37 30 -23 -90 -73 0 52 31 -29 -39 -77 -41 -14 44 31 -35 -59 -68 3 40 60 5 -23 -38 -30 4 84 69 50 -34 -44 -16 44
6621 44 68 74 12 -45 -45 0 43 52 47 -14 -62 -46 12 68 67 19 -33 -64 -21 27 66 -6 -49 -53 -55 -47 34 69 -5 -45 -84 -72 11 50
6655 50 38 -21 -67 -95 -33 24 42 56 5 -102 -76 2 50 68 58 -20 -53 -25 23 66 65 28 -66 -62 18 57 90 56 -6 -19 -24
6686 -24 19 65 85 37 -28 -46 -49 11 44 46 -23 -66 -57 -25 9 42 31 -26 -100 -49 10 28 40 19 -29 -64 -47 -14 34 45 1 -31
6718 -31 -69 -22 37 55 53 -2 -45 -31 16 55 82 37 -14 -17 -26 37 107 79 16 -11 -21 6 47 65 62 8 -55 -39 -9 32 48 19
6750 19 -37 -78 -52 0 54 53 -21 -46 -61 -23 44 64 33 -28 -54 -67 17 39 52 19 -24 -61 -65 33 76 61 -16 -30 -38 19 37 60
6782 60 37 1 -65 -30 5 47 69 29 -40 -53 -35 21 64 60 1 -29 -61 -21 41 59 32 -31 -64 -44 -2 21 44 20 -38 -62 -50
6813 -50 20 49 53 -8 -56 -50 -24 25 49 40 -6 -40 -56 37 44 54 39 -24 -47 -5 18 61 55 14 -53 -18 -4 59 36 49 6 -58 -43
6846 -43 -2 66 81 34 -59 -60 -34 31 70 40 -16 -18 -53 -18 46 51 43 -25 -58 -39 0 45 47 15 -68 -75 -25 13 50 39 -15 -49 -59
6879 -59 30 42 66 30 -3 -34 -36 18 55 38 17 -46 -43 -6 47 53 28 -3 -38 -46 -3 52 44 42 -32 -55 -16 -6 62 67 11 -40 -34 -30 35
6914 35 58 46 0 -63 -53 -8 35 33 35 -14 -82 -49 -1 60 57 0 -32 -65 -28 36 75 28 15 -31 -40 -15 45 62 18 -21 -52 -40
6946 -40 19 51 50 40 -39 -48 -23 29 39 34 20 -55 -66 5 46 25 32 -21 -64 -36 18 56 39 38 -27 -68 -32 42 61 38 -2 -32 -43
6979 -43 -3 35 82 18 -27 -52 -29 10 58 62 13 -34 -58 -34 24 61 48 0 -42 -65 1 53 67 35 -15 -41 -37 45 53 73 3 -27
7011 -27 -59 -25 15 42 32 -6 -40 -44 -28 45 56 43 -15 -34 -55 20 75 82 -17 -48 -35 -13 55 62 45 7 -49 -34 8 19 74 34
7043 34 2 -61 -22 7 29 60 24 -20 -49 -19 25 26 28 -4 -32 -63 -17 50 64 -11 -42 -35 -48 5 55 52 -5 -43 -63 -14 27 64
7075 64 70 -4 -35 -35 -2 51 64 21 -9 -74 -15 46 50 50 34 -13 -49 20 36 28 26 -16 -65 -36 5 45 42 5 -44 -56 -36 -6 55 37
7109 37 -10 -62 -46 -48 17 67 21 -41 -69 -49 -25 32 53 17 -23 -68 -23 20 24 38 -10 -61 -49 0 44 54 40 20 -27 -57 2
7140 2 56 58 32 5 -30 -27 16 49 49 21 -15 -45 -15 22 69 42 -30 -50 -53 -15 38 39 19 -34 -86 -45 -24 33 25 -14 -34 -60 -40 18
7174 18 20 23 -13 -32 -29 10 64 58 15 -2 -39 -30 31 40 49 14 -24 -12 -4 35 63 55 0 -17 -20 8 64 81 44 -28 -11 -13 27 43 61 15
7210 15 -27 -42 -41 27 27 10 -19 -71 -72 -13 36 58 -3 -83 -94 -62 22 56 33 0 -34 -62 -25 29 31 34 -2 -18 -11 14 51 90 34
7243 34 -8 -55 2 41 60 63 19 -35 -27 -13 52 61 39 13 -40 -28 10 24 41 16 -49 -37 -40 24 19 42 -5 -52 -86 -29 11 45 8
7276 8 -43 -50 -49 -12 39 38 -12 -61 -45 -31 -10 31 32 8 -67 -39 29 24 59 50 -8 -21 -22 32 69 46 42 8 -26 0 31 69 57 8 -24
7311 -24 -40 -22 34 30 15 -13 -49 -52 -4 51 48 -18 -51 -41 -34 4 34 34 6 -35 -56 -46 14 27 25 -29 -70 -47 1 40 42 28 -31 -51
7345 -51 -46 28 65 9 17 -40 -65 -11 52 85 37 1 -72 -17 35 75 32 48 -12 -56 -21 24 66 48 -3 -23 -26 -31 32 67 32 -36
7377 -36 -59 -38 -2 30 18 26 -37 -58 -9 21 38 40 11 -38 -41 -21 26 62 15 -11 -47 -34 3 64 64 17 -16 -24 -10 27 68 31 0
7410 0 -41 -13 -10 46 56 34 -34 -48 -12 -7 25 35 40 -29 -45 -24 13 23 25 -15 -39 -60 -14 24 -2 -5 5 -41 -72 14 22 47 31 -26
7444 -26 -74 -15 -3 51 57 -4 -28 -28 -3 24 31 32 -13 -47 -20 33 47 56 36 -17 -13 13 23 62 59 9 -24 -66 1 35 23 30 -20 -42
7478 -42 -56 32 48 22 -9 -25 -40 -39 17 26 48 4 -25 -34 6 23 47 17 -25 -40 -15 -5 15 62 20 -67 -44 -5 41 9 51 -5
7510 -5 -47 -54 -27 33 32 -7 6 -38 -31 4 53 48 16 -6 -31 -15 9 21 32 -5 -20 -13 -5 27 50 36 -7 -23 -18 15 46 48 22 -31 -39
7545 -39 -20 12 46 58 5 -37 -14 -1 41 24 43 -18 -21 -37 -7 49 49 8 -7 -24 -25 26 51 36 10 -22 -36 -21 3 64 10 -31
7577 -31 -30 -39 -12 42 24 1 -27 -56 -18 16 72 62 -2 -52 -54 19 23 16 19 0 -32 -41 10 26 43 40 1 -5 11 19 53 23 -9 -7 -42 0
7613 0 43 57 -14 -29 -21 -43 18 53 67 10 -36 -30 -34 -3 42 20 -13 -59 -50 -10 17 41 19 -10 -62 -52 17 41 39 5 2 -49 2 19
7647 19 51 51 12 -33 -38 7 71 78 18 35 -16 -12 17 49 69 9 -13 -34 -7 -13 59 24 12 -52 -37 -3 26 48 13 -7 -36 -35 11
7680 11 50 24 -11 -19 -71 -30 13 41 1 -34 -49 -45 -10 32 49 3 -29 -35 -27 29 33 38 23 -16 -14 18 21 53 36 -10 -17 -26 29 21 47 46
7716 46 -36 -15 -25 48 41 46 32 -21 -45 -2 48 34 40 -15 -32 -19 -4 32 12 -5 -36 -50 -24 10 49 3 -23 -64 -46 -23 1 38
7748 38 16 -27 -52 -17 10 9 33 3 -20 -36 -1 11 51 56 58 -4 -18 5 38 70 36 0 -22 -3 11 22 25 3 -17 -18 -19 4 28
7781 28 45 -6 8 -27 -12 6 40 6 -24 -45 -46 -2 12 35 1 -26 -37 -52 -13 9 34 -21 -51 -40 -9 36 25 24 -6 -27 -31 10
7813 10 53 63 20 6 -7 -25 1 51 45 8 -5 -14 -16 33 63 22 4 -47 -15 -1 42 43 13 -30 -69 -19 10 18 15 -4 -54 -55 -7 13
7847 13 15 16 -21 -57 -41 -33 16 7 19 -38 -52 -18 9 37 6 -9 -53 -34 -13 19 45 31 -14 -43 -19 -2 22 40 0 -3 -13 -6 22
7880 22 32 54 16 -28 -9 11 39 32 30 -14 -28 -73 -20 3 26 -9 -32 -54 -30 -8 17 27 -10 -19 -47 -14 1 47 11 -4 -42 -10
7912 -10 -12 40 41 5 -30 -39 -15 11 55 35 23 -38 -32 17 22 54 42 -12 -23 -26 7 38 45 26 -25 -45 -18 28 56 26 -7 -44 -47 -5
7946 -5 26 -6 13 -37 -40 -41 -21 23 33 10 -40 -40 -32 -6 21 19 -19 -54 -38 -20 15 58 19 -5 -24 13 26 35 40 20 -13 -22 -9 49 31
7981 31 59 -15 -28 -21 13 42 68 38 12 16 2 12 58 51 6 -35 -29 2 17 47 21 -10 -32 -13 -31 7 29 10 -16 -31 -14 -14 31
8014 31 9 -2 -3 -33 -27 2 22 29 12 -18 -26 -14 36 32 21 -15 -31 -12 -10 68 36 15 -12 -27 -13 2 44 54 -2 -27 -31 -2 -14 36
8048 36 37 16 -30 -46 6 31 6 10 -19 -59 -25 2 31 25 -11 -44 -75 -8 32 14 -10 -39 -39 -48 17 16 28 -36 -20 -22 -33 -5 39 43
8082 43 9 -16 -26 -16 23 34 7 -3 -43 -2 10 7 37 12 -8 -56 -18 16 37 15 -28 -17 -54 -37 23 32 6 -11 -44 -20 2
8113 2 17 16 6 -23 -7 -7 7 32 11 -8 -54 -53 -30 20 25 10 -33 -42 -19 -22 27 13 2 -42 -38 -16 -4 27 26 10 -40 -40 4 30 46
8148 46 13 10 -29 -22 -7 23 18 -33 8 -39 -50 34 55 36 -5 -20 -8 -19 5 43 10 -40 -43 -32 22 24 41 0 -36 -42 -8 11 25
8181 25 44 23 -4 -26 -6 32 22 7 -17 -49
8191d9
##END NTUPLES=NMR FID
##END=
