##TITLE=1H ikalashn
IG-Meac(nlock)
25.10.2024
##JCAMPDX= 6.0         $$ Bruker NMR JCAMP-DX V2.0
##DATA TYPE= NMR FID
##DATA CLASS= NTUPLES
##ORIGIN= UXNMR, Bruker Analytische Messtechnik GmbH
##OWNER= root
$$ TOPSPIN		Version 1.3
$$ 2024-10-25 15:29:10.703 +0400  Irina@DPX200
$$ Compression mode = diff/dup
##.OBSERVE FREQUENCY= 200.131300845
##.OBSERVE NUCLEUS= ^1H
##.DELAY= (6, 6)
##.ACQUISITION MODE= SIMULTANEOUS
##.ACQUISITION SCHEME= undefined
##.AVERAGES= 8
##.DIGITISER RES= 18
##SPECTROMETER/DATA SYSTEM= spect
##.PULSE SEQUENCE= zg
##.SOLVENT NAME= DMSO
##.SHIFT REFERENCE= INTERNAL, DMSO, 1, 17.49637
##AUDIT TRAIL= $$ (NUMBER, WHEN, WHO, WHERE, WHAT)
$$ ##TITLE= Audit trail, TOPSPIN		Version 1.3
$$ ##JCAMPDX= 5.01
$$ ##ORIGIN= Bruker BioSpin GmbH
$$ ##OWNER= Irina
$$ $$ F:/spectra/data/iren/nmr/1H/4/audita.txt
$$ ##AUDIT TRAIL=  $$ (NUMBER, WHEN, WHO, WHERE, VERSION, WHAT)
(   1,<2024-10-25 15:28:52.375 +0400>,<Irina>,<DPX200>,<TOPSPIN 1.3>,
      <created by zg
	started at 2024-10-25 15:28:14.859 +0400,
	POWCHK disabled, PULCHK disabled
       configuration hash MD5:
       BE 6D 3F 07 2A EA 11 49 91 17 2B D3 AF B3 58 0D
       data hash MD5: 16K
       C9 9E 62 CD 66 0B 98 55 EF 7C AF 87 7B 42 06 CC>)
$$ ##END=
$$ 
$$ $$ hash MD5
$$ $$ F1 0E FD 41 7D BF 53 62 0A 45 C4 A8 10 E1 FE 6D
##$RELAX= 
##$RELAX= 
##$RELAX= 
##$RELAX= 
##$RELAX= 
##$RELAX= 
##$RELAX= 
##$RELAX= 
##$RELAX= 
$$ Bruker specific parameters
$$ --------------------------
##$DU= <F:/spectra>
##$EXPNO= 4
##$NAME= <1H>
##$PROCNO= 1
##$TYPE= <nmr>
##$USER= <iren>
##$AMP= (0..31)
100 100 100 100 100 100 100 100 100 100 100 100 100 100 100 100 100 100 
100 100 100 100 100 100 100 100 100 100 100 100 100 100 
##$ANAVPT= -1
##$AQSEQ= 0
##$AQ_mod= 1
##$AUNM= <au_zg>
##$AUTOPOS= <>
##$BF1= 200.13
##$BF2= 200.13
##$BF3= 200.13
##$BF4= 200.13
##$BF5= 200.13
##$BF6= 200.13
##$BF7= 200.13
##$BF8= 200.13
##$BYTORDA= 1
##$CFDGTYP= 0
##$CFRGTYP= 5
##$CHEMSTR= <none>
##$CNST= (0..63)
1 1 145 1 1 1 1 1 1 1 1 1 1 1 1 1 1 1 1 1 1 1 1 1 1 1 1 1 1 1 1 1 1 1 
1 1 1 1 1 1 1 1 1 1 1 1 1 1 1 1 1 1 1 1 1 1 1 1 1 1 1 1 1 1 
##$CPDPRG= <>
##$CPDPRG1= <>
##$CPDPRG2= <>
##$CPDPRG3= <>
##$CPDPRG4= <mlev>
##$CPDPRG5= <mlev>
##$CPDPRG6= <mlev>
##$CPDPRG7= <mlev>
##$CPDPRG8= <mlev>
##$CPDPRGB= <>
##$CPDPRGT= <>
##$D= (0..63)
0 2 0 0 0 0 0 0 0 0.06 0 0.03 0 0 0 0 0.0002 0 0 0 0 0 0 0 0 0 0 0 0 0 
0 0 0 0 0 0 0 0 0 0 0 0 0 0 0 0 0 0 0 0 0 0 0 0 0 0 0 0 0 0 0 0 0 0 
##$DATE= 1729855728
##$DBL= (0..7)
120 120 120 120 120 120 120 120 
##$DBP= (0..7)
150 150 150 150 150 150 150 150 
##$DBP07= 0
##$DBPNAM0= <>
##$DBPNAM1= <>
##$DBPNAM2= <>
##$DBPNAM3= <>
##$DBPNAM4= <>
##$DBPNAM5= <>
##$DBPNAM6= <>
##$DBPNAM7= <>
##$DBPOAL= (0..7)
0.5 0.5 0.5 0.5 0.5 0.5 0.5 0.5 
##$DBPOFFS= (0..7)
0 0 0 0 0 0 0 0 
##$DE= 6
##$DECBNUC= <off>
##$DECIM= 32
##$DECNUC= <off>
##$DECSTAT= 4
##$DIGMOD= 1
##$DIGTYP= 9
##$DL= (0..7)
0 120 120 120 120 120 120 120 
##$DP= (0..7)
150 150 150 150 150 150 150 150 
##$DP07= 0
##$DPNAME0= <>
$$ [...]
##$SW= 21.9926040160658
##$SWIBOX= (0..15)
0 0 2 0 0 0 0 0 0 0 0 0 0 0 0 0 
##$SW_h= 4401.40845070422
##$TD= 16384
##$TD0= 1
##$TE= 300
##$TE2= 300
##$TE3= 300
##$TEG= 300
##$TL= (0..7)
0 120 120 120 120 120 120 120 
##$TP= (0..7)
150 150 150 150 150 150 150 150 
##$TP07= 0
##$TPNAME0= <>
##$TPNAME1= <>
##$TPNAME2= <>
##$TPNAME3= <>
##$TPNAME4= <>
##$TPNAME5= <>
##$TPNAME6= <>
##$TPNAME7= <>
##$TPOAL= (0..7)
0.5 0.5 0.5 0.5 0.5 0.5 0.5 0.5 
##$TPOFFS= (0..7)
0 0 0 0 0 0 0 0 
##$TUNHIN= 0
##$TUNHOUT= 0
##$TUNXOUT= 0
##$USERA1= <user>
##$USERA2= <user>
##$USERA3= <user>
##$USERA4= <user>
##$USERA5= <user>
##$V9= 5
##$VALIST= <valist>
##$VCLIST= <CCCCCCCCCCCCCCC>
##$VD= 0
##$VDLIST= <DDDDDDDDDDDDDDD>
##$VPLIST= <PPPPPPPPPPPPPPP>
##$VTLIST= <TTTTTTTTTTTTTTT>
##$WBST= 1024
##$WBSW= 25
##$XGAIN= (0..3)
0 0 0 0 
##$XL= 0
##$YL= 0
##$YMAX_a= 323661
##$YMIN_a= -324908
##$ZGOPTNS= <>
##$ZL1= 120
##$ZL2= 120
##$ZL3= 120
##$ZL4= 120
##$ABSF1= 10
##$ABSF2= 0
##$ABSG= 5
##$ABSL= 3
##$ALPHA= 0
##$AQORDER= 0
##$ASSFAC= 0
##$ASSFACI= 0
##$ASSFACX= 0
##$ASSWID= 0
##$AUNMP= <proc_1d>
##$AXLEFT= 0
##$AXRIGHT= 0
##$AXTYPE= 0
##$AXUNIT= <>
##$AZFE= 0.1
##$AZFW= 0.1
##$BCFW= 1
##$BC_mod= 2
##$BYTORDP= 1
##$COROFFS= 0
##$CY= 7568.61572265625
##$DATMOD= 1
##$DC= 2
##$DFILT= <>
##$DTYPP= 0
##$F1P= 17.9538593292236
##$F2P= -4.03888763876832
##$FCOR= 0.5
##$FTSIZE= 32768
##$FT_mod= 4
##$GAMMA= 1
##$GB= 1
##$INTBC= 1
##$INTSCL= 1
##$ISEN= 128
##$LB= -0.5
##$LEV0= 0
##$LPBIN= 0
##$MAXI= 945.577
##$MC2= 0
##$MEAN= 0
##$ME_mod= 0
##$MI= -402.1523
##$NCOEF= 0
##$NC_proc= 0
##$NLEV= 6
##$NOISF1= 8.587773
##$NOISF2= 6.764455
##$NSP= 1
##$NTH_PI= 0
##$NZP= 0
##$OFFSET= 17.49637
##$PC= 1
##$PHC0= 11.76868
##$PHC1= 39.25309
##$PH_mod= 0
##$PKNL= yes
##$PPARMOD= 0
##$PPDIAG= 0
##$PPIPTYP= 0
##$PPMPNUM= 100
##$PPRESOL= 1
##$PSCAL= 0
##$PSIGN= 0
##$REVERSE= no
##$SF= 200.13
##$SI= 32768
##$SIGF1= 18.5376
##$SIGF2= -6.396296
##$SINO= 400
##$SIOLD= 32768
##$SREGLST= <1H.CDCl3>
##$SSB= 3
##$STSI= 0
##$STSR= 0
##$SW_p= 4401.40845070422
##$SYMM= 0
##$S_DEV= 0
##$TDeff= 0
##$TDoff= 0
##$TI= <>
##$TILT= no
##$TM1= 0
##$TM2= 0
##$TOPLEV= 0
##$USERP1= <user>
##$USERP2= <user>
##$USERP3= <user>
##$USERP4= <user>
##$USERP5= <user>
##$WDW= 1
##$XDIM= 8192
##$YMAX_p= 0
##$YMIN_p= 0
$$ End of Bruker specific parameters
$$ ---------------------------------
##NTUPLES= NMR FID
##VAR_NAME=  TIME,          FID/REAL,        FID/IMAG
##SYMBOL=    X,             R,               I
##VAR_TYPE=  INDEPENDENT,   DEPENDENT,       DEPENDENT
##VAR_FORM=  AFFN,          ASDF,            ASDF
##VAR_DIM=   8192,          8192,            8192
##UNITS=     SECONDS,       ARBITRARY UNITS, ARBITRARY UNITS
##FACTOR=    0.0002272,     1,               1
##FIRST=     0,             0,               0
##LAST=      1.8609952,     10,              -74
##MIN=       0,             -324908,         -324908
##MAX=       1.8609952,     323661,          323661
$$ Real data points
##PAGE= N=1
##DATA TABLE= (X++(R..R)), XYDATA
$$ [...]
2402e316J907R322k802q385K965N796k137k172K97j650K217M722m711o493O561
2417A21O706p161n507O170L374l628r76K1j116L947K274p200k485R064J874r021
2433c543q57P055p5l575N15o92k16M714p38p545J975Q656l035p803L387N339k749
2450H13j876J092j764J306M610l763o145N663O130o408m734N641K497l447j1J70
2466b26k067L443L176o429l279Q124K498q052j223O148J2k797P43j317p61N176
2482C169P3p847R59Q834j929p897K305N361j845j762M37k020J655N038l847o721
2498f037N552O829o171n485N380L197l187n95r2j606L677K869o663l077Q390K343
2514E324q343j148O494Ql237O84p96o11M574j78p237J322Q270k421p432K948N041
$$ plain form
2402 -5316 -3409 5913 3111 -5274 -2309 3487 1350 -822 -525 -2175 42 4764 53 -6440 121
2417 121 6827 -334 -5841 329 3703 75 -901 -880 -1996 1951 4225 -2975 -5460 3604 5478 -3543
2433 -3543 -4400 2655 2580 -995 -480 -1172 -1388 3326 2588 -4957 -2982 5674 2639 -5164 -1777 3562 813
2450 813 -1063 29 -1735 -429 4181 418 -5727 -64 6066 -342 -5076 565 3062 -385 -396 -226
2466 -226 -2293 1150 4326 -2103 -5382 2742 5240 -2812 -4035 2113 2125 -672 71 -1246 -2007 3169
2482 3169 3242 -4605 -3646 5188 3259 -4638 -2333 3028 1183 -579 -142 -2162 -507 4531 684 -6037
2498 -6037 -485 6344 173 -5312 68 3265 78 -517 -609 -2215 1462 4331 -2332 -5409 2981 5324
2514 5324 -3019 -4167 2327 2335 -902 -218 -1014 -1625 2949 2771 -4466 -3144 5126 2705 -4727 -1779 3262
2531C262k570j700J234j812Q36M614l093o070M871O037n652m640N091K367l215
2546d40K05K81k342L000L510n755l607P320K771p264j377N495k0k386J015j446
2562a040j204M986O40p411L48Q244j402p250J974M733j742j273O12k315J234N113
2578D247l267o563M844O527n509n071M824K778k863k03q9j960L397L115o123l240
2594e156P686K463p618j186N862m1k810Q42r33r14M453K49o907Q61P759j919o912
2611d221K514M598k325j364J221j999O06M630k671n943M341N781n105m322M635
2626C76K028k909M83K31k538K805L586n373l515O785K561o687j113M995l26k026
2642f37J287j545j452M849Q01p023K97P643j389o585K020M100j824p87P56k588
$$ plain form
2531 3262 692 -1008 226 -1586 -750 3864 771 -5299 -428 5609 -43 -4683 408 2775 -440
2546 -440 -235 46 -2296 704 4214 -1541 -5148 2172 4943 -2321 -3698 1797 1777 -609 406 -1040
2562 -1040 -2244 2742 3382 -4029 -3681 4563 3161 -4089 -2115 2618 876 -397 215 -2100 -866 4247
2578 4247 980 -5583 -739 5788 279 -4792 32 2810 -53 -256 -345 -2305 1092 4207 -1916 -5156
2594 -5156 2530 4993 -2625 -3811 2051 2010 -800 42 -891 -1805 2648 2897 -4010 -3149 4610 2691 -4221
2611 -4221 -1707 2891 566 -798 423 -1576 -970 3660 989 -4954 -613 5168 63 -4259 376
2626 376 2404 -505 -22 209 -2329 476 4062 -1311 -4826 1959 4520 -2167 -3280 1715 1389 -637
2642 -637 650 -895 -2347 2502 3303 -3720 -3423 4220 2831 -3754 -1734 2366 542 -245 511 -2077
2658b077J027N141k978o369M482O123n060m610M410K292k520K15k84k257L361
2673H96L321n878l336P228K480p061j148N308j40k333R88j248j061M538M00o750
2689c796O95P424j774o488K416M169k275j007J218k207N80M630k575n750M202
2704e38N430m933l916M481J613k762Q02J40k692K795L575n218l385O493K328o295
2720b082q34M580o23j648J542j798j643M869R74o841J44P258j218o088J854L584
2736B030j758k79P50k920Q69N300k674o334M073N944m597m342L988J968k210N35
2752C43m29k519L303L495n636l406O853K472o615j080M874k64j960J122j477j186
2768b110M585M95o602O22P108j695o072K321L715k177o02J131k458N80M712k512
$$ plain form
2658 -2077 -1050 4091 1113 -5256 -774 5349 289 -4321 89 2381 -139 76 -208 -2465 896
2673 896 4217 -1661 -4997 2231 4711 -2350 -3498 1810 1670 -663 325 -923 -1984 2554 2954 -3796
2689 -3796 -3101 4323 2549 -3939 -1523 2646 371 -636 582 -1625 -1045 3585 1010 -4740 -538
2704 -538 4892 -41 -3957 524 2137 -625 177 317 -2375 420 3995 -1223 -4608 1885 4213 -2082
2720 -2082 -2916 1664 1041 -607 935 -863 -2506 2363 3337 -3504 -3360 3898 2680 -3408 -1554 2030
2736 2030 272 -7 743 -2177 -1308 3992 1318 -5016 -943 5001 404 -3938 50 2018 -192 343
2752 343 -86 -2605 698 4193 -1443 -4849 2004 4476 -2139 -3219 1655 1391 -569 553 -924 -2110
2768 -2110 2475 2970 -3632 -3010 4098 2403 -3669 -1348 2367 190 -412 719 -1739 -1159 3553 1041
2784A041n630M011N171m635l583M129J271k436J100p6k887K832L642n034l331
2799d415O106K218n775p16M065p29j257J637j945j782M781J139o492o9O763j024
2815B505n537J713L064j645K1Q02l036P04N175k370o044L674N525m145l890L540
2831E6J588j876Q24n96k651L218L515n313l330O324K337n956r70M209l51j385
2847c57J158j834j193M621N68o374M93O636j493n442K049L104j877j39Q80k649
2863a849O84M628k418n328L730M748m216l165L673R62k075J222k66k794K734L429
2879C699m682l070N595J962n203n29L574q38r59J644j969j688M473J063n969l4
2895b931O087r85m835J600K495j536M09O99l115O85M960k172n607L321M975l672
$$ plain form
2784 1041 -4589 -578 4593 -42 -3625 504 1775 -661 439 363 -2524 308 3950 -1084 -4415
2799 -4415 1691 3909 -1866 -2582 1483 754 -503 1134 -811 -2593 2188 3327 -3165 -3234 3529 2505
2815 2505 -3032 -1319 1745 100 121 923 -2113 -1409 3766 1396 -4648 -974 4551 406 -3484 56
2831 56 1644 -232 592 -4 -2655 563 4078 -1235 -4565 1759 4096 -1860 -2830 1379 1028 -357
2847 -357 801 -1033 -2226 2395 2963 -3411 -2918 3718 2225 -3217 -1168 1936 59 -80 800 -1849
2863 -1849 -1165 3463 1045 -4283 -553 4195 -21 -3186 487 1449 -626 596 330 -2464 270 3699
2879 3699 -983 -4053 1542 3504 -1699 -2228 1346 508 -451 1193 -776 -2464 2009 3072 -2897 -2931
2895 -2931 3156 2171 -2664 -1064 1431 -105 304 1003 -2112 -1427 3533 1361 -4246 -925 4050 378
2911C78l324L018J101j384J117q97k736L267L391n041l122N773K117n239p94L475
2927A100m18q29J124k084j117M546M86n978M91O037j380m814J844K579j614J30
2943A03O59k618P60M338k304m868L445M261l831k741L245P04j710J259m16k635
2959b349K625L140m338k752N083J679m593l58K990q60n52J558k095j559M293R53
2975B865n498j5N448r11m121J412J884j319P90M98l167P69M700k082n123L034
2991h36M366l235k741K533O88r83J275j101k634L164L137m664k792N205J829m580
3007a369o10K855m15m41J017k171r71M287M09n472M54N416j191m208J537K115
3023A242j294L51M18k569Q43M063k169m482L102L851l335k391K703N22j286J273
$$ plain form
2911 378 -2946 72 1173 -211 906 9 -2727 540 3931 -1110 -4232 1541 3658 -1581 -2375 1100
2927 1100 682 -147 977 -1107 -2224 2322 2808 -3170 -2679 3358 1978 -2836 -992 1587 -27 103
2943 103 762 -1856 -1096 3242 938 -3930 -485 3776 -55 -2796 449 1153 -557 702 286 -2349
2959 -2349 276 3416 -922 -3674 1409 3088 -1505 -1863 1127 267 -285 1273 -822 -2381 1912 2865
2975 2865 -2633 -2648 2800 1889 -2232 -820 1064 -255 535 1033 -2134 -1365 3335 1253 -3870 -836
2991 -836 3530 295 -2446 87 775 -208 1067 -34 -2668 496 3633 -1031 -3823 1382 3211 -1369
3007 -1369 -1979 876 461 20 1037 -1134 -2105 2182 2591 -2881 -2427 2989 1798 -2410 -873 1242
3023 1242 -52 299 717 -1852 -1009 3054 885 -3597 -495 3356 21 -2370 333 855 -431 842
3039H42o68k466K598K870m023k467M545J457l975k41K434q41k06J417k131j366
3055b221L986P89m945Q5M744q66l453J287J392j129R69L58l009P65M257j899m502
3072c392K655L767k749k271K043M28o25J273j171k467K933K887m165k559M515
3087A102J692l826o19K241l44m9Q77k213q61M007L94m938L05M760r17l574J188
3104g75J628q95N38J57k488R47L703k054l967K768L330k863j984K217L31q86J173
3121H80q19k162K487K433l644k037L992J141l368r9J905p58L2J218k051j115L577
3138A612O09m299J02M028p48k823J038R99q56J056J80k778P45L810j631l976K216
3155g16L253k195j905J517K70k85J243j248k263K685K606l632k330L835J559l144
$$ plain form
3039 842 174 -2292 306 3176 -847 -3314 1231 2688 -1287 -1528 906 65 -141 1276 -855 -2221
3055 -2221 1765 2554 -2391 -2306 2438 1572 -1881 -594 798 -331 638 996 -2013 -1248 3009 1110 -3392
3072 -3392 -737 3030 281 -1990 53 481 -144 1129 -42 -2509 424 3311 -854 -3413 1102
3087 1102 2794 -1032 -1651 590 246 197 1074 -1139 -2000 2007 2401 -2537 -2232 2528 1611 -1963 -775
3104 -775 853 -42 496 653 -1835 -888 2815 761 -3206 -438 2892 29 -1955 262 593 -293 880
3121 880 61 -2101 386 2819 -825 -2862 1130 2271 -1097 -1196 709 -49 -17 1201 -850 -1965 1612
3138 1612 2221 -2078 -1976 2052 1304 -1519 -481 518 -338 718 898 -1880 -1135 2675 1044 -2932 -716
3155 -716 2537 342 -1563 -46 224 -61 1182 -66 -2329 356 2962 -670 -3000 835 2394 -750
3171g50o00J686k27K29P19k173p15L662L25m366K50M109p44k982R19J249o43O63
3189F11m3k314J001L288j892l473K448K850k418j664J755K20n43J078r47j900
3205a943K327K128l256j754L414J036k811j53J496n82K40R73j952r29L210N47
3221A991l754J1L441n21k336P38P33o03J048P3k522O79L374j382l465J804K816
3238B125j759j607J156J50p8J170j228k043K405K339l157k075L238J398k564n66
3254a096J223j40M29N84k088o16L328L37l855Q8L566m59k504N66R50l35P48k19
3272E07k168R53L011j601l160J973K599j877j543J274K71k53R10r70j702K080
3288C04J937k779j676K870J073k322k89J179l92K79Q03j720q39K770N60l195j39
$$ plain form
3171 -750 -1350 336 109 338 1057 -1116 -1831 1831 2156 -2210 -1960 2149 1405 -1577 -658 591 -52 611
3189 611 568 -1746 -745 2543 651 -2822 -374 2476 58 -1606 149 369 -174 904 -43 -1943
3205 -1943 384 2512 -744 -2498 916 1952 -859 -1012 484 -98 142 1115 -837 -1766 1444 1991
3221 1991 -1763 -1752 1689 1168 -1168 -430 303 -300 748 821 -1701 -1022 2352 970 -2495 -691 2125
3238 2125 366 -1241 -85 65 -13 1157 -71 -2114 291 2630 -527 -2602 636 2034 -530 -1096
3254 -1096 127 -13 416 1000 -1088 -1704 1624 1961 -1894 -1806 1760 1301 -1203 -637 313 -22 726 507
3272 507 -1661 -708 2303 702 -2458 -485 2114 237 -1306 -32 239 -14 896 -74 -1776 304
3288 304 2241 -538 -2214 656 1729 -593 -882 297 -95 184 987 -733 -1572 1198 1758 -1437 -1576
3305a576K938k94j986N20N68m32R50M8k216N05K958j052l031J381K433j285j374
3322i45P61R9J28J067j141j881K070K185k620j968K588J408j975o57Q11k4N98
3339E04M87j967o16K924N11l331k19L035p1k100J88P59q8P04k68j927P65K671
3357A961j215k810J457K352j380j443Q98L40j11P14q39j455J726J734k264j579
3373a914K340J064j852m06R23k17K78O50j462p78K340O23k691k97K425m3j609
3390f26K45M20k47Q77J3j960L56K565p11k615R08K115q39j188M39O4K43R57j007
3409Ij694J685J987k046j864J998J388j472p27N55Q3N72M03j661o44K455O18k760
3427a115m41K519K12j747p7O51P9N84k64j644N70K308q47k487J020K118r29j359
$$ plain form
3305 -1576 1362 1068 -918 -398 170 -262 688 736 -1480 -975 1983 931 -2100 -719 1714 429 -945
3322 -945 -184 -85 43 1110 -31 -1912 158 2343 -277 -2245 343 1751 -224 -881 -70 -94 504
3339 504 991 -976 -1592 1332 1843 -1488 -1707 1328 1257 -843 -655 104 16 720 452 -1475 -710 1961
3357 1961 746 -2064 -607 1745 365 -1078 -180 160 49 763 -76 -1531 195 1929 -335 -1914
3373 -1914 426 1490 -362 -768 155 -62 216 866 -596 -1374 966 1589 -1102 -1399 1026 983 -626
3390 -626 -381 39 -208 669 682 -1278 -922 1643 932 -1683 -775 1340 501 -687 -248 -184 59 1016 9
3409 9 -1685 0 1987 -59 -1923 75 1463 -9 -736 -181 -98 474 877 -784 -1428 1027 1645 -1115
3427 -1115 -1556 963 1175 -572 -649 2 81 665 401 -1243 -673 1635 788 -1699 -679 1439 510 -849
3445h49N61L83L3N81p69j281J416J597j827j514J846J122j448n25O57n3L01N11
3463G42j265p02J959O59k238m57K036J61j328M7L62j38P28M4j641J74K178m08
3481I13k243N43J852n10j064K33J21J95Q28p70j491J250J828j529j785J500J387
3498A258j089q15L79J66N27L57j391o91K052P71k302o99K124M92j485l04N32J86
3516F8N44k19j490L73K090n16k264O27J958n57j306L18M17J28M65o55j153J156
3534a6J486j446j496J476J170j165o42N59P4K07M29j014o92J585P53j858o02J720
3552E28L67j202j06L83p7N40J27j356n5J870o8k006J98J685j90j057R2J88J74
3571C5O92n40j387Q71J777j090j770J068J439p68q86K40K23M51L96j168p87J690
$$ plain form
3445 -849 -288 95 128 709 -60 -1341 75 1672 -155 -1669 177 1299 -149 -674 -17 -70 231 742
3463 742 -523 -1225 734 1393 -845 -1302 734 895 -433 -386 -24 -162 566 610 -1031 -857 1321 913
3481 913 -1330 -787 1065 555 -509 -276 -155 40 868 98 -1393 -143 1685 156 -1629 -129 1258
3498 1258 169 -646 -267 -101 426 783 -608 -1299 753 1524 -778 -1477 647 1139 -346 -650 -118 68
3516 68 612 393 -1097 -724 1366 850 -1414 -787 1171 614 -692 -374 43 171 636 -19 -1172 -16
3534 -16 1470 24 -1472 4 1174 9 -633 -74 0 207 636 -378 -1070 515 1268 -590 -1192 528
3552 528 895 -307 -413 -30 -107 433 560 -796 -851 1019 951 -1055 -857 828 638 -419 -327 -139 35
3571 35 727 187 -1200 -329 1448 358 -1412 -344 1095 327 -559 -319 -96 355 751 -417 -1204 486
3589D86R70j918r31J761P40j241m73M45K37M65j08j309J12J859j76k044K52J815
3607I42k55j250J34M63J08L64m58j057Q20J455j046j519J113J248r11p62M73J83
3625D5J24L52p32p52J253R12j523q45J454O02j063k67L90k0L94K10j111k78J623
3644G68K29j778j38J567L6j014j3K42J10N75k83j284N29J655o88j707P24J401
3662I31n48q79J82K26L22M25r11q51J349J073j559j067J480Q56j062n35L93K31
3680E6L79Nj122j14J644J44j880n1J699Jj213j2M92J15K99k96j009N44J438p26
3700C93j540Q01J324o96q74M21K55K8L42n42p94J002R93j274r41J266O85r64l38
3719d53M38l6K34L08q85m37J372M07j555k83J411J29r43j1K42%N37j02j162K51
$$ plain form
3589 486 1456 -462 -1393 368 1108 -133 -606 -161 76 541 433 -876 -764 1095 919 -1125 -873 942
3607 942 687 -563 -429 34 142 506 48 -1009 -189 1266 220 -1299 -186 1062 151 -611 -138 45
3625 45 169 521 -211 -963 290 1202 -321 -1166 288 890 -173 -440 -50 -70 324 534 -577 -855 768
3644 768 997 -781 -919 648 684 -330 -343 -101 9 584 301 -983 -454 1201 513 -1194 -470 931
3662 931 383 -496 -314 -88 234 659 -252 -1103 246 1319 -240 -1307 173 1029 -33 -568 -175 56
3680 56 435 440 -682 -796 848 992 -888 -939 760 761 -452 -464 28 143 442 146 -863 -319 1119 393
3700 393 -1147 -346 978 282 -592 -171 84 112 454 -88 -882 120 1113 -161 -1102 164 849 -115 -453
3719 -453 -15 -51 183 491 -394 -831 541 948 -607 -890 521 650 -293 -304 -62 -62 475 373 -789 -538
3739e38J568m25j625M94J358m13q53J76J80K30M62o80r51J060J219j307j192J266
3757B9R66r50o03M01J90L03J34r87l30J518L63j752k77J633J59j210m4N09K8K71
3777C51j24r72L17J413m93j562O24J361o02r04M44K67q3L58l66q36P95J070j095
3796c7j016J150P51r37l51M79p6J50L97p70n80J263N69j483m12J346K14r24j0
3815b77K61j00M84Q6j146L0J556j85j650L15J388l19q50J89J36J02N59m87j086
3834i94Q55J350j084j337J125J038q82n96M28R7K09L19q68n68J408N98j659m82
3852a043J587K81j179q5N08l5K75L1r79Q9J461k96j598M50J407n13r16M13K48
3871A06j36M07k55r34O77J170r65j142J072Q45r08l66M82j12P4N18o79p29J170
$$ plain form
3739 -538 1030 605 -1020 -526 832 419 -434 -258 -78 152 614 -66 -1017 43 1262 -45 -1237 29
3757 29 995 45 -558 -157 33 336 470 -517 -847 671 1034 -718 -995 638 797 -413 -457 52 80 351
3777 351 227 -745 -428 985 492 -1070 -446 915 313 -591 -147 120 37 395 29 -807 -12 1058 -37
3796 -37 -1053 97 848 -89 -440 39 -37 113 510 -260 -840 423 992 -491 -903 443 657 -267 -277
3815 -277 -16 -116 368 454 -692 -662 894 709 -941 -626 762 443 -407 -218 -82 20 579 92 -994
3834 -994 -139 1211 127 -1210 -85 953 71 -525 -97 0 209 528 -340 -908 500 1098 -561 -1043
3852 -1043 544 825 -354 -439 69 34 309 340 -639 -550 911 615 -983 -533 874 361 -555 -142 106
3871 106 -30 377 122 -812 -135 1035 70 -1072 0 845 -63 -429 53 -59 15 533 -146 -875 295
3890B95P40j413n44J321K48r20K3K92k20M38K93j109k03J531J3j609J74J359k78
3909D31q21K58R4n9O26k71j173O10J457q92j412R77J078q11n51L83QJ85M66q13
3929b30p55J333P83j570o32J498L65j077j02M30j04L38J68j031o6J495j24j636
3947i17L25J409m30q96M01J98j81M94j64j027N43J279q52j215R94Q63q87l61N43
3966A19j91j1O24n70q55J067Q29j310o22J278K62r03J00K79l60M33M59j084l79
3985h35J503J69j591O7J328k36p64K83J6j33P17j46j274M86J532p59j447Q59J067
4004H42p33m94L54j01J95N87p58q95J250R18j505p22J418L94j022m7L70j99L86
4023B38K80j065k04J532j6j620K35J380l88q64M32J25k45N66p3j086M34J345p75
$$ plain form
3890 295 1035 -378 -922 399 647 -273 -250 42 -178 260 553 -556 -759 772 785 -824 -650 709 431
3909 431 -390 -132 -38 -97 529 258 -915 -305 1152 260 -1152 -175 903 92 -459 -76 -68 117 583 -230
3929 -230 -985 348 1131 -439 -1071 427 792 -285 -387 43 -61 277 445 -586 -652 843 719 -917
3947 -917 -592 817 387 -509 -108 90 -91 403 239 -788 -245 1034 182 -1033 -39 824 -63 -424 119
3966 119 -72 -83 541 -29 -884 183 1012 -298 -920 358 620 -283 -183 96 -264 169 628 -456 -835
3985 -835 668 837 -754 -687 641 405 -359 -76 -60 -193 524 378 -896 -410 1122 363 -1084 -225 842
4004 842 109 -385 -31 -132 63 650 -108 -1003 247 1165 -340 -1062 356 750 -272 -319 51 -148 238
4023 238 518 -547 -751 781 765 -855 -620 760 372 -492 -60 65 -180 386 313 -773 -339 1006 231
4042B31j254R32Q82q54l36N48k58l3P14n23r64J016R38j286o72J232K90q67J23
4061a41K63m27M41N57j084m96J501K63j561J1J257k28o66L07p3k20Q09n3j321
4080h61L61J553o48j427P64J015o74l97L27k44J84P53p31j025J191J017j406p96
4098a044J346M08r37j8L02k96M60M01j128l37J561J48j679J33J396l24q33M09
4116c2P0k66O53j9j197L77J435p02j329Q79R03q29l00N23l20m5Q12n12j055R90
4136C6R94j232o96J188K51q23J87K44n25M52O55j062n65J444L35j499k7J181k28
4155C10n71L49j79k90Q83O0j404K64J591n34j436O82R73o08l15K99l74J93Q73
4174G66o85j174J130J157j346q89J256M61q58KK10l51N26N20j188m51J575K21
$$ plain form
4042 231 -1023 -91 791 -63 -399 149 -109 -142 572 49 -915 101 1039 -247 -919 313 603 -264 -141
4061 -141 122 -305 136 693 -391 -887 614 877 -684 -673 584 356 -310 -3 -76 -296 513 460 -861
4080 -861 -500 1053 405 -1022 -258 757 83 -314 13 -231 -47 706 -25 -1050 141 1158 -248 -1044
4098 -1044 302 710 -227 -245 57 -239 221 622 -506 -843 718 866 -813 -680 716 392 -441 -32
4116 -32 38 -228 425 406 -791 -414 1021 319 -1010 -131 772 -57 -357 166 -154 -199 613 101 -954 36
4136 36 1030 -202 -898 290 541 -282 -95 149 -376 76 731 -331 -896 548 883 -616 -643 538 310
4155 310 -261 88 -91 -381 502 562 -842 -578 1013 479 -957 -275 698 90 -225 74 -300 -107 766
4174 766 81 -1093 37 1194 -152 -1041 215 676 -182 -180 30 -321 205 725 -463 -914 661 882
4192H82j616K9J344k70p49L88j2k95P37L6j257L11J465o34j303Q00Q53p59k51
4211c01N05l94k1Q60m97j087R46J002j177o75J110K23p64K41J67n68N10O96j072
4230b96o37J423L80j433o2J100k15m89L62k54l36R69J10j432J61J600m26j419
4248h94O02Q98n48k17K73m66J67R82o52j232J048J192j235q86J140M20p35O3J15
4267C5m29N91N74j196n23J561K92j576LJ247k48o35L60j22k71Q05M2j310L00J456
4287I56n97j279P49Q17o98j89M26m44L1R04n28j101R50J002j141o76J058K08p01
4306b53K80J12o18N41P55j101o49J402L81j375n4J026k48m01M13l44l68R99J76
4325F74j447J12J564l96j318N38P96m99j01K34n80J91J063o57j271J011J188j160
$$ plain form
4192 882 -734 -705 639 369 -380 8 -4 -299 438 474 -783 -472 993 359 -944 -144 709 -50 -301
4211 -301 204 -190 -211 649 152 -935 11 1013 -164 -839 271 494 -270 -29 138 -430 80 776 -296
4230 -296 -933 490 870 -563 -625 475 260 -229 133 -121 -457 512 622 -810 -649 951 525 -894
4248 -894 -292 606 58 -159 114 -352 -185 797 145 -1087 -39 1153 -82 -968 172 592 -143 -80 35
4267 35 -394 197 771 -425 -948 613 905 -671 -668 579 331 -304 56 -66 -337 468 510 -800 -500 956
4287 956 359 -920 -171 646 -52 -241 185 -259 -228 676 148 -953 -3 999 -142 -818 240 448 -253
4306 -253 27 139 -479 62 817 -284 -933 469 850 -525 -579 447 199 -202 211 -133 -501 498 674
4325 674 -773 -661 903 507 -811 -273 523 24 -77 157 -423 -232 831 174 -1097 -86 1102 -58
4343e8q55J034L81o20J11om71O95O18j258n55J561L29j518l2J146k03m98K90k28
4363a37k33R14nj365L07J470n49j281O95P82o33j26L44m91Q4R42n49j131R35J014
4383I87j106o64J000J87o37L02O5o49N63P68j087o66J353M03j310n0R25k51l07
4402a74M15m08l87J055K01j459P5J533l25j267M77O98m15jJ58o59K32J130o53
4421B26j323R84J195j078q39R06L48m76J39j43m94P66O70j280n98J517L92j455
4439e43j05J062j65l99K69l21k19R61K7j380K47J468m88j239O23P25n62p7K93
4458A77n23J13R71n48j137Q97R93j026o54R17J71n49L32l0o33O03P63j080o63
4477i06J303L90j207p7Q21k24j90L62m83l51J065J88j419N9J429k65j130L89N64
$$ plain form
4343 -58 -913 121 502 -118 -7 -13 -484 211 829 -429 -984 577 906 -612 -644 502 299 -199 91 -137
4363 -137 -370 544 539 -826 -519 951 402 -879 -184 598 -35 -161 183 -308 -224 718 169 -962 -27 987
4383 987 -119 -783 217 404 -233 69 134 -515 48 816 -271 -937 416 819 -491 -541 384 133 -174
4402 -174 241 -167 -554 501 702 -757 -682 851 526 -741 -264 434 19 18 176 -483 -251 879 226
4421 226 -1097 -113 1082 4 -835 71 419 -57 82 -61 -555 211 881 -399 -997 520 912 -543
4439 -543 -648 414 249 -150 119 -202 -421 540 567 -813 -566 902 414 -825 -202 523 -39 -116 177
4458 177 -346 -233 738 190 -947 -50 943 -83 -737 180 351 -198 134 104 -529 74 837 -243 -906
4477 -906 397 787 -420 -497 324 100 -90 272 -211 -562 503 691 -728 -669 760 495 -635 -246 318
4496C18l34R3J17p27K61J134o12j283Q69J156r37p97P56L02l44J84k16n40P92
4515A92O86j225o35J431M17j311j36R13j10k80K07m06j76J024j2j359K16J414
4533H50m14j164N03O68m45k8J62n25J86R50n93j074Q70R52r61o07P99J43m19K87
4553A40r2n98O25P08j026n95J200L47j070n1O68k00j05L42n11l50J048J84j317
4572f53L4J296k32r84L18M59k66J74N3p39K59J115n73j227P82J087q10p49O29
4591b7K71k24J87k96n27Q16O77j213o26J352M44j208j92P67j2j81J45m69j33J029
4611E80j8j333K17J335l59j059M06N85l15mR0n48K59Q97n87r99Q06Q65q58n48
4631e88O82J28l19K83j70n36O20O41r71n55J098L28r49o5N70j71k7K83n32k96
$$ plain form
4496 318 -16 77 194 -533 -272 862 250 -1033 -164 992 55 -742 14 316 -28 156 -60 -600 192
4515 192 878 -347 -982 449 866 -445 -581 332 222 -58 149 -257 -433 591 579 -780 -564 850
4533 850 436 -728 -225 443 -2 -30 132 -393 -207 743 150 -924 -54 898 -63 -670 129 272 -147 140
4553 140 48 -550 75 783 -243 -838 362 709 -361 -412 256 56 -49 293 -218 -568 480 664 -653
4572 -653 -619 677 445 -539 -221 238 -28 146 199 -540 -281 834 261 -966 -184 903 93 -656 -27
4591 -27 244 20 207 -89 -616 200 877 -336 -962 390 834 -374 -566 201 189 8 153 -316 -449 580
4611 580 562 -771 -554 781 422 -637 -231 354 39 35 125 -423 -164 733 146 -853 -47 818 -40 -588
4631 -588 94 222 -97 186 16 -520 100 741 -230 -785 313 641 -308 -373 197 26 -1 282 -250 -546
4651e46J010J71j242oJ208j52r03K39L71j67J96np36K87J075n23j184O87J036
4670H16o75o87M70K36j02K00l61n24Q24O60j125o20J214M55j042k47O35L5p5Q5
4690A72n13q3J009k2j272J79J222k65r69L02M94j96M4k0n38L13Q54n77r46P28
4710h4Q46p52n29N59J54k20J95k00m65O06N86r05n32J010L39q49j07M86j00LK30
4731B71n08k53R20J71j112m4J074r0p74J47L02r8K13n7o87K44J013m45j091N54
4751b50R31n18o00L11K00K0J89m17m87P92O26j016o20J056M96q85k97M83J29L4
4771A77j6n21m9R56j5j160Q9J137j58q84J63M57o1K8j09m72L23P80n22q82O37
4792a02P92o21n33M39J88j36J31k12l95N61N13p91n02Q54L58p32j32M00n4K9J76
$$ plain form
4651 -546 464 635 -607 -613 595 443 -460 -221 150 -17 179 174 -562 -275 800 277 -907 -220 816
4670 816 141 -546 -76 160 58 258 -103 -627 197 857 -268 -888 326 781 -261 -508 127 162 87 172
4690 172 -341 -424 585 563 -709 -530 692 427 -542 -240 254 58 102 82 -456 -143 711 134 -812 -84
4710 -84 762 10 -519 40 194 -26 169 -31 -496 110 696 -209 -741 269 608 -241 -348 138 38 41 271
4731 271 -237 -490 430 601 -511 -555 519 429 -345 -198 104 6 219 162 -525 -281 732 287 -804 -250
4751 -250 681 163 -437 -126 74 94 283 -134 -621 171 797 -219 -839 217 713 -172 -469 14 143 177
4771 177 161 -360 -409 547 532 -628 -539 598 440 -444 -281 176 115 143 34 -438 -115 665 143 -739 -102
4792 -102 690 69 -464 -25 163 27 158 -54 -449 112 625 -166 -668 186 544 -188 -320 80 26 55 231
4813B31m71k08Q23J63r69q4R24j5o62O1K47k1K13q6o18K29Q97l62r88M36Q48l72
4835B16n72J84K25J00J20m19m25P21N95q91o23Q97N28p19l68L77J97O3o1n05k7
4856c87Q69L5j060OJ026k8q15K0M44K0Qj48m01K88P11m32q26N13P60m82n40L34
4878h5K49q3O4k23l14N07M53o95m73P38L76o08k12L27M0L4J01m09j68P07J60q57
4900c71j23Q14P3n88l0K19N0J78j07n48J97Q01k71q91K84Q12k31n67Q3K46J22
4921A52J01l67m03O02N95p47o46P36N97n89m39L00K53P3q7m69k3P88R2r61j11
4942e53R59Q9p62p2M14J05j3j93l61K87O46l80p80M08P64l74n90K50L10l4ok21
4964a07k52M49M30o20m65O35M23n43k68L00J06RM7l27j51N85K07p30k09P17J68
$$ plain form
4813 231 -240 -448 375 538 -431 -515 409 394 -268 -207 40 19 232 146 -472 -243 654 292 -696 -260 588 216
4835 216 -356 -172 53 153 273 -146 -571 150 745 -146 -769 128 656 -63 -431 -54 143 206 145 -360 -387
4856 -387 482 517 -543 -537 489 461 -354 -334 110 130 138 -10 -411 -123 588 156 -670 -157 603 121 -419 -85
4878 -85 164 81 145 -78 -392 115 568 -127 -600 138 514 -94 -306 21 61 95 196 -213 -381 326 486 -371
4900 -371 -494 320 393 -195 -225 -6 44 222 115 -433 -236 565 294 -597 -313 499 268 -299 -216 30 152
4921 152 253 -114 -517 85 680 -67 -713 23 620 31 -408 -108 145 218 131 -338 -361 427 519 -442 -553
4942 -553 406 495 -267 -339 75 180 167 -26 -387 -100 546 166 -614 -206 558 184 -406 -156 154 120 114 -107
4964 -107 -359 90 520 -100 -565 70 493 -50 -318 -18 88 97 144 -183 -334 251 458 -272 -481 236 404
4985D04n51r7K47N7J12n5m63Q3P39j23q53J48P95j20n92M5K61J25P1l01m05M91
5007A8O08o09o95O19O56n01n11K47L14O7j07m28n5P19J60q74k06Q88K20p47j87
5028d04M38J86n0k11l02K24O16k63p96L01P83k64o26J65L61j0p8j48k16L48M14
5049D68m85n19N44M82m83l46L16J54o3M5k32j85M76K77o52k91O76K40n45j65L03
5070A5O7K8j2l96L1O58j3q30M6Q02l7o09lL05J12M1k45l72L70O37m84p45N03P16
5094E85m32n53K28L36N4j05l50j20O34K61q23l28Q55L21p30k65M56J99r4j53k74
5115b98J37N99j63p87J72Q34j73o98J29M46o0j05r4k11K58M63m05o02N23N58m88
5136C5m35L74K06j23J3j49k12M18L32o11l47O69L03n91j88L49N7j1N0l56q2O21
$$ plain form
4985 404 -147 -244 3 60 172 117 -346 -263 476 353 -500 -352 443 323 -269 -224 37 162 233 -68 -473 18
5007 18 626 17 -678 -59 597 96 -415 -168 146 213 106 -322 -377 342 502 -372 -578 310 530 -217 -404
5028 -404 34 220 170 -41 -343 -119 497 234 -562 -261 522 258 -368 -203 158 148 70 -78 -294 54 468
5049 468 -17 -536 8 490 7 -339 -23 131 68 113 -119 -304 172 449 -203 -494 182 422 -123 -288 15
5070 15 82 110 98 -298 -267 391 378 -452 -406 396 359 -250 -253 52 164 205 -40 -412 -42 595 111 -634 -131 585
5094 585 153 -400 -172 164 218 113 -237 -357 277 538 -285 -613 242 563 -167 -432 24 223 129 -24 -298
5115 -298 -161 438 275 -512 -340 494 321 -377 -248 198 138 33 -61 -272 -14 449 44 -558 -35 523 35
5136 35 -400 -26 180 57 70 -79 -291 127 459 -152 -499 170 473 -118 -306 43 100 89 139 -217 -299 322
5158C22R8q10n2Q04J2o40qL36N6N1j70l87K74O72l88p98M29P82l78o14K32L41
5180A64J0n9k83k21N88L79p79m48Q50M15p55l22N05K03j43q8k77M6O34n6q59R0
5202d06R26j37p82J37M96q3j28l2k51J99N39l65o98M86O61m89n12M07K30j90M9
5223E7q3k81L65M23n75m54O82L47o12k00M05K1o7J27l07j94O29J88q13j41Q31
5244C48O6o79J7L42k3O6n0m59J74P56k95q96L84Q71m05o52K83L16l9J4k37l27
5266d25N56N00p76n73Q79M97p94l47N31J74j51j5l02n5O78N8r25RR92r2q59J66
5288b74N15j32j00L0k98J41O10l26p51M61P32n32n27M59K22k56R3k8l43L27N02
5309E25n99m96P04L81o63j75M57n3r8J99k85k94O46K71q76j49Q79K8o97P5L40
$$ plain form
5158 322 420 -390 -442 362 374 -266 -274 62 118 169 -1 -388 -114 558 170 -628 -199 583 205 -409 -177 164
5180 164 174 115 -168 -389 199 578 -201 -649 201 616 -139 -461 44 247 104 16 -261 -215 419 363 -496 -406
5202 -406 520 383 -399 -262 234 151 23 -9 -260 -61 478 113 -585 -99 562 73 -439 -32 198 8 57
5223 57 -26 -307 58 481 -94 -548 134 481 -131 -331 74 95 28 155 -152 -346 283 471 -342 -483 348
5244 348 414 -265 -248 94 71 137 87 -372 -198 558 263 -633 -249 622 217 -435 -152 164 125 139 -98 -425
5266 -425 131 631 -145 -718 161 658 -136 -483 48 222 71 56 -246 -301 377 435 -490 -481 511 419 -440 -274
5288 -274 241 109 9 39 -259 -118 492 166 -585 -124 608 76 -451 8 230 -26 67 39 -304 23 525
5309 525 -74 -570 134 515 -148 -323 134 81 -17 182 -103 -397 249 520 -356 -505 374 402 -295 -220 120
5330A20j19J08N2n13O7Q36k34r59L60Q79l90o38L14K68r9J23j99m46N20O29p54
5351g5o62Q79N36q16l20N37R4j30R1l27j64P33J27r94l6J058r0q77J65N23j65
5372H7q9Q4l61R9O90l29q24N14P63n85n27N11J99k99J48j2m30L66N49o43n25P66
5394A52L73p24j19M96j41j14L15l17l68O95L05q94j70R07jo99J52K99k02J51J54
5415B50o00J2Q94j98j003L67Q79m37n80L52J77j21K21j88n50N34P06q12o63R01
5435A41N21q17k76N23L8j04J47l81k09Q04J61j059k6J085j22q77K34M74k22lJ04
5456A36m56J16P64l42q97N46Q01o46m94N47J36l29K43k3n06L87O15p06n29Q38
5476B01L19p75k3M92k24q8L67l56m06P23L21r37j32R38q8o75K43K44k67K28J97
$$ plain form
5330 120 1 109 161 -352 -285 551 317 -642 -282 597 207 -431 -117 151 52 175 -24 -470 50 679 -75
5351 -75 -737 142 678 -138 -458 79 173 43 134 -193 -357 376 503 -491 -527 531 441 -436 -271 252 87
5372 87 -2 82 -279 -180 510 181 -643 -129 634 49 -478 33 232 -67 81 69 -361 5 554 -89 -614 152
5394 152 525 -199 -318 178 37 -77 238 -79 -447 248 553 -341 -511 396 395 -304 -152 147 -55 96 250
5415 250 -350 -338 556 358 -645 -278 601 164 -416 -64 113 -8 213 25 -525 9 715 -97 -760 141
5435 141 662 -155 -431 92 130 26 173 -208 -417 387 548 -511 -537 548 426 -451 -217 257 35 32 136
5456 136 -320 -204 560 218 -679 -133 668 22 -472 75 211 -118 125 102 -404 -17 598 -108 -637 201
5476 201 520 -255 -278 214 -10 -98 269 -87 -493 230 551 -386 -518 420 332 -343 -100 144 -123 105 302
5497C02o65kR71k58j008M10Q49m67n14L85P7j37L40k20o25N71P47q45o79R26M80
5518F38p97k05M80o1l1K31m65k67Q88J80j120j3J105j79q32K72L93k57J02J06
5538A68n45J28Q55m06r23O15P66o73m62N82N4l12L21o4n49M56O23p60n05Q85K57
5559E11p84M0M84k89o2M34m12m19P80K71r61o2R13j58o34L12J75l19L22J91p29
5580c96MR87k54r97M41P88n03l96L79m6j14M41k50p01O02P75q61o46R13M21p75
5601a88j09M04j43P9K78n55k91R57J69j147K5J087k16p70L09K96k50J98P8o22
5621d11J72R01m75r15O58P21p03l91N72k4k47L58j34n65N22N84q06m34R06J59
5641D48p67J29M37l53RM47m60l97Q05K23r52J9Q57k42n31L66P2l37L92J96p79
$$ plain form
5497 302 -363 -365 606 348 -660 -250 599 132 -382 3 80 -57 283 63 -562 9 756 -89 -768 158 638
5518 638 -159 -364 116 55 24 255 -210 -477 411 591 -529 -542 563 384 -448 -176 217 -40 62 168
5538 168 -377 -249 606 200 -723 -108 658 -15 -477 105 159 -153 168 104 -445 11 634 -126 -631 254 511
5559 511 -273 -233 251 -38 -100 334 -78 -497 283 554 -407 -469 444 286 -348 -36 139 -180 142 333 -396
5580 -396 -392 595 341 -656 -215 573 70 -326 53 7 -107 334 84 -617 -15 760 -101 -747 166 587 -188
5601 -188 -297 107 -36 43 321 -234 -525 432 601 -546 -521 566 350 -420 -111 185 -65 133 211 -411
5621 -411 -239 662 187 -728 -70 651 -52 -443 129 105 -142 216 82 -483 39 623 -183 -617 289 448
5641 448 -319 -190 247 -106 -97 350 -110 -507 298 521 -431 -412 445 203 -328 38 110 -227 165 361 -418
5662d18N4R60l03r23M76O86n10k79L66j63o7N12k97p30O56P49q84n87R00L27p14
5683a89k6L14k06J80L10o72k59R98J26j154R0J033k62o60L08J98k36K93K8o88
5703d74K45R13n30q64O78O38o89k81N08j00j69L96k15n70O01N29q35l46Q69J04
5723D08p32J93L58l73R1M21n28l23Q26J24r07J03P82l13m42M07k0l43M61J50p87
5744d44Q7R42l48q31M97N51n00j61L49k68rN66l51p38O94O97q63n14Q55K30o18
5765a77P0J85k47K76L26p27k54J010Q1j085J29R10k71n48K83Q2j77L76m2p17L19
5786a98Q76n63q21P11N46o53j95M27j52r0M16l08n21O57M59q67k60Q59Oo49K38
5807h2K74l67J66L71n51k70Q28M4q70J90O90l53l27L99j04l11N07J07p94J57Q68
$$ plain form
5662 -418 -364 596 293 -630 -154 532 22 -257 109 -54 -121 391 94 -636 20 769 -115 -702 198 525 -189
5683 -189 -215 99 -107 73 383 -289 -548 450 576 -578 -488 545 283 -377 -69 129 -107 186 214 -474
5703 -474 -229 684 154 -710 -32 606 -83 -364 144 44 -125 271 56 -514 87 616 -219 -565 304 408
5723 408 -324 -131 227 -146 -55 366 -162 -485 341 465 -442 -339 443 130 -312 95 75 -268 193 343 -444
5744 -444 -357 585 237 -594 -97 454 -46 -207 142 -126 -135 431 80 -658 36 733 -130 -644 211 441 -177
5765 -177 -107 78 -169 107 433 -294 -548 462 543 -542 -413 497 226 -322 -39 43 -134 242 200 -517 -198
5786 -198 678 115 -706 5 551 -102 -297 130 -22 -112 304 -4 -525 132 591 -276 -536 323 329 -320 -82
5807 -82 192 -175 -9 362 -189 -459 369 413 -457 -267 423 70 -257 142 38 -273 234 341 -453 -296 572
5828E72l91p24N04M17m59l5K49l17L8N99m06o81O89O08q30l95P46J47m83J10O2
5849B0k42L70K75p56j80R84J2r91J57P84k53m18K42l0j04M35j36p05L88Q03n89
5870F6o96O65M59n79j23L30j80J4L84l77m57O84L62q26j85P87p0n32K54J56l36
5891b00K29L08n80j60P72l7p70K51N47l65k08L63j70k43N25K0p24K16P53m18n76
5912d67M77K90l94M5J81l54J33N53m43o06O77M93p56k81O39N5l47J30l3k25M38
5933B05K06p50j22R16l7q73J57O42k27k74J76j13l9M80j98o84M05P46n77o14N99
5954B4L61m85n3K17j95J15L58m43l78O94K68p63j10O82q2m32K28Q4k78K90K02
5975C04n83m0O98j20o65K76M61l56j32L07k12j54M92o5o24K65O05m11m39M24J76
$$ plain form
5828 572 181 -543 -39 378 -81 -116 133 -184 -146 453 47 -634 55 663 -167 -562 184 331 -152 -42 20
5849 20 -222 148 423 -333 -513 471 483 -508 -351 433 180 -238 4 -26 -130 305 169 -536 -148 655 66
5870 66 -630 35 494 -85 -208 122 -58 -44 340 -37 -494 190 552 -274 -459 328 258 -274 -20 136 -200
5891 -200 29 337 -243 -403 369 332 -438 -187 360 -5 -213 150 -20 -263 262 282 -442 -226 527 109 -467
5912 -467 10 300 -94 -49 132 -222 -89 464 21 -585 92 585 -171 -452 187 242 -105 25 -8 -233 205
5933 205 411 -339 -461 455 418 -455 -298 344 117 -157 19 -94 -133 347 149 -535 -130 616 39 -575 24
5954 24 385 -100 -153 64 -131 -16 342 -101 -479 215 483 -280 -390 292 210 -222 6 90 -188 102 304
5975 304 -279 -319 379 259 -406 -130 331 -25 -157 150 -62 -216 276 211 -413 -148 457 46 -393 31 207
5996B07l13J27P9l57K05M97m74n00O30L85o44k06M94J6k18J40j36k06M89J63p25
6017c47o9Q34o4p42J52N12j88j55R7j78N2M76k50o47M44O48n55n09N38K84l88
6038e5l4J18j77K04K92n00k92O81J91p18m0N81r3l20J85kj93L07J22n41L5O09
6060C60j80n43K74L38l11l7K27k32q0M48j11n34K79M91l79l25L66R8k30J46J3
6081G8l30K26M35m46m12N64L01n47j31L70j7j12J15k06j54M88J14o75k3P37r9
6102B76o05J28L92j17q9K8k25J43M42l10n56M41N41m86l98M06K28k56j5mj34K75
6124A05K08m91k14O16J37o14%M48p8k16J21n1j07L19Rm56O9N26j87m32K44K47
6146B03k27k6J54k22oL62j35m43K73L91l40k41K92M8j56J52m1k83K39L45l91l16
$$ plain form
5996 207 -106 21 100 -257 -52 445 -29 -529 101 486 -158 -364 130 146 -72 68 -68 -274 215 378 -347
6017 -347 -416 418 354 -388 -236 276 88 -67 30 -148 -96 380 130 -517 -73 575 20 -489 49 333 -55
6038 -55 -89 29 -148 56 348 -152 -444 237 428 -290 -330 251 158 -162 23 21 -172 135 257 -284 -249 360
6060 360 180 -363 -89 249 -62 -99 128 -104 -184 264 153 -381 -102 389 10 -315 51 149 -81 65 78
6081 78 -252 -26 409 -37 -449 115 416 -131 -262 108 91 -21 94 -112 -266 222 336 -339 -362 375 276
6102 276 -329 -201 191 74 -15 13 -212 -69 373 63 -493 -52 489 3 -395 11 239 -17 -32 -36 -170 105
6124 105 313 -178 -392 224 361 -253 -253 195 117 -99 22 -29 -136 183 192 -264 -195 331 144 -288 -44 203
6146 203 -24 -50 104 -118 -124 238 103 -340 -67 324 -16 -257 35 83 -73 79 38 -245 -6 339 -52 -368
6168c68M56K33m30r0K56j2j6P7k44r0M64O0n87%O01o3m75P1K62l8po0k32K03L90
6193C61l03m79L83M56l86l50K95J87j13m5q9q5L07J29m54j36N24R3m95k2L43j0
6215A11j59M3r1LK75n6m02J34M22j69l62K02J98j61pP3j70O1K84j77l17K49K81
6238B65k63j69J98K7q1J10q8k10K45K56l55k33L63J69k92p6J31J3O1K9k62l3M14
6261B19K0m97J3M66k8l51NJ77N0K3j48j84K29L37l16l90L44L75k99k95K00J69
6283A19l2o9j46k1L11P8m25r2M57Q8m11m3K58O2j19l6r5P1K32r0l36J37L30j52
6307G6k72J33J47o9j5jj14R5K02j66k32J88K08j76j27J22K6qO0j19j19K05J80
6330B24k73j69K63J43j97j02Q1N3Q5l4k26J3L38j0l78oL61K8k84o1J46J19J4j82
$$ plain form
6168 -368 88 321 -109 -199 57 45 29 106 -138 -228 236 296 -291 -291 310 247 -228 -157 105 67 60 0 -232 -29 361
6193 361 58 -421 -38 418 32 -318 -23 164 51 6 -83 -168 139 268 -186 -322 202 295 -200 -222 121 111
6215 111 -48 -5 -96 -93 182 126 -276 -142 280 111 -251 -49 149 -12 -19 54 -116 -55 229 52 -265 -16 265
6238 265 2 -167 31 58 -23 87 -1 -211 34 290 -65 -298 65 234 -58 -134 -3 10 71 100 -162 -195 219
6261 219 239 -258 -245 221 193 -158 -153 24 74 97 -51 -235 -6 331 15 -375 -31 344 45 -250 -50 119
6283 119 87 18 -128 -149 162 240 -185 -277 180 268 -143 -186 72 134 15 -21 -116 -45 187 97 -239 -102 228 76
6307 76 -196 -63 84 15 0 -1 -115 -20 182 16 -216 -28 180 4 -123 -1 25 17 77 -42 -161 44 224
6330 224 -49 -218 45 188 -9 -111 -30 23 108 74 -152 -139 199 189 -189 -195 166 194 -90 -151 -5 114 128 -54
6354e4j54K21K62k46l31K37L19j66k95R3K00L7j17j75L6K85N6l63q3L61J06l14
6376h5j03K05J10n0j31p0J19J97j37k42J11K52p2k22M7J36On0o1l7J10J14j47
6399@j49J48J39j11j07N2O1K5rj02n1J49J11j80j37J58J49j31j17K4J04P1o0j65
6423a28MK62J2k79p2K78J00k10j32J12J82%k02r7J94K19j95k60J28K90o6k78k4
6446a62K29J12j70j75O8K52Jk70q7K65J45k15j83J44J98n5j90l8J59J11j15j75
6468a51P5K03k7k00k8J63Q0j13q7L8Q5N8j02r6O8J22m0j28OJ02M0m9o2j1P5Q5
6494A06q4j39Q1J73m6j70lJ33O1r1j21L1J58M8j95j22J92J71j61k11J18K16m2
6517A03j98n9J58J61j16k27M4K82K3k89q8K71J31k01j58J03J86Ok08j04J87J88
$$ plain form
6354 -54 -208 13 275 29 -302 -65 254 88 -207 -114 86 123 6 -169 -133 152 208 -155 -238 123 229 -85
6376 -85 -188 17 127 77 -54 -124 -5 192 55 -187 -76 176 104 -118 -71 65 71 21 -40 -77 33 147 0
6399 0 -149 -1 138 27 -80 -28 33 58 49 -53 -104 45 156 -24 -161 -3 146 15 -102 -78 26 97 37 -128
6423 -128 -124 138 150 -129 -201 77 177 -33 -165 -53 129 129 -73 -170 24 243 48 -212 -84 206 140 -138 -162
6446 -162 67 179 9 -166 -98 154 155 -115 -202 63 208 -7 -190 -46 152 97 -93 -131 28 139 24 -151
6468 -151 -76 127 100 -100 -128 35 115 2 -85 -47 38 96 -6 -102 -34 88 48 -80 -74 28 68 19 -43 -54 21 106
6494 106 22 -117 -36 137 91 -79 -82 51 112 21 -100 -69 89 137 -58 -180 12 183 22 -189 -71 145 103
6517 103 -95 -154 4 165 49 -178 -134 148 171 -118 -206 65 196 -5 -163 -60 126 132 -76 -180 7 195
6539A95j55k47J29K57p3k21MJ77M9p9j35J3J79M5j92j07J99J14j65r4Q3P6rm1
6563Bo3%J39J1j74k8J61K2j12j0L3RM3Lj20%J84j1k00J3J73Rj17l9J3Q2Q0j04
6591aj70J40K27j36k56J25K19p5j67JR3J02ok25m6K76J05l07j28L03J35k35j24
6614a50J08J13K6j12j61J19K70j36l10J20K97r8k28M4J47J5l4r4o3J76J28k34
6636e7j47K50J27k23p6J52K6m2L0p6n2J67M8k23k0K22j2j65L0P7n6M6N3j61m5
6661a27K17K3k38K2K07n2r3K1j0MJ36n4k31J03K78j45k78J39K27j02j30K7K1Q4
6685D9Q3k23j26K96J54l38j27L16J06k33p9J06M2P5n0k24Q7L19j33l38J33L26
6707B21j32k25P8J04kQq4j20J87J77k73j73K91J31k63o4J86k0n9P8p9r9K09O3
$$ plain form
6539 195 40 -207 -78 179 106 -115 -111 66 115 36 -99 -86 93 138 -54 -161 38 152 -13 -107 -24 52 43 2
6563 2 -61 -61 78 89 -85 -113 48 70 -42 -52 -19 -10 33 36 -84 -84 100 89 -111 -98 75 84 -33 -72 -59 23 103 -1
6591 -1 -171 -31 196 60 -196 -71 148 73 -94 -93 0 102 96 -129 -175 101 206 -101 -229 74 209 -26 -150
6614 -150 -42 71 97 -15 -176 -57 213 77 -233 -113 184 86 -142 -98 49 64 30 -64 -127 49 177 -57
6636 -57 -204 46 173 -50 -126 26 52 10 40 -36 -88 79 127 -96 -116 106 94 -71 -41 36 -20 26 79 -82 -127
6661 -127 90 113 -125 -103 104 52 -41 -20 -30 -26 110 56 -175 -72 206 61 -217 -78 149 47 -83 -56 -35 49
6685 49 132 -91 -217 79 233 -105 -232 84 190 -43 -122 -16 26 101 51 -173 -86 233 100 -238 -105 221
6707 221 89 -136 -58 46 44 52 -32 -152 35 212 -61 -234 57 188 -75 -139 47 27 -32 46 -33 -132 77 140
6731A40k54k5K59n8j64R2O4j18N8J09j75p3K55Kk69P8J97r7q0R7o8l4J85l5k61
6756a75R7L03j70k57J86J59j30n4L6o4R5J35k28j71L29J59l64j25L28O3k16lL4
6779c3MJ26j2k69N8L65j16l79J53L05j42k01J11N3k1Q4q7j82K07K11k98j78L24
6802H3J06k70l4J72m7l4J04j11j01K33O8l19L2K72q8j98J57O1j73Q9J32k18m9
6825a33K81m8k62J18J67j54m0J42j03p5K27k4k99J25K99k01k25K06J12j55L2M5
6847C5j43J10K09k58k07L48J59l60r7L08J7j74N3k0l6J69Rl18M1M04j16l94J80
6870h1K90j72j61J13Oj6J46j27k20K48K25l30j73L45Q8k89K1J53j02NJ36j61j05
6893a61K75L2l31O0L07j50j65J86J5j87J47J04k37j4K90q8k54J75J29j90J3J59
$$ plain form
6731 140 -114 -139 120 62 -102 -10 54 -64 -6 103 -72 -145 110 112 -157 -79 118 21 -59 38 -30 -64 121 86 -175
6756 -175 -78 225 55 -202 -16 143 13 -41 -5 -69 26 161 -67 -238 91 250 -114 -239 89 152 -64 -67 -33
6779 -33 -29 97 85 -184 -126 239 123 -256 -103 202 60 -141 -30 23 2 86 -1 -183 24 235 -63 -241 83
6802 83 189 -81 -115 57 10 -24 80 -31 -132 101 169 -150 -118 154 66 -132 25 86 -87 2 134 -84 -133
6825 -133 148 100 -162 -44 123 -31 -71 71 -32 -107 120 96 -203 -78 221 20 -205 1 113 -42 -10 35
6847 35 -108 2 211 -47 -254 94 253 -107 -204 104 121 -53 0 -20 -56 113 122 -196 -155 249 133 -261 -81
6870 -81 209 37 -124 -11 -5 -21 125 -2 -222 26 251 -79 -252 93 181 -108 -87 66 -36 -31 105 -56 -161
6893 -161 114 146 -185 -125 182 32 -133 53 68 -119 28 132 -105 -119 171 83 -171 4 133 -57 -44 115
6915A15j66p0K68l2l23J50K85k19j93K20N6j45Q5Pj83J31K46k84k07L38J57l59
6937a23m9K77l1j42P7m7o8K34J2l67P8L97j31l71J89K48j77r1J13o8K2J75j60
6960ck46K93K36l58j49L45L8k68P8J08j23N2J34k20q2L03Ll33J02K67j67j53K11
6983F8k0j67J59Q8k64L2K80j27k36K16J03k26O4J54j96o4L02o7l19J75K50k22
7005a7j22K17k3j39J55ok30J64K39k95j86L49J10l38LK31q2o2J15j26r9K92J6
7028A66l89P8M06j73l23J95J84j69j2Q0j41N7K23k04k49L23K11l60j35L54kk33
7050a13J09N5j34J02J39k59n4L24k8l47J38K60k11j04K13n2j65J98N4k71P7K60
7072A91j83j87K52M4k42J15J58k45l0K87r2k74K06J86k38o5K04r1r2J91m8k37
$$ plain form
6915 115 -51 -121 147 115 -208 -58 227 8 -185 35 91 -54 31 38 -145 -14 232 -52 -259 79 236 -123
6937 -123 -172 105 74 -68 9 -38 -106 128 140 -227 -149 248 117 -254 -65 183 6 -85 28 -40 -18 157 -3
6960 -3 -249 44 280 -78 -227 118 156 -112 -34 74 -49 3 137 -83 -165 138 141 -192 -90 177 10 -143 68
6983 68 48 -119 40 128 -136 -104 176 49 -187 29 132 -94 -30 124 -72 -136 166 99 -220 -45 205 -17
7005 -17 -139 78 55 -84 71 65 -165 -1 238 -57 -243 106 216 -122 -119 112 30 -32 83 -43 -142 150 166
7028 166 -223 -145 261 88 -235 -40 144 -25 -37 43 -98 -41 182 -22 -271 52 263 -97 -232 122 120 -113
7050 -113 -4 51 -83 19 158 -101 -155 169 141 -206 -68 192 -19 -123 90 38 -127 71 125 -146 -69 191
7072 191 8 -179 73 117 -125 -10 148 -97 -127 160 68 -206 0 186 -52 -117 87 -4 -96 95 47 -190
7094a90J90K40l24j53L48N5k95M9J70j07QJ08j81o8L30l0l83J26L58j71k93K19
7116FJ15j42K4M2j67J07K31k28k54L39J80l73o7L07l0j82J05Mj19J67R0l02kL48
7140A99r7l21J73K14k09n7J92r1j20K11nk66J31K30k29j23K58pk24J51J33k43
7162a00LK80j38k23K17J17k19kJ85j35o1K21r2k39K11K02k98j30L39kk55P8J21
7185H0j47P7J20k45n9L61n0l66J34L24j94k16J99N2j07P7J0k00J32K47k78k10
7207b59L54J39l57l0K74p3j10J19o1j16K20N2l16L4L49j48k71J98J61k18QJ60
7229A09j39o3K28o6k36J70J80k51p5K57n3j97J61Q2k35N8K34j54j78K23N0k05
7251a00N8J54j78j8K35j31k25K44J63l06n8K93n8j75J15L0j35J29J02k65j6L41
$$ plain form
7094 -190 0 240 -84 -237 111 166 -129 -80 90 -17 -9 99 -82 -150 180 150 -233 -107 251 80 -213 6
7116 6 121 -21 3 45 -122 -15 216 -12 -266 73 253 -120 -187 120 90 -92 13 17 -102 65 155 -147 -149 199
7140 199 102 -219 -46 168 -41 -98 94 3 -117 94 89 -177 -46 184 -45 -168 90 83 -141 10 143 -100
7162 -100 -97 183 45 -178 39 156 -63 -65 120 -15 -76 145 53 -186 25 227 -71 -201 138 136 -119 -41 80
7185 80 -67 10 130 -115 -174 187 137 -229 -95 229 35 -181 18 70 -37 40 50 -150 -18 229 -49 -259
7207 -259 95 234 -123 -153 121 48 -62 57 -4 -120 100 152 -164 -130 219 71 -200 -2 159 -59 -51 109
7229 109 -30 -93 135 69 -167 3 183 -68 -143 114 61 -136 25 107 -128 -70 164 10 -168 55 105 -100
7251 -100 -42 112 -66 -84 151 20 -205 39 202 -104 -162 131 73 -102 13 43 -92 37 139 -126 -142 199
7273A99p9l39J50K77k00j42J67qo2J33o3k08J91K30l09j64L33R2l06J5J84q4m5
7296c8R8j16p4K43J0l20Q6L10j56k27K10R2j89L5J22j58jK19j18k00K16J19k50
7319h7j6K40r8j57J85K5k06Q5J88j90j02K23nk07J36J00k14L9K17j50j92K45J02
7342A61k72%K28r0j19J36k7j33J74P9k94K7L15j01k82J60J91j74o1J21o5rJ47
7365A12j05j92K14J99k93j30L10M2k54M5J34j00L4Q2j66m4K65l8k95J09K65j68
7387B6j83J91N0j48P5N5j57O2J72j62j51K36P3k54K7K16j27j09J85k8j76J30J11
7410A14j80k5J97q2j42J59N1j97O5J87j68j29K17N2k17N1J48j07l7J27r5r3K02
7433I8K0k69N8K74j28k16J56J23j48%P1j07M7J62j61j75K39J42k79p1K40K1j86
$$ plain form
7273 199 120 -219 -69 208 8 -134 33 25 -37 96 33 -175 16 246 -63 -227 106 198 -108 -93 91 7 -38
7296 -38 60 -56 -130 113 123 -197 -111 199 43 -184 26 118 -71 -36 86 -72 -73 146 28 -172 44 163 -87
7319 -87 -103 137 39 -118 67 92 -114 -29 159 -31 -133 90 85 -122 14 114 -100 -61 156 6 -186 59 161
7342 161 -111 -111 117 27 -92 44 17 -116 58 137 -157 -130 185 84 -198 -38 153 -21 -82 39 -26 -35 112
7365 112 7 -185 29 228 -65 -195 115 157 -97 -52 82 -18 16 98 -68 -112 153 115 -180 -71 194 26
7387 26 -157 34 84 -64 11 66 -91 -29 143 -19 -170 66 139 -115 -88 128 1 -108 77 49 -127 3 114
7410 114 -66 -91 106 24 -118 41 92 -105 -40 147 -21 -150 67 119 -98 -47 101 -6 -43 84 -11 -104 98
7433 98 118 -151 -93 181 53 -163 -7 116 -32 -32 39 -68 -21 141 -20 -195 44 186 -93 -164 76 97 -89
7456h9O6M6p6R4M2j90J4K50p2k60J39K16j75j17J58mj00J13j7j48J21J54k15j02
7480a52K48J0k15O8J47j26m9J53o4j19J44N5j73K6J62j19r1J74j7j74R5J42j62
7503c7p4J87j6j63Q3P7j05L0J16j43o8K14j4k33Q1K15j30j41J25P6j06M3J1j22
7527i4J02J57j94j30K38Q0k36m0J92j0j04M2pn3J25Qj97M9K34j05k17J50J45j42
7551gm7Q8m4k8J13p9j07J28J09k02m4K00j2j70P5R2j01nR6p8n4J45j1j51Q0J10
7577I6j32l7J52k1j60J24Q2j46j8J45m7j06J03Mr9O5Q8j58k4K02m8j93R0J60j13
7602Iq1R5jm3P3m6j21J27J30j92r6K16M3j88qJ38l8l2M1p3pJ51m7j87Q7K12j41
7629B1j59J49Q7j10qM3n1M0Q1j24p5J76M6j99MJ78m6j24P6K9o3L7M5j10lJ36o3
$$ plain form
7456 -89 -23 23 -53 41 83 -107 -93 157 85 -175 -36 180 5 -112 46 42 -58 55 38 -110 11 165 -50 -152
7480 -152 96 106 -109 -41 106 -20 -69 84 20 -99 45 100 -73 -47 115 -4 -95 79 62 -112 -17 125 -37
7503 -37 -111 76 60 -103 -20 57 -48 -18 98 -45 -113 101 87 -146 -65 150 20 -121 4 80 -26 17 28 -94
7527 -94 8 165 -29 -159 79 159 -77 -117 75 65 -39 3 -4 -57 68 76 -121 -72 162 57 -160 -10 135 -7
7551 -7 -54 34 -10 -38 75 -4 -111 17 126 -76 -120 80 68 -102 -27 65 -36 -41 55 -23 -77 68 57 -94 -14 96
7577 96 -36 -73 79 58 -102 22 104 -42 -60 85 38 -68 35 39 -60 5 93 -65 -89 113 65 -128 -38 122 9
7602 9 -72 23 22 -21 52 6 -115 12 142 -50 -146 70 113 -75 -83 55 17 -15 26 -47 -54 97 50 -137 -50 162 21
7629 21 -138 11 98 -12 -20 23 -28 12 93 -31 -106 70 116 -83 -79 99 53 -71 5 34 -29 8 53 -57 -60 76 13
7656A3j20J22P0j44%J17m9j07J22L0j06L2Q4q6k8J02l9q6J10M4j53RJ70p4j23
7681i0R1P3r4PM4m9KJ11j04j06J55R0j90n1J83Nj30J8P1m2L1nq3QJ67p2j82J22
7709b0J44j17j12J04M8o1J2j5m6R0N6j40l6J69Qj77L3J39n1p7O8k1k4N9Rj04N2
7736a0J06j06q4J36L5j24L0P6p2k6P7j0p0N1L2q5K5Q1q5m3J19Oj36M5J06o5p5
7763f6P3L0o7M1Oq2O8Q7j21p4J45M9j53oJ30j7o7K0qj0Q1pj22M0J54r1j42J08
7791aJ15j10n3O9Qj6K5n7l6J12K8j56%J50j5j48N4R0o4pK8n0J9Q5o1r7R2P5j23
7820d4l1J12Nj04N9M4p6J1N4n0k7R2k8q4N9Q0r4l6J05j0r9N8O0n9j3M3l5j3P1
7849E0l1q8Q2P2j15n1J29J8j21J2P4k7j0J2m6RR7l2j33Q8J16r9r8R7O0p8qK5j8
$$ plain form
7656 13 -107 15 85 -59 -59 58 9 -98 24 54 -52 -20 64 -22 -50 52 13 -73 37 81 -72 -63 107 33 -90
7681 -90 1 74 -20 -13 31 -18 -16 95 -9 -115 40 130 -60 -111 72 77 -53 -35 36 -6 25 20 -63 -55 112 40 -142 -20
7709 -20 124 7 -105 -1 47 -14 -2 -17 -63 27 83 -57 -93 76 84 -93 -60 79 28 -49 19 -2 -26 33 42 -62 -10
7736 -10 96 -10 -94 42 77 -47 -17 59 -13 -39 38 28 -42 9 41 -44 -19 62 -23 -66 53 59 -77 -32 74 9 -66
7763 -66 7 37 -30 11 17 -65 3 90 -31 -105 40 89 -64 -70 60 43 -24 -4 -12 -22 59 52 -70 -30 124 33 -109 -1
7791 -1 114 4 -49 20 28 12 37 -20 -56 56 84 -72 -72 78 63 -85 -31 59 -5 -12 16 -34 -15 70 9 -88 4 79 -44
7820 -44 -75 37 42 -62 -3 41 -35 -24 30 -20 -47 45 17 -67 -8 72 -22 -58 47 37 -62 -4 56 -3 -16 27 -8 -21 50
7849 50 19 -69 13 85 -30 -81 48 66 -55 -43 31 4 -6 6 -40 -31 66 34 -99 -11 105 6 -92 5 65 -13 -21 4 -14
7878a4K3L8r1j9J31mj41K3J36n9q3N3M5m1K7j3n8M9Q6r8p7J22M9j15j2J09m3n0
7906b7M8On0M0J8q7L8Q1o0p3Q7L7j03oR5m1n1N3J8n4K7K6o7K3R0p9o6J03N0j18
7936d2j2J00ro2K3J8j7K7Lq8M5J02p0j15R6Q8r8o8J00J7m1J5k9j6P2K3j27%J46
7965H1k5j36N0R8n4m8L7lj0M5m2o1Q1O5j05o6J34J1j03K5P0n5%M2m3j1O6nj00
7994f2O3P8r2m4R8J5j03M0O2o1k3N5j7m4P2qp3M2O5q3n6J07K4j00J6O4k5l0L4
8023A4k9j4P4k7r8N6J10r4p8R4N4p9j8M6j7PL1o5k4J20Lj40K6J31m8j03O9O1o6
8052dQ%l0L0O8p5p2J00N3j08l9J15jq4K8K5l1J6L0o8mR8m4q2Q1N8r3k5R1k6o0
8083d5M5K1o2K7M9o2j9R6l2r1R0M8q6k8R7j6o4K9K7m1J2M5p2JJ07m0j14O7R4r3
$$ plain form
7878 -14 9 47 -44 -63 68 64 -77 -54 82 23 -60 -7 38 -3 24 11 -47 2 88 -10 -87 35 84 -31 -43 66 23 -27
7906 -27 21 27 -23 17 35 -52 -14 67 7 -66 21 58 -45 -51 44 3 -48 5 23 -31 -4 22 -45 -22 68 -11 -77 26 76 -42
7936 -42 -54 46 37 -25 -2 16 -1 26 29 -59 -14 88 18 -97 -1 87 -11 -79 21 38 -3 12 -17 -33 39 62 -65 -65 81
7965 81 56 -80 -30 68 14 -34 3 0 -10 35 -7 -68 13 78 -27 -93 41 52 -51 -26 44 -11 -11 31 -12 -23 43 38 -62
7994 -62 1 79 -13 -57 41 56 -47 -7 55 -6 -29 26 9 -35 37 29 -44 -2 63 -20 -76 31 55 -45 -29 35 10 -20 14
8023 14 -15 -29 45 18 -80 -24 86 -8 -86 8 62 -17 -35 11 -6 1 32 -33 -57 63 66 -74 -48 83 35 -68 1 62 -4
8052 -4 4 4 -26 4 72 -3 -75 25 78 -30 -69 46 45 -39 -11 14 -17 -1 29 -39 -43 55 11 -71 10 68 -25 -50 41 15 -45
8083 -45 0 21 -41 -14 35 -27 -46 50 18 -73 17 65 -21 -49 48 32 -32 -3 24 -17 -5 40 -32 -31 76 36 -78 -11 83 -10
8113a0o5J06J7o5J1K3l4L2K6r3qJ30k4j30L8J17o6o6O1K7m7L6qo6N8O5q8n2J16
8142D1K4j21QJ05l1m7K6J0n0P1oq2L7Q2o5q0J00M8r3k2R4l5l8N2k1n4O7K6r0J3
8172c1Q8n8o9Q4M2r2rP4l4l5M1Jn1O6J8q9J8J02n6
$$ plain form
8113 -10 -75 31 48 -17 -6 17 -17 15 41 -52 -60 70 46 -84 -46 71 5 -61 0 27 -20 16 8 -58 0 65 -23 -75 41
8142 41 65 -56 -48 57 26 -21 5 15 -35 36 30 -52 -15 67 2 -78 22 70 -23 -45 49 14 -24 28 7 -47 20 46 -44 -31
8172 -31 57 -1 -70 14 56 -36 -45 29 -5 -40 1 2 -49 17 35 -54 -36 66 10
8191A0
$$ Imaginary data points
##PAGE= N=2
##DATA TABLE= (X++(I..I)), XYDATA
0@%%%%%%%%%%%Kj0J6j7J8k3L1l6M4n2O1p6R2j09J28j48J73k04K34k66L03l46L94
34B09m44N00n63O32p08P92q83R83j094J213j342J486j641J811j996K197k423K670
52A399k942L242l576L951m375M860n414O057o820P738q863J0281j2139J4689j8421
67a0333K4476l6335R5072k97615k4855M69690j20962k35469J02655N2012n9493
78d1157K04728n6001l73258J34074M47741k38522m02513K81928L07825k47010
88A7835j31126J29072n3454P966J92998j76100k54814L21143K64589l91562k00256
99b73709L62633Q9856k64186J7410R6781q5882J05753J20863k83112j06131L87289
110A67565M5620m11564K5028L44196p1464j92325Q8343P63o4927J77579l013l12145
$$ plain form
0 0 0 0 0 0 0 0 0 0 0 0 0 2 -8 8 -9 9 -14 17 -19 25 -27 34 -42 50 -59 69 -79 94 -110 124 -142 161 -185 209
34 209 -235 265 -298 334 -374 418 -465 518 -576 637 -705 781 -860 951 -1045 1152 -1271 1399
52 1399 -1543 1699 -1877 2074 -2301 2559 -2855 3202 -3618 4120 -4743 5538 -6601 8088 -10333
67 -10333 14143 -22192 72880 -224735 -249590 220100 99138 -136331 -33676 18336 -41157
78 -41157 163571 107570 -265688 -131614 316127 77605 -324908 -42980 264845 17835
88 17835 -113291 15781 -37673 -29707 163291 -12809 -267623 53520 318109 -73453 -273709
99 -273709 88924 178780 -85406 -67996 28785 -57097 48656 169519 -113593 -219724 167565
110 167565 213185 -198379 -173351 170845 99381 -92944 -4601 -3838 -68765 108814 105801 -206344
122b06344Q9227L74444j57524l44780J89961K38363j72609r2835R5241n9317K5582
133b0591J85277j53456k51714K57608K48694l12062j91849K93296J01962j99486
143d2321l613N5107p1975J07465J04675k53857r5516L46333N5540l59915q96K94751
155A35778m4118j67938N8394O983l6945J49747j3159k64093P8165L13595j35629
166H0780k92736J61371K09511j42535q7584P9808l9201J5990J40839j22836j97298
177a93891K10905J99525k55033j53095K41748P7771j69871J799N3003o4053Q1093
188B9901R3614j99774q5658K74917M8942k87863q56K34302m0082j27472N8132
199a897n958m5146J34615M791k28745M8838K66859r6979k42785J21432J66353
$$ plain form
122 -206344 -117117 257327 99803 -244977 -55016 183347 10738 -82097 13144 -46173 -20591
133 -20591 164686 11230 -240484 17124 265818 -46244 -238093 55203 157165 -42321
143 -42321 -45934 9173 -62802 44663 149338 -104519 -200035 146298 201838 -158077 -158973 135778
155 135778 91660 -76278 -17884 -10901 -47846 101901 88742 -175351 -97186 216409 80780
166 80780 -211956 -50585 158926 16391 -71193 8615 -30586 -14596 126243 3407 -193891
177 -193891 17014 216539 -38494 -191589 50159 127930 -41941 -40142 12861 -51192 29901
188 29901 123515 -76259 -161917 113000 161942 -125921 -126777 107525 67443 -60029 -1897
199 -1897 -7855 -53001 81614 86405 -142340 -93502 173357 76378 -166407 -44975 121378
210A21378j09302n8882N8887n2232J8941J40152j04701j86135J75082J84361k08680
221b1131j41478J92848P3597j28018k005K7418n3430Q6282Q0380j85911p6303
232a47751K46719M8110k53575r983K04421k1625j10411L3838o281k1233J18219
243H0448j2873k00001N6999K34257r4943k15564J11240J51457r6207o0154M8912
254C571l4618K1638J10311r8349j50762J60659J50025j90308j13646J76549N5957
265I1027j19334M535L0376n0540O9779P0932j57180o3427K10135L4950k15297
276i4044J553J71040l1363q7958M2623j3703l0649J09844j035j78064M1613K03410
288A33267p6411j82146R1590J21820p8513l9104L7042m4945K4080J10654q9500
$$ plain form
210 121378 12076 -46806 12081 -40151 -21210 118942 14241 -171894 3188 187549 -21131
221 -21131 -162609 30239 103836 -24182 -26187 1231 -52199 34083 114463 -71448 -147751
232 -147751 98968 147078 -106497 -116480 87941 66316 -44095 -10257 -16538 -37771 80448
243 80448 67575 -132426 -75427 158830 63887 -151677 -40437 111020 14813 -45341 3571
254 3571 -31047 -9409 100902 2553 -148209 12450 162475 -27833 -141479 35070 91027
265 91027 -28307 -23772 6604 -43936 25843 96775 -60405 -123832 86303 121253 -94044
276 -94044 -92491 78549 47186 -40772 1851 -11852 -42501 67343 66308 -111756 -70143 133267
288 133267 56856 -125290 -33700 88120 9607 -29497 7545 -37400 -13320 97334 7834
299G834j44418J40996J41819j62727j08136J45999N5944r1701j377J0775m0777
310d5769P8428O1116j54697n7658J99144L6057k00336p350J57290j5991p9681
321b9447K4036j4253j2679J02722j5045j65584M9633J89414p8276j70693Q8823
332c1349J16380p3801m1721L3212l4071K4884R3081q6381j22988J34587J20046
343A31879j55079q9436J39909M2993r0112M397J6052l9469O5205N4227j34288
354e3722m7599J74105K5477j74634J698J35607k2728o6222K9036j6829j7665R4000
366F0524p963j47588L9008J66111o4078j46935P2755R6621n9016k8829K3458l9351
378c5283K6449R2143p8306j18628J17622J15441j32177q7023J15498M3841o8947
$$ plain form
299 7834 -136584 4412 146231 -16496 -124632 21367 77311 -14390 -15767 -4992 -45769
310 -45769 32659 93775 -60922 -118580 80564 116621 -83715 -91065 66225 50234 -29447
321 -29447 -5411 -19664 -32343 70379 55334 -110250 -60617 128797 50521 -120172 -31349
332 -31349 85031 11230 -30491 2721 -31350 -6466 86615 234 -122754 11833 131879
343 131879 -23200 -112636 27273 70266 -19846 -15449 603 -38866 26339 80566 -53722
354 -53722 -101321 72784 98261 -76373 -74675 60932 38204 -28018 1018 -15811 -33476 60524
366 60524 52561 -95027 -56019 110092 46014 -100921 -28166 68455 9439 -19390 4068 -35283
378 -35283 -8834 83309 5003 -113625 3997 119438 -12739 -99762 15736 59577 -9370
389i370R35J885l5207P0489N1423j31013m8217J64610L0406j62474p129J24412
401E0750j1469n8954J7460j8628p934R0532j4317j40489M1318J57960o2651j40660
413i7082O8810R4681n4278l2653J9770k9742K7607P8174p6249j02888J12859J00932
425A09941j26234p6543J10784L9124o8028m63O876k8885N8805M2361j13451l8974
437h4687J43754K2969j42075k309J08527j4196n0932J9763j7088j1827P9707p226
449D4380j22696L0712J36732m9689j19843N5886P7563m4512k1145J5911l5307
460c2008K3950P8785o5105j00325R5870R7201j06312p3192R1312L6937n2112O09
472d390l346k9549O2529M3722j11248m2070J37268K8490j33633j0292J00538m423
$$ plain form
389 -9370 -8435 -6550 -41757 28732 80155 -50858 -99075 65535 95941 -66533 -73662 50750
401 50750 39281 -19673 -2213 -20841 -28775 61757 47440 -93049 -51731 106229 43578 -97082
413 -97082 -28272 66409 12131 -20522 -752 -30494 -2887 75287 -962 -103850 9009 109941
425 109941 -16293 -92836 17948 57072 -10956 -11419 -4543 -33428 25377 67738 -45713 -84687
437 -84687 59067 82036 -60039 -62348 46179 31983 -18949 814 -16274 -28101 51606 44380
449 44380 -78316 -47604 89128 39439 -80404 -24518 53045 8533 -12612 3299 -32008
460 -32008 -8058 70727 5622 -94703 1167 98368 -7944 -81136 10176 47113 -4999 -4390
472 -4390 -7736 -37285 25244 68966 -42282 -84352 52916 81406 -52227 -62519 38019 33596
484C3596m5324R488j9268k662P8533j3722j19262L3447J32924m8423j17845N1419
496b7099P9147l8457k7232J0301k4979K7261O5718o5058q6933R2730Q6017j01679
508a0263o6217Q7614L5136n1955k418J865k3102N1466L5803r5592l4380J19602
520D7559K2139j17324n412Q8798q500m0435J3896j6511q453O8920o065j04855
532f6243K4318J16464l9016j02039M3476O6040l3699j7958J0077l0347K2451O7821
544F1345n5601q6826P9810Q4857q7077o4909P3389L4101m0054j600o145k4248
556c2958N4739L8101r4197l8620J14525K8743j10325j4114Q1904J265l5425M604
568a758j8550j317O7918r689j01788K3862J13014l4915j00104L7099O7198k7030
$$ plain form
484 33596 -11728 -2240 -21508 -24170 54363 40641 -78621 -45174 87750 39327 -78518 -27099
496 -27099 52048 13591 -13641 -3340 -28319 -1058 64660 -398 -87331 5399 91416 -10263
508 -10263 -76480 11134 46270 -5685 -8103 -6238 -29340 22126 57929 -37663 -72043 47559
520 47559 69698 -47626 -53038 35760 27260 -13175 721 -15790 -24243 44677 38612 -66243
532 -66243 -41925 74539 35523 -66516 -23040 43000 9301 -8657 1420 -28927 -6476 61345
544 61345 5744 -81082 -1272 83585 -3492 -68401 4988 39089 -965 -2565 -8710 -32958
556 -32958 21781 59882 -34315 -72935 41590 70333 -39992 -54106 27798 29063 -6362 -1758
568 -1758 -20308 -21625 46293 36604 -65184 -41322 71692 36777 -63327 -26228 40970 13940
580A3940k2872N079k2091K4424N7653n4216p6826P6043P6987q2754o0575P0717
592E509L3745m0847m721r98j8842M5614L1771q2557l2518J02569K3438j00290
604c8127r703P5702k667l4186Q662j4685o048N9665m047r0573J7571J00643k8780
617C3427q8340L2297N7461k4862j6028O656k5856J8523N8758m4273p5909O3025
629e121P4977o8446n8190N7289L1444l0505k504o559k1433M5660L5391p7459l7761
642f3217R3879L0481r0323j8012O6856N784k8307J552j6884j654N8654m924q7735
655e3850J4929R7813k3414q7236K5615N9073j8413k0517J736j9187K1220N1239
667D9008m4770o9151O2071P0326o7251n6464N7167L2747l2502o270k060j6032
$$ plain form
580 13940 -8932 -3853 -25944 -1520 56133 1917 -74909 1134 78121 -4633 -65208 5509
592 5509 39254 -1593 -6314 -7312 -26154 19460 51231 -31326 -63844 38725 62163 -38127
604 -38127 -47830 27872 25205 -8981 -319 -15004 -21052 38613 34566 -56007 -38436 62207 33427
617 33427 -54913 -22616 34845 9983 -6045 611 -25245 -6722 52036 7763 -68146 -5121
629 -5121 69856 1410 -56780 509 31953 1448 -1056 -7615 -29048 16612 52003 -25456 -63217
642 -63217 30662 61143 -29180 -47192 19664 25448 -2859 -1307 -18191 -19845 38809 33885 -53850
655 -53850 -38921 58892 35478 -51758 -26143 32930 14517 -6000 -4264 -23451 -2231 49008
667 49008 4238 -64913 -2842 67484 233 -56231 936 33683 1181 -5089 -7149 -23181
679b3181L8954K9295o9493l1710Q6002K4882q3984j2977O3349J198k8526N901
691b90j2459o040N0300l85p6444J0365Q5185j9340p5153K2891M9316j8117j4269
704d440M787k1622J4429N0316l4547o5965M9576O6135n4235n2368M5613K9403
716B7082k4210l723n957j8293L8220L2020o4767l5643P8750L0308p6051j9519
728d1783N6389P994k3727J28j4883k354N0881j367p6105Q671Q4988j5633p5873
741d2674J8165N1339j3417j7558R71j7487J6915M5927l5671o2013M9745O3302
753E7544n4198n1164M6246L0041k6254o111k089j4518L2624K7388n8167l0681
765d9339P2267K5456p0959j5139N3957M126k4711L477j0189n396M2907J567o6048
$$ plain form
679 -23181 15773 45068 -24425 -56135 29867 54749 -29235 -42212 21137 22335 -6191 -290
691 -290 -12749 -18789 31511 31126 -45318 -34953 50232 30892 -44261 -21370 27946 9829 -4440
704 -4440 347 -21275 -6846 43470 8923 -57042 -7466 58669 4434 -47934 -2321 27082
716 27082 2872 -851 -6808 -25101 13119 45139 -19628 -55271 23479 53787 -22264 -41783
728 -41783 14606 22600 -1127 -999 -15882 -18236 32645 31278 -44827 -36156 48832 33199 -42674
741 -42674 -24509 26830 13413 -4145 -3174 -20661 -3746 42181 6510 -55503 -5758 57544
753 57544 3346 -47818 -1572 28469 2215 -3896 -5985 -20503 12121 39509 -18658 -49339
765 -49339 22928 48384 -22575 -37714 16243 20369 -4342 -865 -11054 -16450 26457 28024 -38024
778c8024N861P4422j3204o6496J6720M4480j3717j3879L671j8059J1565M4137
790C7477k8014n8869M0736N9731m5065m7820L8370K7082k0738l384m596j7382
802b2472L2076L0697n5018l4522O7313K9700o5257j9324M8437P677k0116J147
814C38j3529m648M5037K421o7214L628P5056j0080o7028J3241M5292j0369j5230
827c085Q62j6155J3609M1904k9265n6782M1360N8420m5496m7826L9101K8769k2233
840C183o719k036j2802K8498K5625n0966k9722O3639K5731o2897j6460M8262N798
853A9134k2548K399q535n694L7999L565n9125K412O7064r167o0194J3287M0325
866B0922j2058j2417M598j6918P818M0943k1935n4507L3395N5220l8024m3920
$$ plain form
778 -38024 -32163 42259 29055 -37441 -20721 23759 10042 -3837 -166 -18225 -6660 37477
790 37477 9463 -49406 -8670 51061 5996 -41824 -3454 23628 2890 -494 -5090 -22472
802 -22472 9604 40301 -14717 -49239 18074 47774 -17483 -36807 11630 19307 -809 338
814 338 -13191 -17839 27198 29619 -37595 -33967 41089 31009 -36019 -22778 22514 12145 -3085
827 -3085 -2223 -18378 -4769 37135 7870 -48912 -7552 50868 5372 -42454 -3353 25416 3183
840 3183 -3536 -5572 -18374 10124 35749 -15217 -44939 18700 44431 -18466 -34926 13336 19134
853 19134 -3414 -1015 -9550 -15244 22755 26320 -32805 -30393 36671 27504 -32690 -19403 20922
866 20922 8864 -3553 1045 -15873 -8055 32888 10953 -43554 -10159 45061 7037 -36883
878c6883L3159K4306j8626j799l024j7967K6978L0741m7333l4480N8591K9846
890D3509n7260j9623M2775P827j7862J667j2099o262M0375N422o0539n55O7909
903C5284n346o0959R003M1401p776j4001Q54j4952J0625L9022k3657n3169L4100
916i571N5030l8121m5257L3244K7204j9282n949j426j3168K4425K5981m4303l0246
929d1439N5807K6381n5560j6909M2868N672k0120L485p705p873L4307O741n3547
942b7892j274O0875n666n4656J0699L6508j1057j0904N607j6089M758L8262j7234
955A1937n0781K7848N1390l2713m0831K9226K2464j7029j306j735j7430K2846
967C886K9682m1050l3421N1353K9079n0512j9176L7912P418j5892K459j0768p854
$$ plain form
878 -36883 -3724 20582 1956 157 -2867 -20834 6144 36885 -10448 -44928 13663 43509
890 43509 -13751 -33374 9401 17228 -634 1033 -11066 -17328 23047 28469 -32070 -32625 35284
903 35284 29938 -31021 -22018 19383 11607 -2394 -1540 -16492 -5867 33155 9498 -43671 -9571
916 -9571 45459 7338 -37919 -4675 22529 3247 -2702 -4128 -17296 7129 33110 -11193 -41439
929 -41439 14368 40749 -14811 -31720 11148 16820 -3300 185 -7520 -15393 18914 25655 -27892
942 -27892 -29166 31709 26043 -28613 -17914 18594 7537 -3367 2240 -13849 -9091 29171 11937
955 11937 -38844 -10996 40394 7681 -33150 -3924 18540 1511 205 -1530 -18960 3886
967 3886 33568 -7482 -40903 10450 39529 -10983 -30159 7753 15171 -721 1738 -9030 -16884
980a6884L6065P953n4153l810O0781k036n4378O452L6498o831j1421K054j5089
993a4799P238L7038j8468m9787K8086N1011l2403m1376K8961K4007j7230l763
1005a485q38j4317K1412K6188l9459k9854N0163K5664n0236j6105L8860M905j8194
1018c296M255p277q752L1702P835m9398k616N6086m211n0255R431L3434j0422
1031F516r735O018j5173L030L5578j4264m6964K4043M7262k8820l7163K6212J9791
1044A6331j5738J16p31j7659J9523K8955l5867l2109M5280K7470m4728j7421L3524
1057F946N599j3726M379j0412r855L3384R930m9767n613N5588o67m9353N755L2487
1071A4675p020q942L168j5779N225L6098j5831m7592K5134M8162k9612l8405K6729
$$ plain form
980 -16884 19181 27134 -27019 -30829 29952 27916 -26462 -20010 16488 9657 -1764 290 -14799
993 -14799 -7561 29477 11009 -38778 -10692 40319 7916 -33460 -4499 19508 2278 -1485
1005 -1485 -2323 -16640 4772 30960 -8499 -38353 11810 37474 -12762 -28867 9993 14898 -3296
1018 -3296 959 -6318 -15070 16632 24467 -24931 -27547 28539 24328 -25927 -16496 16938 6516
1031 6516 -3219 2799 -12374 -9344 26234 11970 -34994 -10951 36311 7491 -29672 -3460 16331
1044 16331 593 709 -22 -17681 1842 30797 -5070 -37179 8101 35571 -9157 -26578 6946
1057 6946 12545 -1181 3198 -7214 -17069 16315 26245 -23522 -29135 26453 25786 -23567 -17812 14675
1071 14675 7655 -1287 1881 -13898 -8673 27425 11594 -35998 -10864 37298 7686 -30719 -3990
1084c990K1493j6034k010p54j5143J9942K6166l6745k9214M6614K4728m6520j5075
1097b6542L5710L921j6297N178p410r724L0000Q901m6119l804N1916l031m6069
1110b3370Q559L0045j0195p794O716j5367J289L4123j1610m4289K0896M3972k5821
1123G154l3889K3960J7086j4755J899j83j8433J7512K8804l2774l1204M1656K6078
1136C2911m1244j5795L0797L921j2186N930j0478j1217L1983J1097m7141o517
1148b7939N2170m4m5748N555K9268p348o676M186j6719L427L5612j3285m5846
1161c3387K2090M5496k6459l5377K4045J8640j4411K09q19j6499J8198K6681l3394
1174d987k9044M2205K4107m1881j4261L1800L040j3936O133p817j0777K8446J0086
$$ plain form
1084 -3990 17503 1469 -541 -1295 -16438 3504 29670 -7075 -36289 10325 35053 -11467 -26542
1097 -26542 9168 13089 -3208 1970 -5440 -15164 14836 23737 -22382 -26186 25730 22699 -23370
1110 -23370 -14811 15234 5039 -2755 3961 -11406 -10117 24006 12396 -31893 -10997 32975 7154
1123 7154 -26735 -2775 14311 -444 1455 1272 -17161 351 29155 -3619 -34823 6833 32911
1136 32911 -8333 -24128 6669 10590 -1596 4334 -6144 -17361 14622 25719 -21422 -27939
1148 -27939 24231 24187 -21561 -16006 13262 5914 -762 3424 -13295 -9868 25744 12459 -33387
1161 -33387 -11297 34199 7740 -27637 -3592 15048 637 846 27 -16472 1726 28407 -4987
1174 -4987 -34031 8174 32281 -9600 -23861 7939 10979 -2957 3176 -4641 -15418 13028 23114
1187B3114m3043n091M8044j779m2231P549K7044r714o109O917j5507L46L2834
1200B2374r975m1960J8855M1125k3723l1091K2282J4794j3891L354M1j8880J6054
1213f41K8300l0219k9900L8334K4243l7696j3744K7690J941j0253P649j0697j2659
1226a7652L0309J2234m3706p430M7529O79m0780N115K4951p385l874M949j7554
1239a2615J757L4450j0698m3060J8787M1866k2947l1741K0971J5747j2406J896
1251B007j252j6892J6888K6025l0544k7758L8342K2700l7790j3089K8307K310
1263I254j1715O417q359j0758K7211J0042m0361n174M4494j553l8497P216K3849
1276A2066r434m108O933j5947k12L1643q801l9390J7131L7673k1704k7427K0355
$$ plain form
1187 23114 -19929 -25020 23024 21245 -20986 -13437 13607 3893 -2216 4701 -10806 -10460 22374
1200 22374 12399 -29561 -10706 30419 6696 -24395 -2113 12681 -1210 2144 2185 -16695 -641
1213 -641 27659 -2560 -32460 5874 30117 -7579 -21323 6367 8308 -1945 5704 -4993 -17652
1226 -17652 12657 24891 -18815 -26245 21284 21963 -18817 -13702 11249 3864 -10 4939 -12615
1239 -12615 -10858 23592 12894 -30166 -11379 30487 7540 -24201 -3230 12517 111 2007
1251 2007 755 -16137 751 26776 -3768 -31526 6816 29516 -8274 -21363 6944 9254
1263 9254 -2461 3956 -4403 -15161 12050 22092 -18269 -23443 21051 19498 -18999 -11783 12066
1276 12066 2632 -1476 5457 -10490 -10702 20941 12140 -27250 -10119 27554 5850 -21577 -1222
1289a222J1690j2641N370o6j9491J4691K7575k7434k8151L4518K2013l3554j1553
1302a8255K4107K02q014Q742j1009j3165K8534J2406m0181p558M3018R36l6215
1315a6452M655K1306o898j848M724j7633J368L2732r514m0075J6863L8322k0543
1328G007k8431J8612J3197j0585L266j987j7081J6284K5157k8573k6160L5275
1340E981K0796l4170j1299K4864Q93r148P283r444j1122K6556J0043l8005n021
1353b1793M0884j638l4424P169K0176r239j671O828j6668l95L0518q083l6766
1366b5102J5811L4237j9886k4071J8412R196j1087O443o75j9081J4051K5940k5444
1379a256k5918L1526J9792l0163r929K1104n70o195Q737j1169j2645K6886J1782
$$ plain form
1289 -1222 10468 -2173 3197 3131 -16360 -1669 25906 -1528 -29679 4839 26852 -6702 -18255
1302 -18255 5852 6054 -1960 6782 -4227 -17392 11142 23548 -16633 -24191 18827 19763 -16452
1315 -16452 -11797 9509 2611 763 5487 -12146 -10778 21954 12440 -27635 -10772 27550 7007
1328 7007 -21424 -2812 10385 -200 3066 1079 -16002 282 25439 -3134 -29294 5981
1340 5981 26777 -7393 -18692 6172 7065 -2083 5200 -4244 -15366 11190 21233 -16772 -21793
1353 -21793 19091 17453 -16971 -9802 10374 1135 -536 6292 -10376 -10771 19747 11664 -25102
1366 -25102 -9291 24946 5060 -19011 -599 8597 -2490 3953 3278 -15803 -1752 24188 -1256
1379 -1256 -27174 4352 24144 -6019 -15948 5156 4586 -1609 7128 -4041 -16686 10200 21982
1392B1982l7034p145L8955R26l2054M325J7880o483J93M591j7936Q97L1318q267
1406A2148l7274J4894L4736j8130k4736J6198J0108q772N275k714j7756J5609
1418d14K4602k6467k4725L2049J8961l0405r582K1282k61o583P740j0431j0976
1431a5210K5703R604l5511m678L7321j525l0701O529J7199q265j27N833j6387
1444a0215Q9K8584p725l3683J4483L0847j7842k1169J6156P438r301O769j359
1457C072j8047J3229K3950k3104k3525K8055J7572k6307q287J7770j456m195Q957
1470G684j1322j2420K5050J1438l3515o957L4463R95k7481M028J4139o131K344
1483B315M491j8153M54K9651p122l4178J3001L1006j5749k1240J3773P611o903
$$ plain form
1392 21982 -15052 -22197 16758 17684 -14370 -10045 7835 1352 1545 6136 -11800 -10903 20415 12148
1406 12148 -25126 -10232 24504 6374 -18362 -2164 7944 -828 4447 1733 -16023 -414
1418 -414 24188 -2279 -27004 5045 24006 -6399 -15981 5301 5040 -1543 6197 -4234 -15210
1431 -15210 10493 20097 -15414 -20092 17229 15704 -14997 -8468 8731 466 339 6172 -10215
1444 -10215 -10126 18458 10733 -22950 -8467 22380 4538 -16631 -475 6963 -2338 4431 3072
1457 3072 -14975 -1746 22204 -900 -24425 3630 21202 -5105 -13392 4378 2922 -1273 7684
1470 7684 -3638 -16058 8992 20430 -13085 -20042 14421 15416 -12065 -8037 6102 -29 2315
1483 2315 6806 -11347 -10893 18758 11636 -22542 -9541 21465 5716 -15524 -1751 5860 -1043
1496a043O334l486j7367J4935K3099k4281k2723K8735J7113k6607q440J7913m90
1509C692m442P174j0745j0056K4107Q776l2267m451L3228j009k6664N354J4178
1522F875o858J201M778j5814L34K6318o903l0312J2638K7152j5344j8006J3633
1535c08N433p421P295k063j7138J2470K1960k0966k0977K4921J5098k2812o473
1548a0981J4729k298k301Q756j1577j1447K3594J0047l0565n662L0646K41k3645
1561a0463M061J1173n525L756L583j7703J219K7415p209l0746J2189K7180j4091
1574D839j7942J1699N540n024O794m458j6289J4476K0974k2319k0185K5507J4910
1587A8522k2859p064J4511q52k232O666j1199r064K2630P846k9246l969K9353
$$ plain form
1496 -1043 5291 1805 -15562 -627 22472 -1809 -24532 4203 21316 -5291 -13731 4182 3692
1509 3692 -750 6424 -4321 -14377 9730 18506 -13761 -18212 15016 14007 -12657 -7303 6875
1522 6875 17 1218 5996 -9818 -9484 16834 9931 -20381 -7743 19409 4065 -13941 -308
1535 -308 5125 -2296 4999 2936 -14202 -1732 20228 -738 -21715 3206 18304 -4508 -10981
1548 -10981 3748 1450 -851 7905 -3672 -15119 8475 18522 -12043 -17705 12941 13182 -10463
1561 -10463 -6402 4771 -754 3002 6585 -11118 -9899 17516 10307 -20439 -8250 18930 4839
1574 4839 -13103 -1404 4136 -888 5906 1448 -14841 -365 20609 -1710 -21895 3612 18522
1587 18522 -4337 -11401 3110 2258 26 6692 -4507 -13571 9059 16905 -12341 -16310 13043
1600A3043q06k2862M515J1307n655K520L673j5417R57K4401o742k7429J1621K4077
1614A7203j3677j5464J1737L992n794P402k924j5997J2256J9927j9558j8706K2620
1627C017J3151k0138n287J2366k558q78Q191j1591j0414K1999R084k7670n172
1640a5900K7063L86k0193L362Q659m661M812K995j7063J054K5294o037k7703J0083
1654g849K3955j1425j5294R157L978l303P137m906j5532J3399J9526j9826j8624
1667a9607K2155J3686j9332o498J1640p29n95O013j1289q221K1208P192k6687
1680a1064l783K6275l83j9992L572R296m491L299K608j4792J486K2543o442k4874
1694a6742J0471K1428j1896j3375R810K902m294P321l470j4865J1479J8156j7483
$$ plain form
1600 13043 12237 -10625 -6110 5197 -458 2062 5735 -9682 -8725 15676 8934 -18495 -6874 17203
1614 17203 3526 -11938 -201 3791 -2003 5399 2475 -13522 -1266 18661 -897 -19603 3017
1627 3017 16168 -3970 -9257 3109 551 -327 7864 -3727 -14141 7858 16942 -10728 -15900
1640 -15900 11163 11549 -8644 -5282 3377 -1284 3528 6523 -10540 -9486 15808 9771 -17932 -7849
1654 -7849 16106 4681 -10613 -1456 2522 -781 6356 1450 -14082 -683 18843 -983 -19607
1667 -19607 2548 16234 -3098 -9596 2044 1315 720 6733 -4556 -12777 8431 15623 -11064
1680 -11064 -14847 11428 11045 -8947 -5375 3921 -570 2729 5337 -9455 -7969 14574 8132 -16742
1694 -16742 -6271 15157 3261 -10114 -304 2598 -1696 5625 2155 -12710 -1231 16925 -558
1707e58j6799J9600J1693j6922m556R761k501L67P601j1092r661J9760Q639k4209
1721h877n275K3168J110j6779K238O521l573N237K448j5817O98K2766m658k4605
1735a5398P916K1049q930j3192O864L114j904O830n042j4313J2135J7827j7351
1748c95j7001J8997J2519j6144o032R131n26O56N384j0982p507J9380O757k3720
1762i483l906K2822L46j6821K457P125l324L984J863j3909J427K0383n399k1993
1776a4428Q526J8634r489j1315P517K072k782O823l750j3280J0302J6054j5066
1789a82j4834J6520J0365j3906m208P619j906J075O371j0160q276J7387P524k0928
1803g539m813J9757J404j4054J418N023k565N191J685j4245Q17K0126l987k1462
$$ plain form
1707 -558 -17357 2243 13936 -2986 -7542 2219 -282 85 7686 -3406 -13067 6693 15332 -8877
1721 -8877 -14152 9016 10126 -6653 -4415 2106 -1467 3770 6218 -9599 -8901 13865 9207 -15398
1735 -15398 -7482 13567 4637 -8555 -1691 1423 -481 6349 1307 -13006 -871 16956 -395
1748 -395 -17396 1601 14120 -2024 -8056 1075 549 1205 6589 -4393 -11900 7480 14237 -9483
1762 -9483 -13389 9433 9779 -7042 -4585 2540 -784 3200 5063 -8846 -7419 12964 7565 -14428
1776 -14428 -5902 12732 3243 -8072 -555 1517 -1265 5558 1808 -11472 -1170 14884 -182
1789 -182 -15016 1504 11869 -2037 -6245 1374 -532 543 6914 -3246 -11522 5865 13389 -7539
1803 -7539 -12352 7405 8809 -5245 -3827 1196 -1369 3822 5507 -8738 -7921 12205 8218 -13244
1817a3244O471J8108p065j1024N106K064p30O616n102j3096J0915J6060j4992
1830H7j5171J5914J1108j3026n289O678n30J806M868j0530o846J7403O341k0677
1844g864m047J9479J081j3984J267N462k078M119J041j2592J477J8039m511j9346
1858a2457O863J6385p446j0032N634K018j614N756l794j1509R175J4084j2977
1871H6j3192J3951R438j1503m087N976j323J501N444r234p368J5291O974j8115
1885f161m751J6816J794j1600P34L593j931N324J441j3125M60J8009k931j8884
1899a1212M858J5664n257r242L548J258J19O376m922j2028R609J4603j2782j3794
1913a3202J3255J0225j0537n111M969p7K333M064r717o067J5449N983j8082m301
$$ plain form
1817 -13244 -6773 11335 4270 -6754 -1648 416 -314 6302 1200 -11896 -981 15079 87
1830 87 -15084 830 11938 -1088 -6377 301 -229 1577 6445 -4085 -10931 6472 12813 -7864
1844 -7864 -11911 7568 8649 -5335 -4068 1394 -684 3435 4476 -8116 -6639 11400 6889 -12457
1858 -12457 -5594 10791 3345 -6687 -1053 965 -649 5107 1313 -10196 -1021 13063 86
1871 86 -13106 845 10283 -1220 -5307 669 -654 847 6291 -2943 -10311 4980 11954 -6161
1885 -6161 -10912 5904 7698 -3902 -3168 425 -1506 3818 5259 -7866 -7406 10603 7672 -11212
1899 -11212 -6354 9310 4053 -5189 -1641 -383 -264 6112 1190 -10838 -1229 13374 592 -13202
1913 -13202 53 10278 -259 -5370 -401 -478 1855 5919 -3798 -9865 5584 11567 -6515 -10816
1927a0816J6876J923j2008J14M546r95L815M53j1202J259J6001l461j7185N190
1941e490J4577n533q991M055J816p80N166l565j0397P865J2811j0857j2112J1515
1955H0Q750r304l917M529j065J828M946q322o903J3357O740j5571m908J4280K308
1970F828r677M5K735j356M984J271j1673J1J5859j843j6590L333J3767l636q184
1985d126K307J174N86N604m365j0686P985J3182j0403j2678J0624R669q287n152
1999d566L613L73K470L494q559n744J3284O084j5384m884J4240K843j0011q47
2013c594L541l19L674L65j0060O43J4219k199j5209L524J2898l857p966K768J626
2028E4k33M603l218r278O638J1522r037j0990R484Q143p602l921L621n77J733
$$ plain form
1927 -10816 6060 7983 -4025 -3911 635 -360 3455 3908 -7294 -6035 9966 6505 -10680 -5490
1941 -5490 9087 3554 -5437 -1382 434 -346 4820 1255 -9142 -1277 11534 677 -11435 80
1955 80 8830 -474 -4391 138 -927 901 5847 -2475 -9378 3979 10719 -4852 -9760 4520 6828
1970 6828 -2849 -2804 -69 -1425 3559 4830 -6843 -6832 9027 7184 -9406 -6073 7694 4058 -4126
1985 -4126 -1819 -645 -59 5545 1180 -9506 -1521 11661 1258 -11420 -796 8873 586 -4566
1999 -4566 -953 -580 1890 5384 -3175 -8919 4365 10449 -4935 -9819 4421 7264 -2747 -3594
2013 -3594 -53 -372 3302 3667 -6393 -5750 8469 6270 -8939 -5415 7483 3626 -4340 -1572 54
2028 54 -179 4424 1206 -8072 -1434 10088 1051 -9939 -455 7688 86 -3835 -214 -791 942
2043I42M157p166o121J1348O288j3209m908J2111K740q241n93K344q60M273J186
2058D291j0002n49J3646o59j4359J773J1972k081p190J252J033P81N006l497r634
2073h217O198J1991q016j1693Q159R070o265m991K501N19K445L269p445n595J1338
2088C268O178j3089n219J2084L398q486j447K939P5L353K97q921K52J2590j369
2103E903j3537K416J1568k724p304J918J717O5L872k803q159N537J0333p460j0072
2118h730P822P676o247l957K957j78J497L636o032n690R529O136j1106n108J0207
2133B412L194o958j073J950n78L709J329q665j184J1888L79j2596N80J0580j023
2148C944o432O39R75P20M500k778q742M881J1008o389j0855O562Q544n070m810
$$ plain form
2043 942 5099 -2067 -8188 3160 9448 -3761 -8669 3442 6182 -2059 -2652 -308 -1168 3105 4291
2058 4291 -5711 -6260 7386 6727 -7632 -5859 6113 4032 -3158 -1906 -873 -92 4914 1417 -8217
2073 -8217 -2019 9972 1956 -9737 -1578 7492 1227 -3764 -1263 -744 1701 4970 -2475 -8070 3268
2088 3268 9446 -3643 -8862 3222 6620 -1866 -3313 -374 -299 3054 3351 -5570 -5318 7272 5903
2103 5903 -7634 -5218 6350 3626 -3678 -1760 -43 22 3894 1091 -7068 -1531 8802 1342 -8730
2118 -8730 -908 6768 521 -3436 -479 -657 840 4476 -1556 -7246 2283 8419 -2687 -7795 2412
2133 2412 5606 -1352 -2425 -475 -1053 2656 3985 -4680 -5864 6024 6403 -6193 -5613 4967 3944
2148 3944 -2488 -1849 -874 -154 4346 1568 -7174 -2293 8715 2326 -8529 -1967 6577 1507 -3303
2163c303J962O07K203L042o461n420R824O197j1375n482J0557L788p418j855K580
2178e54K66K996N22p981m26J1296k94j2218J133J0551j542o754J168J697J38L462
2194C460k105p524M178R707n714r664O116P543m997m090K443J04J159L376m924
2209i32n597P934O268r430n445Q841L607o198j403J938n10L034J606p505j766
2224e558J0474J202j1278k83R631m00n921M05R68M28M111j934q105L605J0278
2239G623m857j0250N142Q102m008m573J540M98J863L177n441n653Q283O575r648
2254a627n952Q997M276o363k167K203K34K676R62p103j279J0096Q79j1076o7R688
2270D377n64o367O45J800K6L015j394o881L025R073m389r213M937P361m221m161
$$ plain form
2163 -3303 -1341 -734 1469 4511 -1950 -7370 2454 8651 -2724 -8206 2351 6139 -1279 -3134 -554
2178 -554 -288 2708 3230 -4751 -5177 6119 5825 -6393 -5260 5291 3749 -3005 -1837 -140 -2 3460
2194 3460 1355 -6169 -1991 7716 2002 -7662 -1546 5997 1000 -3090 -647 -543 616 3992 -932
2209 -932 -6529 1405 7673 -1757 -7202 1639 5246 -952 -2355 -417 -927 2107 3713 -3792 -5558
2224 -5558 4916 6118 -5160 -5443 4188 3788 -2133 -1728 -760 -332 3779 1845 -6260 -2655 7623
2239 7623 2766 -7484 -2342 5760 1752 -2821 -1281 -783 1080 4257 -1184 -6837 1446 8021 -1627
2254 -1627 -7579 1418 5694 -669 -2836 -633 -399 2277 3239 -3864 -5143 4953 5832 -5244 -5311 4377
2270 4377 3813 -2554 -1909 -109 -83 2932 1538 -5343 -2318 6755 2366 -6847 -1910 5451 1230 -2931
2286b931K271L41O76L134l929n433O641O238q093n541P754L733n563j458J894
2301b66o56K513K016o548k416R274J992j0072j054Q634J56n298K52P74L9L908
2317C248j013p630K295R681l415r660L823P649l107m297J286L34J433L266m389
2332d96n750O858O733q160o175P774M504n657k286K106J51K198J331o215j880
2347d964R040J608j0054q05Q931Jn989M35J794j90K730p97o415K114Q567l363
2363B643q767M015P019l618l927K098J92L55L239l191n516N616O310o992n583
2378f107O812L735m989j342J782r21K148K461n821k972Q337K553r098j543P869
2393B904M46m901L08P68l88L577k63p078J352R037k415r081K990P240k657m063
$$ plain form
2286 -2931 -660 -319 357 3491 -438 -5871 770 7008 -1085 -6626 1128 4861 -702 -2160 -266
2301 -266 -922 1591 3607 -2941 -5357 3917 5909 -4163 -5217 3417 3573 -1725 -1473 -699 -660 3248
2317 3248 2235 -5395 -3100 6581 3166 -6494 -2671 4978 1871 -2426 -1140 -806 627 3893 -496
2332 -496 -6246 612 7345 -815 -6990 784 5288 -369 -2655 -549 -398 1800 3131 -3084 -4964
2347 -4964 4076 5684 -4370 -5175 3756 3757 -2232 -1797 -3 -193 2537 1740 -4675 -2561 6006 2643
2363 2643 -6124 -2109 4910 1292 -2635 -537 -345 10 3249 58 -5458 158 6468 -524 -6107
2378 -6107 705 4440 -549 -1891 -109 -1030 1118 3579 -2242 -5214 3123 5676 -3422 -4965 2904
2393 2904 3350 -1551 -1243 -475 -863 2714 2451 -4627 -3275 5762 3347 -5734 -2744 4496 1839 -2224
2409b224J312K26R17L325l497n800N738O817p047o272O864M519n074k161J908
2424d49j66K015J820n707k509Q343K272r303j394Q269L47n450L71J462m57K830
2440B294j85o347J352Q328k545q467L317O730l190l668K030J6L5L360k583n572
2456e095M839O322o217n578O219L693m714j243J893j124J670K747n060l349P475
2471B478K963q317j884P299O02m614M35P65q39L343M76o688M19Q586j471q621
2487e068K208O812k194l641J251j62N45L679k763o089M797O989o033o310N967
2502a2M406m431j899J648o01J906K370n294l094P707K812q599j776P612N42m987
2518a690M12J253p50K775L10o103P25P978j914q064K772O412k881l458K034j04
$$ plain form
2409 -2224 -912 -686 231 3556 59 -5741 -3 6814 -233 -6505 359 4878 -196 -2357 -449
2424 -449 -615 1400 3220 -2487 -4996 3347 5619 -3684 -5078 3191 3538 -1912 -1541 -79 -536 2294
2440 2294 2109 -4238 -2886 5442 2897 -5570 -2253 4477 1287 -2381 -351 -335 -300 3060 477 -5095
2456 -5095 -256 6066 -151 -5729 490 4183 -531 -1774 119 -1005 665 3412 -1648 -4997 2478
2471 2478 5441 -2876 -4760 2539 3141 -1473 -1038 -273 -1112 2231 2707 -3981 -3562 5024 3553 -5068
2487 -5068 -2860 3952 1758 -1883 -632 -794 -249 3430 667 -5422 -625 6364 331 -5979 -12
2502 -12 4394 -37 -1936 -288 -889 1017 3387 -1907 -5001 2706 5518 -3081 -4857 2755 3297 -1690
2518 -1690 -1278 -25 -775 2000 2310 -3793 -3068 4910 2996 -5068 -2296 4116 1235 -2223 -189 -293
2534b93k68L349j969n535M075O246n425n477N564L571m314j071J835j359J372
2549C01L056m481l673O698L303p516k103O572O55m083N97M98j215L312J024o406
2565c461j77Q047q96p958J758O150j969l071J283n55K30L866k261o035M143O736
2581E830n328n936N344L999m018j482J474r58J773K663m882l297P091K950p891
2596b668j862O958N57m481N21R59r84K804O54n865K86P545j411p550K300N929
2612C692k548l065J893l61l81L461j646n466L587O029m857n191N030L247l936
2627e12p50J669j617J303L200m191l687O244L143o934j880O040L57l652Q93K79
2643i5j471L283J203o103k77P540q70p310J788N477k041k488J403r58Q5M000k013
$$ plain form
2534 -293 -561 2788 819 -4716 -641 5605 180 -5297 267 3838 -476 -1547 288 -1071 301
2549 301 3357 -1124 -4797 1901 5204 -2312 -4415 2157 2812 -1271 -674 -176 -1391 1921 2945 -3461
2565 -3461 -3638 4409 3513 -4445 -2687 3463 1494 -1577 -294 -849 -619 3247 986 -5049 -906 5830
2581 5830 502 -5434 -90 3909 -109 -1591 -117 -1075 698 3361 -1521 -4818 2273 5223 -2668
2596 -2668 -4530 2428 2985 -1496 -975 -16 -1000 1804 2458 -3407 -3121 4424 3013 -4537 -2237 3692
2612 3692 1144 -1921 -28 -389 -770 2691 1045 -4421 -834 5195 338 -4853 177 3424 -512
2627 -512 -1262 407 -1210 93 3293 -898 -4585 1659 4802 -2132 -4012 2028 2385 -1267 -374 -95
2643 -95 -1566 1717 2920 -3183 -3460 4080 3210 -4100 -2312 3165 1124 -1364 39 -919 -834 3166 1153
2660A153n932L820O418m928n489M893L522l616j022J197j324J852K903m728l465
2675d746O746K987p357j842O381M61l950O45N63j121K979Q01n803J33P295j283
2691B889p146K192N455k447k645J850o61l74L562j587n364L466N766m713m802
2706d559M879K815l761l78J535j848J334L279m110l610O034K930o594j600N603
2721A949Q1l227J168o3j701L431J391o033m66P258o98o862J620M964j920j974
2737a082J361j374j9M270j794n992L459O313m466n273M454L199l236o84R58j618
2753a524J887L149m578l582O414L031o933j794N904L80l527P67K66j248L116R20
2769B648n760L1P047j172o792K087N024k369k178J729r82l11L712j565n346L353
$$ plain form
2660 1153 -4779 -959 5459 531 -4958 -65 3457 -159 -1181 16 -1308 544 3447 -1281 -4746
2675 -4746 2000 4987 -2370 -4212 2169 2630 -1320 -675 -112 -1233 1746 2547 -3256 -3123 4172 2889
2691 2889 -4257 -2065 3390 943 -1702 148 -513 -887 2675 1088 -4276 -810 4956 243 -4559
2706 -4559 320 3135 -626 -1004 531 -1317 17 3296 -814 -4424 1610 4540 -2054 -3654 1949
2721 1949 2030 -1197 -29 -92 -1793 1638 3029 -3004 -3470 3788 3090 -3772 -2152 2812 892 -1082
2737 -1082 279 -1095 -1114 3156 1362 -4630 -1171 5142 676 -4597 -143 3056 -180 -864 94 -1524
2753 -1524 363 3512 -1066 -4648 1766 4797 -2136 -3930 1974 2354 -1173 -406 -140 -1388 1728 2648
2769 2648 -3112 -3081 3966 2794 -3998 -1911 3113 744 -1434 295 -687 -998 2714 1149 -4197 -844
2785h44N567m462m494M541K459l414l3J226k095J482L386m007l631N729K882o134
2801a842j500N087n1k754J282l56j801L452J535n803o16O804n05o322J447M432
2817B489j789j559J325j589j03M244j549n775L082N949m035m831L993K786k845
2832b07l41P10j840J922L212m366l547N988K919o340j668N236K74k887Q32k05
2848c08j281L306R68n660l8O675j022o223J861M390k067j656J468j323j26L771
2864B735j568n143L139N205m100m065M080K090k968J70R51k113J532L228l810
2879f37l344N286K574n567j242M522k06k339J322n15j767L314J454n375n74O214
2895C120n26n616J364L768j658j070J211j813m8M169j458n449K837N444l621m260
$$ plain form
2785 -844 4723 261 -4233 308 2767 -647 -680 546 -1549 -67 3319 -688 -4319 1410 4292 -1842
2801 -1842 -3342 1745 1694 -1060 222 -134 -1935 1517 3052 -2751 -3367 3437 2932 -3390 -1943 2489
2817 2489 700 -859 466 -1123 -1226 3018 1469 -4306 -1224 4725 690 -4141 -148 2638 -207
2832 -207 -548 162 -1678 244 3456 -910 -4457 1531 4450 -1890 -3558 1678 1952 -935 -103 -308
2848 -308 -1589 1717 2685 -2975 -3013 3662 2640 -3583 -1722 2668 601 -1055 413 -910 -1036 2735
2864 2735 1167 -3976 -837 4368 268 -3797 283 2373 -595 -425 526 -1587 -55 3173 -637
2879 -637 -3981 1305 3879 -1688 -2930 1592 1386 -953 369 -146 -1913 1401 2855 -2520 -3094 3120
2895 3120 2594 -3022 -1658 2110 452 -618 593 -1220 -1268 2901 1443 -4006 -1169 4275 654 -3606
2911c606L483K239k305O2K87k015K091L198m247l372N558K691n672j489M519J34
2927A556k227Q48o43j203L410Q58n404k2O177r69n580J671L811j826j248J240
2943D49j444kL611j559m767K957M718l757l599L670J755k586L17O91k033J549
2959c0L004l583l042M840K294m986j036L924k86j856J295p78j642L278J322n050
2975b332n01N641m88m923J231L091j468n40R83k060J12M050j445n056K634M872
2991C801l249l639K996J740j843L50l3k051K175K986m008l064N079K367n041j240
3007b674L854M8j703Q06q89j083L325P47n020J9N583q40m960J443L235j490q92
3024d91R40j543J73L440j518m407K701M278l314l191L124J459k067M05L48j962
$$ plain form
2911 -3606 -123 2116 -189 -127 160 -1855 236 3434 -813 -4185 1373 4064 -1608 -3097 1422 1556
2927 1556 -671 177 -466 -1669 1741 2599 -2805 -2827 3350 2381 -3199 -1528 2283 457 -791 449
2943 449 -995 -997 2614 1055 -3712 -755 3963 206 -3393 277 2032 -554 -237 454 -1579 -30
2959 -30 2974 -609 -3651 1189 3483 -1503 -2539 1385 1099 -757 538 -240 -1882 1396 2718 -2332
2975 -2332 -2833 2808 2320 -2603 -1372 1719 251 -289 694 -1366 -1254 2796 1351 -3705 -1071 3801
2991 3801 552 -3087 -91 1649 -194 156 123 -1928 247 3233 -775 -3839 1240 3607 -1434 -2674
3007 -2674 1180 1228 -475 331 -558 -1641 1684 2431 -2589 -2570 3013 2173 -2787 -1344 1891 401 -491
3024 -491 449 -1094 -921 2519 1001 -3406 -705 3573 259 -2932 192 1651 -416 -11 337 -1625
3040a625J666K772l395k763M409K014m386q60L301l25j375J210r97j469L150J135
3056B462m590l89M988m94m202J132K480j268k10P92k044J77L744j353m531K366
3072i40M249k805l080K489J360j399M74k65j961K116K756l651k798M459K191m308
3088a113j159L132R9j194O68j104r35L198O81m599o2M983o32m283J095K679j123
3105C31n36N94j583L71L199j512l964K489L746k932k686K630J163j618M77N5j767
3122a543J686K397l152k300L923J625l793o06K726l82r66J050j081j223K912Q83
3138B156m066k55M286m45l528R49J954j004M8N58j981K65L393j211l995J975L705
3155B804k292k623J924J099r59N42m75j830K009K521l233k547L838J989l594j086
$$ plain form
3040 -1625 41 2813 -582 -3345 1064 3078 -1308 -2168 1133 808 -567 643 -354 -1823 1327 2462
3056 2462 -2128 -2517 2471 1977 -2225 -1093 1387 119 -91 701 -1343 -1166 2578 1225 -3306 -940
3072 -940 3309 504 -2576 -87 1273 -126 348 83 -1878 238 2994 -657 -3455 1004 3195 -1113
3088 -1113 -2272 860 959 -235 433 -671 -1606 1592 2273 -2326 -2388 2595 1963 -2320 -1225 1454 331
3105 331 -205 389 -1194 -823 2376 864 -3100 -611 3135 203 -2483 147 1310 -308 169 224 -1543
3122 -1543 143 2540 -612 -2912 1011 2636 -1157 -1763 963 581 -385 665 -416 -1639 1273 2156
3138 2156 -1910 -2165 2121 1676 -1852 -903 1051 47 95 653 -1328 -1063 2330 1119 -2876 -901 2804
3155 2804 512 -2111 -187 912 -47 495 20 -1810 199 2720 -513 -3060 778 2767 -827 -1913
3171a913K503J55p59N26j230p84L009N69m137n5M361n19l648Q89K163q39k81L28
3189C38j541N00K909j463l499K224L243k504k296K159R55j203M51j83j560J681
3205B11K080k853k027L439J431l211n87K222k58o39Q24j115j002K653P63l587
3221a656k58L702k82k992O89J571p20J65L72j830K81L037j037l533J651L208j838
3238E30k246J506Q85o68N52n82j646J836K266k864k262L288J785k993r94J972
3254C65J89m37M18j290o58K797N00l687j27L807l01l112N53J777m95j04P7j498
3272a226N85K674j298l173J839K943j995k102J643R16q20L65l53j356J551J878
3288B071k500j856K909J400k673o80J807o5m96O52j036q53K306P32l081l49L144
$$ plain form
3171 -1913 590 745 -14 512 -718 -1502 1507 2076 -2061 -2116 2245 1726 -1922 -1033 1130 291 10 338
3189 338 -1203 -703 2206 743 -2756 -532 2711 207 -2089 70 1025 -178 273 90 -1470 211
3205 211 2291 -562 -2589 850 2281 -930 -1517 705 447 -192 632 -483 -1485 1168 1931 -1656
3221 -1656 -1914 1788 1506 -1486 -797 774 54 219 591 -1239 -958 2079 1042 -2491 -840 2368 530
3238 530 -1716 -210 675 7 559 -23 -1669 167 2433 -431 -2693 595 2380 -613 -1607 365
3254 365 554 117 535 -755 -1413 1384 1884 -1803 -1930 1877 1576 -1536 -983 794 299 195 272 -1226
3272 -1226 -641 2033 735 -2438 -599 2344 349 -1753 -110 806 -14 351 -2 -1358 193 2071
3288 2071 -429 -2285 624 2024 -649 -1329 478 413 -83 569 -467 -1320 986 1718 -1363 -1712 1432
3305A432r1k525M42J301n11J96K74j633K25K672q13l071J258K814j392j951J086
3322b87P43l73N40o40j538J658K103k425k133K690J722k353j050J446K99j21K92
3339E73j309n80K504N77l207l68L254N5k608J47J470j75k5p8j350N12K375j017
3357G50k803J365K643j470j930J184Q93n31K03l59j138J314J660k042j725K372
3373C86J364k160p60J450P4l38M70q93p38J955P21k583m73K628J37k087J64J042
3391C59k73K37J52j466J75K319n41k677Q45K429r23j674O51O54j38M83o29j362
3409a379J349J903j916j966K083J637j771j073J045M00PJ92j142n51K103O47k665
3426a097n37K707L25k190j36J235M8k0j46j156L97K034p07k447R50K353j014j763
$$ plain form
3305 1432 1341 -1184 -742 559 48 244 518 -1115 -890 1782 969 -2102 -844 1970 578 -1373 -287
3322 -287 456 83 623 -17 -1555 103 2206 -219 -2352 338 2060 -293 -1343 103 402 281 573
3339 573 -736 -1316 1188 1765 -1442 -1810 1444 1499 -1109 -962 508 333 308 230 -1120 -608 1767 750
3357 750 -2053 -688 1955 485 -1445 -261 632 101 304 -55 -1193 121 1781 -261 -1986 386
3373 386 1750 -410 -1170 280 354 16 486 -407 -1145 810 1531 -1052 -1525 1103 1240 -847 -683 359
3391 359 86 323 475 -991 -816 1503 962 -1715 -870 1559 636 -1038 -387 267 129 612 -17 -1379
3409 -1379 -30 1873 -43 -2009 74 1711 -60 -1133 -88 312 319 511 -631 -1182 921 1568 -1097
3426 -1097 -1634 1073 1398 -792 -928 307 355 335 189 -967 -570 1464 757 -1690 -740 1613 599 -1164
3444a164P90Q69k98J20m08r59J126J472j659j617J896J347j703q38J108K19k03
3461I8L15q13o24J671O98k171n57K187L16j735m6Q65j09K04J03j215N4J966l06
3480I01k264M93K093n48j499M19N93k6L61m86j185J026J711j438j837J548J621
3497A483j339j127P80M76O0J27r73n59J758P75k251p62K274O09j851l87J022K39
3515C54J1k05j042K92J840m43k235N94K160o23j658M63Q60j12N7l89q49R18J375
3534A368j351j529J515J364j376r15Q88L54j75J92o18n88J340P36j777o81J834
3551E81M84j496k31Q14JO9J16r70r3J650j0j979J42J889k25j409J78O26K7K79
3571D43l63j074P20J628j010j821J117J654r58j196N43N46J03J11q17o22J458
$$ plain form
3444 -1164 -374 495 197 317 -91 -1050 76 1548 -111 -1728 168 1515 -188 -1026 82 301 98
3461 98 413 -400 -1024 647 1345 -826 -1383 804 1120 -615 -661 204 95 299 402 -813 -759 1207 901
3480 901 -1363 -870 1223 675 -824 -405 188 162 523 37 -1148 -122 1589 151 -1686 -138 1483
3497 1483 144 -983 -203 273 333 460 -513 -1072 686 1461 -790 -1552 722 1331 -520 -907 115 354
3515 354 365 160 -882 -590 1250 807 -1428 -834 1326 703 -955 -492 368 256 313 -76 -925 -7 1368
3534 1368 17 -1512 3 1367 -9 -924 -36 318 143 335 -283 -871 469 1205 -572 -1253 581
3551 581 1065 -431 -662 152 153 222 338 -632 -725 925 915 -1064 -922 967 742 -667 -489 137 164 443
3571 443 80 -994 -274 1354 344 -1477 -360 1294 336 -860 -317 229 332 443 -374 -996 462
3588D62R13j848r91J904Q41j556n97Q75L47Pj72q96R5J631j41k011K23J968k52
3607H02j574K14Q62j7m0k94p33O45J295r60j519J105J420j042j035P19M81k00
3625A29J12m39n87J049Q41j414q94J520P35j296m48P64J26j4J34p61k71J398K76
3644I60j750j87J725O6j309j4O27L9J97j94r49M05J509o41j707P26J600o66j165
3663g28L79N42N7J31o07o79J123J020j481j091J528R92j306p05P59L70j4r3p60
3682e63r4J432J29j795j02J829K5j484mQ80M6r3j82o78M21J240o35j533P88J483
3702A110p86j130N95N59k20O8k84n93P81R23j159j001J296Q45j155n28P33J43
3720A97j15J83n65m00J176M32j509l47J524K07j215n1O09j5J37k9q52J59J402
$$ plain form
3588 462 1375 -473 -1464 440 1281 -275 -872 3 350 357 185 -711 -616 1015 874 -1137 -914 1054 802
3607 802 -772 -558 304 287 247 -47 -780 -135 1160 200 -1319 -214 1206 164 -871 -152 329 129
3625 129 241 -198 -785 264 1105 -309 -1203 317 1052 -244 -692 72 198 184 318 -443 -714 684 960
3644 960 -790 -977 748 814 -495 -509 118 157 354 160 -789 -384 1125 484 -1223 -497 1103 437 -728
3663 -728 -349 193 250 381 -226 -905 218 1238 -243 -1334 194 1186 -120 -825 -66 304 290 197 -563
3682 -563 -657 775 904 -891 -993 836 861 -623 -627 253 299 206 24 -654 -233 1007 372 -1161 -373 1110
3702 1110 324 -806 -211 348 128 196 -88 -681 100 1023 -136 -1137 159 1004 -151 -679 54 197
3720 197 82 265 -300 -700 476 908 -601 -948 576 783 -432 -483 126 111 248 219 -633 -474 928
3739I28l44j634M66J545m85j119L10N09L8J32m38p46Q98J110j205j236J323J087
3757A139j141q02P16L86o4j5o51k58J277L69j665l35J729K29j465r7Q77K7j17
3776A39p9o20K07J227m05j528N67J504o29j158N44N80k66M6j16o32N93R78r66
3795a4j065J159Q87j064n59P31J21j73K64m65n11J036N87j414m81J442L19j180
3813c80r9O13n5J04J09q29l6J381j08j651K62J559l33j151K62N25o1K13k86q30
3833g91O49J258r75j379J134J215j039q34O74L59j22J24n58m56J161O01j552n57
3851a088J654L88j422j62Q58Kj07M4o45J8J252k02j572L91J551n22j184M86N98
3870C38k92R9m7p14M60J092q33j202J052J021j031o11P22J24k09L36l84o45R40
$$ plain form
3739 928 584 -1050 -584 961 476 -643 -333 176 214 346 -92 -838 60 1170 -35 -1271 52 1139
3757 1139 -2 -804 -88 298 234 219 -432 -690 587 956 -709 -1044 685 914 -551 -648 229 256 139
3776 139 60 -560 -353 874 469 -1059 -492 1012 383 -775 -231 349 83 129 13 -619 -26 952 -14
3795 -14 -1079 80 967 -97 -656 75 196 23 287 -178 -689 347 934 -480 -961 481 800 -380
3813 -380 -479 134 79 183 292 -537 -573 808 700 -951 -689 870 537 -614 -352 173 112 325 39 -791
3833 -791 -142 1116 141 -1238 -104 1111 72 -762 -88 271 149 273 -285 -741 420 1021 -531 -1088
3851 -1088 566 954 -468 -630 228 230 123 167 -478 -460 792 590 -982 -591 960 438 -746 -260 338
3870 338 46 145 98 -616 -156 936 103 -1099 -47 974 -57 -668 54 178 -31 305 -79 -724 216
3889B16P46j312o48J406L97j162r7O36j47O8K74p90k58J364J01j609O5J546k43
3908E53j115K94M56j68K76r2r44M51J352p59j487R64J275r34q27O22K73j02K50
3927C38n05o35J078P96j488p36J586N14j343k08P78k3m0J46p16j13J314l6j616
3946i09K45J549l95j178M37N61l21J62L0p78L42J181p21j265R57J059r70o21P41
3965A06O9k90M24k70p81Q32Q82j224p35J317M49j120p7O13k38O3M19p73m26J321
3985E61K91j596m2J491j58j071K85L97k33L72Lj026L28J428o38j514Q30J279q17
4004A70q05N72J98j09L79m81p72J033R34j423q27J490N71j260k09P10r9J4K53
4023C39p33k67J328J13j624J18J555l33j157M38M96l51K27J12q70K50J267o18
$$ plain form
3889 216 962 -350 -998 408 805 -357 -454 182 35 103 377 -413 -671 693 794 -815 -750 796 553
3908 553 -562 -268 188 20 296 204 -740 -289 1063 304 -1183 -219 1056 122 -705 -83 190 88 338
3927 338 -167 -802 276 1072 -416 -1152 434 948 -395 -603 175 152 112 258 -458 -571 743 707 -909
3946 -909 -664 885 490 -688 -251 310 -11 151 181 -597 -255 926 205 -1060 -103 956 -14 -635 106
3965 106 175 -115 309 39 -742 90 972 -252 -987 330 779 -341 -418 195 -43 20 439 -334 -760 561
3985 561 852 -744 -786 705 547 -524 -239 158 -75 297 300 -726 -398 1030 392 -1122 -292 987 170
4004 170 -635 -63 135 26 405 -76 -848 185 1119 -304 -1131 359 930 -330 -539 171 72 86 339
4023 339 -394 -661 667 780 -844 -726 829 496 -661 -223 273 -78 149 261 -609 -359 908 290
4041B90j347Q86J105r40o17P33L1k96N09k42q90Q00R88j180q38J299M93j096p3
4060c85N94l04J07N18p92n46J341L64j565j26J461j44r96K92L07k77M51R4j102
4079g08K02J483n05j554P25J268p64p04N35N8r4N24m53r27R75J066j335r30J433
4098B95N95j174k14O50j64Q8L70q02l93J381K27j650K7J552k43j141L93M60l61
4117a04K96J48r49J83J366n59j418Q11J156q97o18P03j7k90N66k25r65P67J052
4136A006j138q61J250M85j045l1N49l75J16O17q01o27J310M52j517j71J382j21
4154D80r00L07K15l53N63J87j181R2J526l85j562O37J227o74o49M87m5q0O58m25
4174A25j080R33J194j266j047J340O77j095k18N52j92J47M51q60n20J425L65j654
$$ plain form
4041 290 -1057 -171 934 -6 -623 110 141 -155 354 112 -778 22 1010 -170 -1008 291 784 -312 -385
4060 -385 209 -95 12 530 -262 -808 533 897 -668 -794 667 523 -473 -181 126 -151 300 394 -708
4079 -708 -506 977 472 -1082 -357 911 147 -557 -22 36 -58 466 13 -914 61 1127 -208 -1138 295
4098 295 890 -284 -498 152 -12 76 446 -356 -749 632 859 -791 -764 788 545 -596 -203 257 -104
4117 -104 192 340 -609 -426 940 381 -1037 -226 930 33 -585 118 101 -189 377 152 -813 -46 1006
4136 1006 -132 -993 257 742 -303 -334 215 -160 -44 573 -228 -855 455 907 -610 -781 601 480
4154 480 -420 -113 102 -251 312 499 -682 -590 936 551 -1011 -374 853 179 -470 17 -28 -108 550 125
4174 125 -955 -22 1172 -94 -1141 199 876 -219 -437 115 -77 70 521 -339 -859 566 931 -723
4192g23j13J559j85j071L44L73l56L91J87j037J37J404m82j420P46J113q16n69
4210e18O55q4k60O51k49j013P40J085j103q51J178M66r69J2M74m15J53O84q12
4229a76p03J285N16j468k09J302j13p99L01J23l76O32K42j239K4J556l11j548
4247i61N62J163o04n53M27j35o3P53m13j142Q62J250j158j063J227O50r75j75
4265c48M60k58K31N29r16n72J407M14j599j37J422j31r59L29K47l17M68J72j087
4284f45J17J429m59j410P02J065p62m88N65j26k14O97k72j052P57J090j062q72
4302i40J138M43r01M1M23m65K03P18q28p30J278N41j419k28J232j01p26L35L0
4321D4m09O90K91j273k0J539k59j481M86J088n45m65L93k40m2Q42m19j221Q60
$$ plain form
4192 -723 -836 723 538 -533 -189 184 -172 219 406 -631 -494 910 428 -992 -246 867 51 -518
4210 -518 137 53 -207 444 195 -818 -78 1007 -96 -947 231 697 -272 -260 214 -201 -48 636 -176
4229 -176 -879 406 922 -546 -755 547 434 -365 -64 59 -317 315 557 -682 -658 898 587 -961
4247 -961 -399 764 160 -393 34 -101 -164 589 176 -966 -104 1146 -12 -1075 152 802 -173 -348
4265 -348 112 -146 85 614 -302 -874 533 947 -652 -789 633 502 -457 -128 119 -198 270 442 -645
4284 -645 -528 901 442 -968 -266 799 37 -451 114 -12 -226 471 199 -853 -96 994 -68 -940
4302 -940 198 641 -260 -219 204 -261 -58 660 -168 -898 380 921 -498 -726 506 405 -321 14 44
4321 44 -365 325 616 -657 -677 862 603 -878 -392 696 151 -314 79 -161 -203 639 220 -1001 -141
4340a41J269j125j048J133O27q48j30L31l20L48N67r71o15J432M52j591j76J377
4358E71r7q50K74J45k84N80J35j167J39J461m25j416O48J049o95m66N32j99j46
4377b11P44l18j085P71J105j054q63J091M19q49P7L67m92K34P49q49p47J251N50
4396H90j372k26J170j26o26L53o2m25P43L23j296n5J535k21j428M25J006m75l58
$$ plain form
4340 -141 1128 3 -1045 88 715 -133 -263 68 -252 96 663 -308 -923 509 961 -630 -806 571
4358 571 474 -376 -102 43 -241 339 474 -693 -554 907 482 -934 -286 763 68 -398 134 -65 -211
4377 -211 533 215 -870 -99 1006 -48 -911 180 599 -250 -173 194 -298 -64 685 -164 -911 340 890
4396 890 -482 -708 462 336 -290 63 1 -424 319 642 -654 -709 826 605 -823 -398 608 133 -225
$$ [...]
8191g4
##END NTUPLES=NMR FID
##END=
