##TITLE=1H ikalashn
IG-MeOH 410(nlock)
23.10.2024
##JCAMPDX= 6.0         $$ Bruker NMR JCAMP-DX V2.0
##DATA TYPE= NMR FID
##DATA CLASS= NTUPLES
##ORIGIN= UXNMR, Bruker Analytische Messtechnik GmbH
##OWNER= root
$$ TOPSPIN		Version 1.3
$$ 2024-10-23 13:47:46.140 +0400  Irina@DPX200
$$ Compression mode = diff/dup
##.OBSERVE FREQUENCY= 200.131300845
##.OBSERVE NUCLEUS= ^1H
##.DELAY= (6, 6)
##.ACQUISITION MODE= SIMULTANEOUS
##.ACQUISITION SCHEME= undefined
##.AVERAGES= 8
##.DIGITISER RES= 18
##SPECTROMETER/DATA SYSTEM= spect
##.PULSE SEQUENCE= zg
##.SOLVENT NAME= D2O
##.SHIFT REFERENCE= INTERNAL, D2O, 1, 17.49637
##AUDIT TRAIL= $$ (NUMBER, WHEN, WHO, WHERE, WHAT)
$$ ##TITLE= Audit trail, TOPSPIN		Version 1.3
$$ ##JCAMPDX= 5.01
$$ ##ORIGIN= Bruker BioSpin GmbH
$$ ##OWNER= Irina
$$ $$ F:/spectra/data/iren/nmr/1H/4/audita.txt
$$ ##AUDIT TRAIL=  $$ (NUMBER, WHEN, WHO, WHERE, VERSION, WHAT)
(   1,<2024-10-23 13:47:24.687 +0400>,<Irina>,<DPX200>,<TOPSPIN 1.3>,
      <created by zg
	started at 2024-10-23 13:46:47.265 +0400,
	POWCHK disabled, PULCHK disabled
       configuration hash MD5:
       BE 6D 3F 07 2A EA 11 49 91 17 2B D3 AF B3 58 0D
       data hash MD5: 16K
       A5 6B C9 66 00 8D 29 14 BB FD DE C9 DB 05 3F C3>)
$$ ##END=
$$ 
$$ $$ hash MD5
$$ $$ 23 76 C2 C1 17 E8 59 32 FB 4D E3 D7 81 98 03 95
##$RELAX= 
##$RELAX= 
##$RELAX= 
##$RELAX= 
##$RELAX= 
##$RELAX= 
##$RELAX= 
##$RELAX= 
##$RELAX= 
$$ Bruker specific parameters
$$ --------------------------
##$DU= <F:/spectra>
##$EXPNO= 4
##$NAME= <1H>
##$PROCNO= 1
##$TYPE= <nmr>
##$USER= <iren>
##$AMP= (0..31)
100 100 100 100 100 100 100 100 100 100 100 100 100 100 100 100 100 100 
100 100 100 100 100 100 100 100 100 100 100 100 100 100 
##$ANAVPT= -1
##$AQSEQ= 0
##$AQ_mod= 1
##$AUNM= <au_zg>
##$AUTOPOS= <>
##$BF1= 200.13
##$BF2= 200.13
##$BF3= 200.13
##$BF4= 200.13
##$BF5= 200.13
##$BF6= 200.13
##$BF7= 200.13
##$BF8= 200.13
##$BYTORDA= 1
##$CFDGTYP= 0
##$CFRGTYP= 5
##$CHEMSTR= <none>
##$CNST= (0..63)
1 1 145 1 1 1 1 1 1 1 1 1 1 1 1 1 1 1 1 1 1 1 1 1 1 1 1 1 1 1 1 1 1 1 
1 1 1 1 1 1 1 1 1 1 1 1 1 1 1 1 1 1 1 1 1 1 1 1 1 1 1 1 1 1 
##$CPDPRG= <>
##$CPDPRG1= <>
##$CPDPRG2= <>
##$CPDPRG3= <>
##$CPDPRG4= <mlev>
##$CPDPRG5= <mlev>
##$CPDPRG6= <mlev>
##$CPDPRG7= <mlev>
##$CPDPRG8= <mlev>
##$CPDPRGB= <>
##$CPDPRGT= <>
##$D= (0..63)
0 2 0 0 0 0 0 0 0 0.06 0 0.03 0 0 0 0 0.0002 0 0 0 0 0 0 0 0 0 0 0 0 0 
0 0 0 0 0 0 0 0 0 0 0 0 0 0 0 0 0 0 0 0 0 0 0 0 0 0 0 0 0 0 0 0 0 0 
##$DATE= 1729676841
##$DBL= (0..7)
120 120 120 120 120 120 120 120 
##$DBP= (0..7)
150 150 150 150 150 150 150 150 
##$DBP07= 0
##$DBPNAM0= <>
##$DBPNAM1= <>
##$DBPNAM2= <>
##$DBPNAM3= <>
##$DBPNAM4= <>
##$DBPNAM5= <>
##$DBPNAM6= <>
##$DBPNAM7= <>
##$DBPOAL= (0..7)
0.5 0.5 0.5 0.5 0.5 0.5 0.5 0.5 
##$DBPOFFS= (0..7)
0 0 0 0 0 0 0 0 
##$DE= 6
##$DECBNUC= <off>
##$DECIM= 32
##$DECNUC= <off>
##$DECSTAT= 4
##$DIGMOD= 1
##$DIGTYP= 9
##$DL= (0..7)
0 120 120 120 120 120 120 120 
##$DP= (0..7)
150 150 150 150 150 150 150 150 
##$DP07= 0
##$DPNAME0= <>
$$ [...]
##$SW= 21.9926040160658
##$SWIBOX= (0..15)
0 0 2 0 0 0 0 0 0 0 0 0 0 0 0 0 
##$SW_h= 4401.40845070422
##$TD= 16384
##$TD0= 1
##$TE= 300
##$TE2= 300
##$TE3= 300
##$TEG= 300
##$TL= (0..7)
0 120 120 120 120 120 120 120 
##$TP= (0..7)
150 150 150 150 150 150 150 150 
##$TP07= 0
##$TPNAME0= <>
##$TPNAME1= <>
##$TPNAME2= <>
##$TPNAME3= <>
##$TPNAME4= <>
##$TPNAME5= <>
##$TPNAME6= <>
##$TPNAME7= <>
##$TPOAL= (0..7)
0.5 0.5 0.5 0.5 0.5 0.5 0.5 0.5 
##$TPOFFS= (0..7)
0 0 0 0 0 0 0 0 
##$TUNHIN= 0
##$TUNHOUT= 0
##$TUNXOUT= 0
##$USERA1= <user>
##$USERA2= <user>
##$USERA3= <user>
##$USERA4= <user>
##$USERA5= <user>
##$V9= 5
##$VALIST= <valist>
##$VCLIST= <CCCCCCCCCCCCCCC>
##$VD= 0
##$VDLIST= <DDDDDDDDDDDDDDD>
##$VPLIST= <PPPPPPPPPPPPPPP>
##$VTLIST= <TTTTTTTTTTTTTTT>
##$WBST= 1024
##$WBSW= 25
##$XGAIN= (0..3)
0 0 0 0 
##$XL= 0
##$YL= 0
##$YMAX_a= 657937
##$YMIN_a= -601236
##$ZGOPTNS= <>
##$ZL1= 120
##$ZL2= 120
##$ZL3= 120
##$ZL4= 120
##$ABSF1= 10
##$ABSF2= 0
##$ABSG= 5
##$ABSL= 3
##$ALPHA= 0
##$AQORDER= 0
##$ASSFAC= 0
##$ASSFACI= 0
##$ASSFACX= 0
##$ASSWID= 0
##$AUNMP= <proc_1d>
##$AXLEFT= 0
##$AXRIGHT= 0
##$AXTYPE= 0
##$AXUNIT= <>
##$AZFE= 0.1
##$AZFW= 0.1
##$BCFW= 1
##$BC_mod= 2
##$BYTORDP= 1
##$COROFFS= 0
##$CY= 7568.61572265625
##$DATMOD= 1
##$DC= 2
##$DFILT= <>
##$DTYPP= 0
##$F1P= 17.9538593292236
##$F2P= -4.03888763876832
##$FCOR= 0.5
##$FTSIZE= 32768
##$FT_mod= 4
##$GAMMA= 1
##$GB= 1
##$INTBC= 1
##$INTSCL= 1
##$ISEN= 128
##$LB= 0.02
##$LEV0= 0
##$LPBIN= 0
##$MAXI= 945.577
##$MC2= 0
##$MEAN= 0
##$ME_mod= 0
##$MI= -402.1523
##$NCOEF= 0
##$NC_proc= 0
##$NLEV= 6
##$NOISF1= 8.587773
##$NOISF2= 6.764455
##$NSP= 1
##$NTH_PI= 0
##$NZP= 0
##$OFFSET= 17.49637
##$PC= 1
##$PHC0= 45.80207
##$PHC1= -16.58058
##$PH_mod= 0
##$PKNL= yes
##$PPARMOD= 0
##$PPDIAG= 0
##$PPIPTYP= 0
##$PPMPNUM= 100
##$PPRESOL= 1
##$PSCAL= 0
##$PSIGN= 0
##$REVERSE= no
##$SF= 200.13
##$SI= 32768
##$SIGF1= 18.5376
##$SIGF2= -6.396296
##$SINO= 400
##$SIOLD= 32768
##$SREGLST= <1H.CDCl3>
##$SSB= 3
##$STSI= 0
##$STSR= 0
##$SW_p= 4401.40845070422
##$SYMM= 0
##$S_DEV= 0
##$TDeff= 0
##$TDoff= 0
##$TI= <>
##$TILT= no
##$TM1= 0
##$TM2= 0
##$TOPLEV= 0
##$USERP1= <user>
##$USERP2= <user>
##$USERP3= <user>
##$USERP4= <user>
##$USERP5= <user>
##$WDW= 1
##$XDIM= 8192
##$YMAX_p= 0
##$YMIN_p= 0
$$ End of Bruker specific parameters
$$ ---------------------------------
##NTUPLES= NMR FID
##VAR_NAME=  TIME,          FID/REAL,        FID/IMAG
##SYMBOL=    X,             R,               I
##VAR_TYPE=  INDEPENDENT,   DEPENDENT,       DEPENDENT
##VAR_FORM=  AFFN,          ASDF,            ASDF
##VAR_DIM=   8192,          8192,            8192
##UNITS=     SECONDS,       ARBITRARY UNITS, ARBITRARY UNITS
##FACTOR=    0.0002272,     1,               1
##FIRST=     0,             0,               0
##LAST=      1.8609952,     2,               0
##MIN=       0,             -601236,         -601236
##MAX=       1.8609952,     657937,          657937
$$ Real data points
##PAGE= N=1
##DATA TABLE= (X++(R..R)), XYDATA
0 0 0 0 0 0 0 0 0 0 -1 0 -2 8 -8 9 -16 16 -24 25 -33 35 -42 51 -59 74 -84 99 -116 134 -151 176 -198 228 -257
33 -257 293 -330 370 -416 465 -523 582 -647 718 -797 884 -978 1077 -1190 1309 -1444 1593
50 1593 -1753 1934 -2128 2351 -2600 2878 -3198 3563 -3992 4500 -5106 5861 -6810 8065 -9800
65 -9800 12360 -16556 24627 -46092 231624 657937 530143 337421 8195 -220913 -337772
76 -337772 -236025 -14903 274376 469280 517934 363196 86188 -234456 -458384 -525981
86 -525981 -402927 -163883 102078 270377 283222 124766 -129908 -385087 -527900 -505187
96 -505187 -315586 -35911 234003 390253 384745 226350 -7710 -217911 -310151 -244529 -41303
107 -41303 218903 435711 522515 446812 237565 -22160 -233017 -315706 -245192 -57649 162466
118 162466 318991 341370 214268 -17454 -266128 -437594 -468242 -350418 -134752 90340
128 90340 235194 244317 118416 -86368 -281874 -383727 -345479 -176982 59752 276082 392434
139 392434 369561 223756 19682 -156458 -231834 -176057 -12832 190124 349002 397562 313709
150 313709 127874 -89616 -257285 -314924 -247114 -88688 89969 211780 224026 119226
160 119226 -62087 -248258 -365675 -367956 -254322 -69435 114754 228262 230791 127339 -34122
171 -34122 -182839 -253897 -214196 -75819 109097 269704 344836 307391 174869 1964 -141897
182 -141897 -200497 -153163 -22797 133953 249776 274101 193455 36616 -137249 -262597 -293762
193 -293762 -222868 -82627 67338 164972 170717 83155 -60733 -201129 -279596 -262738 -155296
204 -155296 2005 149237 231535 220777 126497 -8551 -126191 -176467 -137595 -24514 117577
215 117577 231839 272618 223689 104364 -38520 -149854 -188305 -142464 -35211 86137 169200
226 169200 177690 105881 -19282 -149319 -233797 -240554 -168410 -47408 73683 147109 145202 71308
238 71308 -41840 -145727 -195770 -169271 -74570 52443 163151 215665 191556 103071 -12123
249 -12123 -106382 -141503 -103915 -9964 100947 182585 200571 146242 39968 -77385 -160997
260 -160997 -180143 -130260 -34521 65928 128866 127971 63313 -38910 -137358 -192295 -181567 -109314
272 -109314 -4048 93094 145065 133569 66190 -27117 -106392 -137932 -107747 -27076 72426 151622
284 151622 179665 146255 65515 -29830 -101997 -123206 -86640 -9174 75999 132704 136563 84680
296 84680 -3294 -93298 -150547 -153575 -102695 -19653 61294 107434 100518 44266 -37541 -110748
308 -110748 -144763 -124914 -58201 29523 104286 137599 117884 54902 -24290 -86659 -106501 -75686
320 -75686 -6945 71672 128177 139612 101237 28227 -50599 -104638 -113669 -75925 -8466 59919
332 59919 100638 96534 48962 -23026 -90872 -127668 -119218 -69473 1271 64745 96266 84274
344 84274 35101 -29997 -83665 -103411 -80632 -24015 44207 97366 114953 90901 35744 -27697
356 -27697 -73846 -84399 -55779 -414 58566 96735 98085 61614 1573 -58581 -95539 -95435 -59439
369 -59439 -3131 50098 78466 70506 29733 -27037 -76639 -98863 -84619 -39578 18360 66438
381 66438 86159 70634 27354 -25194 -65158 -76082 -53440 -6487 45852 82671 89425 63776
393 63776 16372 -33703 -66749 -70202 -43678 1138 45401 70791 66814 35030 -11874 -55321
405 -55321 -78307 -72217 -40134 4502 43641 61766 52069 19140 -23088 -57221 -69170 -53995
417 -53995 -17714 25281 58186 68296 52268 17275 -22024 -49646 -54462 -34776 1093 38455
429 38455 62082 62374 39246 1975 -34629 -56305 -54908 -31757 3108 35168 51255 44840 18650
442 18650 -16594 -46719 -59699 -50491 -23090 11336 39122 49526 38930 12321 -18934 -41986
454 -41986 -47352 -32915 -4610 26210 47386 50720 35353 7852 -20537 -38533 -39244 -22879 3405
467 3405 28702 42675 39646 20938 -5918 -30296 -42748 -38695 -20276 4647 25911 35022 28497
480 28497 9300 -14568 -33380 -39545 -30645 -10308 13230 30805 35660 26298 7005 -14106 -28392
493 -28392 -30074 -18568 1290 21444 33839 33591 20966 1240 -17679 -28446 -27020 -14459 3736
506 3736 19966 27595 23541 9555 -8624 -23801 -30053 -25134 -11333 5587 18845 23366 17590
519 17590 4333 -10784 -21559 -23612 -16188 -2415 12212 22009 23289 15924 3199 -9564 -17328
532 -17328 -17096 -9221 2810 14038 19959 18200 9585 -2309 -12809 -17940 -15893 -7857 2634 11262
546 11262 14559 11294 2967 -6918 -14434 -16580 -12629 -4330 4935 11517 13019 9090 1613 -6157 -11036
561 -11036 -11092 -6363 1123 8295 12421 11970 7322 535 -5596 -8763 -7826 -3518 2255 6992 8828 7037
577 7037 2491 -2920 -7105 -8536 -6837 -2978 1387 4438 5080 3291 -66 -3463 -5455 -5371 -3310 -224
593 -224 2679 4267 4129 2577 368 -1521 -2259 -1738 -300 1349 2448 2631 1899 681 -469 -1077 -1010
610 -1010 -518 81 374 193 -317 -831 -1023 -725 -37 663 960 628 -277 -1326 -1998 -1894 -873 733 2240
629 2240 2947 2445 813 -1346 -3087 -3643 -2690 -456 2172 4028 4271 2680 -247 -3311 -5216 -5089 -2898
646 -2898 645 4078 5975 5495 2745 -1240 -4804 -6399 -5295 -1753 2832 6609 7990 6313 2142
661 2142 -2909 -6805 -7908 -5709 -1071 4139 7730 8109 4969 -550 -6259 -9908 -9930 -6203 -214 5661
677 5661 9040 8471 4129 -2189 -7918 -10596 -8955 -3473 3726 9839 12417 10350 4477 -2832 -8597
692 -8597 -10430 -7488 -925 6564 11907 12768 8624 1015 -7133 -12643 -13276 -8842 -1171 6530 11123 10585
708 10585 5035 -3309 -11123 -15153 -13654 -7080 1982 10025 13928 12113 5418 -3312 -10470 -12992 -9661
723 -9661 -1707 7772 15007 17045 12994 4414 -5233 -12213 -13689 -9131 -499 8612 14348 14158 7872
738 7872 -2118 -11977 -17793 -17275 -10624 -564 8786 13674 12086 4690 -5456 -14141 -17652 -14307 -5263
753 -5263 6018 15234 18759 15285 6362 -4268 -12213 -14160 -9193 675 11438 18719 19375 12973 1954
768 1954 -9418 -16822 -17345 -11037 -641 9453 14974 13482 5425 -6041 -16388 -21428 -19064 -10161
782 -10161 1727 11986 16631 13906 5141 -5894 -14532 -17015 -12032 -1409 10784 19800 22058 16704
796 16704 5944 -5860 -13995 -15217 -9079 1740 12737 19192 18215 9892 -2639 -14598 -21400 -20429
810 -20429 -12258 -345 10318 15404 12690 3328 -8839 -18855 -22422 -17888 -6869 6415 16902
823 16902 20618 16261 5905 -5993 -14419 -15775 -9280 2473 14858 22878 23232 15671 3149 -9444
837 -9444 -17309 -17469 -10121 1406 12210 17660 15199 5615 -7450 -18953 -24363 -21573 -11741 1124
851 1124 11925 16436 12945 3075 -8903 -17941 -20038 -14001 -2012 11419 21155 23463 17610 6151
865 6151 -6158 -14291 -14894 -7720 4183 15930 22559 21107 11873 -1634 -14303 -21334 -20138 -11489
879 -11489 781 11498 16151 12623 2272 -10760 -21257 -24857 -20009 -8522 5133 15712 19249
892 19249 14585 3957 -7973 -16129 -16931 -9743 2667 15535 23818 24227 16675 4204 -8197 -15742
906 -15742 -15515 -7870 3766 14470 19588 16729 6704 -6647 -18297 -23798 -21096 -11503 976 11231
920 11231 15139 11148 1008 -11043 -19920 -21764 -15552 -3487 9821 19371 21587 15840 4759 -6890
934 -6890 -14270 -14203 -6638 5379 17009 23455 21958 12943 -76 -12131 -18668 -17303 -8919 2691
948 2691 12597 16527 12594 2282 -10444 -20601 -24132 -19648 -8953 3646 13280 16255 11609 1532
962 1532 -9604 -17057 -17482 -10449 1429 13631 21519 22066 15254 3963 -7156 -13689 -13041 -5621 5380
977 5380 15360 20030 17256 7890 -4532 -15324 -20418 -18007 -9332 1827 10813 13919 9744 6
991 6 -11312 -19595 -21323 -15632 -4657 7366 15911 17748 12411 2437 -7897 -14199 -13665 -6330 4885
1006 4885 15619 21552 20297 12325 835 -9675 -15168 -13646 -5982 4398 13087 16319 12508 3048
1020 3048 -8450 -17597 -20816 -16985 -7753 3057 11137 13337 8858 -251 -10172 -16679 -16941 -10618 -101
1035 -101 10650 17544 18038 12136 2464 -6917 -12203 -11156 -4238 5695 14570 18685 16241 8045 -2718
1050 -2718 -11980 -16216 -13956 -6362 3218 10732 12985 8884 52 -10028 -17346 -18900 -14018 -4637 5526
1065 5526 12563 13824 8991 284 -8534 -13732 -12976 -6398 3453 12777 17937 16952 10300 746 -7874
1080 -7874 -12193 -10567 -3812 5139 12524 15198 11897 3800 -5956 -13704 -16470 -13340 -5749 3118 9615
1095 9615 11147 7075 -833 -9364 -14943 -15240 -9998 -1208 7714 13401 13766 8821 797 -6894 -11069
1110 -11069 -9878 -3803 4748 12348 15918 13963 7232 -1599 -9099 -12409 -10308 -3871 4104 10245 11903
1125 11903 8245 713 -7801 -13933 -15263 -11327 -3750 4392 9897 10621 6383 -903 -8187 -12377 -11648
1140 -11648 -6191 1917 9531 13736 12968 7659 88 -6654 -9872 -8273 -2598 4764 10808 13005 10361
1155 10361 3888 -3901 -10038 -12202 -9657 -3623 3347 8362 9360 5861 -650 -7588 -12160 -12456 -8353
1170 -8353 -1451 5524 9889 10012 5959 -443 -6472 -9655 -8540 -3532 3374 9473 12347 10857 5631
1185 5631 -1192 -6888 -9261 -7406 -2195 4128 8907 10151 7212 1257 -5395 -10206 -11266 -8268 -2507
1200 -2507 3636 7675 8038 4620 -1129 -6803 -10082 -9572 -5394 762 6532 9723 9152 5167 -502 -5510
1216 -5510 -7806 -6451 -2036 3666 8331 10066 8153 3357 -2439 -6972 -8507 -6568 -2004 3202 6896
1231 6896 7517 4804 -200 -5484 -8950 -9224 -6193 -1110 3977 7054 6979 3867 -976 -5473 -7740 -6834
1247 -6834 -3031 2154 6658 8757 7637 3799 -1137 -5188 -6722 -5167 -1223 3478 6962 7807 5631
1262 5631 1279 -3555 -6950 -7666 -5446 -1337 3005 5779 5854 3263 -965 -5075 -7412 -7024 -4074 295
1278 295 4328 6490 6006 3155 -860 -4343 -5834 -4778 -1542 2574 5858 7079 5742 2381 -1643
1293 -1643 -4723 -5656 -4188 -912 2755 5262 5579 3595 16 -3704 -6066 -6216 -4095 -595 2886 4866
1309 4866 4660 2377 -1060 -4158 -5650 -4946 -2289 1296 4364 5703 4896 2287 -1064 -3734 -4605 -3470
1325 -3470 -696 2545 4873 5398 3924 1018 -2196 -4399 -4788 -3319 -569 2307 4066 4009 2239 -621
1341 -621 -3373 -4883 -4642 -2723 98 2726 4060 3671 1778 -862 -3113 -4035 -3268 -1110 1592 3736
1357 3736 4463 3599 1478 -1111 -3025 -3540 -2528 -354 2001 3598 3744 2410 105 -2260 -3745 -3754 -2419
1374 -2419 -223 1913 3085 2877 1362 -819 -2745 -3642 -3153 -1482 718 2569 3350 2803 1201 -811
1390 -811 -2363 -2844 -2083 -381 1570 2962 3252 2362 645 -1204 -2457 -2650 -1744 -140 1488 2460 2403
1407 2403 1337 -316 -1892 -2745 -2600 -1511 58 1476 2179 1908 828 -633 -1838 -2316 -1849 -647
1423 -647 816 1956 2338 1842 690 -652 -1620 -1826 -1227 -81 1162 1942 1984 1277 79 -1113 -1817 -1801
1441 -1801 -1083 12 1038 1541 1381 609 -456 -1350 -1740 -1493 -698 333 1140 1462 1184 426 -456 -1103
1459 -1103 -1282 -913 -156 674 1242 1337 934 222 -516 -991 -1031 -636 26 649 995 930 497 -132 -705 -980 -887
1480 -887 -473 93 549 749 611 210 -285 -659 -758 -566 -166 281 596 662 454 97 -259 -485 -485 -265 49
1501 49 329 488 422 204 -72 -301 -378 -311 -136 85 252 276 183 24 -128 -207 -194 -80 46 149 162 116 22 -60
1525 -60 -82 -53 18 79 97 47 -43 -140 -201 -164 -82 43 122 127 55 -89 -229 -293 -253 -93 126 317 381 315 136 -86 -280
1552 -280 -304 -172 93 365 536 541 329 13 -318 -506 -482 -261 84 390 520 408 78 -344 -679 -804 -653
1573 -653 -277 182 534 633 453 33 -420 -714 -731 -422 99 619 951 951 627 89 -432 -719 -641 -244 324 838
1595 838 1047 874 354 -322 -870 -1098 -922 -404 222 726 851 551 -51 -736 -1206 -1257 -867 -162 584 1067
1615 1067 1135 734 26 -646 -1019 -925 -368 422 1140 1491 1326 712 -123 -861 -1170 -974 -357 465 1101 1260
1635 1260 901 107 -806 -1456 -1625 -1226 -421 466 1074 1153 691 -144 -997 -1488 -1407 -774 194 1122 1637 1563 943
1656 943 7 -836 -1228 -1022 -272 713 1492 1800 1462 609 -478 -1319 -1628 -1292 -467 528 1222 1346 823 -173
1676 -173 -1216 -1889 -1927 -1315 -270 801 1457 1474 841 -162 -1106 -1583 -1367 -531 629 1635 2082 1840 984
1695 984 -182 -1104 -1489 -1152 -244 844 1663 1855 1308 220 -987 -1851 -2046 -1523 -484 640 1372 1408
1713 1408 762 -347 -1435 -2038 -1942 -1119 99 1265 1903 1806 1007 -127 -1120 -1554 -1240 -311 917 1904
1731 1904 2261 1854 823 -461 -1447 -1786 -1359 -347 816 1598 1713 1022 -160 -1409 -2207 -2259 -1549 -341
1749 -341 859 1586 1545 778 -404 -1468 -1987 -1716 -706 627 1765 2295 2010 1047 -213 -1230 -1607 -1179
1767 -1179 -140 1101 2007 2186 1582 384 -962 -1904 -2104 -1527 -418 785 1540 1536 773 -473 -1651 -2307
1785 -2307 -2205 -1316 -20 1202 1864 1743 889 -325 -1349 -1766 -1416 -365 968 2023 2413 1970 881
1802 881 -420 -1423 -1707 -1234 -135 1058 1861 1926 1191 -77 -1385 -2211 -2273 -1525 -302 899 1569 1485
1820 1485 640 -597 -1694 -2187 -1885 -867 485 1645 2159 1878 891 -336 -1317 -1630 -1159 -69 1196
1837 1196 2108 2300 1702 505 -810 -1727 -1911 -1315 -211 953 1643 1605 823 -428 -1631 -2289 -2186 -1328
1855 -1328 -62 1107 1707 1539 673 -512 -1505 -1890 -1485 -420 895 1918 2282 1839 801 -460 -1377
1872 -1377 -1594 -1068 32 1213 1968 1980 1248 6 -1245 -2021 -2035 -1317 -159 960 1539 1386 525 -688
1890 -688 -1730 -2196 -1898 -934 361 1438 1904 1594 671 -473 -1375 -1622 -1137 -75 1154 2015 2198 1637
1908 1637 540 -683 -1512 -1649 -1059 -4 1064 1695 1630 842 -352 -1477 -2097 -1986 -1209 -49 1001
1925 1001 1519 1325 470 -653 -1572 -1900 -1503 -510 710 1669 1994 1587 621 -500 -1298 -1473 -931 103
1943 103 1206 1897 1928 1236 121 -1006 -1701 -1702 -1048 14 1001 1499 1331 522 -590 -1556 -2010 -1749 -888
1962 -888 239 1201 1592 1312 477 -576 -1356 -1576 -1128 -148 945 1742 1923 1432 472 -580 -1302 -1396 -834
1981 -834 108 1068 1632 1553 853 -222 -1210 -1756 -1662 -967 36 942 1341 1128 363 -653 -1455 -1753 -1403 -520
2001 -520 548 1366 1643 1259 427 -538 -1213 -1316 -815 115 1077 1693 1698 1125 161 -787 -1362 -1348 -776 136 971
2022 971 1384 1214 523 -466 -1283 -1672 -1479 -760 177 967 1281 1034 297 -587 -1254 -1440 -1041 -212 722 1396
2042 1396 1539 1144 343 -511 -1100 -1155 -676 168 972 1444 1379 790 -91 -921 -1374 -1287 -699 130 853 1171 969
2063 969 300 -557 -1239 -1482 -1186 -465 395 1051 1260 956 250 -540 -1081 -1158 -743 23 840 1340 1370 904 136
2084 136 -611 -1078 -1053 -575 180 841 1186 1062 484 -312 -983 -1299 -1151 -592 172 790 1025 802 198 -512
2104 -512 -1054 -1203 -888 -231 519 1051 1172 855 213 -469 -905 -923 -525 139 803 1178 1121 656 -42 -690 -1031
2125 -1031 -946 -476 175 739 977 781 239 -445 -977 -1165 -940 -381 277 785 936 670 121 -494 -899 -959
2145 -959 -602 -8 617 1020 1027 674 88 -486 -813 -788 -400 166 696 968 856 433 -179 -693 -935 -831 -395
2166 -395 177 635 811 619 152 -398 -821 -942 -715 -200 348 763 817 585 98 -404 -724 -739 -416 97 582
2187 582 882 840 491 -27 -502 -744 -659 -319 166 594 761 607 216 -284 -681 -844 -669 -270 215 564 649
2208 649 478 61 -373 -682 -721 -469 -48 405 691 722 465 58 -344 -597 -561 -284 115 498 704 619 322
2229 322 -98 -460 -642 -561 -263 139 446 578 441 98 -296 -587 -665 -510 -152 220 499 548 362 37 -306
2250 -306 -513 -531 -304 53 390 587 559 330 -9 -314 -469 -427 -172 134 415 539 444 183 -153 -416 -524
2271 -524 -419 -166 143 372 439 303 33 -249 -436 -474 -320 -49 229 422 420 266 21 -228 -387 -365 -188 76
2293 76 306 432 384 192 -44 -273 -383 -324 -130 98 294 366 265 70 -155 -340 -367 -279 -65 131 293 322
2315 322 208 3 -188 -308 -300 -156 22 215 326 312 161 -24 -196 -264 -231 -95 84 217 293 229 96 -88
2337 -88 -216 -278 -210 -75 71 205 234 163 20 -135 -233 -250 -162 -25 108 208 204 123 -4 -127 -197 -172 -86 45 152
2362 152 211 174 78 -28 -139 -168 -132 -37 75 141 180 113 39 -74 -130 -143 -98 -19 75 131 136 80 -1 -87 -137 -132 -65 10 82
2391 82 120 103 39 -36 -90 -118 -89 -33 31 73 90 71 17 -38 -77 -95 -60 -15 37 82 72 43 9 -32 -60 -55 -35 14 39 58 47
2422 47 29 -11 -33 -44 -34 -2 21 26 32 11 -12 -33 -38 -32 -19 -12 10 8 9 8 -20 -12 -11 0 14 20 18 1 3 -7 -1 18 18 29 40 19 -10 -16
2460 -16 -33 -35 -11 2 10 23 10 0 -37 -54 -52 -46 -13 16 49 43 18 -11 -34 -56 -50 -15 30 80 91 67 26 -18 -52 -58 -49 -6 51 74
2494 74 91 47 -8 -65 -100 -104 -83 -26 38 70 60 30 -49 -111 -123 -114 -62 18 82 108 104 48 -36 -92 -94 -61 12 86 148 160 109 38
2526 38 -58 -100 -106 -65 10 90 131 107 55 -46 -128 -177 -175 -91 -17 88 118 106 20 -77 -151 -160 -135 -38 68 145 183 138 45 -63
2556 -63 -133 -146 -80 23 121 183 180 110 2 -101 -177 -170 -92 9 106 147 130 38 -87 -185 -221 -180 -100 39 137 173 137 44
2584 44 -79 -168 -177 -121 -7 124 216 224 166 43 -84 -167 -160 -102 36 145 207 197 97 -33 -160 -236 -215 -125 9 132
2610 132 170 132 31 -103 -204 -235 -181 -57 90 197 234 179 53 -80 -182 -174 -99 36 167 247 250 168 20 -123
2634 -123 -198 -192 -94 38 156 217 180 66 -88 -229 -284 -229 -113 33 144 190 145 30 -115 -230 -248 -166 -10 140
2658 140 242 253 188 44 -96 -199 -195 -96 53 184 266 253 129 -37 -172 -246 -225 -106 40 153 210 160 23 -129
2682 -129 -254 -293 -208 -75 86 212 245 165 23 -117 -211 -217 -112 28 186 278 277 162 7 -139 -216 -210 -84 51
2706 51 187 240 194 73 -93 -235 -291 -245 -112 46 164 204 146 11 -139 -241 -274 -173 -18 136 235 268 177 32
2730 32 -109 -187 -201 -89 56 205 284 246 150 -21 -161 -242 -219 -86 56 179 222 168 31 -125 -255 -298 -234 -95
2754 -95 74 187 219 149 -4 -140 -226 -243 -133 17 178 257 265 158 -3 -132 -210 -190 -87 76 204 262 234 90
2778 90 -53 -193 -262 -210 -88 62 181 219 153 23 -130 -238 -275 -188 -39 101 220 242 162 29 -134 -218 -199 -90
2802 -90 38 185 255 247 141 -12 -158 -217 -192 -90 68 194 229 171 40 -103 -224 -260 -214 -80 72 175 198 128
2826 128 3 -146 -233 -233 -125 20 159 248 225 152 3 -123 -188 -174 -72 67 184 250 213 90 -61 -184 -236 -192
2850 -192 -84 61 171 190 130 -4 -135 -232 -245 -179 -51 92 187 192 120 -5 -129 -209 -184 -97 45 164 234 220 114
2875 114 -14 -133 -188 -159 -50 83 193 218 170 48 -81 -193 -219 -168 -50 75 162 173 114 -10 -134 -210 -193 -131
2899 -131 7 133 195 191 103 -6 -137 -183 -151 -74 55 167 208 179 77 -38 -159 -195 -143 -50 63 162 178 121 4
2924 4 -113 -202 -210 -151 -41 77 154 173 107 -19 -112 -187 -162 -95 27 146 199 180 96 -39 -127 -163 -133 -41 81 164 179
2951 179 138 43 -73 -162 -182 -124 -28 72 137 150 94 -13 -120 -184 -177 -109 0 101 159 141 78 -8 -112 -155 -126 -44 56
2978 56 140 194 161 72 -36 -120 -148 -123 -22 77 149 156 117 16 -87 -141 -163 -108 -34 85 125 130 71 -28 -110 -166 -140 -82 22
3007 22 105 140 120 61 -37 -103 -141 -120 -34 60 129 140 117 42 -60 -132 -141 -102 -16 63 117 125 83 -9 -93 -150 -133 -80 -6 79 128
3038 128 122 63 -10 -102 -132 -113 -43 42 114 141 109 45 -20 -103 -118 -89 -15 58 114 118 97 15 -72 -117 -133 -86 -15 52 107 96 44
3069 44 -21 -88 -127 -123 -54 17 81 110 96 43 -20 -72 -94 -68 -13 54 103 120 78 25 -38 -80 -92 -62 -6 41 106 111 63 2 -67
3100 -67 -106 -108 -73 -13 45 71 76 34 -28 -68 -105 -79 -40 26 66 96 71 26 -32 -82 -84 -68 -26 45 78 91 69 0 -36 -83 -76 -46
3132 -46 15 57 81 75 46 -14 -66 -68 -72 -38 15 70 86 77 34 -18 -48 -74 -54 -12 35 66 77 56 18 -41 -67 -75 -49 -3 37 60 70
3165 70 31 -8 -48 -67 -72 -35 -9 38 58 53 24 -31 -53 -66 -60 -33 29 53 60 46 23 -22 -49 -56 -30 -7 26 54 59 50 -5 -21 -50 -43
3199 -43 -24 4 40 56 43 23 -8 -45 -61 -50 -35 2 13 33 38 6 -15 -50 -56 -26 -3 20 37 41 39 7 -27 -28 -45 -25 -2 26 50
3232 50 42 23 2 -20 -33 -31 -12 7 31 46 35 22 -5 -27 -39 -23 -7 14 29 29 33 18 -2 -30 -29 -21 4 15 21 30 16 -4 -26 -39
3266 -39 -26 -20 1 18 16 11 5 -13 -20 -31 -22 -13 3 18 22 13 12 -4 -7 -22 -5 4 13 24 26 17 11 -12 -8 -24 -9 -6 8 18 5 12 -3 -13 -12 -10 -7
3307 -7 5 3 17 10 7 -3 -10 -26 -16 0 -2 9 -3 6 5 -3 -13 -5 -6 0 16 8 12 -4 -10 -6 5 -7 4 0 18 20 8 10 5 -8 9 4 15 12 7 18
3349 18 16 9 4 3 -1 15 13 9 6 6 3 -2 -11 -7 3 5 2 -13 -17 -8 -16 -13 0 3 -1 -1 -9 -5 -14 2 -3 -3 9 -3 -3 1 -1 2 0 -7 0 -4 5 12 17 17 -4 -3 -3 -19 -3
3400 -3 7 6 2 9 0 -11 -12 -17 -6 -7 8 14 12 13 9 -14 -25 -18 -10 4 14 3 22 3 -8 -13 -23 -9 -1 10 19 11 7 3 -16 -22 -34 -17 -1 10 4
3441 4 12 22 6 -8 -10 -16 -8 1 13 11 23 13 0 -7 -24 -15 -5 15 12 19 8 1 -3 -15 -28 -13 -11 10 8 16 3 -18 -18 -23 -32 -18 -4 17 18 20 19
3482 19 -19 -18 -27 -13 1 12 26 30 25 13 -4 -23 -13 -24 -6 21 27 26 28 18 1 -20 -25 -16 -7 15 14 21 5 -5 -23 -36 -35 -15 5 12 33
3519 33 12 8 -10 -26 -27 -27 1 16 23 15 22 6 -17 -16 -26 -18 -7 6 27 24 21 1 -8 -19 -32 -22 4 21 33 30 24 7 -9 -19 -15 -11 20 33
3557 33 48 25 23 6 -20 -25 -21 -14 16 26 24 25 13 -17 -31 -27 -28 -9 12 27 6 4 -13 -30 -38 -42 -15 -3 23 36 32 8 -4 -24 -32 -30 -9
3594 -9 20 26 35 40 20 -6 -32 -38 -11 0 28 34 32 34 8 -11 -25 -32 -39 -8 8 21 19 7 -22 -31 -37 -28 -12 5 17 28 41 14 -17 -31 -34 -25
3632 -25 -11 -1 13 31 27 3 -11 -27 -10 -26 -8 14 21 31 4 5 -2 -23 -25 -4 -9 13 28 32 10 -5 -20 -20 -15 -13 6 31 33 31 29 -9 -17
3669 -17 -29 -26 -11 7 26 26 20 -1 -19 -30 -27 -26 -7 10 24 19 5 -17 -29 -35 -42 -15 0 25 44 24 14 -1 -8 -29 -11 -2 8 18 31
3704 31 36 14 0 -33 -23 -12 -5 25 26 31 14 6 -27 -44 -33 -19 -10 12 24 17 9 -8 -24 -43 -23 -33 0 23 21 24 2 -15 -38 -25 -25 -26
3740 -26 8 25 35 19 13 -18 -25 -31 -16 0 20 34 13 13 -9 -28 -18 -36 -10 11 32 40 28 14 -15 -17 -31 -22 -7 8 32 31 28 2 -11
3775 -11 -31 -31 -21 -15 9 17 32 15 -9 -27 -18 -30 -15 2 6 14 15 4 -9 -28 -20 -17 -16 6 29 34 23 9 -4 -21 -22 -21 6 11 25 21 16 0
3813 0 -13 -31 -32 -17 5 19 16 25 0 -9 -27 -41 -30 -13 -6 7 19 9 9 -8 -28 -31 -24 0 4 24 26 16 -4 -10 -34 -20 -12 6 21 34 33
3850 33 21 15 -9 -16 -12 -11 1 20 28 24 10 -2 -21 -19 -18 -13 22 17 29 19 20 2 -23 -19 -14 -17 7 21 25 15 -5 -13 -23 -38 -23 -4 6 17
3888 17 16 6 -11 -19 -29 -29 -6 4 11 21 11 7 -14 -23 -24 -20 7 9 21 14 22 1 -8 -15 -23 -18 9 14 23 33 22 -4 -15 -19 -20 -13 -1 9 26 10
3928 10 -10 -8 -22 -34 -21 -10 -4 21 8 16 1 -13 -26 -28 -17 -1 5 5 14 0 4 -9 -13 -19 -22 5 16 28 25 15 1 -5 -9 -16 3 2 32 29 21
3967 21 -5 0 -20 -12 -21 -17 1 17 21 9 -4 -9 -3 -22 -16 -17 1 7 1 1 -2 -15 -13 -15 -11 -2 13 22 5 2 -3 -11 -29 -18 2 0 10 7 2 -2 -9 -12 -19 -9
4011 -9 4 22 21 13 12 3 -16 -25 -8 -8 0 19 12 15 3 2 -5 -2 -11 0 -3 1 19 8 -2 -7 -10 -29 -14 -25 4 10 8 10 -1 -6 -17 0 -6 -6 3 20 11
4054 11 7 0 0 -4 -15 0 11 0 9 13 0 -1 -18 -10 2 -5 0 15 17 5 -11 -6 -18 -5 -3 -5 8 4 14 -1 -8 -15 -18 -13 -12 -11 5 9 6 3 -4 -8 -14 -14
4098 -14 -7 3 7 -2 1 9 -3 -9 -15 -16 -6 8 2 8 16 8 -10 -1 4 8 3 10 12 4 8 4 -5 -3 -6 7 2 8 0 6 8 -6 -15 -13 -15 -4 -1 2 0 -10 -9 -17 -17 -10 -2 -2 2
4149 2 2 12 2 4 6 -8 -11 -11 2 -2 13 11 5 5 1 4 1 -7 7 12 17 8 8 6 -17 -13 -13 4 -1 -4 -5 3 -9 -7 -13 -8 -4 3 0 5 -6 -10 -2 -7 -16 -8 -7 -12 -14 -8 -13
4200 -13 -5 -3 -6 -8 -2 0 5 -12 8 10 -4 0 2 -11 2 4 6 11 14 7 1 17 3 2 -3 3 12 -1 -5 2 -1 -3 5 -8 -7 -1 -9 7 0 -3 10 -3 1 1 -2 -4 -11 -1
4248 -1 0 -7 2 -13 -1 2 -8 9 8 2 3 1 -1 -7 -2 -1 2 -5 -3 2 -6 9 1 12 7 10 2 22 14 -1 9 12 1 -3 2 -7 8 -3 4 0 0 2 -11 -8 -10 -9 -2 4
4296 4 -6 -10 -5 4 2 -1 -18 -2 -14 -1 -4 -1 -4 1 -7 8 6 -1 3 5 -2 6 4 2 5 1 3 -9 16 8 7 10 12 1 -6 -1 -1 1 -6 -12 -4 1 -1 -9 -2 0 -5 -1 -1 -13 9
4347 9 8 -7 -5 -3 -13 -2 -10 -11 -3 -1 0 -8 3 4 1 8 1 -7 3 8 1 10 4 6 8 1 -4 -3 5 13 13 8 8 7 11 3 2 -6 -9 1 7 -1 10 -3 3 -8 -3 -9 -2 -10 3
4398 3 5 4 5 3 -7 -7 -14 -8 6 -5 2 -8 0 -2 -7 2 -2 0 4 5 -2 3 -1 -12 -7 -1 5 -3 3 5 2 -2 3 -9 -5 -5 -7 -2 5 0 -4 -4 -2 -12 -9 -5 1 -13 5 -11 -10
4449 -10 -1 -16 -7 -6 -8 -6 4 7 0 -13 -10 -4 -3 -12 -2 6 13 13 19 5 -2 0 -5 -1 -2 -3 16 4 0 3 -4 -18 -5 4 -4 -12 3 0 -3 3 -16 -20 -11 -10 2 -2 -6 -17
4497 -17 -10 -6 -13 -5 -13 -6 -7 -3 -6 -10 -13 -7 -12 -13 1 9 11 2 -2 -4 -14 -9 -6 5 9 3 4 2 -2 0 9 -1 -6 -5 -9 2 15 15 8 -2 -6 -10 -11 -4 2 -4 6 -1 -3 -11 -10 -10
4549 -10 -8 -12 -2 -3 -7 2 -2 -2 -12 -8 -7 -1 -12 -2 0 3 -7 1 -1 -6 -1 7 10 10 12 10 3 0 -7 3 7 1 10 7 -2 -3 4 -3 -7 1 -10 1 -4 14 3 -6 1 -13 -14
4598 -14 -6 -4 -3 3 -2 -4 3 -8 -12 -4 2 -9 2 4 2 -4 -6 3 -5 1 15 6 -5 3 2 1 12 7 3 14 -7 12 12 3 7 7 3 -10 -7 7 -9 7 3 15 4
4643 4 -4 -2 -14 -1 -4 10 3 4 -14 -3 4 -2 -9 -6 -3 1 4 12 7 -3 -7 -3 -14 -2 3 -4 -2 8 -4 4 10 2 -4 7 15 8 9 9 1 2 6 1 5 -6 4 2 4 -3
4691 -3 5 -3 -3 -8 -12 -6 0 13 -2 -2 9 -11 -10 -9 -4 -8 0 0 1 -2 -6 -7 -2 -4 -7 0 -2 -4 11 9 3 4 -1 -3 1 23 21 7 13 18 5 10 -1 -3 15 10 13 7 15 12 -1
4742 -1 -6 -7 -5 5 -1 -3 0 9 -5 -11 -8 -8 -7 -1 -17 -5 -2 1 -2 -7 -12 -10 1 -2 12 2 4 2 9 1 1 -4 7 2 2 3 4 15 0 9 -3 8 5 12 15 15 8 6 3
4791 3 -9 -2 0 -3 -14 -5 -7 -1 -9 -15 -3 -11 -7 -12 -1 0 -5 -10 0 -22 -7 3 -1 -8 -6 -5 4 -3 -8 -5 -2 2 1 4 2 12 2 -2 3 8 -5 4 11 5 7 8 12 4 -10
4840 -10 -6 -4 1 -3 -3 0 16 -7 -11 -7 -9 2 -12 -19 8 -6 -2 -1 -8 -10 -15 -10 -9 5 -4 -9 -11 -13 -14 -7 -3 -7 -5 1 16 6 3 7 -2 -2 2 3 7 7 4 2 2 -3 -2 8
4890 8 -3 3 7 2 0 7 -12 -6 -9 0 -2 4 -1 2 -4 -8 -5 -4 -1 -6 -3 6 10 2 0 0 3 -5 -10 16 -2 5 5 0 0 8 11 9 -4 11 0 5 5 9 4 2 4 -2 4 9 -8 6
4942 6 4 -7 0 5 -12 0 -17 1 -5 -9 -12 -7 -8 -19 -9 -15 -5 -6 -9 -11 -15 -10 -21 -11 3 -21 2 -6 1 -5 -9 -7 -13 2 -9 -3 -1 -3 9 14 1 3 3 4
4986 4 -10 5 -1 7 1 5 -1 7 9 -1 -5 -3 -4 8 8 3 7 6 -4 0 -3 -3 -11 -5 -2 2 -4 -12 2 9 -2 -3 -3 -2 -7 -4 3 3 -3 -9 4 3 10 7 9 10 4 4 5 3 10 4 4
5039 4 1 -10 8 7 -5 0 1 -1 5 0 11 4 3 -13 -12 -7 -2 -11 -4 -1 -12 3 -2 1 4 -6 -2 -3 -3 -2 10 -7 -9 -7 -4 -5 -5 13 -6 -8 13 4 4 1 11 4 3
5086 3 7 11 3 17 3 -6 7 1 2 2 2 -8 11 13 0 1 -3 -3 6 -9 -2 5 -3 -3 -4 -5 -7 -4 -10 -5 -1 -11 -4 4 8 -12 -1 10 -5 1 1 4 8 6 3 5 5 -4 2
5135 2 -18 -7 -1 15 2 2 -6 -6 3 5 3 6 -4 3 -6 6 -12 -5 -2 0 -3 0 3 -5 -9 -5 -11 -7 -1 -5 -5 -8 -1 -8 -4 -13 0 -7 3 0 3 -6 7 -1 -12 19 6 10
5183 10 1 4 6 1 -7 -1 12 12 5 6 6 -1 -4 3 8 5 8 -5 11 -1 3 -1 1 -6 6 -11 1 -1 -10 -1 -11 -18 -14 -8 -7 -8 -7 -3 -2 -3 9 -15 7 -3 -1 2 2 3
5231 3 -7 -1 8 9 4 5 5 1 7 11 11 -2 3 11 0 12 6 -1 -8 -2 2 2 2 2 2 5 -5 -1 10 -6 1 -2 -7 -12 -6 12 0 -6 4 -6 -9 -1 -2 -11 -7 5 4 -15
5279 -15 7 8 -1 -2 12 17 1 1 0 2 5 -1 4 11 11 11 1 15 8 9 6 1 -2 3 -13 -3 2 15 -1 1 4 4 -1 -8 3 2 -2 -1 -3 -2 0 -6 5 0 -5 -4 -3 -11 4
5328 4 -1 0 -10 8 -2 9 -4 4 7 10 9 0 0 5 7 9 6 10 18 12 22 3 3 5 2 0 3 -5 -1 6 0 3 1 5 -5 4 1 8 -10 -2 1 3 1 -8 -5 5 -17 -12 -5 -1
5378 -1 -5 -3 1 -13 1 0 -3 8 -6 2 1 -13 3 -2 2 -2 0 5 -2 7 2 0 2 8 1 7 -4 14 -1 3 -9 11 -7 1 12 5 -2 0 -4 -2 -11 -8 4 -2 -7 1 5
5425 5 2 -3 -10 -1 -9 2 -6 -8 3 -1 -1 7 -1 9 6 2 14 1 4 -3 -1 1 9 2 10 10 4 3 17 12 14 4 13 10 -3 8 -7 5 -3 14 3 9 -3 -13 10
5470 10 9 -2 0 -1 -8 -2 8 3 2 1 4 -5 -2 0 1 -11 -9 11 0 -1 -5 -4 3 11 1 11 -3 -3 2 5 0 3 0 11 13 4 12 4 4 2 -11 3 -2 14 -10 -10 4
5517 4 -4 2 -3 7 -3 3 7 -5 1 -3 -6 2 -6 -1 -1 -9 -7 -4 -3 -5 -1 13 3 6 10 7 13 -3 6 4 4 4 12 12 10 6 6 5 8 5 -4 9 10 15 7 -3 10 0 -11 -3
5567 -3 0 6 -4 -3 -11 8 5 -6 6 13 -6 9 -7 1 4 -14 6 1 0 -7 4 3 -1 2 -4 -3 -4 16 5 8 5 2 16 1 11 17 11 5 0 7 0 15 14 22 4
5612 4 -1 5 -1 -1 5 5 -13 -7 -3 -2 -2 -3 0 2 -6 -12 4 -1 1 -1 -2 -3 2 -2 1 12 -2 5 13 4 4 8 5 15 6 12 14 -2 14 -2 14 13 13 11 2 -4 -4 7 4 1 3
5663 3 10 -1 -8 -3 -8 -3 -2 -16 -4 -4 -11 -3 -7 -15 -4 -9 3 -6 -10 0 -4 -1 -15 -8 -8 6 -1 -13 -6 1 -5 6 6 9 2 8 -8 10 5 16 1 8 17 8 5 -5
5709 -5 14 -1 -7 -2 1 2 -3 0 -1 9 -5 -13 -4 -9 -3 -3 -15 -14 -13 -17 -4 1 -9 4 -4 -12 -19 6 -1 8 1 0 -8 -2 3 -11 -4 8 -8 -6 -5 1 -2 10 15 6 6 -3
5757 -3 0 2 4 -8 -3 -5 5 -2 7 -8 -18 -4 -2 13 5 3 -4 7 -17 5 -4 -16 3 -7 -4 2 -1 -8 -2 -7 -3 0 -8 4 3 -2 3 1 13 3 -2 3 11 4 5 11
5803 11 2 3 11 6 2 5 1 11 5 3 4 10 1 0 8 3 -7 1 -1 3 -2 -5 -13 9 4 -7 -8 -15 -3 -1 -6 -5 1 -12 -4 -2 11 3 -4 5 -3 -4 2 3 -16 -8 -7 0 3 -3 -2 -2
5855 -2 2 5 8 5 6 11 5 1 -5 1 -5 -2 1 11 -3 6 2 1 -4 6 13 -8 -6 -8 -1 8 -10 -5 -7 -11 -8 -11 -13 -4 -6 -4 3 -11 6 0 -5 -12 -8 7 -7 3 2 -10 -1 -13
5905 -13 5 -5 -6 -3 6 -2 3 12 -7 -5 0 7 3 -4 -2 -10 -5 -1 -7 0 -1 -5 -6 12 7 2 -7 -11 4 -6 -9 -11 5 -4 -16 -11 -12 -1 2 2 3 1 -1 3 7 10 8 6 3 -1 4
5956 4 -1 8 7 12 -2 14 11 6 13 6 9 2 12 8 0 7 -3 2 -1 -7 -5 -5 -7 -8 -12 -3 -3 -10 -8 -2 -4 0 -7 -1 -2 -3 4 -11 -6 0 -9 -7 -5 9 -9 -11 4 -8 4 -11
6006 -11 -2 3 -6 4 9 3 9 -2 7 -6 9 3 1 7 -3 0 4 0 8 -1 -6 -2 -7 -3 -4 -5 -8 0 -9 -5 -3 -1 -11 -10 -6 -7 -5 -12 2 4 -3 -10 0 -6 -2 -7 11 3 0 -1 6
6057 6 3 -4 0 4 0 3 13 7 -2 5 4 3 1 18 7 -4 1 4 1 6 -4 -13 0 -5 -9 0 -9 -14 -3 3 -15 -12 3 4 -8 1 -8 -5 -10 1 -9 -4 -3 -9 -9 -7 -3 0 0
6106 0 -2 8 2 7 -3 -1 -1 1 -11 4 1 3 2 0 16 2 -12 5 -2 -2 -3 -3 14 7 3 -4 8 -1 0 -1 2 -9 -3 1 -6 -5 -2 -3 11 6 6 3 -10 -2 -4 -3 -2 3
6154 3 -5 13 9 0 -2 3 4 6 16 19 12 12 4 3 4 6 2 5 13 12 2 7 13 -7 1 -6 -3 -3 2 -1 5 -8 -9 -4 0 -10 -1 -8 -10 2 3 1 -1 -3 -1 -7 11 7 -6 -4 -3 -3
6206 -3 -8 6 2 10 7 8 1 1 3 17 16 10 -1 15 11 6 -3 4 -4 5 17 4 8 8 3 -7 -1 -4 2 -1 -1 -5 -6 -12 4 -6 -15 -6 -8 -1 -4 -2 -3 6 -11 -3 0 -10 -7 3
6256 3 -6 -9 5 -5 -6 -10 -11 -4 14 1 7 7 2 -6 5 8 9 6 5 6 -3 -1 6 -11 -5 0 3 -6 7 2 -11 -3 -14 1 -11 -5 -1 -11 -2 -12 -6 -2 -7 -3 0 -7 2 7
6304 7 -1 -6 -2 -1 -3 -6 10 2 6 2 2 5 12 5 4 9 6 6 9 -2 3 7 3 9 3 -3 -6 -4 1 2 -2 -11 -7 -6 -4 -6 0 -16 -6 -5 -3 -2 -12 4 -3 -12 -7 -1 -2 -1 -2 -2 -3 6 -8
6359 -8 -2 0 -3 -2 -6 -17 -2 -1 9 -1 1 1 -5 2 5 1 8 -4 9 1 -2 -11 2 1 -1 0 -3 8 1 -2 -9 -4 -3 -7 3 -10 -9 3 -10 -10 4 -15 3 2 2 -2
6405 -2 -3 1 6 -2 -11 0 -1 10 3 1 -4 1 4 -6 -3 1 9 5 1 12 -2 9 3 6 6 -1 4 3 5 -5 -2 -14 -5 -5 -4 3 -11 4 1 -12 -3 4 -13 -6 -8 -4 -3 -6 -14
6454 -14 -1 -7 0 -2 -9 1 -6 11 0 -4 -2 2 2 4 6 0 9 3 -9 1 2 6 5 4 2 9 6 -1 -2 -6 2 -1 -6 1 -2 8 -1 -5 -2 1 2 -1 -2 5 -1 -1 -12 1 -9 -5
6504 -5 -9 -11 4 -2 6 1 0 -3 2 -3 -3 5 5 2 1 0 8 0 5 7 12 2 0 6 -3 16 -10 -4 7 -5 -1 1 -3 3 -5 1 -3 -2 0 -15 -14 1 -5 -8 -2 4 -7 -4 0 5 -15
6555 -15 -5 -8 -2 -13 -7 -3 -13 10 -4 5 7 7 9 9 9 11 6 7 11 -2 0 6 11 12 8 10 6 8 8 7 -2 1 6 -1 2 2 6 2 -1 3 7 -9 1 0 -4 -5 -4 19 -7 -5
6605 -5 -13 -4 -5 -1 -5 4 1 -13 0 -10 -1 5 1 7 1 7 -14 12 10 1 7 7 -8 1 13 12 4 11 11 16 5 14 0 -3 13 -2 -6 -1 1 -7 -3 -5 -4 15 -3 1 3 -2
6653 -2 -5 12 6 -2 -12 -5 -2 -10 9 1 6 7 -6 -6 4 8 1 7 4 1 9 13 6 -1 12 -4 7 -7 7 -1 13 -6 5 -5 0 3 11 7 1 5 -2 5 1 5 -17 -14
6699 -14 -4 -9 -10 0 -5 -4 -10 -7 -8 -7 -1 -18 -9 1 -6 -7 -11 -7 -2 8 3 6 -5 3 -7 -3 3 -2 1 0 -7 -3 7 9 2 14 7 -1 1 6 5 5 0 -3 4 4 7 -1 -9 -6 -8
6750 -8 -1 -3 -10 7 2 -6 -7 -7 -7 -4 5 -7 -15 -4 -11 -5 -7 -7 0 -14 -8 -7 -1 -3 -3 9 1 -3 8 4 6 10 9 0 -4 7 9 2 7 -6 -5 0 -6 -8 6 -3 -4 -6 2 -5 -4 -9
6802 -9 -8 7 -15 -3 -6 -5 -5 -2 -5 -2 -12 2 -15 -2 -7 -13 -10 -12 -17 -7 -12 6 4 -6 9 6 -2 -4 5 1 8 -6 -2 -6 -2 3 -6 -5 2 3 10 -1 -3 13 4 1 -1
6849 -1 1 -8 -9 -23 -12 -13 -5 -9 -9 3 -6 -2 -3 -5 -2 5 -14 -7 5 -6 2 1 -1 5 9 11 3 8 -1 8 2 -7 12 1 2 6 11 -1 1 6 10 12 -3 -5 -2 12 -4 8
6897 8 -1 1 -3 4 -7 -11 0 -5 0 -6 0 -4 -7 -14 -2 -5 5 7 -3 9 0 3 -6 -4 -1 -4 -5 2 -2 11 7 1 10 3 19 13 9 10 4 11 11 9 13 12 6 9 7 22 -14 -1
6947 -1 0 -8 1 5 -2 7 4 -3 2 -20 3 7 1 -5 -5 -4 -4 -12 -4 -4 1 -2 -8 -2 3 -6 4 4 0 7 2 8 3 5 3 16 4 2 7 7 -4 -6 8 4 -2 12 12 7 -6 2 0 -4
6999 -4 9 4 0 -8 -6 -5 8 0 -1 -11 -2 6 -7 8 -12 -5 8 8 19 0 -1 9 1 10 9 1 7 8 -1 7 2 8 5 4 1 6 -1 12 5 15 -9 2 1 9 2 10 0
7046 0 -4 7 11 -5 2 -11 -4 -1 -6 4 0 -3 -1 -1 -6 11 0 9 -2 -10 -11 3 0 -7 1 1 -6 -5 0 0 -2 -4 0 -8 3 12 6 8 8 1 3 -10 2 12 9 -8 9
7093 9 6 0 6 9 1 6 15 2 -5 10 6 0 3 11 13 -4 7 -1 1 4 -2 -5 -7 1 -1 -3 0 7 -2 4 -2 1 3 5 2 7 10 -4 -12 8 -7 -3 5 -5 0 -3 4 7 -5 5 6
7144 6 -2 3 12 2 8 -5 -5 0 3 -6 1 1 0 11 -6 -1 -5 -2 5 -3 7 6 0 -2 -11 12 -6 1 -2 -4 -13 -2 -6 -7 -6 -1 6 -1 -7 -3 -1 2 15 9 13 -2 11 13 11 11
7194 11 7 4 21 8 8 5 7 6 -6 -11 -9 4 -2 11 2 1 -2 1 9 2 -1 11 6 4 1 8 8 -10 2 -2 1 -5 -2 -15 -11 -9 12 -12 3 -8 1 2 5 4 -15 6
7240 6 2 -5 1 5 -5 -2 5 -2 -2 -5 -3 1 2 7 -1 8 1 -4 -7 -1 2 -3 -4 -3 -10 -10 -14 -10 -1 -4 -8 -9 -4 -3 -9 2 -5 8 10 -12 -8 10 0 -4 5 15 1 2 14 6 1 8
7292 8 12 8 4 11 8 7 4 4 5 3 3 3 5 2 8 -1 -8 -11 -6 6 -5 -12 -12 -9 -10 -5 -19 -9 -8 -6 1 0 -7 -10 -8 -15 -10 -1 -10 -14 -14 -11 -11 -3 7 2 1 1 9 5 0 5 -2 -2 -7 0
7348 0 1 7 -3 1 -7 0 -13 3 10 4 -4 10 15 8 0 0 -10 -4 -8 -6 -13 -2 3 3 -8 3 -4 -9 10 2 0 -1 -4 -6 1 -3 -1 -3 -5 6 1 -4 5 7 4 10 4 -1 -6 6
7398 6 4 8 -2 1 -3 -3 -5 2 5 -3 12 5 8 -4 -12 1 3 -7 -10 -1 1 -10 -3 -10 -6 4 -15 -10 -1 -11 -3 -9 0 -1 -4 5 -16 -1 2 0 1 5 13 -2 2 2 1 13
7446 13 6 10 -2 10 5 -3 1 1 6 -5 -1 13 10 1 -1 -2 -4 3 0 -2 5 -15 -12 -7 -7 -7 -14 -9 -13 -8 -16 -4 0 -3 3 -3 0 -1 -10 -1 2 -10 -7 -1 -5 -7 11 -9 11 -2
7496 -2 1 1 10 -2 -4 3 5 1 -9 -3 -7 -1 3 1 3 -4 6 2 3 0 -5 -3 -3 -4 -3 -11 -4 -14 -4 -12 -10 -6 -9 -7 -6 0 -4 3 -14 3 5 -6 -4 2 -11 -4 -2 -13 0 -2
7546 -2 -3 8 1 5 5 6 -3 8 2 4 -3 5 -3 10 2 -3 5 7 -1 7 9 4 -2 1 -3 4 -14 -2 -9 -5 -8 -14 -5 2 -10 -3 -2 -14 -6 -9 -4 -7 -4 -4 -8 -2 -7 -6 -11 -11 -3 1 4 1
7600 1 -6 -14 0 7 8 5 -1 2 1 1 8 -3 -4 -3 -1 -5 2 -2 7 -2 -5 -5 -5 -2 -12 2 -11 -12 -11 -5 -12 -9 -10 -1 4 -2 0 -2 5 -5 2 11 -2 -2 -1 -10 -2 -4 5 5 7 4 3 -7
7654 -7 4 1 -9 3 -2 4 7 -1 -11 7 -4 1 -13 1 -9 0 -3 -11 -10 -1 5 -2 -6 -11 -7 -4 -14 -10 -5 -5 -18 -15 -6 -4 0 4 -1 -3 -8 -11 -2 -1 -1 -2 -3 -2 -16 1
7702 1 -4 -7 -4 -7 -2 2 5 -3 2 1 6 4 3 -4 -7 -4 -6 3 1 -5 -6 7 -13 -3 -6 -2 -11 -1 -5 -7 -12 -12 -20 -18 -13 -8 -2 -7 -2 -4 -12 -5 -6 -7 -12 5 -4 -8 -10 -5 -1 -7 -10 -9 1
7757 1 -11 -4 -3 1 1 -4 0 2 -3 -8 8 -2 -10 -12 -5 -7 -3 -13 -8 -2 -13 -10 -8 -6 -1 2 2 -8 -4 -14 -8 -7 -4 -5 -13 -4 -10 -5 -17 -5 -10 -8 5 -5 -3 -17 7 -5
7805 -5 -4 12 7 7 -1 0 -6 -2 7 2 -6 -5 1 -5 -3 -6 -20 -11 -4 -13 -8 -7 -6 -14 -8 -1 -10 -11 -13 -20 -8 -7 -16 -8 -4 -8 -14 -5 -13 -2 -4 -4 1 4 -2 -7 6 -1 0 2 -8 -11 -13 6
7859 6 -2 -5 -7 -1 -8 6 -4 4 -11 4 -15 -5 -8 -16 -6 -9 -4 -9 -6 -14 -6 -21 -6 -12 3 -5 -16 -3 -4 -10 5 -3 -13 -9 -14 3 -10 -9 8 2 -1 3 1 -2
7903 -2 4 -1 14 9 2 -1 11 9 2 -3 0 3 7 -11 6 4 8 8 6 -1 8 7 -14 -2 -10 -7 -17 -3 -6 -4 -6 -4 2 1 -10 -14 1 -5 -8 2 -15 -6 -13 -7 -8 -17 -3 0
7951 0 2 -9 -16 -1 -5 -6 -9 -3 -18 -10 1 0 -5 1 4 0 2 0 0 0 -5 -5 -6 2 -5 -4 -2 -1 -5 -4 -13 -7 2 -8 -6 -10 1 -7 5 -5 0 -1 2 -3 -7 -7 -1 -2 6 0 -8 -7 -2
8004 -2 1 12 8 -3 8 -6 10 1 5 18 15 -3 -9 1 -3 8 4 14 7 -1 5 2 -2 7 2 0 -4 0 -12 -8 -3 -4 -2 -4 -1 -8 -15 -8 -2 -11 -5 -5 -12 -2 -5 -14 1 -1
8052 -1 3 -5 -2 1 0 7 5 11 8 5 1 0 9 16 2 -11 6 -1 6 -7 -1 -4 6 12 -2 -1 2 11 1 3 -4 -5 -3 -17 -14 -9 -15 -4 -7 -3 -5 3 -1 5 -11 -2 -12 -10 -2 -7
8102 -7 -12 -6 -4 -9 -3 3 0 8 7 7 2 -5 0 -4 -3 2 5 3 -11 -4 -6 -14 -1 -14 -13 -6 -6 -7 -6 -4 -10 1 -4 -15 -3 -12 -11 -6 -4 -20 2 -4 -6 -7 -5 3 -5 -1 -5 -11 -8 -6 1
8155 1 3 -10 -11 -3 1 4 10 -2 5 1 5 5 2 2 13 7 9 6 -8 6 -4 5 3 6 -4 -9 -3 -3 -4 -1 -2 4 -10 3 -5 2
8191B
$$ Imaginary data points
##PAGE= N=2
##DATA TABLE= (X++(I..I)), XYDATA
0 0 0 0 0 0 0 0 0 0 0 2 0 8 -8 8 -9 13 -16 22 -25 33 -33 42 -50 58 -68 82 -93 109 -126 143 -165 186 -215
33 -215 240 -273 306 -345 389 -432 483 -538 597 -664 733 -813 896 -989 1092 -1202 1326
50 1326 -1459 1607 -1773 1955 -2161 2392 -2654 2958 -3307 3723 -4217 4825 -5594 6592 -7958
65 -7958 9944 -13116 19016 -33764 152298 154042 -226709 -408195 -469583 -302789 -56420 216139
77 216139 349993 323557 108041 -184062 -464844 -601236 -561321 -342948 -49311 220962
87 220962 352528 313984 119495 -132182 -339756 -403034 -296773 -49856 238789 466238
97 466238 543079 449511 223698 -37211 -231945 -281974 -174518 43765 276475 425522 422837
108 422837 264325 5415 -256337 -425373 -441645 -307619 -83722 133803 254526 227934
118 227934 65288 -166804 -372595 -466861 -408157 -216132 37171 256291 361111 318110
128 318110 153417 -58481 -225346 -274653 -182510 16669 244793 411836 452056 349973
138 349973 146154 -79656 -240870 -278726 -185269 -5818 179984 290975 277047 139019
148 139019 -71912 -275410 -394452 -385719 -256625 -61542 120470 217857 194770 64978 -114213
159 -114213 -265817 -324213 -261511 -98376 104418 270892 340154 290351 146887 -28216 -161861
170 -161861 -199215 -125557 28163 198265 314178 326967 228810 55959 -126025 -248977 -269169
181 -269169 -184463 -34792 114581 199609 183237 70283 -94835 -246417 -323956 -296635 -175146
192 -175146 -7286 141755 215657 189342 78710 -66472 -183070 -220232 -159862 -23661 136021
203 136021 257547 294743 235248 104875 -42976 -149586 -174053 -109660 13945 143270 222942
214 222942 217953 127599 -14441 -154214 -239137 -238864 -157232 -30186 89110 151870 133228 41836
226 41836 -83850 -191531 -236183 -198068 -90589 45327 157926 205469 172606 76430 -40951
237 -40951 -129613 -152010 -98052 10974 131278 214372 226655 162813 47863 -73283 -153948
248 -153948 -164498 -103939 -69 102052 158615 144753 64433 -51251 -157022 -211595 -194317
259 -194317 -113295 -1690 95757 141005 117803 38002 -63674 -143843 -168239 -125396 -31042
270 -31042 78462 160986 185544 144580 56633 -41444 -109621 -120773 -71355 17285 108122 163328
282 163328 159561 97301 334 -93910 -149627 -146770 -88995 -1803 77896 117001 99148 31557
294 31557 -58367 -134154 -165022 -138277 -64241 28026 102648 131207 104268 34871 -46941 -106489
306 -106489 -118481 -77084 1576 86423 143826 151264 106320 27365 -53802 -105234 -107343 -60849
318 -60849 13686 84674 122153 109969 52198 -28616 -100915 -136709 -122913 -66340 9243 72978
330 72978 99469 78681 20126 -51478 -106450 -121927 -91137 -25957 48069 102327 116413 86218
342 86218 25438 -40273 -83857 -87582 -50153 12897 75895 113249 109771 66777 1310 -60917
354 -60917 -95889 -90757 -49039 11087 64324 88513 73410 24948 -37500 -89029 -109155 -90116
366 -90116 -39814 21437 69326 85297 63865 14836 -40962 -80227 -86479 -56761 -2774 54151
378 54151 91661 95324 64383 11999 -40406 -71883 -70194 -36747 14094 61218 85152 76021 37267
391 37267 -15646 -61994 -83883 -73462 -35916 12801 52662 67620 51904 12331 -34776 -70245
403 -70245 -79748 -59538 -17792 28880 62240 69628 48993 9636 -31907 -58513 -59284 -33980 7070
416 7070 47368 70826 68218 40883 -17 -38124 -58490 -53526 -25970 12300 45361 59541 48903
429 48903 17687 -21619 -53474 -65342 -52947 -21691 15510 43704 51782 36938 5756 -28696
441 -28696 -52225 -55133 -36237 -3092 31091 52958 54232 35031 3683 -26860 -44272 -41717 -20615
454 -20615 10121 37924 51517 45497 22429 -8363 -34718 -46518 -39562 -17340 10637 32871
466 32871 40360 30201 6749 -20410 -40439 -45395 -33508 -9790 16152 34128 37314 24887 2424
479 2424 -20601 -34814 -34371 -19510 3687 25986 38612 36742 21431 -844 -21087 -31323 -27673
492 -27673 -12014 8940 26561 33621 27239 10059 -11009 -27685 -33544 -26598 -10056 9099 23131
505 23131 26495 17997 1459 -16281 -28006 -29022 -19011 -2116 14906 25493 25701 15916 520
518 520 -14040 -21912 -19976 -9230 5784 19006 25209 22031 10939 -3453 -15465 -20555 -16946 -6590
532 -6590 6051 15747 18588 13468 2643 -9505 -18195 -20094 -14666 -4303 6693 14006 14905 9272
546 9272 -281 -9730 -15202 -14513 -8005 1611 10523 15309 14260 8066 -559 -8018 -11429 -9516 -3307
561 -3307 4499 10700 12815 10043 3623 -3789 -9349 -11010 -8353 -2757 3306 7382 7869 4737 -586
576 -586 -5876 -9009 -8866 -5611 -687 3893 6423 6106 3367 -470 -3763 -5079 -4088 -1291 2151 4739
592 4739 5617 4545 2149 -542 -2457 -2946 -2005 -233 1485 2401 2203 1086 -451 -1690 -2182 -1869 -1053
609 -1053 -187 296 253 -174 -646 -828 -559 62 675 930 611 -167 -986 -1412 -1101 -107 1266 2340 2564 1721
629 1721 17 -1869 -3094 -3080 -1710 569 2791 3988 3569 1541 -1311 -3812 -4854 -3884 -1176 2274
645 2274 5024 5905 4473 1199 -2673 -5458 -6008 -3988 -82 4083 6775 6817 4015 -617 -5243 -8007
661 -8007 -7710 -4398 615 5289 7661 6703 2642 -2882 -7638 -9637 -7858 -2948 3265 8284 10115 7948
677 7948 2670 -3572 -8183 -9187 -5985 174 6871 11375 11746 7691 771 -6322 -10766 -10766 -6303 739
693 739 7452 10979 9735 4036 -3901 -10964 -14262 -12382 -6050 2221 9196 12028 9572 2878 -5267
708 -5267 -11485 -13056 -9157 -1201 7719 14150 15482 11187 3031 -5679 -11436 -11852 -6724 1793 10248
723 10248 15084 14160 7637 -1987 -11012 -15912 -14782 -8133 1216 9425 13074 10518 2766 -7096 -15077
738 -15077 -17827 -14058 -5146 5442 13604 16147 12142 3346 -6490 -13276 -14028 -8215 1887 12334
752 12334 18951 18978 12342 1678 -8819 -15030 -14498 -7589 2721 12098 16504 13909 5131 -6452 -16377
767 -16377 -20723 -17788 -8822 2532 11668 14981 11092 1768 -9119 -17022 -18472 -12637 -1664 10266
781 10266 18569 20074 14309 3776 -7116 -13917 -13765 -6665 4455 15106 20822 19082 10386 -1923
795 -1923 -13143 -18979 -17239 -8849 2541 12119 15831 11880 1787 -10491 -20059 -22983 -17970 -6937
809 -6937 5738 15161 17693 12462 1862 -9542 -16918 -16944 -9302 3076 15451 22969 22653 14688 2343
824 2343 -9407 -15911 -14626 -6241 5658 16025 20409 16727 6182 -7220 -18393 -23061 -19536 -9467
838 -9467 2915 12519 15433 10430 -366 -12514 -20987 -22133 -15230 -2832 10320 19274 20681 14238
852 14238 2847 -8605 -15330 -14370 -5974 6526 18165 24178 22032 12418 -887 -12774 -18685 -16470
866 -16470 -7306 4755 14553 17843 12912 1577 -11826 -22061 -25061 -19668 -8054 5088 14569
879 14569 16702 10794 -493 -12350 -19678 -19171 -10724 2509 15513 23336 23000 14864 2413 -9208
893 -9208 -15328 -13441 -4417 7945 18526 22789 18796 7859 -5834 -17162 -21850 -18321 -8320 3801
907 3801 12957 15308 9697 -1567 -14007 -22582 -23699 -16758 -4406 8580 17309 18495 11970 764
921 764 -10293 -16459 -14923 -6053 6722 18449 24462 22373 13003 121 -11165 -16515 -13937 -4743
935 -4743 7043 16386 19183 13914 2499 -10757 -20776 -23712 -18572 -7577 4672 13255 14757 8606
949 8606 -2482 -13888 -20774 -20107 -11873 837 13177 20557 20246 12699 1251 -9268 -14488 -12205
963 -12205 -3326 8555 18614 22714 19021 8893 -3747 -14113 -18350 -14990 -5774 5247 13395
976 13395 15126 9513 -1303 -13091 -21232 -22405 -16170 -5010 6675 14349 15129 8904 -1469 -11528
990 -11528 -16951 -15211 -6739 5231 16140 21752 19955 11590 167 -9700 -14092 -11266 -2574 8279
1004 8279 16716 19086 14152 3721 -8278 -17302 -19926 -15339 -5677 4952 12179 13012 7061 -3154
1018 -3154 -13487 -19705 -19116 -11823 -663 10122 16472 16101 9414 -549 -9525 -13776 -11322 -3125 7586
1033 7586 16625 20329 17193 8463 -2378 -11159 -14520 -11319 -3128 6504 13452 14670 9418 -296 -10780
1048 -10780 -17958 -19052 -13720 -4163 5676 11918 12131 6324 -2950 -11753 -16354 -14649 -7113 3362 12815
1063 12815 17621 16033 8866 -765 -8878 -12208 -9333 -1488 8057 15420 17467 13249 4319 -5814
1077 -5814 -13351 -15476 -11540 -3379 5470 11326 11695 6354 -2567 -11515 -16910 -16573 -10570 -1332 7551
1092 7551 12689 12177 6457 -1940 -9431 -12840 -10608 -3523 5663 13386 16622 14142 7001 -1871 -8941
1107 -8941 -11466 -8509 -1425 6742 12572 13523 9034 811 -8003 -14024 -14938 -10537 -2720 5240 10130
1122 10130 9934 4773 -3158 -10612 -14465 -13037 -6797 1804 9515 13373 11962 6080 -1731 -8190 -10625
1137 -10625 -7955 -1293 6702 12810 14557 11193 4050 -4018 -9956 -11496 -8172 -1544 5564 10169 10285
1152 10285 5813 -1522 -8846 -13269 -13075 -8376 -1137 5782 9656 9031 4275 -2537 -8539 -11226 -9352
1167 -9352 -3622 3757 9930 12539 10579 5000 -1914 -7321 -9055 -6454 -639 5976 10653 11411 7850
1182 7850 1351 -5546 -10227 -10868 -7370 -1261 4859 8482 8116 3858 -2500 -8439 -11518 -10470 -5693
1197 -5693 902 6746 9610 8431 3824 -2170 -7081 -8845 -6682 -1452 4784 9538 10970 8506 3201
1212 3201 -2826 -7192 -8219 -5601 -509 4898 8374 8432 5017 -574 -6123 -9509 -9421 -5958 -622 4450
1228 4450 7212 6577 2892 -2337 -6882 -8906 -7496 -3217 2305 6880 8772 7292 3135 -1954 -5844
1243 -5844 -6943 -4850 -382 4642 8113 8675 6032 1256 -3763 -7072 -7412 -4762 -259 4185 6706
1258 6706 6263 3037 -1718 -6057 -8304 -7538 -4099 592 4703 6573 5591 2217 -2151 -5624 -6788 -5158
1274 -5158 -1332 3144 6535 7528 5794 2048 -2145 -5110 -5663 -3699 8 3866 6288 6291 3841 -114
1290 -114 -4029 -6332 -6221 -3780 -63 3427 5204 4608 1901 -1847 -5039 -6424 -5397 -2385 1456 4566
1306 4566 5755 4638 1705 -1821 -4423 -5031 -3463 -262 3240 5615 5941 4122 864 -2535 -4675
1321 -4675 -4770 -2889 209 3234 4840 4459 2220 -1043 -3969 -5421 -4897 -2629 459 3152 4294 3536
1337 3536 1244 -1693 -3989 -4694 -3610 -1092 1896 4099 4710 3587 1170 -1539 -3404 -3706 -2327 151
1353 151 2705 4253 4206 2610 58 -2460 -3908 -3768 -2185 216 2407 3490 3015 1194 -1255 -3299
1369 -3299 -4137 -3448 -1552 867 2779 3471 2698 808 -1377 -2966 -3293 -2230 -196 1974 3417 3597
1385 3597 2475 476 -1536 -2772 -2772 -1570 329 2111 3062 2799 1427 -520 -2248 -3070 -2761 -1419 372
1402 372 1866 2489 1996 622 -1075 -2384 -2782 -2137 -684 978 2197 2518 1867 507 -979 -1963 -2061
1419 -2061 -1252 132 1517 2355 2320 1436 56 -1272 -1992 -1876 -999 271 1396 1892 1584 606 -658 -1698
1437 -1698 -2094 -1718 -735 455 1365 1643 1220 272 -785 -1508 -1619 -1071 -103 930 1566 1615 1071 161 -732
1456 -732 -1252 -1199 -628 221 989 1352 1213 621 -210 -915 -1215 -1046 -497 218 800 1000 760 209 -453 -931
1476 -931 -1040 -775 -225 368 776 834 560 80 -427 -707 -702 -392 89 515 748 683 376 -49 -395 -555 -472 -175
1498 -175 170 424 508 375 85 -195 -395 -414 -287 -38 198 340 317 165 -19 -172 -244 -184 -57 98 187 171
1520 171 94 -8 -102 -136 -105 -36 29 62 10 -62 -133 -163 -125 -30 73 143 150 67 -44 -155 -182 -113 53 234 369 372 264
1547 264 46 -167 -294 -275 -114 112 338 425 349 81 -224 -491 -596 -489 -190 131 393 453 267 -50 -427
1568 -427 -667 -653 -383 48 457 736 706 430 -7 -416 -606 -505 -133 367 783 957 786 326 -250 -697 -865
1589 -865 -666 -184 340 728 791 479 -110 -713 -1101 -1138 -768 -151 494 876 864 466 -173 -739 -1025 -883 -341
1610 -341 412 1041 1343 1169 616 -133 -746 -969 -733 -101 648 1172 1278 886 117 -724 -1299 -1398 -1000 -240
1630 -240 536 1011 1005 476 -359 -1127 -1551 -1422 -782 146 982 1400 1268 642 -228 -956 -1228 -925 -147 809 1543
1651 1543 1769 1386 551 -438 -1167 -1366 -969 -117 794 1369 1370 805 -197 -1194 -1810 -1796 -1183 -183 769 1298
1671 1298 1206 512 -480 -1348 -1729 -1435 -556 571 1507 1887 1606 753 -313 -1139 -1374 -931 44 1104 1833
1690 1833 1941 1333 244 -903 -1677 -1785 -1191 -163 868 1457 1355 595 -550 -1613 -2137 -1949 -1097 110
1708 110 1170 1678 1483 632 -491 -1382 -1697 -1240 -218 1008 1941 2224 1759 704 -488 -1364 -1551 -1023
1726 -1023 20 1157 1847 1827 1082 -141 -1374 -2099 -2079 -1335 -177 938 1524 1338 470 -727 -1752 -2186
1744 -2186 -1816 -794 537 1628 2073 1707 737 -474 -1379 -1583 -1034 99 1364 2200 2315 1633 406
1761 406 -887 -1734 -1811 -1151 14 1134 1753 1601 709 -592 -1771 -2377 -2174 -1250 45 1177 1688 1423
1779 1423 484 -733 -1695 -2002 -1490 -342 994 2002 2312 1819 714 -539 -1422 -1569 -957 201 1396
1796 1396 2129 2084 1278 -24 -1300 -2046 -2031 -1242 -29 1084 1638 1390 437 -843 -1933 -2362 -1987 -909
1814 -909 434 1541 1961 1562 533 -691 -1584 -1757 -1118 77 1365 2247 2357 1668 459 -831 -1627
1831 -1627 -1676 -958 213 1330 1931 1736 820 -505 -1695 -2312 -2101 -1197 59 1145 1613 1300 339 -883
1849 -883 -1841 -2130 -1619 -472 858 1846 2146 1642 573 -632 -1445 -1557 -873 291 1476 2185 2150 1343
1867 1343 68 -1163 -1862 -1787 -1008 179 1212 1695 1400 413 -860 -1906 -2315 -1933 -912 379 1377
1884 1377 1718 1301 295 -885 -1693 -1818 -1171 15 1246 2068 2181 1531 386 -781 -1493 -1486 -756 363
1902 363 1426 1961 1781 886 -368 -1477 -2038 -1842 -994 160 1153 1532 1187 243 -924 -1812 -2092 -1595
1920 -1595 -541 677 1594 1836 1359 360 -745 -1467 -1509 -841 289 1382 2056 2004 1251 108 -995 -1606
1938 -1606 -1521 -774 322 1284 1693 1380 473 -713 -1676 -2063 -1727 -801 346 1229 1504 1082 157 -918 -1659
1957 -1659 -1759 -1175 -121 1017 1763 1872 1307 293 -737 -1348 -1324 -650 386 1346 1854 1695 904 -194
1975 -194 -1197 -1689 -1524 -762 251 1092 1419 1088 215 -846 -1647 -1891 -1475 -536 522 1297 1495 1065 165
1994 165 -804 -1413 -1420 -813 187 1179 1760 1718 1077 89 -855 -1352 -1223 -555 404 1230 1581 1311 502 -526
2014 -526 -1357 -1689 -1400 -610 336 1078 1289 906 68 -854 -1491 -1587 -1098 -201 757 1392 1483 984 137 -711 -1207
2035 -1207 -1164 -575 326 1157 1596 1449 811 -108 -951 -1326 -1175 -532 317 1021 1281 972 235 -661 -1338 -1560
2055 -1560 -1207 -444 422 1054 1199 811 59 -754 -1271 -1252 -743 100 911 1400 1377 857 39 -723 -1107 -976
2075 -976 -408 381 1062 1360 1142 477 -358 -1034 -1299 -1076 -443 331 909 1064 741 57 -704 -1233 -1324 -931
2095 -931 -218 549 1047 1114 728 35 -648 -1034 -987 -511 235 914 1269 1176 653 -74 -717 -1005 -874 -335 351
2116 351 911 1091 845 243 -487 -1032 -1180 -913 -313 364 849 919 592 -26 -665 -1071 -1053 -636 29 669 1028
2137 1028 1013 600 -36 -601 -894 -782 -317 313 845 1070 901 386 -241 -766 -959 -785 -287 307 751 857
2157 857 598 75 -535 -932 -1003 -708 -163 413 781 818 506 -12 -537 -831 -798 -422 135 660 929 863 474
2178 474 -66 -534 -753 -645 -219 295 709 848 662 201 -339 -731 -858 -644 -194 296 648 696 427 -40
2198 -40 -510 -801 -797 -506 -16 455 717 711 408 -47 -456 -655 -581 -236 211 623 782 676 316 -141 -503 -656
2220 -656 -516 -174 256 578 648 468 89 -332 -630 -694 -503 -124 268 526 551 325 -39 -411 -612 -581 -319
2241 -319 60 425 610 566 290 -73 -385 -538 -438 -154 205 494 595 463 162 -196 -470 -548 -408 -111 218
2262 218 452 479 302 -13 -330 -528 -520 -331 -21 265 441 434 232 -45 -304 -444 -390 -160 117 365 485 418
2284 418 204 -72 -305 -407 -309 -89 161 364 417 301 57 -192 -382 -403 -287 -68 154 321 332 181 -26
2305 -26 -246 -373 -357 -193 26 222 372 317 163 -54 -233 -298 -242 -72 132 287 351 270 91 -91 -251 -286 -202
2328 -202 -43 144 260 265 163 3 -167 -282 -278 -176 -21 142 231 213 117 -35 -179 -239 -216 -111 60 186 226
2351 226 202 83 -55 -165 -198 -149 -34 91 191 197 138 24 -86 -168 -175 -111 -14 107 172 152 84 -6 -114 -161 -138 -67
2377 -67 42 107 147 122 48 -35 -120 -132 -97 -29 63 121 121 85 16 -55 -103 -103 -66 -7 49 110 108 51 -5 -57 -89 -81 -44 18 59 74
2409 74 76 34 -17 -49 -73 -59 -13 26 60 64 34 9 -16 -43 -46 -37 3 29 21 27 8 0 -37 -36 -23 -3 14 24 22 17 11 -5 2 2 14 11 12 20
2447 20 6 -1 -4 -16 -7 9 10 8 1 -22 -34 -40 -20 -20 5 23 22 2 -14 -42 -45 -34 -18 27 54 72 56 34 -1 -25 -34 -19 24 55 82 88
2483 88 52 -2 -41 -72 -65 -45 8 49 65 56 25 -40 -90 -116 -96 -48 13 55 73 65 8 -44 -87 -98 -60 20 79 123 131 95 20 -43
2515 -43 -83 -80 -42 46 105 135 125 55 -33 -101 -140 -128 -66 14 91 105 83 13 -83 -145 -164 -125 -40 53 120 148 104 11 -68 -123 -126
2546 -126 -58 35 128 183 171 107 -3 -96 -138 -144 -60 43 125 157 130 33 -80 -180 -213 -168 -75 40 124 147 103 4 -103
2573 -103 -180 -173 -124 7 113 194 210 141 32 -85 -154 -139 -38 64 170 226 184 85 -38 -149 -207 -172 -83 36 125
2598 125 173 121 -5 -119 -226 -246 -190 -59 71 167 193 125 6 -113 -187 -175 -95 49 177 246 235 151 11 -120
2622 -120 -185 -170 -50 67 186 237 190 60 -97 -211 -256 -201 -77 59 167 190 113 -7 -151 -243 -244 -159 -14 130
2646 130 227 234 150 -1 -131 -200 -171 -83 71 212 277 237 126 -37 -175 -226 -187 -75 73 189 213 161 21 -124
2670 -124 -253 -281 -205 -63 90 194 205 129 -8 -153 -242 -231 -108 28 187 282 262 153 -12 -144 -194 -164 -57
2693 -57 95 226 270 206 84 -93 -226 -270 -204 -77 75 192 198 123 -30 -175 -275 -272 -194 -35 117 230 242 133
2717 133 -7 -142 -230 -196 -75 91 232 294 276 143 -29 -160 -212 -185 -49 105 231 251 188 39 -126 -256 -281
2740 -281 -209 -50 92 205 201 119 -13 -181 -268 -247 -142 29 180 264 242 137 -19 -155 -214 -185 -59 103 234
2763 234 280 226 82 -78 -204 -260 -175 -53 110 208 221 140 -8 -160 -256 -275 -184 -36 120 222 212 136 -23 -166
2787 -166 -228 -210 -94 71 212 271 246 118 -32 -157 -201 -162 -44 112 215 254 190 48 -115 -230 -256 -179 -54
2810 -54 93 191 207 111 -35 -163 -256 -248 -150 23 158 245 212 115 -18 -151 -200 -165 -53 106 222 274 218 92 -59
2835 -59 -165 -207 -152 -26 113 205 223 134 1 -138 -245 -240 -165 -27 110 197 180 98 -52 -181 -234 -203 -103 33 180
2860 180 235 206 101 -47 -141 -188 -163 -26 104 206 237 169 47 -96 -195 -199 -144 -16 105 181 190 114 -28 -152 -225
2885 -225 -211 -113 22 132 198 177 94 -35 -151 -194 -139 -42 91 198 238 193 71 -56 -153 -179 -115 -20 101 181 199
2910 199 122 -1 -121 -199 -209 -131 -13 99 160 155 89 -41 -152 -209 -179 -98 32 141 200 177 85 -35 -132 -154 -125 -13
2936 -13 98 195 212 161 39 -68 -151 -171 -122 -15 114 173 162 81 -30 -141 -191 -190 -104 7 99 157 135 50 -52 -144
2962 -144 -181 -140 -48 55 144 191 146 56 -51 -126 -152 -95 -7 93 157 168 105 8 -93 -152 -148 -101 0 101 150 146 69 -36
2990 -36 -132 -164 -142 -73 33 127 157 125 54 -51 -127 -142 -103 -19 74 156 167 108 30 -68 -124 -129 -92 -9 98 133 131 74 -12 -111
3020 -111 -148 -137 -76 13 82 134 109 49 -43 -121 -142 -117 -38 47 124 149 115 47 -30 -113 -117 -68 -3 70 127 146 96 20 -66 -111
3050 -111 -120 -68 1 85 111 108 51 -30 -98 -135 -123 -58 20 79 102 88 24 -44 -104 -123 -85 -13 67 116 124 93 25 -39 -89 -99 -62
3081 -62 17 77 111 119 72 -1 -67 -99 -94 -50 30 65 104 94 33 -31 -79 -98 -99 -40 40 84 111 77 21 -43 -83 -95 -53 -15 62 91
3113 91 94 63 -7 -56 -85 -85 -57 -9 50 78 81 28 -22 -81 -95 -91 -32 20 49 69 69 19 -43 -68 -84 -52 -13 42 75 80 54 17 -34
3146 -34 -64 -70 -35 5 51 72 79 53 -10 -48 -70 -82 -39 10 55 58 42 17 -16 -52 -77 -57 -28 18 51 60 40 16 -28 -58 -71 -39
3178 -39 -11 30 64 72 50 3 -33 -57 -56 -29 9 43 68 49 34 -17 -40 -39 -37 -22 13 42 50 36 25 -18 -46 -53 -38 -6 26 47 47 36
3212 36 1 -26 -47 -54 -23 -8 28 28 36 15 -11 -24 -55 -40 -24 -3 28 43 28 0 -18 -28 -49 -29 -11 10 40 43 34 5 -10 -36 -26
3245 -26 -21 6 18 27 36 15 -4 -18 -23 -30 -11 11 20 29 37 5 -6 -19 -34 -13 -7 10 11 18 8 -7 -18 -20 -35 -21 -15 8 23 25 9 -9 -9 -22
3283 -22 -14 -6 -6 25 26 22 11 -8 -17 -5 -7 -17 2 18 22 12 4 7 -13 -22 1 9 3 13 13 10 -9 -19 -12 -2 -13 8 -5 11 13 2 -5 -18 -18 0
3323 0 -10 0 1 0 5 -14 -1 -11 -7 -4 5 -2 8 5 2 14 -2 4 4 -7 15 18 15 2 0 2 9 2 4 12 3 3 8 2 -11 0 -4 -6 1 -5 4 -1 -4 3 -9 -5 -9
3370 -9 -5 -8 -2 0 3 -9 -6 -1 -2 4 0 6 0 -11 -10 0 2 -4 -5 2 0 8 0 -14 -12 -9 -7 -2 0 9 3 6 -4 1 -19 -10 4 5 14 14 14 -5 -1 -12 -2 -6 -14 15 10 12
3420 12 2 1 -9 -24 -13 -13 2 3 14 16 4 -7 -14 -16 -18 -6 -6 4 27 22 15 4 -1 -8 2 1 11 23 23 14 11 -3 -4 -5 -5 4 11 29 22 7 6 -20
3462 -20 -22 -17 -11 0 8 27 18 -14 -11 -28 -38 -27 -8 -3 19 16 24 9 -9 -37 -24 -17 -5 13 21 21 11 19 -8 -15 -29 -8 -3 18 16 27 8 6 -28
3501 -28 -22 -15 -8 2 25 24 10 12 0 -19 -22 -13 -12 6 26 28 15 14 -14 -24 -17 -23 8 18 26 34 10 2 -17 -37 -33 -32 -2 10 22 25 11 -6 -32
3540 -32 -19 -9 -12 9 22 37 32 9 4 -20 -15 -18 11 25 30 44 32 5 -9 -25 -33 -22 -6 16 21 33 10 -5 -27 -36 -46 -22 -8 9 16
3575 16 15 5 -18 -29 -38 -28 -10 5 20 30 21 8 -16 -30 -28 -18 0 17 29 20 29 0 -29 -32 -30 -23 4 20 21 31 25 -8 -23 -38 -27 -10
3611 -10 20 31 25 27 23 -8 -25 -19 -24 -9 13 31 35 35 7 -2 -32 -32 -21 6 23 31 26 17 3 -27 -36 -41 -21 2 25 29 32 0 -9 -24 -34 -21 -7
3650 -7 19 35 40 34 16 -8 -20 -26 -21 -2 17 40 37 26 9 -17 -31 -24 -18 5 11 35 29 22 -11 -37 -28 -36 -19 5 11 43 26 1 -16 -35 -36 -30
3688 -30 -1 26 35 33 32 0 -4 -36 -29 -28 -1 18 38 40 11 8 -20 -27 -34 -12 10 24 22 22 16 -1 -24 -36 -24 -2 3 35 31 17 0 -21 -35 -21
3726 -21 -16 5 26 28 31 20 2 -22 -33 -23 -13 -6 13 19 29 7 -28 -30 -31 -31 -18 9 19 33 27 0 -5 -23 -20 -16 -3 16 46 35 17 4
3762 4 -17 -30 -11 -8 11 20 28 22 24 -3 -18 -31 -17 -14 10 14 18 17 7 -15 -24 -28 -33 -12 3 19 26 22 7 -11 -24 -39 -15 6 12 22 31 13 3
3801 3 -5 -26 -31 -17 3 21 37 33 14 -1 -18 -27 -29 -3 -4 16 20 12 10 -17 -13 -26 -28 -5 0 17 11 10 -2 -9 -33 -23 -11 -5 15 18 24 7 -15 -27
3841 -27 -30 -30 -13 -8 15 7 17 9 -10 -29 -30 -15 -3 8 23 29 14 3 -6 -17 -13 -20 7 7 23 35 26 16 -10 -15 -28 -15 1 24 19 31 10
3878 10 -1 -12 -19 -16 -9 -3 9 27 29 -6 -9 -20 -42 -17 -4 4 10 7 13 5 -21 -23 -19 -17 4 15 21 19 11 2 -7 -21 -10 -10 8 14 25 27 13 10 -18 -24
3920 -24 -16 -7 -1 6 15 11 4 -20 -42 -21 -24 -11 1 9 16 -5 -2 -11 -28 -23 -19 3 6 10 8 8 -17 -23 -22 -14 -18 6 8 8 6 1 -5 -18 -19 -20 -10 5 18 12 13 -11
3966 -11 -24 -12 -15 -8 6 14 18 11 11 -9 -8 -16 -19 -14 -8 13 17 10 -2 -3 -20 -28 -23 -16 -3 19 13 10 5 -20 -10 -28 -12 -7 -2 16 6 0 -6 -6 -10 -13 -14 -1
4010 -1 6 18 10 5 -3 -10 -21 -21 -5 11 11 7 17 9 -2 -5 -5 -15 -14 1 14 6 -2 -17 -9 -18 -19 -22 -8 11 9 9 -2 -4 8 -11 -6 -3 5 2 18 19 7 -1
4054 -1 -18 -9 4 -3 -5 5 -3 7 13 -7 -11 -5 -10 5 7 4 13 0 2 -21 -15 -9 -7 3 9 13 15 4 -9 -10 -13 -14 -16 1 -1 7 3 6 -7 2 -2 -11 -2 -6 14 5 3
4101 3 2 -5 -6 -16 -14 -9 -3 15 12 2 3 -6 -14 -2 2 -6 11 -2 -1 0 -12 -15 -11 -5 8 2 13 5 0 12 -2 -11 -2 -17 -8 -16 4 -4 11 1 -1 -5 -18 -19 -7
4146 -7 3 9 8 5 -1 -13 -9 -11 0 -8 10 2 -1 2 4 -1 -3 1 -12 6 7 6 6 8 -14 -7 -9 1 5 -4 -4 3 3 -11 -4 -6 -4 -10 5 -4 -6 2 -6 -6 -5 -16 -12 -21 -1
4195 -1 -3 3 -10 -6 -4 -3 -4 -10 -1 3 0 4 5 -4 -10 1 -4 -2 2 15 17 12 6 -6 12 6 7 6 11 9 -1 9 -7 5 -7 1 -2 5 12 9 3 3 -2 -12 9 -2 -2 -10
4243 -10 -5 -6 -2 -13 -4 8 -9 -5 4 -3 -9 10 -6 6 1 8 4 -1 11 3 -8 3 -3 5 9 4 -4 3 3 -6 7 6 3 -9 8 0 2 11 0 6 -7 -5 0 -15 -7
4288 -7 8 -13 -10 -14 0 4 2 -5 -2 -8 -10 -4 -13 1 -12 -1 -8 2 7 10 3 3 -1 -1 4 -7 3 -4 0 -4 7 14 0 1 2 1 2 3 2 4 0 12 3 -9 -7 -3 4 -11
4336 -11 2 1 14 1 2 -6 -6 4 2 -4 1 -12 3 -6 0 -9 -3 -7 9 -7 9 7 -1 0 0 -7 -3 -10 6 18 -4 7 0 -1 5 8 -1 2 5 1 19 11 2 -7 1 6
4382 6 5 2 -6 -5 5 11 5 0 -4 -4 -8 -11 9 5 -5 8 -6 -3 -3 0 3 -2 1 -2 3 2 12 3 2 5 1 11 1 5 7 6 -7 -11 -1 -7 0 9 -4 17 7 0 8 7
4430 7 11 11 3 6 7 5 -1 1 3 -11 -10 -5 2 -10 6 2 0 -13 -12 -6 -12 2 -2 -8 -3 -6 16 0 -12 -9 1 -4 0 -6 9 -5 -3 -18 -3 0 7 14 15 2 3 0 14
4477 14 -11 5 3 7 0 2 13 12 3 3 -4 -2 -7 -6 3 9 4 -3 1 -2 2 -4 -13 -2 -2 -14 -1 -6 -3 -7 -16 -9 0 -10 5 9 -1 -3 -11 -16 0 0 12 18 17 3 10 -2
4525 -2 -1 -10 -14 -2 0 0 9 6 5 16 -8 0 -8 -8 7 6 4 -6 -1 -4 -10 -2 4 10 3 8 5 15 -10 -3 -7 -11 -3 0 12 -1 8 -1 -6 -13 -1 0 -5 -14 -4 2 2 3 20
4574 20 6 -7 -2 6 10 8 1 3 9 3 -7 7 -1 7 13 13 5 6 3 -5 -6 0 -6 5 -8 8 -1 -8 1 -10 -5 -3 -10 -4 2 0 10 -11 -5 -6 -10 -5 -2 -5 6 14 -3 -4
4622 -4 6 -3 -9 0 10 7 7 16 11 -3 3 -9 -8 -6 6 3 6 0 4 -14 -10 0 -10 -7 6 -8 5 -3 -6 -6 -13 -3 -1 -12 -8 1 13 -1 -9 3 -9 -13 -9 -17
4666 -17 7 6 -4 4 -4 7 -6 3 11 5 7 15 10 5 -6 4 -1 6 7 9 -7 3 0 -1 4 -2 -7 -8 -6 4 0 -1 -3 -1 -5 -9 -6 -21 -2 5 9 8 -8 -8 -13 -9 -4 -13
4714 -13 1 6 2 -11 3 -3 -4 -1 -7 -3 -1 3 5 11 -6 -2 4 -11 -9 4 10 11 3 1 6 -1 5 2 5 -2 6 4 2 5 6 -1 0 -12 -3 0 6 2 9 3 -5 -7 -10 -12 8 8 4 3
4766 3 -5 6 1 -19 -7 7 -5 -3 -1 5 4 -4 -3 -7 -5 0 1 4 7 -7 1 -8 -3 6 -7 -14 2 0 0 7 -5 -6 -12 1 -3 -4 9 1 9 5 -8 -18 -2 -8 -11 2
4812 2 -2 4 -10 -9 4 1 -4 -3 -2 4 0 -1 10 0 -5 2 -2 4 6 4 11 5 10 11 -10 8 -3 -3 6 0 -2 -5 -3 -1 -7 -1 -6 -8 8 2 -9 -5 9 5 1 -14 -15 -13 7
4861 7 6 -8 -4 8 -12 -16 -9 8 -1 10 3 -8 15 4 -4 -17 0 -4 1 8 0 3 6 -2 3 -13 -2 4 -1 -2 -9 2 1 5 -1 -11 -5 -3 -2 9 6 4 -1 -4 -13 -4
4907 -4 -5 -3 -17 3 -7 -16 -10 -12 -7 -6 -19 -9 -6 1 2 -11 -4 1 3 -6 4 -4 -3 0 0 13 0 -1 8 5 3 -1 5 10 1 4 -1 -10 -4 -1 2 -3 -2 3 4 -11 -11 -1 -6 4
4957 4 5 -8 8 -19 -4 -7 -8 3 -7 -5 1 3 5 -3 0 -6 -10 -5 6 0 0 3 -6 4 1 5 2 -7 8 4 -3 1 10 2 -8 -3 6 -2 5 6 9 -5 11 1 -2 -6 6
5004 6 -9 6 -4 3 3 0 -2 -3 -11 -6 0 1 -4 -24 -5 0 -4 -7 0 -9 -6 -6 -10 5 9 -2 -3 8 -4 3 -1 -4 4 9 -4 -4 0 -7 4 1 -1 4 4 10 7 9 3 -4 -5 4
5054 4 -2 -5 1 -2 -7 1 2 6 -1 -4 -2 0 -2 -10 5 -4 0 1 1 0 -1 4 -2 9 -4 -1 11 4 -4 -1 10 1 3 -2 5 7 4 7 -2 2 -2 -4 6 -5 8 3 2 8 -2 5 10 -4
5106 -4 1 0 -2 8 -2 -12 -3 -4 4 -3 1 4 -12 -12 -5 -4 -4 -1 -2 -4 -4 2 -6 -10 1 -10 4 2 0 3 -2 5 1 -1 -3 0 0 7 -3 -13 1 0 1 0 -3 6 -9 6 -3
5155 -3 -3 5 -12 3 5 -4 -3 1 -9 4 1 -3 1 -12 -3 0 -14 -4 -13 -2 -3 -6 -5 -4 -10 -4 -10 8 -9 -10 -3 -14 -5 9 5 0 11 6 11 -1 12 6 -2 3 10 -2
5201 -2 1 6 9 8 2 -1 3 1 1 -5 -9 0 -5 0 0 -4 -4 0 6 -7 4 2 -5 -4 -1 7 -16 -5 -7 -3 -7 -10 -1 2 -1 0 -4 10 12 -2 5 5 8 -1 3 -8 -1 -1 0 4 7 -2 6 10
5255 10 -1 14 -1 3 4 13 -2 12 -2 1 2 2 -8 -1 2 4 6 9 7 -1 14 -2 3 4 -17 3 4 -2 -1 -2 0 -1 -5 -3 -3 -2 6 6 16 7 8 4 10 -1 6 -2 10
5302 10 1 5 -2 7 9 5 3 4 0 -6 0 -9 -5 12 2 -6 0 3 -4 1 -3 -1 -8 -5 -11 0 -19 -7 -4 -2 6 -12 3 -7 -1 -4 -19 -9 10 3 6 0 1 -4 -3 0 0 1 0
5351 0 -5 3 -10 7 8 1 7 -5 10 -2 -4 -12 -2 -8 7 1 -1 1 -3 -6 -1 -13 -8 0 3 -8 -2 2 -2 4 -8 4 2 -6 -9 0 7 2 4 -9 11 5 4 12 -3 -3 6
5398 6 1 -7 2 4 6 19 -10 -9 -8 -5 -7 -1 2 -4 9 7 -5 -3 -8 -13 -5 -8 -13 -7 1 -23 -21 -5 -10 -2 -2 -4 -9 -10 -7 -10 -4 -4 -16 -13 -13 -4 -11 -10 -9 -10 6 -2 -5 -9 1 -4
5450 -4 3 1 -2 3 -11 -13 -4 -4 -6 -11 -12 -3 -2 -2 -2 -5 -4 3 2 -7 12 -3 -1 -6 13 -7 0 -8 -8 7 10 6 1 -4 -4 3 -4 5 9 6 -4 3 8 2 -6 0 -3 7 7 -9 3
5501 3 7 -2 11 -7 -2 18 -4 2 -2 3 4 0 -8 -4 -1 -8 -7 -1 1 -3 7 -3 -5 -8 0 -14 -4 -7 -8 -3 -6 -2 -6 10 12 0 -3 1 5 -2 -2 -7 6 -8 -11 4 -9
5548 -9 3 4 11 4 5 1 -3 2 6 8 3 5 2 1 -5 -2 1 1 -4 13 -1 6 -9 2 1 -5 -3 3 3 -14 -6 -9 -11 -11 -10 -16 -3 -3 -4 -16 -8 -4 -2 -10 -5 -2 -8 0 -5 -3 -11 0
5600 0 -10 -2 -5 -3 2 4 -4 1 -8 11 2 2 -10 -4 12 -1 3 -7 1 4 2 5 -1 5 6 -5 7 1 8 2 -2 -5 -3 4 3 -5 -10 -2 5 -2 2 -1 -8 -5 -8 6 1 5 8 -13 -7
5651 -7 8 5 -9 5 -1 -2 5 -7 2 4 0 9 -4 3 18 -5 0 3 2 2 -2 -2 4 -9 5 -6 8 2 -2 -7 0 -11 -10 2 5 -7 -8 -7 -12 -1 -8 -8 1 6 -9
5696 -9 3 -5 -4 -4 8 -6 18 2 -2 8 -4 -9 3 3 5 6 2 5 -4 9 11 -2 6 0 10 -2 7 -3 -7 0 -3 2 -4 0 6 6 -7 -5 1 0 -3 -3 4 -11 -3 3
5742 3 14 -10 -3 -8 4 6 16 8 -2 7 3 -3 15 -1 4 0 -6 8 9 9 7 0 -2 4 -2 2 -4 3 2 -2 7 5 5 -8 -4 -4 1 -6 5 -2 -1 2 -9 -5 -4 -6 -3 -1 -4 -9
5792 -9 -1 2 -9 7 -2 -2 11 -5 2 -1 -11 2 11 17 -5 9 0 -10 6 9 2 -2 2 7 5 1 1 1 7 8 -10 0 8 8 -6 -6 0 -6 -5 0 -1 5 4 5 1 -4 -6 -13
5840 -13 6 -15 -2 7 4 2 -13 -2 1 3 -2 11 2 3 -4 5 4 -1 -8 -8 -11 -6 1 1 7 5 -5 0 3 -5 4 3 0 3 9 -8 -4 0 7 -1 -5 -1 3 0 -7 4 3 -7 -2 -6
5890 -6 -9 -4 -6 0 -8 3 -11 -14 -2 -2 -9 -4 6 -12 13 -1 5 -4 -1 13 -1 0 4 -2 2 1 -7 -4 5 -6 5 5 2 8 5 4 -8 -3 9 1 0 2 -5 -3 -11 1 -2
5937 -2 5 3 -4 2 -9 -6 4 -5 -1 -10 -8 -5 -7 1 -4 7 0 -7 -9 0 -2 3 4 5 9 10 1 -6 -4 7 0 -6 0 2 2 -3 12 -1 -6 8 12 -2 8 -1 3 3 10 -7 8 3
5987 3 -5 -3 2 5 0 6 8 4 -1 5 -5 2 1 2 2 5 -2 1 1 2 5 0 8 5 2 10 4 10 5 -5 9 2 6 6 9 8 11 0 -1 -1 5 6 10 9 2 6 -12 3 3 -4 7 -7 -1
6040 -1 -7 -6 -8 -8 1 1 0 -4 -1 -3 5 -4 -1 1 2 0 -1 -2 -1 -12 4 0 -1 -9 -7 4 6 14 -1 2 9 5 -6 11 9 -6 8 3 9 12 -2 7 4 5 8 1 4 -4 -3 5 3 -1
6092 -1 -8 7 -5 0 -6 6 -2 5 -5 5 0 -1 -3 -4 9 -8 -8 0 10 7 1 -8 5 11 10 -2 6 0 3 5 -2 6 -10 -6 11 -8 -4 -5 -1 4 -2 3 -4 -1 -9 1 -7
6139 -7 0 -11 3 1 -4 -12 3 -3 -9 -5 -6 -10 14 -3 4 -3 -11 -2 13 13 4 4 4 12 -12 10 4 2 0 3 14 7 4 -1 -4 2 14 -17 1 5 -2 2 0 -5 7 4 10 -4
6187 -4 -1 4 -3 -2 11 5 9 1 -1 -6 -1 -7 0 5 -11 -2 6 -2 -3 2 8 1 -4 4 3 -3 10 3 -7 0 9 1 0 -6 7 9 3 16 1 -9 2 7 2 7 2 12 9 6 8 7 0
6238 0 2 -9 0 -3 7 0 3 2 -4 -11 2 -1 -4 2 -4 -4 -11 -2 -7 -7 -4 1 -12 -2 -6 9 -2 4 13 -2 0 -7 8 1 6 3 6 5 3 -2 6 12 2 -7 2 -1 8 -4 0 -11
6288 -11 -6 -4 1 0 -1 0 0 -10 0 0 2 4 -9 7 5 1 -7 -7 -11 -9 -3 4 9 4 1 -3 5 3 -6 5 6 8 6 7 -2 1 7 -3 5 14 5 2 2 -1 3 13 8 9 -2 9 -1
6339 -1 0 6 1 0 4 1 -4 -9 10 -2 -3 -4 -3 -8 0 1 5 3 0 -2 -5 8 4 9 -2 2 2 11 -3 5 -4 15 -1 13 1 -1 -8 4 7 -4 -2 10 8 -15 -1 4 -1
6386 -1 -11 -13 -1 0 -2 2 -1 -2 -4 2 8 -1 9 3 -4 -1 0 2 -11 1 -3 -7 1 2 -3 -1 4 -3 4 -3 -8 -15 -6 2 6 2 13 -7 6 4 -8 0 10 10 -2 6 -4 7
6434 7 -5 6 14 -4 -2 18 7 7 7 4 -1 -2 4 2 7 9 0 -2 0 -10 -14 -9 2 -6 -11 -8 7 -8 -5 -5 -9 3 -12 -9 -2 -3 3 -4 -3 -5 -1 -3 -3 9 -4 0 11
6481 11 -4 -2 -1 2 -9 -1 4 -10 8 -2 6 12 -4 -5 9 -11 2 1 0 1 -11 0 -8 -3 -9 -4 5 -8 2 -3 2 -4 -9 6 -4 8 3 3 8 -3 13 -4
6523 -4 -2 -8 -4 -1 -11 -4 3 7 10 -4 2 -10 -13 1 -1 -4 4 -7 -4 4 3 -4 -9 -7 -6 -9 -10 0 -4 -12 -9 -6 -3 -4 -9 -7 -2 -1 6 -6 -5 -3 -7 3 -2 5 3 -7 -3 1 4 -9
6575 -9 -4 -12 -1 1 3 -3 -7 0 1 -1 9 -6 5 -6 6 -9 8 -9 -4 8 -1 -1 1 11 12 3 -2 -8 -11 7 1 -1 -2 -1 7 8 7 3 -12 4 11 0 2 3 5 2
6621 2 2 0 2 -7 3 -3 2 -8 1 -6 7 1 -5 -3 4 5 7 -6 6 -6 -2 -7 2 10 0 6 -5 1 8 -2 -3 6 -5 -1 -4 0 1 6 0 9 -5 5 2 2 3 -5 -3 2 8
6670 8 -7 1 -7 -3 -1 -1 5 5 -8 -1 7 11 6 3 14 10 -1 8 3 7 6 -1 16 5 5 2 11 7 4 6 -3 0 -2 3 -5 14 -9 0 5 1 -7 -7 -4 -1 3 -1 -3 -3 -12 8 -2
6721 -2 8 3 -5 5 -6 -11 -2 -3 -6 -9 -5 6 -3 6 0 -11 6 4 7 1 1 -6 -8 1 2 -10 4 0 7 -5 -2 0 5 1 6 -2 -1 0 2 2 -3 1 8 3 -4 6 -4 -4 -4 0
6771 0 -10 7 1 -22 1 -11 -5 0 -1 -6 5 2 1 3 9 7 4 7 1 6 4 3 2 -3 6 0 0 -4 -7 -4 9 1 1 6 -3 4 2 3 -4 -16 -4 -2 2 2 -5 3 -13 -4 2 -8
6821 -8 -4 -1 1 5 2 5 3 -9 -6 2 -2 -1 -12 6 -5 -3 -4 6 9 -4 7 -1 5 -9 -3 0 7 -7 -7 -2 6 -7 -5 -1 9 -1 -2 -3 -5 6 -9 -9 1 -4 8
6866 8 -6 -2 0 -2 9 -3 -5 -5 10 -4 -3 -1 -2 1 -6 1 6 9 -7 -1 7 -6 6 3 -6 13 -9 7 4 -8 -6 3 -5 4 4 -6 -7 2 -14 0 3 -3 0 -10 -2
6911 -2 -8 -3 -3 -7 -9 3 -3 -15 -10 -2 3 -4 -2 -2 -8 15 -5 6 0 3 4 3 -1 1 -3 6 9 -1 10 5 5 6 4 0 -9 2 2 7 -5 0 13 -7 5 -2 6 6 1 6 5
6960 5 -6 -8 2 -5 2 0 -3 4 8 2 -1 4 -7 -4 5 -10 0 10 -7 -9 4 4 0 3 -1 15 11 -5 6 4 8 7 6 -3 5 9 5 6 2 14 14 3 10 7 4 7 -5
7007 -5 2 -4 -1 5 -6 1 1 -4 -9 0 -3 -4 3 -12 -8 3 -5 11 13 0 0 -3 -3 -6 -2 -7 9 3 5 -2 6 4 -1 21 -1 8 5 3 5 4 3 6 -7 0 -7 14 -7 6 3
7056 3 12 1 -13 11 4 -3 2 -10 3 12 -3 1 10 -4 0 -3 -1 -5 -6 -13 -4 2 -8 9 9 1 -4 -3 2 3 16 5 -3 7 -1 -1 -3 -7 -3 11 5 5 4 3 8 3 6 9
7104 9 5 11 19 6 -1 -7 11 2 9 2 10 2 -4 1 3 -6 3 -2 10 0 -4 0 2 2 7 18 -5 -3 -1 4 8 -3 -7 -1 3 4 13 -6 0 7 -6 9 8 10 -5 3 6 -8 -2
7153 -2 0 7 3 2 5 2 -2 12 15 7 -8 -1 4 -4 3 -7 -6 5 5 -1 2 5 2 5 0 -1 -7 -13 2 1 -1 -2 7 -6 5 2 -1 -5 10 -1 -2 6 -2 3 -3 6 -4 1 0 -5 3
7204 3 -6 3 8 5 7 6 5 -2 16 -3 7 2 2 -6 1 16 1 0 2 5 0 2 -15 2 6 5 7 -3 0 -5 -6 -3 3 2 -7 -2 -1 -1 7 -5 -4 -2 -3 -4 2 8 4 4 10 -6 -1
7255 -1 1 2 5 3 1 -6 -8 -4 0 10 1 -6 -4 -8 -8 8 -4 -12 -9 -12 -11 -8 -13 -10 -3 1 -14 -8 -4 -5 -15 -9 -6 0 1 -2 1 5 7 -6 2 -5 -10 10 3 3 16 -5 7 5 15
7306 15 0 -6 7 0 -3 7 0 9 8 -6 13 5 -9 3 1 -4 -9 -11 3 -10 5 -1 11 -4 -5 -15 5 -3 -7 -6 -4 -7 9 1 0 12 2 1 -3 -6 -2 5 4
7349 4 9 15 8 7 10 -3 -9 -6 -7 2 6 9 10 -3 5 0 6 9 -1 3 -7 -2 12 -4 -4 -12 3 -12 -5 -3 -6 13 -4 -3 3 -1 -5 1 0 -1 4 -4 -3 11 0 -11 1
7396 1 7 -4 0 13 -3 -2 -3 3 -1 6 4 4 -3 5 8 10 4 -9 -5 -1 1 -2 -7 4 -11 5 -5 3 -10 -7 -5 1 -2 -13 -2 -4 2 -10 -2 11 -9 8 -3 3 -7
7441 -7 -13 -10 -1 0 -19 -6 3 -2 -11 11 -6 7 -3 -4 3 6 -10 -4 4 2 -6 -18 14 -3 -8 12 -2 0 2 -7 -5 -6 -2 2 5 -13 5 -15 -5 -5 2 -2 -6 -12 1
7486 1 0 -10 -9 1 -3 -11 4 -10 6 -1 -3 -2 1 -10 11 0 -5 1 1 1 1 -3 10 -2 2 -7 4 -2 0 -5 -9 1 1 -11 -10 -7 -10 -8 -6 -3 -9 0 -7 5 6 -6
7532 -6 -1 -8 -9 -2 -7 -11 2 -5 -1 -3 -3 8 -2 -10 -12 0 -5 0 -4 2 3 -5 2 3 -2 -3 -2 -2 1 0 3 5 -3 -3 18 -8 6 -2 8 -5 6 -8 2 -8 -7 -1 -1 0
7580 0 -12 -3 -3 -6 11 9 -14 -10 2 -9 -16 -14 -10 -2 -4 -8 1 -7 -4 -4 0 1 -3 -11 1 -2 -9 3 -2 -12 -10 -23 -7 -1 -5 -11 -2 2 4 -11 -7 -16 -11 -6 -13 -15 -5 -6 1
7629 1 -12 -5 -2 -13 -10 -10 10 -7 -9 7 2 -2 -4 -3 -6 -9 -8 -5 -3 -1 -5 -2 -1 -1 20 1 -3 1 -3 2 0 -8 4 -3 -1 10 1 8 5 15 4 4 14 3 3 9 -5
7676 -5 -1 0 -11 1 -1 -8 -6 1 -8 2 5 -9 -8 -5 -1 -2 6 -9 -9 -10 -19 -1 -1 -8 2 -4 -8 12 -3 4 -8 -13 -6 0 5 -4 3 4 3 1 2 1 8 9 -4 2 13 -2
7724 -2 2 -5 2 -3 -8 4 -7 2 -12 1 9 4 -5 -13 9 -5 -2 5 -2 -9 0 -15 -14 -9 -6 -16 -8 -1 -12 1 1 0 -9 3 -5 -7 2 -4 -4 2 3 -15 -5 0 -8 -7 0 0
7772 0 -4 -4 7 4 -12 0 -7 -3 -10 7 3 4 -4 -4 -18 -13 -4 -7 -14 -16 -10 4 -4 -9 -16 -11 2 2 -3 0 4 -5 -7 -1 -15 -13 2 -3 -19 -16 -18 -6 -2 -9 -5 -8 -6 4 -3
7821 -3 0 -10 5 -13 -5 -1 -4 -7 -4 0 -6 -8 2 -3 0 -4 -14 -2 5 6 -1 -3 1 5 3 -7 4 -4 -15 -1 -5 -2 4 -3 -7 -5 4 1 0 -4 2 5 3 3 -7 2 -14 8
7869 8 -2 -4 -10 -13 -12 2 -5 -4 -3 -7 -3 0 7 -8 -6 -7 -4 5 -11 -3 0 3 -4 0 -12 -3 -8 -9 -3 0 7 -11 -14 -1 -4 1 -7 -7 -10 -7 -4 -9 8 -4 2 -5 7 13 10 -2
7919 -2 -3 6 -8 -4 -9 4 7 -1 3 0 -3 5 8 -4 -1 -1 -7 -4 1 -2 -5 -2 -16 -2 -5 -2 -2 -3 1 -5 1 -6 -3 2 -12 -7 -4 3 11 -7 1 -2 -5 2 5 -6 2 1 0 -3 -6 1 -9
7972 -9 -4 4 -1 -1 4 12 1 -1 -5 -10 -8 -16 -7 -1 1 1 5 3 -10 1 -11 1 -9 -6 -3 -11 4 -10 -5 -2 -13 -15 4 -1 2 -15 -1 -3 -12 4 -10 -8 -3 -3 6 3 0
8019 0 9 6 12 -2 9 0 3 0 -3 10 0 7 10 0 -6 0 -9 -7 -4 1 0 -12 -7 -7 -2 -3 5 8 -6 4 -5 -8 2 0 8 8 5 -4 3 -1 -8 -3 -3 -7 4 3 -12 1 1
8068 1 -11 -8 -9 -7 -4 -7 -1 -3 9 -4 1 3 -2 14 -3 -4 -1 -2 2 9 2 -6 3 -2 3 -2 0 2 3 7 -3 3 1 3 2 8 -5 -5 -1 -4 -4 -3 4 0 1 -2 -9 12 2 2 2 6
8120 6 -6 -8 -7 1 -4 -2 12 -9 -12 5 -4 -13 -8 11 3 13 7 -7 -6 5 -4 -13 -4 -4 3 -5 -1 1 -10 -12 -11 -10 2 -6 1 -10 -3 3 1 3 -7 -4 -8 -1 -9 -7 -7 -6 2
8169 2 -8 0 7 2 -5 -4 -4 -2 -3 10 -8 -3 -2 -3 0 7 6 -2 6 -12 1 0
8191@
##END NTUPLES=NMR FID
##END=
