##TITLE=1H ikalashn
IAMT-169
23.5.2024
##JCAMPDX= 6.0         $$ Bruker NMR JCAMP-DX V2.0
##DATA TYPE= NMR SPECTRUM
##DATA CLASS= NTUPLES
##ORIGIN= UXNMR, Bruker Analytische Messtechnik GmbH
##OWNER= root
$$ TOPSPIN		Version 1.3
$$ 2024-05-23 10:54:57.234 +0400  Irina@DPX200
$$ Compression mode = diff/dup
##.OBSERVE FREQUENCY= 200.13120078
##.OBSERVE NUCLEUS= ^1H
##.ACQUISITION MODE= SIMULTANEOUS
##.ACQUISITION SCHEME= undefined
##.AVERAGES= 128
##.DIGITISER RES= 18
##SPECTROMETER/DATA SYSTEM= spect
##.PULSE SEQUENCE= zg
##.SOLVENT NAME= DMSO
##.SHIFT REFERENCE= INTERNAL, DMSO, 1, 18.03457
##AUDIT TRAIL= $$ (NUMBER, WHEN, WHO, WHERE, WHAT)
$$ ##TITLE= Audit trail, TOPSPIN		Version 1.3
$$ ##JCAMPDX= 5.01
$$ ##ORIGIN= Bruker BioSpin GmbH
$$ ##OWNER= Irina
$$ $$ F:/spectra/data/iren/nmr/1H/4/pdata/1/auditp.txt
$$ ##AUDIT TRAIL=  $$ (NUMBER, WHEN, WHO, WHERE, VERSION, WHAT)
(   1,<2024-05-23 10:53:44.781 +0400>,<Irina>,<DPX200>,<TOPSPIN 1.3>,
      <created by zg
	started at 2024-05-23 10:45:41.875 +0400,
	POWCHK disabled, PULCHK disabled
       configuration hash MD5:
       BE 6D 3F 07 2A EA 11 49 91 17 2B D3 AF B3 58 0D
       data hash MD5: 16K
       D0 49 E0 C2 79 58 A7 57 4B 6B EC 15 90 B3 60 87>)
(   2,<2024-05-23 10:53:46.750 +0400>,<Irina>,<DPX200>,<TOPSPIN 1.3>,
      <Start of raw data processing
       efp BC_mod = 2 LB = 0.08 FT_mod = 6 PKNL = 1 PHC0 = 54.90332 PHC1 = 26.37461 SI = 32K 
       data hash MD5: 32K
       72 C0 2B 42 ED F3 B4 F3 3E 83 DB 17 1B 5E 0E 12>)
(   3,<2024-05-23 10:53:49.984 +0400>,<Irina>,<DPX200>,<TOPSPIN 1.3>,
      <apk 
       data hash MD5: 32K
       17 26 C0 18 22 6D A2 CA 9D 3F F7 39 37 95 47 83>)
(   4,<2024-05-23 10:54:07.640 +0400>,<Irina>,<DPX200>,<TOPSPIN 1.3>,
      <pk fgphup PHC0 = -2.925269 PHC1 = 5.2 
       data hash MD5: 32K
       0B 0E 6D 64 89 08 E1 0D B5 23 F0 F6 24 21 73 1D>)
$$ ##END=
$$ 
$$ $$ hash MD5
$$ $$ BA AA FA 8F 1B 6A F3 B7 C2 F1 73 9D 7E 9A 01 8A
##$RELAX= 
##$RELAX= 
##$RELAX= 
##$RELAX= 
##$RELAX= 
##$RELAX= 
##$RELAX= 
##$RELAX= 
$$ Bruker specific parameters
$$ --------------------------
##$DU= <F:/spectra>
##$EXPNO= 4
##$NAME= <1H>
##$PROCNO= 1
##$TYPE= <nmr>
##$USER= <iren>
##$AMP= (0..31)
100 100 100 100 100 100 100 100 100 100 100 100 100 100 100 100 100 100 
100 100 100 100 100 100 100 100 100 100 100 100 100 100 
##$ANAVPT= -1
##$AQSEQ= 0
##$AQ_mod= 1
##$AUNM= <au_zg>
##$AUTOPOS= <>
##$BF1= 200.13
##$BF2= 200.13
##$BF3= 200.13
##$BF4= 200.13
##$BF5= 200.13
##$BF6= 200.13
##$BF7= 200.13
##$BF8= 200.13
##$BYTORDA= 1
##$CFDGTYP= 0
##$CFRGTYP= 5
##$CHEMSTR= <none>
##$CNST= (0..63)
1 1 145 1 1 1 1 1 1 1 1 1 1 1 1 1 1 1 1 1 1 1 1 1 1 1 1 1 1 1 1 1 1 1 
1 1 1 1 1 1 1 1 1 1 1 1 1 1 1 1 1 1 1 1 1 1 1 1 1 1 1 1 1 1 
##$CPDPRG= <>
##$CPDPRG1= <>
##$CPDPRG2= <>
##$CPDPRG3= <>
##$CPDPRG4= <mlev>
##$CPDPRG5= <mlev>
##$CPDPRG6= <mlev>
##$CPDPRG7= <mlev>
##$CPDPRG8= <mlev>
##$CPDPRGB= <>
##$CPDPRGT= <>
##$D= (0..63)
$$ [...]
0 0 2 0 0 0 0 0 0 0 0 0 0 0 0 0 
##$SW_h= 4816.95568400771
##$TD= 16384
##$TD0= 1
##$TE= 300
##$TE2= 300
##$TE3= 300
##$TEG= 300
##$TL= (0..7)
0 120 120 120 120 120 120 120 
##$TP= (0..7)
150 150 150 150 150 150 150 150 
##$TP07= 0
##$TPNAME0= <>
##$TPNAME1= <>
##$TPNAME2= <>
##$TPNAME3= <>
##$TPNAME4= <>
##$TPNAME5= <>
##$TPNAME6= <>
##$TPNAME7= <>
##$TPOAL= (0..7)
0.5 0.5 0.5 0.5 0.5 0.5 0.5 0.5 
##$TPOFFS= (0..7)
0 0 0 0 0 0 0 0 
##$TUNHIN= 0
##$TUNHOUT= 0
##$TUNXOUT= 0
##$USERA1= <user>
##$USERA2= <user>
##$USERA3= <user>
##$USERA4= <user>
##$USERA5= <user>
##$V9= 5
##$VALIST= <valist>
##$VCLIST= <CCCCCCCCCCCCCCC>
##$VD= 0
##$VDLIST= <DDDDDDDDDDDDDDD>
##$VPLIST= <PPPPPPPPPPPPPPP>
##$VTLIST= <TTTTTTTTTTTTTTT>
##$WBST= 1024
##$WBSW= 25
##$XGAIN= (0..3)
0 0 0 0 
##$XL= 0
##$YL= 0
##$YMAX_a= 12773282
##$YMIN_a= -12998817
##$ZGOPTNS= <>
##$ZL1= 120
##$ZL2= 120
##$ZL3= 120
##$ZL4= 120
##$ABSF1= 0
##$ABSF2= 0
##$ABSG= 0
##$ABSL= 0
##$ALPHA= 0
##$AQORDER= 0
##$ASSFAC= 0
##$ASSFACI= 0
##$ASSFACX= 0
##$ASSWID= 0
##$AUNMP= <proc_1d>
##$AXLEFT= 0
##$AXRIGHT= 0
##$AXTYPE= 0
##$AXUNIT= <>
##$AZFE= 0.1
##$AZFW= 0.1
##$BCFW= 0
##$BC_mod= 2
##$BYTORDP= 0
##$COROFFS= 0
##$CY= 7568.61572265625
##$DATMOD= 1
##$DC= 0
##$DFILT= <>
##$DTYPP= 0
##$F1P= 12.6985496478733
##$F2P= 1.34767866218088
##$FCOR= 0.5
##$FTSIZE= 32768
##$FT_mod= 6
##$GAMMA= 0
##$GB= 0
##$INTBC= 0
##$INTSCL= 1.564343e-010
##$ISEN= 128
##$LB= 0.08
##$LEV0= 0
##$LPBIN= 0
##$MAXI= 10000
##$MC2= 0
##$MEAN= 0
##$ME_mod= 0
##$MI= 50
##$NCOEF= 0
##$NC_proc= 2
##$NLEV= 6
##$NOISF1= 8.587773
##$NOISF2= 6.764455
##$NSP= 0
##$NTH_PI= 0
##$NZP= 0
##$OFFSET= 18.03457
##$PC= 4
##$PHC0= 81.3557
##$PHC1= -6.52634
##$PH_mod= 1
##$PKNL= yes
##$PPARMOD= 0
##$PPDIAG= 0
##$PPIPTYP= 0
##$PPMPNUM= 100
##$PPRESOL= 1
##$PSCAL= 1
##$PSIGN= 0
##$REVERSE= no
##$SF= 200.13
##$SI= 32768
##$SIGF1= 16.12182
##$SIGF2= -4.496377
##$SINO= 3.521527
##$SIOLD= 32768
##$SREGLST= <1H.CDCl3>
##$SSB= 0
##$STSI= 32768
##$STSR= 0
##$SW_p= 4816.95568400771
##$SYMM= 0
##$S_DEV= 0
##$TDeff= 16384
##$TDoff= 0
##$TI= <>
##$TILT= no
##$TM1= 0
##$TM2= 0
##$TOPLEV= 0
##$USERP1= <user>
##$USERP2= <user>
##$USERP3= <user>
##$USERP4= <user>
##$USERP5= <user>
##$WDW= 1
##$XDIM= 32768
##$YMAX_p= 316985656
##$YMIN_p= -81026
$$ End of Bruker specific parameters
$$ ---------------------------------
##NTUPLES= NMR SPECTRUM
##VAR_NAME=  FREQUENCY,     SPECTRUM/REAL,   SPECTRUM/IMAG
##SYMBOL=    X,             R,               I
##VAR_TYPE=  INDEPENDENT,   DEPENDENT,       DEPENDENT
##VAR_FORM=  AFFN,          ASDF,            ASDF
##VAR_DIM=   32768,         32768,           32768
##UNITS=     HZ,            ARBITRARY UNITS, ARBITRARY UNITS
##FACTOR=    0.147006307687848, 1,           1
##FIRST=     4816.95568400771, -77238,       -62310
##LAST=      0,             -75084,          -65229
##MIN=       0,             -81026,          0
##MAX=       4816.95568400771, 316985656,    0
$$ Real data points
##PAGE= N=1
##DATA TABLE= (X++(R..R)), XYDATA
$$ [...]
17102c6178j315n22J151L38k133j935J503L373R32k174j805M56P08q53j158J63
17086c9449Q07K05j2N21N05r9P1R81J080J51m06k69o25j515j369J59J127K09j267
17067c9195j257K28J453J284K19m60j68M29L82q2N3N93l9k085l144j279J792K766
17049c8510J190m32n17J5L0k30l01l18k09L09N70m75k113k068K82K562K275j45
17031c8085k245k458j101P15K027K152J021m97j185o70J95M26J66M59J494J800
17015c5786J60k135k477n29J083L91j302j596k58J085J404R14J56j88M32J371
16999c7275J065n66j548r50m49j176j367L30J769P74n79O20K394P03k979k952
16983d2186J412L826O48l427k722R84J971o00k361q70J487J767K86p47l14O52
$$ y = [-36178, -37493, -38015, -36864, -36526, -38659, -40594, -39091, -35718, -34786, -36960, -38765, -38309, -37601, -38454, -39612, -39449, -38642, -38437, -38449, -37928, -37423, -37522, -37451, -36470, -35390, -35239, -35645, -35914, -36539, -38054, -39423, -39264, -38137, -37928, -39195, -40452, -40224, -38771, -37487, -37268, -37728, -37896, -37467, -37085, -37167, -37114, -36521, -36560, -38645, -41789, -43068, -41276, -38510, -37320, -37752, -38269, -38254, -38224, -38454, -38755, -39073, -39282, -38973, -38403, -38878, -40991, -43059, -42777, -40215, -37940, -38085, -40330, -42788, -43889, -43174, -41147, -38995, -37974, -38471, -39656, -40326, -40131, -39705, -39539, -39080, -37586, -35786, -35626, -37761, -40238, -40767, -39684, -39293, -40595, -42191, -42449, -41364, -39960, -39046, -38890, -39078, -38646, -37275, -36210, -36776, -38324, -39274, -39723, -40899, -42266, -41936, -40167, -39393, -39972, -39352, -36958, -36255, -39234, -42186, -40774, -36948, -36300, -39727, -42449, -41465, -39494, -40094, -42455, -43325, -41838, -40071, -39785, -40532, -40846, -40194]
16967d0194O13q38k408k369l78K376M398M328J215l589n803k561K868M246O01
16952c7495k676j935J13L8p42M57K139J220j426k463j427n27l05M94J586J488
16936d1461N67L52M04p29k070j378O94J310J59k85O30P55o85j611p99L08N72Q12
16918d2455J248M04j838k906j144J487K247J198K54K06L98L03o5m84n11J10O47
16901d0901J07j041j325m90L29N89P03N13m76j296m64J208J350j65j009m14j42
16884d2924o98k38J465J678o08k322j125P21L70q96m27R16N99q19q42L86O03l01
16866d4462l81M33L17o68m06J282J932M77j083j025k31k6oN55J056O40l26q44
16848d2766o34r8L08L81L55O01P13k39j741j605P67K510J089j492j464P83J405
$$ y = [-40194, -39581, -40419, -42827, -45196, -45574, -43198, -38800, -34472, -33257, -36846, -42649, -45210, -42342, -38096, -37495, -40171, -42106, -41993, -41955, -42697, -42240, -40101, -38881, -40307, -42770, -44197, -44724, -45029, -44535, -42949, -41461, -40894, -40542, -40138, -40867, -42937, -44315, -43621, -42311, -42152, -42437, -41807, -41052, -41737, -43348, -44147, -43839, -43267, -42455, -41207, -40803, -42641, -45547, -46691, -45204, -42957, -41759, -41505, -41299, -40901, -40598, -40663, -41147, -41658, -41548, -40901, -40794, -41835, -43160, -43650, -43321, -42732, -42029, -41516, -41992, -43288, -43752, -42544, -41194, -41359, -42368, -42782, -42924, -43622, -43860, -42395, -40717, -41325, -43647, -44772, -44051, -43681, -44577, -45004, -44088, -43489, -44308, -45150, -44764, -44161, -44462, -44843, -44410, -44093, -44761, -45167, -43885, -41953, -41476, -42559, -43584, -43815, -43841, -43847, -43292, -42236, -41596, -41922, -42766, -43400, -43498, -43190, -42809, -42454, -41853, -41140, -41379, -43120, -44725, -43958, -41448, -40359, -41851, -43315, -42532, -41127]
16831d1127m96j539K8J394J38j605q47J249J449k96j094J84J507J053m31j140
16815d1573n42L75L99n73j255l93J297J618k06k203k158m50P95N78j37q6Q73J796
16797d1845J586J19j374j628r98p89r30q1J649K185P02p26k56Q71N45q09j337
16780d3116r13o48l22R37K054J053j349k214p75N18K3p50q7J117J238N98L33J05
16762d2198r54k065j691j06Q83N90J12K41L51j90q27p95l07J3K00O23R83O75N
16743d4457LP01P35n12j368q5J934J396j884l746j174K963L459j16l073k330n9
16726d7613N41j16J54J199J201K15M6R76J264J78p68l38N68N07m49j161r59jJ072
16707d3484J369M56q65j331j000q82q11M96K549K649j85k916k414K9R10j27n08
$$ y = [-41127, -41623, -43162, -43134, -41740, -41602, -43207, -44054, -42805, -41356, -41652, -42746, -42562, -41055, -40002, -40433, -41573, -42115, -41740, -41341, -41914, -43169, -43562, -42265, -40647, -40853, -43056, -45214, -45664, -44869, -44291, -44428, -44514, -43641, -41845, -40259, -40140, -41514, -43142, -44140, -44929, -45859, -45940, -44291, -42106, -41404, -42130, -42386, -41515, -40970, -41779, -43116, -44029, -44677, -44999, -44062, -42008, -40955, -42304, -44518, -45293, -44775, -44752, -45502, -45589, -44472, -43234, -42636, -42303, -42198, -43152, -45217, -46908, -47014, -46131, -45541, -45429, -45188, -44837, -45027, -45854, -46649, -46956, -46943, -46743, -46120, -45137, -44462, -44457, -44454, -43753, -43018, -43530, -44898, -44983, -43049, -41653, -43537, -47283, -48457, -45494, -42035, -42151, -45224, -47554, -47613, -47072, -47188, -47034, -45835, -44634, -44419, -44373, -43397, -42133, -41955, -42723, -43061, -42493, -41986, -42435, -43596, -44555, -44556, -43484, -42115, -41659, -42524, -43855, -44855, -45737, -46548, -46052, -43503, -40854, -41039, -43955, -46369, -46340, -45430, -45557, -46065]
16690d6065L54L15r29p47J479K318k04k651j262J856K024m78j258N37J018j243
16674d4936k403rK375R67j784j190J845K337n39k315p42Q92j69j397M08L195K631
16657d0834q99k793j295K63o90j853j65K757K751n80l143k166M03J368O74L51
16641d5851Q33P75j18m84K45Q09J06j171j727j314n54J33O25Q59Q87P98M49j50
16623d4850l67Q8J88q87j689k32K159J841j438l227q40K237J606j220j573P50
16607d7454J662o0j174j08M98q54j428P32K780J566j075j452R3N69r3N23K088
16590d3187J479j653l437j405J866K632Q53q53j243j070q82l54M56Q38M94m4j59
16573d5669J89N19K34p38j593j360j62Q16P93K11j48j35J8K54M67L85J47L74J116
$$ y = [-46065, -45711, -45396, -46325, -47072, -45593, -43275, -43479, -46130, -47392, -45536, -43512, -43990, -45248, -44711, -43693, -44936, -47339, -47348, -44973, -44006, -45790, -46980, -45135, -42798, -43337, -45652, -46394, -45502, -45671, -47068, -46660, -43465, -40834, -41733, -44526, -45821, -45558, -46248, -48101, -48266, -45509, -42758, -43338, -46481, -48647, -48244, -46876, -46202, -45851, -45018, -44243, -44361, -44845, -44600, -43791, -43685, -44856, -46583, -47897, -48451, -48318, -47693, -46834, -45947, -45149, -44700, -44850, -45217, -45129, -44941, -45828, -47517, -47749, -45590, -43749, -45187, -48414, -49254, -47017, -45411, -46631, -48204, -47454, -45792, -45852, -47026, -47134, -46636, -47490, -48918, -48186, -45406, -43840, -44915, -46367, -46274, -45705, -45798, -45275, -43187, -41708, -43361, -46798, -48203, -46337, -43705, -42852, -43705, -44948, -46018, -46900, -47254, -46798, -45960, -45466, -45510, -45669, -45480, -44961, -44727, -45465, -47058, -48418, -48580, -47764, -46971, -46760, -46908, -47043, -47025, -46771, -46304, -45919, -45772, -45398, -44282]
16554d4282J337K65j219j460j89J081R56k40j122j008n02m68q65r38l59L24N10
16537d8179M04N34P34K82q46j602j060M13J566J590P50j23m65l88l87n93n31J06
16519d7795O83L46m79l41R79J697M79j196r07Q98J222q80k387o91K092J921r90
16502d5349k269l1K094M39l022l436K1L283L052L89j633j501J48J643J502n0q56
16485d5576L50J583M04j655r98J878K450n65k769j027J746J862N95N42L19k003
16469d2864l628j209K302J646j641j468K220L103n21k703j81K184K85k184o91
16454d5350K137J584q81q61J078J251n9K27J607R27j419j962j84J135J032Q92
16438c8846O01r17k053m99J890J551l53J61K180R63l071l884J24K969P99k184
$$ y = [-44282, -42945, -42680, -43899, -45359, -45548, -44467, -43511, -43751, -44873, -45881, -46383, -46851, -47716, -48654, -49013, -48689, -48179, -47775, -47241, -46507, -46225, -47071, -48673, -49733, -49320, -47754, -46164, -45414, -45537, -46002, -46390, -46777, -47370, -47901, -47795, -47112, -46766, -47245, -47586, -46607, -44910, -44431, -45627, -46534, -45636, -44414, -45294, -47681, -48372, -46280, -44359, -45349, -47618, -47649, -45555, -45116, -48138, -51574, -51553, -48270, -45218, -44829, -46462, -47963, -47815, -46172, -44670, -44720, -45576, -45226, -43643, -43239, -44894, -45892, -44014, -41564, -42129, -44898, -45925, -44179, -42317, -41722, -41180, -40861, -42864, -46492, -47701, -45399, -43753, -45394, -46862, -44642, -41539, -42060, -44763, -44944, -42760, -42475, -44659, -45350, -43213, -41629, -42510, -43371, -42293, -41042, -41101, -40874, -39267, -38340, -39759, -41721, -41905, -40770, -39738, -38846, -38245, -39162, -41215, -41714, -39824, -38273, -38626, -38465, -36285, -35322, -38393, -42277, -42153, -39184, -38385, -40569]
16422d0569j258J504J951O68L19N20o2j64J140J499o02k229o11J980K103N79r0
16405c3322l40j276j260Q18K350J347J60N51q1k595k234K658M906m8m164K88N054
16388b7188j275r858j257K0871K8162P734j6648j7393m65Q103J173n322j832K848
16374a2347P28k634n49L236K774m4o14L72J75l17M96J010j33p24Q63K229J308
16357d171K08J013J664J19j258K18K251J301j134r18J656K326l80l254l277p97
16341d433K142L679K652p5j310O75L021K017r83j421J208K488L30j608J34L267
16325A1783L390N30j474p69O99Q50K2n40n34j35P31J660J562J86j064q88l1j35
16307A5843j085j080L78J310J08j817j807K59J828J144q32k256k475j741l88Q41
$$ y = [-40569, -41827, -40323, -38372, -37704, -37385, -36865, -36927, -37091, -35951, -34452, -35054, -37283, -37894, -35914, -33811, -33232, -33322, -33662, -34938, -36198, -35380, -33030, -31683, -31523, -30972, -31053, -33648, -35882, -33224, -28318, -28366, -32530, -32242, -27188, -28463, -38321, -39578, -18707, 9455, 17189, 541, -16852, -17317, -9214, -8041, -13363, -15195, -12347, -11619, -14253, -14802, -11566, -8792, -8836, -9450, -9078, -8903, -9220, -8724, -7714, -7847, -8571, -7708, -5479, -4171, -3963, -2950, -1286, -1167, -2425, -2207, 44, 1345, 211, -707, 949, 3275, 2895, -359, -3636, -4433, -2291, 1388, 4040, 3965, 2655, 3330, 6351, 8368, 7385, 5964, 7172, 9660, 9990, 8382, 8516, 11783, 15173, 15703, 14229, 13460, 14159, 15009, 15031, 14491, 13957, 13822, 14553, 16213, 17775, 17961, 16897, 16009, 15978, 15843, 14758, 13678, 14056, 15366, 15474, 13657, 11850, 12109, 13937, 15081, 14249, 11993, 9518, 7777, 7389, 8230]
16291H230Q87j94r01k59P57P16k55j036j241j190q64n9P18P01%n98p72q98j267
16272B475j730j923j469k93R22J168L66n28q20o88k38P04J458P11j275k314j241
16255d715K78L46l59k31L59l6j123j358o99n44j218j592j165o66n87n91l78N2
16237a4227N77M18j327l440k805J030L724J722k048k249N81J143j679l009k95
16222b1884K437J435q59o64O29m84l025l082m46J139K7j294o37Q56J130J51p53
16205b5324q96o15m79n41j28J224K428J600j196l295k646l77J068R48R8q13j269
16188c0213n85Q14J133j37r79k5R29o3j465o14J669K146J36j738j535l3J111R27
16170b8522p07k421j801J299L230J203k059j955J066K493Q95q16j024j314k036
$$ y = [8230, 9117, 8923, 8022, 7763, 8520, 9236, 8981, 7945, 6704, 5514, 4650, 4591, 5309, 6010, 6010, 5412, 4640, 3742, 2475, 745, -1178, -2647, -2940, -2018, -850, -484, -1012, -1832, -2520, -2758, -2054, -596, 115, -1160, -3474, -4715, -4437, -4091, -4450, -4681, -4322, -4358, -5481, -6839, -7538, -8082, -9300, -10892, -12057, -12723, -13310, -13901, -14279, -14227, -13650, -13232, -14559, -17999, -20804, -19774, -16050, -14328, -16376, -18625, -18044, -16901, -18580, -21589, -21884, -19447, -18012, -18871, -19535, -18906, -19390, -22415, -25497, -25943, -24804, -24777, -26071, -26708, -25852, -24722, -24571, -25324, -26220, -26835, -27314, -27855, -27983, -26759, -24331, -22731, -23927, -27222, -29868, -30245, -29177, -28229, -28131, -28944, -30213, -30798, -29984, -28851, -28988, -29967, -29992, -29063, -29126, -30591, -31205, -29536, -27390, -27254, -28992, -30527, -30560, -29449, -28522, -29229, -31650, -33451, -32152, -28922, -27719, -29778, -31733, -30667, -28174, -27279, -28095, -29119, -30433, -32469]
16155c2469j090J446K352O46o16Q7J97j517j936O37K563Q10j475l37J948R04j987
16138b9837j714J423K235l51j539R04K780O14k544k210N18J222q92k413j256Q50
16122c2210J550P62l25j105j351n49J164K176J024j223j776J07J826J045q21q42
16106c0548Q11J338Lq93k42J01q97j260K87J523M29j097m59J025M91j296j270
16089c1954N67J360M84J73R69P76q65j512j25R86J25r29j05J527J671K96q02o87
16071b8045Q6O13L24o98j483j126j09M11L66L99K10o95j178mJ318L82j663j315
16053c2207J313K091l97k287p52J475J010p40p73J85j42p90M50K170J352j028
16037b9070j247Q30J459o20k228j195L75N6j093q81M35J097O61n6n68p73l53N87
$$ y = [-32469, -33559, -32113, -29761, -29115, -29731, -29644, -29447, -30964, -32900, -32263, -29700, -28890, -30365, -30702, -28754, -27850, -29837, -31551, -30128, -27893, -28244, -29783, -28879, -26099, -25485, -28029, -30239, -29721, -28499, -29391, -31804, -33060, -32210, -30660, -29898, -30223, -31328, -32679, -33228, -32064, -29888, -28864, -30087, -31863, -31756, -29930, -28885, -29706, -30548, -29737, -28399, -28396, -29289, -29531, -29430, -30327, -31587, -31300, -29777, -29348, -30445, -30904, -29879, -29388, -30684, -31954, -31387, -30027, -29543, -29370, -28401, -27625, -28490, -30002, -30127, -29141, -29016, -29945, -30050, -28523, -26852, -26556, -27358, -28045, -27959, -27346, -27022, -27720, -29203, -30329, -30438, -30027, -29661, -29262, -29052, -29747, -30925, -30929, -29611, -29229, -30892, -32207, -30894, -28803, -29200, -31487, -32239, -30764, -29754, -30494, -31267, -31082, -31224, -32014, -31564, -29394, -28042, -29070, -30317, -29487, -28028, -28648, -30876, -32071, -31696, -31640, -32733, -33614, -33179, -32082, -31421, -31477, -32045, -32818, -33171, -32584]
16019c2584J118O21k84o99o07n19o10p33p68n94k23L9J3M5L57L85l75j171p98
16000c7387N45J383R38l1m48j36K83N7r16j645q77J046K112J163n90j488j494
15983c7485j135q7J372J334r42k701j230J579J774m24j053R65K103K29j956j436
15967c9093N59J016l41j511j339j85J125J539M34r21m90J139J111r11j574O84
15951c8758K415L91k949l041k0K063J388k04j167j723j664l21J150Q51l57K51
15935d1695K453K744k02l124k845n32P28L07k61l00l70m82L0J062J584R37m63
15918d0429j570j427N5J693J930N97q58j199p94o85r58p35M03J565J379l10j855
15901d3198j517K62J296O34k49m6L24k41o24N59J916J058j214j788k24O56l40
$$ y = [-32584, -31466, -30845, -31129, -31828, -32435, -32954, -33564, -34297, -35065, -35659, -35882, -35843, -35830, -35785, -35428, -35043, -35418, -36589, -37387, -36842, -35459, -34521, -34552, -35000, -35136, -34853, -34796, -35712, -37357, -38234, -37188, -35076, -33913, -34503, -35991, -37485, -38620, -38707, -37335, -36001, -36943, -39644, -40874, -39295, -37521, -37945, -38998, -38033, -35930, -35701, -37657, -39093, -38534, -37518, -37859, -39370, -40709, -40894, -39769, -38230, -37796, -38717, -39207, -38068, -36957, -37868, -39442, -38758, -36343, -35952, -38901, -41942, -41962, -39899, -38511, -38715, -39882, -41605, -43269, -43590, -42440, -41589, -41946, -41695, -39242, -36498, -36700, -39824, -42669, -43201, -42473, -42166, -42427, -42727, -43097, -43579, -43549, -42487, -40903, -39966, -40429, -41999, -43426, -43371, -41678, -39748, -39151, -40009, -41208, -42002, -42687, -43645, -44380, -43977, -42412, -41033, -41343, -43198, -44715, -44453, -43157, -42523, -42772, -42818, -42494, -42735, -43359, -42800, -40884, -39826, -41040, -42828, -43052, -42396, -42736]
15884d2736r32K53J049k51j458n6K183J757r90k443j203M56O46J31n2l87j125
15867d5158j041N58K194K015K51j329j613p35P16J923J832J29j783j901j1J856
15851d2097J767J13j149j025l14N2K47O10N68m23j516j449m35K95N14Q85J125
15834d2232L10r56r46J81L53o66n24J336J835p22k953j327J899K055n15j478J01
15817d4249J007L71P45J726p98o353p470m10P354O761J15l023l14J500j059k848
15801d6945K25L864K536j506k240N22J610q47k909j331J939L190J762j59p38p2
15785d1099M78j17j197j047N58J426K6j716r59J539K266K07j783j514l20j10k45
15768d3607N40J368P18p32j168o31o11j269j251j68Q48J136J199J176L99j047
$$ y = [-42736, -43668, -43415, -42366, -42617, -44075, -44131, -41948, -40191, -41181, -43624, -44827, -44371, -43725, -43594, -43646, -44033, -45158, -46199, -45641, -43447, -41432, -41181, -42510, -44123, -44858, -44142, -42219, -40387, -40258, -42041, -43942, -43953, -42097, -40330, -40217, -41366, -42391, -42705, -42653, -42406, -41796, -41228, -41651, -43167, -44616, -45051, -44756, -44242, -43357, -42232, -41922, -42878, -43824, -43643, -43290, -43956, -44480, -43144, -41309, -42031, -44984, -46311, -44412, -42357, -42872, -44350, -44249, -43242, -42871, -42126, -40400, -41198, -47551, -55021, -55431, -48077, -41316, -41201, -44224, -44538, -43038, -44097, -46945, -46720, -42856, -40320, -41826, -44066, -43544, -41934, -42781, -45690, -47021, -45082, -41892, -40130, -40289, -41027, -41099, -40621, -40738, -41935, -42982, -42424, -40998, -40972, -42688, -43647, -42108, -39842, -39635, -41418, -42932, -43252, -43362, -43607, -43067, -41699, -40981, -41713, -42881, -43512, -44123, -45392, -46643, -46811, -45963, -44827, -43628, -42452, -42053, -43100]
15752d3100j855j296k36L82Q10J385J341M4j340j006P73J666N26q17k82J085M67
15735d1453k096l070n80K246J603j125j411J214K381N9k013n00J935J027k082
15720d3865k736j72J853J377N06R19J277L84o65r22j110j344l54J559J911J13
15704d1269r81L27J578L90j343p77R14O57j206j701k85P54L73k44n68j170j431
15687d5982r4J786J745j5p31L19Q72n3n48K28K14j537k490p29J564J631N50Q07
15669d2463J639O08j515j527Q06J991J64k144j959L0J058L02o11k83P95J198L11
15652d1600j039j542r80m19n33m63P29K116J926K83q22m29K25j9n27l54L8j48
15634d3558m86j53N45Q12P76Q89O54m53j498j222j74J39q7N44J602R98j187j997
$$ y = [-43100, -44955, -46251, -46487, -46105, -45295, -43910, -42569, -42525, -43865, -44871, -44098, -42432, -41906, -42723, -43005, -41920, -41453, -43549, -46619, -47199, -44953, -43350, -44475, -45886, -44672, -42291, -42232, -44245, -44745, -42810, -41783, -43865, -46601, -46773, -44920, -43543, -43037, -42118, -40841, -40457, -41122, -42044, -43154, -44498, -44852, -43293, -41382, -41269, -42250, -41923, -40345, -39955, -41298, -42075, -41161, -40504, -41710, -43411, -43696, -42942, -42569, -42813, -43381, -44551, -45982, -46076, -44290, -42545, -42560, -43291, -42972, -42100, -42153, -42701, -42473, -42259, -43796, -46286, -47015, -45451, -43820, -43270, -42463, -40824, -40216, -41731, -43258, -42452, -40461, -40297, -42441, -44400, -44370, -43312, -43010, -43621, -43904, -43109, -41911, -41600, -42639, -44181, -45161, -45580, -46113, -46576, -45847, -43731, -41805, -41522, -42344, -42773, -42548, -42567, -43094, -43448, -43410, -43558, -44044, -44197, -43652, -42840, -42064, -41175, -40521, -40974, -42472, -43694, -43868, -43729, -43816, -43272, -41670, -40672, -41859, -43856]
15616d3856j04J733Q32j171j078O93J131k87j199p34n97j342j086Q82K402J843
15600d1938M95l6k35p22n34O28R38l76r47Q62K487R90j769j932j1K56j399j372
15582d4615J178K488N57j403m19J407P36j410j681J6P55n37j822j417mJ058J356
15565d3757J025K67m09n61m30m18l32N7K82O5J84J222K034J029j293k629j799
15548d5463K4J185J397J153N32m43r10P1J781K008j83k623k316N88K771K163L93
15531c7872k90l66j169j634r8J884J342j036j622J48R02o44j437K20J413k7j290
15514d1576L91K316P15k385k188Q55J756q43k841j494R68J755J319J059Q04K49
15498c9140Q0K33m01j487j129O53J276k42j324O0K038J756l53j677j299m75j82
$$ y = [-43856, -43960, -42227, -41395, -42566, -43644, -42951, -41820, -42107, -43306, -44040, -44637, -45979, -47065, -46183, -43781, -41938, -41443, -41479, -41714, -42436, -42970, -42342, -41404, -41780, -42727, -41865, -39378, -38388, -40157, -42089, -42100, -41844, -43243, -44615, -43437, -40949, -40392, -41795, -42214, -40807, -40071, -41481, -43162, -43146, -42391, -42928, -44750, -46167, -46171, -45113, -43757, -42732, -42465, -42874, -43435, -43865, -44283, -44615, -44558, -44276, -44211, -44027, -42805, -40771, -39742, -41035, -43664, -45463, -45439, -44254, -42857, -41704, -41172, -41615, -42525, -42454, -40673, -38665, -38848, -41471, -43787, -43199, -40428, -38265, -37872, -38162, -38528, -39697, -41331, -41429, -39545, -38203, -39239, -40861, -40713, -39811, -40455, -41892, -41672, -40259, -40286, -41576, -41185, -38869, -38154, -40539, -42727, -41872, -40116, -40959, -43800, -45294, -44326, -42571, -41252, -40193, -39389, -39140, -39060, -38827, -39228, -40715, -41844, -41191, -39915, -40157, -41481, -41421, -39383, -37627, -37980, -39657, -40956, -41431, -41613]
15481d1613j77n5K00N32P21M56n6k13n5j68l94N4Q87O91q21k000j468J35J292
15462d2052J394P65L1q3N86J041K95r15j076l25n2l39J2Q23N46p29r70L51J283
15443c9414P23J1J28L2p81q41M86J345L89r18q52k5M23Q65J523J110p34j941j116
15424c9587O0j90p10J07J135O36m78m44K16K32L31J417J856k0k287j833P39K080
15406c6740J034n76j316j239m07Q33J026l33j164P6J442O90o71j91Q18k30j834
15389c8782o87K026K117m61j634k68M59p39j318j99L36n08m83R03J052n71j018
15372c9775N30R52q00j241J171K524J10k431j090J754J582q44j506n8N96j11k01
15355c8838N11K91p19n28J001J751P28p24j120l16Q81J224Oj452r51J019J236
$$ y = [-41613, -41790, -41845, -41645, -41113, -40392, -39936, -39992, -40205, -40260, -40428, -40822, -40768, -39881, -39190, -40011, -42011, -43479, -43344, -42052, -40658, -39893, -39862, -39945, -39359, -38318, -38023, -38938, -40014, -40339, -40391, -40730, -40718, -39895, -39349, -40078, -41048, -40697, -39414, -38691, -38680, -38552, -38520, -39301, -40142, -39656, -38311, -37922, -38840, -39692, -39717, -39294, -38429, -36906, -35796, -36530, -38471, -39587, -39527, -39717, -40427, -40320, -39185, -38549, -39027, -39471, -39255, -39023, -38692, -37275, -35419, -35439, -37726, -39559, -38820, -36740, -35706, -36282, -37598, -38837, -39244, -38411, -37385, -37718, -38882, -38806, -37364, -36674, -37345, -37536, -36718, -36948, -38782, -39469, -37443, -35326, -35787, -37421, -37689, -37230, -37969, -39287, -39486, -39150, -39658, -40141, -39238, -38186, -38757, -39775, -39245, -38293, -39093, -40334, -39163, -36639, -36529, -38960, -40050, -38296, -36714, -37558, -39064, -39122, -38526, -38637, -38838, -38327, -38036, -38755, -39283, -38282, -36531, -35803, -36527, -37647, -37963, -37082, -35858, -35852, -37304, -38255, -37236, -36000]
15338c6000j229k957j348J286J663O25O81J270M44p73j10J416R70j132j963p95
15322c7952M31R12J443J628K14j936k540j340QR25J769J734Q2j347m66J250R06
15305c4279p77p74P04N75j309j621O70K464J586l11j112r60m96L29Q33K5r87k03
15287c5643J482J289n35r27N00Q28o11r68N42Q53j140k093o9J883J143p8O08J156
15269c1780o89k432r55J544R62j601j664J011K102q8k075q79J805K690J293m38
15253c1194j121r58n92j03P82J703J479l33k106j843o9Q90N63O74J503R90j261
15236c0996k351n28J691J359m20p55L73P94M2m93k65P9L31N44J72p58q53N43J791
15217b9700J397L57J33J41n47q84J70J113J82j376j203K88Q01j20q65n41L38J040
$$ y = [-36000, -37229, -40186, -41534, -40248, -38585, -37960, -37279, -36009, -35565, -36338, -36448, -35032, -34062, -35194, -37157, -37952, -37521, -36609, -35166, -33538, -33324, -35260, -37800, -39140, -39132, -38207, -36438, -34704, -34622, -35969, -36435, -35185, -34279, -35056, -35830, -35126, -34551, -35860, -37481, -36811, -34347, -32761, -33072, -34184, -35144, -35640, -35311, -34478, -34453, -35440, -35643, -34161, -32872, -33407, -34334, -33834, -33006, -33617, -34585, -34043, -33190, -34330, -36423, -36492, -34609, -33466, -33544, -32936, -31780, -32469, -34901, -35856, -34312, -33350, -34951, -36615, -35604, -33502, -33590, -35665, -36544, -34739, -32049, -30756, -31194, -32315, -33273, -33865, -33968, -33186, -31483, -30004, -30337, -32443, -34286, -34355, -33465, -32902, -32228, -30725, -29735, -30996, -33347, -33875, -32184, -30825, -31245, -32000, -31627, -30833, -30791, -31284, -31549, -31470, -31139, -30595, -30423, -31181, -32034, -31491, -29700, -28303, -27946, -27813, -27672, -28219, -29103, -28933, -27820, -27638, -29014, -30217, -29929, -29128, -29248, -30113, -30654, -30316, -29276]
15199b9276P45r92k471q62L092M495J161k405j559J391J396j148j973m93K90l6
15183b8645O80J763N72j722j372R51Q53j788k222O79K254K74j371JJ289j43j483
15166b9430P3J954Q69j422j560k30J13n5P89J377O5j362m50J457J491N3n89m89
15148b7346j006j315O8J708J278j62P6J411J006r58j382M59J827J183K67M66M53
15131b1967j074k690k152M00K497K109k52k078j557L22J080J78m69K77J064N88
15115b3724j98k0N61O65Q19J344R87p75j966r59Q03J221P27O20L37p79j082P55
15097b0664K533J518r54j565k94L15k5N65J814J423n61j456k88J110J496J371
15081a3662P44p44j635j58K075J736q09j829k54R41P0r03m59J63J82Q08K007J730
$$ y = [-29276, -28531, -29523, -31994, -32856, -29764, -25269, -24108, -26513, -28072, -26681, -25285, -26433, -28406, -28899, -28609, -28645, -27965, -26202, -25630, -27352, -28724, -27773, -26920, -28708, -30930, -30251, -27997, -27723, -29094, -29093, -27804, -27947, -29430, -29357, -27403, -26534, -27956, -29516, -29746, -29633, -29688, -28899, -27522, -27457, -28819, -29269, -27812, -26321, -26268, -26857, -27346, -28352, -29667, -29599, -27891, -26613, -26775, -26699, -25288, -24282, -25240, -26622, -26163, -24336, -23153, -22886, -22420, -21967, -23041, -25731, -27883, -27483, -24986, -22877, -23129, -25207, -26764, -26442, -25362, -25184, -25653, -25376, -24312, -23724, -23922, -23942, -23381, -22716, -21897, -20553, -19566, -20341, -22307, -23266, -22463, -21242, -20515, -19895, -19558, -20337, -21419, -20664, -18131, -16613, -17567, -19132, -19426, -19111, -19136, -18571, -16757, -15334, -15895, -17351, -17639, -16529, -15033, -13662, -12918, -13662, -15297, -15455, -13380, -11644, -12453, -14282, -14536, -13595, -13525, -14428, -14887, -14724, -14542, -13734, -11727, -9997]
15063i997j4l06J585K439O64o92O08J780Rk128p34K772L802J613l64j96P46J178
15045B765J375J298M07n77l18Q19J399J436J897K270J320j16k7J227J274k1O1
15028A6489K521M452L294Q47N26K241K861J297K35J871M284M082J511L18K284
15013D9113M497L658J066P62L520N811M976K669J955L171M400M540M155L991M168
14998A02452M515M708M375L722L616M551N900O623O361N700N624O567P580P185
14984A79479N631N188O936Q687Q180O749O941P786O376L584L514O611Q316O325
14970B70303M442O260R183Q715N647M542O831R515J0056Q993P939P677Q328R559
14956C77990J0615J1244J1963J2785J3005J2816J3206J3610J2338J0165J0204
$$ y = [-9997, -10011, -10317, -8732, -6293, -5629, -6321, -5713, -3933, -3924, -6052, -6786, -4014, -212, 1401, 1037, 841, 1587, 2765, 4140, 5438, 5845, 5268, 4950, 5769, 7168, 8604, 10501, 12771, 14091, 13975, 13948, 15175, 16449, 16428, 16489, 19010, 23462, 26756, 27603, 28129, 30370, 33231, 34528, 34763, 36634, 40918, 45000, 46511, 46829, 49113, 53610, 57268, 58334, 59096, 62616, 68427, 73403, 76072, 78027, 81198, 85598, 90138, 94293, 98284, 102452, 106967, 111675, 116050, 119772, 123388, 127939, 133839, 140462, 146823, 152523, 158147, 164714, 172294, 179479, 185110, 190298, 197234, 205921, 214101, 220850, 227791, 235577, 241953, 245537, 249051, 255662, 263978, 270303, 274745, 281005, 290188, 298903, 304550, 309092, 315923, 325438, 335494, 344487, 352426, 360103, 368431, 377990, 388605, 399849, 411812, 424597, 437602, 450418, 463624, 477234, 489572, 499737, 509941]
14945E09941J2662J3493J0547P171O689P141N285K161L29j129m136o994p427p540
14931E48193j0334j3733j3967j2681j4092j6859j6017j2117j0771j2954j3664
14920D01004j1250j0175j2384j3437j0568p663q215r488q230o645p791r639q907
14907B76612p037p242q652q374o825o313o440n450m297m980o351n865m228m172
14893A90386n534n625m045l268m316n230m366k622j819k610m171m855l560j324
14879A37041m97j502k225j623j459k744l288j427M31o76l289l792k043q88j092
14864A10927q89j11o97k669l257j230R11M38j844k893j356R68J343o89k675k273
14848I4004l28N16j31k74M68jk083l080j716m51r09q98R00J445j336l606j324
$$ y = [509941, 522603, 536096, 546643, 553814, 560503, 567644, 572929, 575090, 575419, 574290, 570154, 563160, 555733, 548193, 537859, 524126, 510159, 497478, 483386, 466527, 450510, 438393, 427622, 414668, 401004, 389754, 379579, 367195, 353758, 343190, 335527, 327312, 317824, 309594, 302949, 295158, 285519, 276612, 269575, 262333, 253681, 245307, 238482, 232169, 225729, 220279, 215982, 211002, 204651, 198786, 194558, 190386, 184852, 179227, 175182, 171914, 167598, 162368, 158002, 155380, 153561, 150951, 146780, 141925, 138365, 137041, 136544, 135042, 132817, 131194, 129735, 126991, 123703, 122276, 122707, 122031, 118742, 114950, 112907, 112019, 110927, 110038, 109927, 109230, 106561, 103304, 102074, 102985, 103423, 101579, 98686, 97330, 98298, 99641, 98952, 96277, 94004, 93676, 94192, 94061, 93787, 94255, 94254, 92171, 89091, 87375, 86924, 86015, 85117, 86017, 87462, 86126, 82520, 81196]
14831H1196K379J729k110k884M83K537M92k028j813n09k77l13M2o13k228k156
14815G3927K19J693M31r41PJ423O43j309j764o18K56R2n60j215j402p67q0m34
14797F9601j006j78J076K81j711j248J734K673k09k531q95J408J07k811k690L3
14781F3634J089m33j518q26K1L43J079J595J24k350k590j92J478M85r35l65J008
14764F1647N94j505k783j777L53J476P21r22j822j336k16M60L03m22j162j269
14748E2340o15Rp1k29L42Q17l1j171m99J238R09j902l679k277j02O0q66q04k30
14729D3239n09j009p86q09j758j996n60M23o07j469k39P42q66k332l29K282N00
14712C3917l782l898Q52L832J416k164k466j034r72j517p15N55P22N14Q69O74
$$ y = [81196, 83575, 85304, 83194, 80310, 80793, 83330, 83822, 81794, 79981, 79472, 79195, 78882, 78924, 78311, 76083, 73927, 74146, 75839, 76270, 75329, 75336, 76759, 77402, 76093, 74329, 73711, 73967, 74059, 73499, 72284, 70882, 70115, 70035, 69601, 68595, 68417, 69493, 69774, 68063, 66815, 68549, 71222, 71013, 68482, 67587, 68995, 69102, 66291, 63601, 63634, 64723, 64290, 62772, 61946, 61967, 62310, 63389, 64984, 65108, 62758, 60168, 59976, 61454, 61939, 61004, 60639, 61647, 62241, 60736, 57953, 56176, 56529, 58005, 58726, 57804, 55982, 54646, 54430, 54890, 55193, 54771, 53609, 52340, 51725, 51734, 51663, 51434, 51776, 52593, 52562, 51391, 50892, 52130, 53039, 51137, 47458, 45181, 45079, 45139, 44273, 43469, 43239, 42730, 41721, 40935, 40126, 38368, 36372, 35812, 36235, 35628, 34159, 33920, 34662, 33796, 31464, 31135, 33417, 33917, 30135, 26237, 27089, 30921, 32337, 30173, 27707, 26673, 25701, 24184, 23469, 24024, 24746, 25260, 26129, 26803]
14696B6803p42j546m83O51J26o81mJ036O26m20l51L29R9p40r99r17j167r68L54
14677B1006J332M04j202j148L56J101L56n74q22p91p48m36o7j33m08l77l30q21
14659A6698j388j024L38J627J722L25j704k551j169J035J539J37p98LR00L41o89
14642A5342p07j64O6N63J638J648m88k630k035M66J687O85n55n45K26R75J398
14625A7570Q15j158l021k703n91P69K77n16j85N53M65j32j24N51Q57K01o47m47
14607A2534P76J322kj741j387P25J312j056l386k386P88K359J183n67j152q67
14591H455k46P06J303N96p19q00N29J422P58m83r89p25k68R4J66j36l23J18P41
14572A0199O45j36p64q41n45K6N54K31r95j663o96Q26J300J032J075Q38p74k565
$$ y = [26803, 26061, 24515, 24032, 24683, 24809, 24128, 24124, 25160, 25786, 25366, 25015, 25344, 25443, 24703, 23704, 22787, 21620, 20652, 21006, 22338, 22742, 21540, 20392, 20748, 21849, 22205, 21631, 20809, 20018, 19270, 18834, 18767, 18634, 18226, 17849, 17519, 16698, 15310, 14286, 14624, 16251, 17973, 18298, 16594, 14043, 12874, 13909, 15448, 15585, 14787, 14790, 15690, 16031, 15342, 14635, 14471, 14537, 15100, 16738, 18386, 17898, 15268, 13233, 13699, 15386, 16071, 15516, 14971, 15197, 16172, 17570, 18385, 17227, 14206, 11503, 10912, 11681, 11958, 11442, 11257, 11810, 12275, 12143, 12019, 12570, 13427, 13628, 12981, 12534, 13310, 14632, 14630, 12889, 11502, 12227, 13539, 12483, 9097, 6711, 7499, 9858, 11041, 10474, 9322, 8455, 8209, 8915, 10218, 10814, 10095, 9295, 9824, 11246, 12004, 11521, 10532, 9807, 9539, 9633, 9799, 9663, 9340, 9458, 10199, 10844, 10708, 9944, 9103, 8558, 8584, 9138, 9369, 8374, 6711, 6015, 6841, 8141, 9173, 10248, 11086, 10312, 7747]
14554G747k205J48J949J955J303Q71J74q70j355r87l11N51J405Q97j496l157j346
14537E273J940K137q18k149J48K158P02j558q22J728K422R99L2J44k76j476j853
14520H731q52K98O61M31m4m57k42N33P37j15p83k65M75K96p7M43J090O22l11l54
14500A0817Q7k30q87n39N32Q41J76l34j65L82J193J867J163j060k458j092J369
14483A1662K031J148J007J373%k460k393Q80L198J451j998l116j686k11M24J175
14467A2485J928J458j05j123p97Q2O34N57l90j926k547j027J337J953O50oJ138
14450A4301J729l33l056k901m5J912J268P0J58N10qk76M86N19j258k227O2L004
14432A3915K287j089k187j42P41j271k410k89J800P92r16k40J010L3j345l64P33
$$ y = [7747, 5542, 5690, 7639, 9594, 10897, 11768, 11942, 11072, 9717, 8730, 8419, 8970, 10375, 11272, 9776, 6619, 5273, 7213, 9350, 8532, 6383, 6531, 8689, 9391, 7833, 7011, 8739, 11161, 12160, 12192, 12336, 12060, 10584, 8731, 7879, 8177, 8838, 9269, 9225, 8768, 8526, 9059, 9796, 9681, 8898, 8633, 9108, 9404, 9327, 9770, 10860, 11482, 11171, 10817, 10904, 10674, 9787, 9248, 9780, 10621, 10797, 10463, 10298, 10680, 11873, 13740, 14903, 13843, 11385, 10293, 11662, 13693, 14841, 15848, 17221, 17221, 14761, 12368, 13248, 16446, 17897, 15899, 12783, 11097, 10886, 11310, 12485, 14413, 15871, 15766, 14643, 13846, 13928, 14562, 15119, 14729, 12803, 10256, 9229, 10566, 12519, 13169, 13163, 14301, 16030, 15697, 12641, 9740, 9695, 11607, 12875, 12945, 13103, 13613, 13605, 13329, 13815, 14334, 13076, 10849, 10911, 13915, 16202, 15113, 12926, 12784, 13525, 12254, 9844, 9555, 11355, 12147, 11231, 10991, 12001, 12034, 10689, 10325, 11058]
14415A1058j429m159k338K338L212n13k462K57K685Q98j699r51J195J130R9R17
14399A0238J928ml008k519J189L214J433j114j561o82p8M34J235J513P82j40o47
14382A2213j007j075j57J242J492L03p34p07n78r29o49Q84K137J646L82K4J17
14365A4604q19k089j330J604L720K657k94k180j945p45K00N73L69j30j30O98J265
14348A6028M01j143j574o81R7K88R22K035J896o2j657r57Q08J201Q7q30q95p62
14330A5202n48Q6N44Q5m65J67J149N45j264j641L59K317J773n27j853q53J219
14313A6295K135J005q51j424m83K50j47l64P42J895J390j5m36Q8J19n28j015j312
14295A7344j437k77K124K801r4l143j983J562J892j376k806KK984K703J075N93
$$ y = [11058, 9629, 5470, 3132, 5470, 8682, 8169, 5707, 5964, 8649, 9547, 7848, 6897, 8092, 9222, 9321, 10238, 12166, 12162, 9154, 6635, 7824, 11038, 12471, 11357, 9796, 9114, 9036, 9470, 10705, 12218, 13000, 12860, 12213, 11206, 10131, 9974, 11216, 12708, 13011, 12277, 11570, 10992, 10063, 9414, 10298, 12435, 14081, 14463, 14487, 14604, 13785, 11696, 10366, 11970, 15690, 18347, 18053, 15873, 13928, 13183, 13383, 13956, 14325, 14195, 14065, 14763, 16028, 16429, 15286, 13712, 13031, 13128, 13416, 14338, 16373, 18269, 18207, 16550, 15593, 16401, 17602, 17689, 16859, 15964, 15202, 14654, 14740, 15284, 15369, 14904, 15071, 16220, 16765, 15501, 13860, 14219, 16536, 18309, 17782, 15929, 15076, 16295, 18430, 19435, 18584, 17160, 16677, 16927, 16780, 16416, 17158, 19053, 20443, 20428, 19992, 20080, 20199, 19671, 18656, 17344, 15907, 15630, 17754, 20555, 20461, 17318, 15335, 16897, 18789, 17413, 14607, 14609, 17593, 20296, 21371, 21964]
14279B1964K28r40r13J020J746m00k090n11J612P78j273r70P21M00j611k091l89
14262A7281J243J565J019k19j671j649J78J257%j347o19M93k6n16Q09J836N20
14245B0154o26R35K334K10k491j258J644J003j761j115K217K391q38j653J093
14230B2239J843j272l013n77J684N45q13L78J355k39j647m07J161Q83O21J502
14214B4243R11j846k706J57K306N86j297K43J996J77k225q47K078J927j70l37
14198B5196O10l44j687l09J717N18j912q52K378K445o46j832Q5J308M85M4J73
14181B7377j276k785n03L793L765j141m101j712J176L66j255k09J173k32k172
14166B2264j139J407J846L04o64o89p90l93J037J570k64k121j102J351J670j00
$$ y = [21964, 22192, 21252, 20339, 21359, 23105, 22705, 20615, 20104, 21716, 22494, 21221, 20251, 20972, 21372, 19761, 17670, 17281, 18524, 20089, 21108, 20889, 19218, 17569, 17747, 19004, 19004, 17657, 17038, 17531, 17505, 16989, 17798, 19634, 20154, 19528, 20463, 22797, 23007, 20516, 19258, 20902, 21905, 20144, 19029, 21246, 23637, 22799, 21146, 22239, 24082, 22810, 19797, 19220, 20904, 21449, 20636, 21014, 22369, 22130, 20483, 20076, 21237, 22120, 22741, 24243, 25154, 23308, 20602, 20759, 23065, 23651, 22354, 22597, 24593, 24770, 22545, 21698, 23776, 25703, 25533, 25196, 25806, 25462, 23775, 23466, 25183, 25701, 23789, 22937, 25315, 27760, 27114, 25282, 25367, 26675, 27160, 27204, 27377, 26101, 23316, 22813, 26606, 30371, 29230, 25129, 23417, 24593, 24959, 23704, 23495, 24668, 24436, 22264, 21125, 22532, 24378, 24682, 24018, 23329, 22539, 22146, 23183, 24753, 24489, 22368, 21266, 22617, 24287, 24187]
14150B4187o78R36K103Q32j501k413j249O89J611O59j128j573J32K136K229P15
14134B7687k32L08R23N2j801k640j551R0N10L6L76J408R52j308k332k66J988R69
14116B5169j637j566J057K075L08r30O9R01J20j1J724K437Lk721k113O35J744
14099B7264N10p68r09o50l42K45O11L36L52J383K147J145p16j337l85O77Q67L84
14081C0814j39M7J211K060Q12j692k160M89L056K587N41k2Q24Q82j00n86l05o4
14063C8255N39K149L236J782r98j786m7J298N07o11l5J281J266J80K54K226L873
14046E3369K742l08j677L66L035K676r2j418l2J340Q40K11J127K164J692Q43J073
14029F7951J332M50k3J560L537L430K064J911K813K806J979K020K828K864K240
$$ y = [24187, 23509, 24445, 26548, 27380, 25879, 23466, 22217, 22906, 24517, 25176, 24048, 22475, 22607, 24743, 26972, 27687, 27455, 27763, 28686, 28738, 26937, 24297, 22746, 22836, 23346, 23382, 23758, 25166, 26118, 24810, 22478, 22212, 24200, 25169, 23532, 21966, 23023, 25098, 25406, 24476, 24545, 25446, 25566, 25555, 27279, 29716, 29719, 26998, 24885, 25520, 27264, 27774, 27006, 26097, 25447, 25105, 25350, 25961, 26297, 26649, 28032, 30179, 31324, 30608, 29271, 28886, 29563, 30430, 30814, 30675, 30722, 31933, 33993, 34805, 33113, 30953, 31442, 34498, 37085, 37626, 37604, 38428, 39310, 39210, 38624, 38319, 38255, 38794, 40943, 44179, 45961, 44963, 43177, 43130, 44428, 44935, 44324, 44289, 45570, 46836, 47016, 47270, 49496, 53369, 56111, 55803, 54126, 54492, 57527, 60203, 60111, 58693, 58661, 60001, 60841, 61052, 62179, 64343, 66035, 66878, 67951, 69283, 69733, 69710, 71270, 74807, 78237, 80301, 82212, 85025, 87831, 89810, 91830, 94658, 97522, 99762]
14014I9762K316K853K644K272L126M427M326L403L730M995N035L921L922N391
14000A52123O187N572N345O386P226O840O306O777Q026R374J0237R714P738O199
13986B54050O677P636O486L710J930J589R36k01l90j73j663m236m641k232k37
13971B69241o87j647r44O00J235R49O81R92K298M397N645M925M087N460P636P452
13955C12320N695O180R180J0846R937R763J1930J3476J2529J1765J3381J5132
13943D42134J4483J2603J1152R058N614K925J995J37m248q078q526p886r355j1430
13929D50578j1069r546j0121j2143j2338j0425q858q193o894m902l581k911k059
13916C47538j687k534l113j965n96q32j114P52L013K445Qn10J398K773K550K634
$$ y = [99762, 102078, 104931, 107575, 109847, 112973, 117400, 121726, 125129, 128859, 133854, 138889, 142810, 146732, 152123, 158310, 163882, 169227, 175613, 182839, 189679, 195985, 202762, 210788, 220162, 230399, 240113, 247851, 254050, 260727, 268363, 274849, 278559, 280489, 282078, 283014, 282813, 282423, 282250, 280587, 276351, 271710, 269478, 269241, 268554, 266907, 265963, 266563, 267798, 268747, 269428, 270420, 272718, 277115, 282760, 287685, 291772, 297232, 304868, 312320, 318015, 324195, 333375, 344221, 354158, 363921, 375851, 389327, 401856, 413621, 427002, 442134, 456617, 469220, 480372, 489430, 495044, 497969, 499964, 500101, 495853, 487775, 479249, 471363, 462008, 450578, 439509, 429963, 419842, 407699, 395361, 384936, 376078, 367885, 360991, 356089, 352508, 349597, 347538, 345851, 343317, 340204, 338239, 337643, 336811, 335697, 336449, 339462, 341907, 341915, 341405, 342803, 345576, 348126, 350760]
13900C50760L669L990L081K308J865N66j270k128k604m584p112p145m988m686
13886C31722p676j0109q700n771n551p789q436n792k828k800m791n396l903l271
13872B48909n112o471m281r27j037l837m229j693j535n208o563j915K792J046
13858B09939l721m099q28m29l477m318j553m6j818k991j336J53p09j843j549j172
13842A80203j386q28J20o98k447j779Q99J439o17r46J480K077r99k923l27K912
13826A76180K345r4n73N3q03k006j301j20r88k753k774j499r46r09k69M3j200
13809A62386k774l017k436j955j131l53j539m142m229n44K418R57k099k347o49
13794A38546l28r59j65J085L74j086m58J275J019p39r87J68n6j658j767O9J050
$$ y = [350760, 354429, 358419, 361500, 363808, 365673, 366239, 364969, 362841, 360237, 355653, 348541, 341396, 336408, 331722, 324046, 313937, 305237, 299466, 293915, 286126, 277690, 271898, 269070, 266270, 261479, 256083, 252180, 248909, 243797, 237326, 233045, 232118, 231081, 227244, 223015, 221322, 219787, 214579, 208016, 206101, 208893, 209939, 206218, 202119, 201291, 200862, 197385, 193067, 191514, 191468, 189650, 186659, 185323, 185476, 184767, 182924, 181375, 180203, 178817, 177989, 178109, 177411, 174964, 173185, 174084, 175523, 174906, 173960, 175440, 177517, 176518, 173595, 173268, 176180, 178525, 178431, 177858, 177911, 177108, 175102, 173801, 173681, 172693, 169940, 167166, 165667, 164721, 163812, 163543, 163586, 162386, 159612, 156595, 154159, 152204, 151073, 150720, 149181, 145039, 140810, 140266, 142684, 143641, 141542, 139195, 138546, 138218, 137259, 137094, 138179, 138553, 137467, 137009, 138284, 139303, 138564, 137577, 137745, 137689, 136031, 134264, 134333, 135383]
13777A35383j45j579j509m33N22P49j29j504j546J53J099m80k394j771K93P98
13761A27507k29n89k52q51j875j312M06P66o85j715q12J162K513K025k80k231
13745A23548j172K053L387J521n2P89J075j327k872k64L164K673r9p36J67n05
13729A31350j379N40K736P76k967k532J249K075q17j882M28J464n09j539J7Q46
13713A29856p8M46K531J909j563k137K037N084L032j51j74R26K41m52O55J137
13697A43299o05j481N68K259Q01j173q69k00j106j334M57R17j803l482q82K028
13681A37394O93k179j771M36J90j543j114M10n65k892k373R09L034K610J406J07
13665A34752j458j629N42J998j16l121k775l48j39j961k159n31j67j272j228l13
$$ y = [135383, 135238, 133659, 132150, 131717, 132239, 132988, 132859, 131355, 129809, 129962, 131061, 130581, 128187, 126416, 126709, 127507, 127278, 126689, 126437, 125586, 123711, 122399, 122805, 123571, 122886, 121171, 120359, 121521, 124034, 126059, 125779, 123548, 122376, 124429, 127816, 129337, 129285, 130074, 131149, 129822, 126950, 126686, 129850, 132523, 132424, 131688, 131855, 131350, 129971, 130511, 133247, 134023, 131056, 128524, 129773, 131848, 131031, 129149, 129577, 131041, 130532, 128993, 129010, 129856, 129778, 130224, 132755, 134664, 133101, 130964, 133001, 138085, 141117, 140966, 140792, 141718, 141959, 141507, 142162, 143299, 142694, 141213, 141781, 144040, 144841, 143668, 142799, 142599, 141493, 140159, 140616, 141533, 139730, 136248, 135366, 137394, 138087, 135908, 134137, 134573, 134763, 133220, 132106, 132516, 131951, 129059, 126686, 127595, 130629, 133239, 134645, 134752, 133294, 131665, 132207, 134205, 134089, 130968, 128193, 127845, 127706, 125745, 123586, 123055, 122888, 121616, 120388, 120075]
13649A20075j504m448n127k255P66J086k89j198j049l62K6n60j283k22K094K243
13633A07993o97k661p20J982J582j17L97J714N71j505r67J034J012j15P31K088
13617A12322N51j995j151J599J079k117k497M30J514n31j233R59K155O62l56L67
13601A11758J20j352o95J846J569k035l316r5K260J18k324p99J851J338p64p70
13585A08710N73M60o94r25o38r36r48q8j04j870l108k064m53k93q31p61m14M2
13567I5658J211J951J67k681k479O88J861p09k538o47J600Q28p89l66M03p27j798
13550I1633o13P64qq09R74L184K283p29k157j130M53J312J112m09k123j845J76
13533I2068J152M28K63Q40l63k791k426O90J346j589k269J872M852K272j038J44
$$ y = [120075, 118571, 114123, 108996, 106741, 107507, 108593, 108304, 107106, 106057, 105695, 105721, 105161, 103878, 103656, 105750, 107993, 107296, 104635, 103915, 105897, 107479, 107362, 107759, 109473, 110044, 108539, 107572, 108606, 109618, 109503, 110234, 112322, 112873, 110878, 109727, 111326, 112405, 110288, 107791, 108221, 109735, 109204, 107971, 108930, 111085, 111747, 111391, 111758, 111878, 110526, 109831, 111677, 113246, 111211, 107895, 107800, 110060, 110178, 107854, 107055, 108906, 110244, 109480, 108710, 109283, 109743, 109049, 108124, 107486, 106550, 105602, 105514, 105410, 103540, 100432, 98368, 97915, 97622, 96791, 96030, 95616, 95658, 96869, 98820, 98987, 96306, 93827, 94515, 96376, 95667, 93129, 92482, 94082, 94910, 94121, 93755, 94158, 93431, 91633, 91020, 91784, 91776, 90967, 91941, 95125, 97408, 96679, 94522, 93392, 93845, 95157, 96269, 95860, 93737, 91892, 92068, 93220, 93648, 93911, 94751, 94388, 91597, 89171, 89861, 91207, 89618, 87349, 89221, 94073, 96345, 95307, 95451]
13517I5451K377P38j755k40K427J042k086j662P06K81j156J033M370K889j801
13502A02614k889n2J005o35m46J961K195K1j40K012K151%j27J942J757o35l5L905
13484A14604N057J415j244O49K939J880K74J328K843K001N12Q36J747J406Q82
13469A37129J417J728P16k51J14J102J899K512K285P12m66M69J526K5k007q32
13453A48078J828J173j865j707J777K401j642m286j595K172K193K19k3R29Q54
13438A50506K85O25J262J457J969K802K484R94J32L46O11J320L178M010J579j375
13422A72185o20K144J951m95k21K388K055j197j532J949L363O76j154M2K66j658
13406A80142j274K091K826m31j538J862L796J287o2K864M324O76k301M2K935J771
$$ y = [95451, 97828, 98566, 96811, 96571, 98998, 100040, 97954, 96292, 96998, 97279, 96123, 97156, 101526, 104415, 102614, 99725, 99673, 100678, 100043, 99597, 101558, 103753, 103774, 103634, 105646, 107797, 107797, 107670, 109612, 111369, 110734, 110699, 114604, 119661, 121076, 119832, 120481, 123420, 125300, 125574, 126902, 129745, 131746, 132258, 133094, 134841, 136247, 137129, 138546, 140274, 140990, 140739, 140853, 141955, 143854, 146366, 148651, 149363, 148897, 149366, 150892, 150917, 148910, 148078, 149906, 151079, 149214, 147507, 149284, 151685, 150043, 145757, 144162, 146334, 148527, 148746, 148723, 149652, 150506, 150791, 151416, 152678, 154135, 156104, 158906, 161390, 162384, 162516, 162862, 163473, 164793, 167971, 171981, 173560, 172185, 171565, 173709, 175660, 175165, 174944, 177332, 179387, 178190, 176658, 178607, 181970, 182646, 181492, 181534, 181800, 180142, 178868, 180959, 183785, 183354, 181816, 183678, 187474, 188761, 188699, 191563, 195887, 196563, 194262, 194304, 197239, 199010]
13390A99010O35L374N287K255m35K540O418M817R51J025L286K977J686K733L562
13375B40121J608J034M793P085L031j475M10M256K914o4K334O581M758n84q79
13360B75923L249M144J125n6J112O22m78J306K864m12m016p59N573N618L34j521
13344B94628R66J103j555j288J275J82l278k359J726J560k122j525L292M550J671
13329B98826J898N702N978K566L094P889Q675M083K065M696N080J735J469N152
13315C58908N333J191Q97N750P152L183K551P481Q721L212N68N350Q724N350L096
13300D27467P452J1060P974M316N619O856M265L659P664Q317K236n88O004J2008
13286E14309Q006J372K850Q693R679P548Q880J1536J0284Q117R836J1844R471
$$ y = [199010, 199645, 203019, 208306, 210561, 210126, 212666, 219084, 223901, 224852, 225877, 229163, 232140, 233826, 236559, 240121, 241729, 242763, 247556, 254641, 257672, 256197, 256607, 260863, 263777, 263713, 266047, 272628, 277386, 276802, 275923, 279172, 283316, 284441, 284385, 285497, 286119, 285641, 286947, 289811, 289399, 285383, 284624, 290197, 295815, 296149, 294628, 295594, 296697, 295142, 293854, 295129, 295311, 292033, 289674, 291400, 292960, 290838, 289313, 292605, 297155, 298826, 300724, 306426, 312404, 314970, 318064, 325953, 334628, 338711, 340776, 345472, 350552, 352287, 353756, 358908, 364241, 365432, 366329, 372079, 379231, 382414, 384965, 392446, 401167, 404379, 404947, 410297, 419021, 424371, 427467, 434919, 445979, 453953, 458269, 463888, 470744, 475009, 478668, 486332, 494649, 496885, 496297, 502301, 514309, 522315, 523687, 526537, 535230, 544909, 552457, 561337, 572873, 583157, 591274, 601110, 612954, 622425]
13273F22425O867R013J1717R746O878P974R480P458O162R035J0701P411N262Q296
13259G38425R769N555L884J0173J5045J0544N285R021J4988J3348R772J3406J8136
13246H77351J4315Q469J1789J8575J6381R318J0304J7083J7149J1246J0846J6154
13234A038980J7031J3010J2878J6773J7146J5089J7817K2725K1685J7951K0783
13223A231868K6831K5422J9001J9181K5436K7016K3336K3228K6378K4972K1268
13212A493937K3936K9536K7616K1355K2526K8944K8582K3146K4818L1843L1201
13201A787440K4227K5030L3667L5891L0219L0050L7359L9629L5162L6033M3196
13190B157903M4211L8673L9937M8325M9262M1871M1978N2029N6091N0256M9379
$$ y = [622425, 629292, 638305, 650022, 659768, 666646, 674620, 684100, 691558, 697720, 706755, 717456, 724867, 730129, 738425, 748194, 753749, 757633, 767806, 782851, 793395, 798680, 807701, 822689, 836037, 845809, 859215, 877351, 891666, 900135, 911924, 930499, 946880, 956198, 966502, 983585, 1000734, 1011980, 1022826, 1038980, 1056011, 1069021, 1081899, 1098672, 1115818, 1130907, 1148724, 1171449, 1193134, 1211085, 1231868, 1258699, 1284121, 1303122, 1322303, 1347739, 1374755, 1398091, 1421319, 1447697, 1472669, 1493937, 1517873, 1547409, 1575025, 1596380, 1618906, 1647850, 1676432, 1699578, 1724396, 1756239, 1787440, 1811667, 1836697, 1870364, 1906255, 1936474, 1966524, 2003883, 2043512, 2078674, 2114707, 2157903, 2202114, 2240787, 2280724, 2329049, 2378311, 2420182, 2462160, 2514189, 2570280, 2620536, 2669915]
13179B669915N7293N9592N3462N4719O6540P1396O4053O2133P2871Q0033P6038
13168C388045P6267Q8013R6016R3262R5382J09171J17803J13629J14495J30075
13158D422158J43158J42761J44512J58952J71032J71189J74995J91048K01833
13149E921638J98401K00891K21233K39481K42011K48410K73533K98094L06263
13140H149955L17222L48040L80018L95073M10948M45562M80845M98296N15972
13131A1941931N52573N89325O06918O25173O65323P08666P35303P66670Q24153
13122A8016035Q83679R19939R56759J021626J090125J131750J171272J244699
13114B6435884J333944J408745J493138J621782J769569J896282K020976K176450
$$ y = [2669915, 2727208, 2786800, 2840262, 2894981, 2961521, 3032917, 3096970, 3159103, 3231974, 3312007, 3388045, 3464312, 3552325, 3648341, 3741603, 3836985, 3946156, 4063959, 4177588, 4292083, 4422158, 4565316, 4708077, 4852589, 5011541, 5182573, 5353762, 5528757, 5719805, 5921638, 6120039, 6320930, 6542163, 6781644, 7023655, 7272065, 7545598, 7843692, 8149955, 8467177, 8815217, 9195235, 9590308, 10001256, 10446818, 10927663, 11425959, 11941931, 12494504, 13083829, 13690747, 14315920, 14981243, 15689909, 16425212, 17191882, 18016035, 18899714, 19819653, 20776412, 21798038, 22888163, 24019913, 25191185, 26435884, 27769828, 29178573, 30671711, 32293493, 34063062, 35959344, 37980320, 40156770]
13106D0156770K333658K456147K587126K790039L042662L287884L547639L876392
13098F4078317M236677M536520M761883M960797N137864N291874N515198N915197
13090A04434327O479388P161000Q024357R118661J0292198J1377359J2483767
13083A69371057J3800097J5174544J6305686J7321059J8556314J9522899J8728670
13076B88780326J5125105R453888L626337j044779m512271p190309r298660j1109942
13068B83829695j3094580j5368753j7372431j8457895j8544964j7930421j6757704
13061A66302947j5049316j3067757j1235958r730753q439241p282990o325252
13054I5171680n571762m915043m312673l831975l486069l187135k891759k649607
$$ y = [40156770, 42490428, 44946575, 47533701, 50323740, 53366402, 56654286, 60201925, 64078317, 68314994, 72851514, 77613397, 82574194, 87712058, 93003932, 98519130, 104434327, 110913715, 118074715, 126099072, 135217733, 145509931, 156887290, 169371057, 183171154, 198345698, 214651384, 231972443, 250528757, 270051656, 288780326, 303905431, 313359319, 316985656, 315940877, 311428606, 304238297, 294939637, 283829695, 270735115, 255366362, 237993931, 219536036, 200991072, 183060651, 166302947, 151253631, 138185874, 126949916, 117219163, 108779922, 101496932, 95171680, 89599918, 84684875, 80372202, 76540227, 73054158, 69867023, 66975264, 64325657]
13046F4325657k479300k324724k162341k034682j949842j854976j735999j643633
13038D8140160j594199j537992j452060j375700j327067j268646j184249j111833
13030C7288414j070025j024686r57726r00498q69430q33354p74918p23778o98731
13021B9435268o73587o30175n91664n73874n53871n16069m82149m66747m48303
13012B4498829m11719l77674l62153l46635l14776k81436k60514k39436k08716
13003B1695770j82842j70576j56844j32009j07043q7498p0537p8999j51561k79458
12993B0278403l98366m66056n03633n36938n47866n18087m74770m50748m35390
12984A5946549m05604l73113l59551l52930l30476l01504k88181k84147k69937
$$ y = [64325657, 61846357, 59521633, 57359292, 55324610, 53374768, 51519792, 49783793, 48140160, 46545961, 45007969, 43555909, 42180209, 40853142, 39584496, 38400247, 37288414, 36218389, 35193703, 34235977, 33335479, 32466049, 31632695, 30857777, 30133999, 29435268, 28761681, 28131506, 27539842, 26965968, 26412097, 25896028, 25413879, 24947132, 24498829, 24087110, 23709436, 23347283, 23000648, 22685872, 22404436, 22143922, 21904486, 21695770, 21512928, 21342352, 21185508, 21053499, 20946456, 20858958, 20788421, 20709422, 20557861, 20278403, 19880037, 19413981, 18910348, 18373410, 17825544, 17307457, 16832687, 16381939, 15946549, 15540945, 15167832, 14808281, 14455351, 14124875, 13823371, 13535190, 13251043, 12981106]
12975A2981106k50742k42541k37954k21253k01418j95860j96250j84270j67065
12966A1083753j63245j66692j58154j41545j35173j36643j29370j15849j12128
12957I824954j15779j10602r7994r3519r6610r2555q1280p6386p8344p5304o7936
12946H838645o7778p3156p1658o4454o3967o9547o9320o4175o6201p4840p7739
12935H075810p4020p4274p8878p8508p4661p7475q4647q4491p8433p8300q3154
12924G208969q1539p5140p6483q3903q3055p3665p0367p5620p6331o9923o8955
12913F373988p5854p7230o8939o3549o6491o7180o0924n7974o2853o5355o0640
12902E646999n8665o4760o9303o5769o1630o2623o3018n9885o0532o7291p1050
$$ y = [12981106, 12730364, 12487823, 12249869, 12028616, 11827198, 11631338, 11435088, 11250818, 11083753, 10920508, 10753816, 10595662, 10454117, 10318944, 10182301, 10052931, 9937082, 9824954, 9709175, 9598573, 9500579, 9407060, 9310450, 9217895, 9136615, 9060229, 8981885, 8906581, 8838645, 8770867, 8697711, 8626053, 8561599, 8497632, 8428085, 8358765, 8294590, 8228389, 8153549, 8075810, 8001790, 7927516, 7848638, 7770130, 7695469, 7617994, 7533347, 7448856, 7370423, 7292123, 7208969, 7127430, 7052290, 6975807, 6891904, 6808849, 6735184, 6664817, 6589197, 6512866, 6442943, 6373988, 6298134, 6220904, 6151965, 6088416, 6021925, 5954745, 5893821, 5835847, 5772994, 5707639, 5646999, 5588334, 5523574, 5454271, 5388502, 5326872, 5264249, 5201231, 5141346, 5080814, 5013523, 4942473]
12891D942473o8121o7511p3313p6107p0596o5801o8390p1229o8067o4725o6082
12880D182531o6270o1463n8479o1140o1848n6208n2203n5025n6683n1042m5647
12869C556523m7598n0642m7533m2987m3069m3466l9602l7046m0482m3390l9883
12858C080825l6154l8706m1899l8762l4085l4963l7894l6833l4857l6471l7358
12847B672843l3075k9043l0865l3675l1793k9706l2331l4259l0112k5940k8165
12836B333879l1079k7927k4494k8077l2623k9477k3893k5503l0481k9275k4717
12825B026333k5919l0272k8706k3754k5226l1426l1758k5815k3461k7000k8882
12814A724114k6784k6222k8048k7131k3754k3416k5252k3149j8127j7129j9811
$$ y = [4942473, 4874352, 4806841, 4733528, 4657421, 4586825, 4521024, 4452634, 4381405, 4313338, 4248613, 4182531, 4116261, 4054798, 3996319, 3935179, 3873331, 3817123, 3764920, 3709895, 3653212, 3602170, 3556523, 3508925, 3458283, 3410750, 3367763, 3324694, 3281228, 3241626, 3204580, 3164098, 3120708, 3080825, 3044671, 3005965, 2964066, 2925304, 2891219, 2856256, 2818362, 2781529, 2746672, 2710201, 2672843, 2639768, 2610725, 2579860, 2546185, 2514392, 2484686, 2452355, 2418096, 2387984, 2362044, 2333879, 2302800, 2274873, 2250379, 2222302, 2189679, 2160202, 2136309, 2110806, 2080325, 2051050, 2026333, 2000414, 1970142, 1941436, 1917682, 1892456, 1861030, 1829272, 1803457, 1779996, 1752996, 1724114, 1697330, 1671108, 1643060, 1615929, 1592175, 1568759, 1543507, 1520358, 1502231, 1485102, 1465291]
12803A465291j9127j4911j4206j7696j8301j4338j2064j3937j5609j5687j7537
12792A291878k0328j8986j4207j2329j4555j5939j5164j5443j6237j4219j1640
12781A122831j3188j5890j3510r056j0430j5196j3803p137n730j0963j2798q263
12769I86867o152r769j0855n947l487q042j1704q671n186p025r278p041n007p679
12755H81024j0354q519o622q927j0808p814m808p142j0658r422o278o794r174
12742G73704q854p279p915q803p003n408p542j0272r007n850n591p590q144p260
12728F67186p053o987n982n714p089p360n017l226m465o279o138n527n771n208
12714E85370l730m153o143n625k972l822q328r016l769q45n021r085o607l060
$$ y = [1465291, 1446164, 1431253, 1417047, 1399351, 1381050, 1366712, 1354648, 1340711, 1325102, 1309415, 1291878, 1271550, 1252564, 1238357, 1226028, 1211473, 1195534, 1180370, 1164927, 1148690, 1134471, 1122831, 1109643, 1093753, 1080243, 1071187, 1060757, 1045561, 1031758, 1024621, 1018891, 1007928, 995130, 986867, 980715, 970946, 960091, 954144, 950657, 942615, 930911, 922240, 917054, 910029, 900751, 893710, 888703, 881024, 870670, 862151, 855529, 846602, 835794, 827980, 823172, 816030, 805372, 795950, 789672, 782878, 773704, 764850, 757571, 749656, 740853, 733850, 728442, 720900, 710628, 701621, 695771, 690180, 682590, 674446, 667186, 660133, 653146, 647164, 641450, 634361, 627001, 621984, 618758, 614293, 608014, 601876, 596349, 590578, 585370, 581640, 577487, 571344, 565719, 562747, 558925, 550597, 541581, 537812, 536967, 531946, 522861, 516254, 513194]
12700E13194n223q815p063l375m543q087p512m440m580o516n176k229k747n249
12686D37639m886k879l468n121m025k341l884n711l412l23j864n118m243j617
12672C88747k901n412l022J409O15l545l718j047k421o173m518J087J323m226
12658C56198o051j552J010k141m518k298n79k484l544j267Lj963l178j951k206
12643C23479m850n252k465j573l853m239j533j070m082m774j582n60l542m076
12629B80028J07J872k275n208j932J473p18l747k099J78k055m838k851K31j225
12614B56941m203k995J18l75l064l275k172l361m785k702L03l01k443j579N24
12599B26631n65l158k728o59j230k969j619J033J60k694k097R87O13l303m550
$$ y = [513194, 507971, 499156, 492093, 488718, 484175, 476088, 468576, 464136, 459556, 453040, 447864, 445635, 442888, 437639, 432753, 429874, 426406, 421285, 417260, 414919, 411035, 405324, 401912, 401589, 399725, 394607, 390364, 388747, 385846, 380434, 377412, 378821, 379436, 375891, 372173, 371126, 368705, 362532, 358014, 359101, 360424, 356198, 350147, 348595, 349605, 347464, 342946, 340648, 340069, 337585, 334041, 332774, 332777, 330814, 327636, 325685, 323479, 318629, 313377, 310912, 309339, 305486, 301247, 299714, 298644, 294562, 289788, 288206, 287646, 284104, 280028, 280135, 282007, 279732, 274524, 272592, 274065, 273347, 269600, 267501, 267679, 265624, 260786, 257935, 258166, 256941, 252738, 249743, 249861, 249486, 246422, 243147, 240975, 237614, 232829, 230127, 230430, 230129, 227686, 226107, 226631, 226066, 222908, 220180, 219521, 218291, 215322, 213703, 214736, 214896, 212202, 210105, 211092, 211705, 208402, 203852]
12584B03852j274J305j88k924l788l360k718j627r01j977l687l568k065j487j727
12569A73866j215p41j861l079k230q00j176j910p75J28j856l899k141N46j156
12554A51701m998m094J081K677j839n794m068L8J555P36J0m32r10n88J31n97k288
12537A32321k180j39Q18k98j174r30j385k663k453p35l11j407q66J772K624J3
12521A23007k344j364N97J8k338l209j501J171K699J895m41j580k71P30j268l539
12505A12262j557K854L098j838n238k845J044R36j841k714j155N2K1OJ39o07k062
12488A00555k905k544j534p89r11j515j407m49k45j388j927q37n55k536l324K9
12472G7718L536J641l119l444Q17K639j65j913K29J605o94k418l30J784K49j991
$$ y = [203852, 202578, 203883, 203695, 200771, 196983, 193623, 190905, 189278, 188377, 186400, 182713, 179145, 177080, 175593, 173866, 172651, 171910, 170049, 166970, 164740, 163940, 162764, 160854, 160079, 160207, 158351, 154452, 152311, 152857, 151701, 146703, 142609, 143690, 146367, 144528, 138734, 134666, 134704, 136259, 136995, 137005, 136573, 135663, 135075, 135206, 134609, 132321, 130141, 130002, 130820, 130522, 129348, 128418, 127033, 124370, 121917, 121182, 120871, 119464, 118598, 120370, 122994, 123007, 120663, 119299, 119896, 119914, 117576, 114367, 112866, 114037, 116736, 118631, 118190, 116610, 116339, 117069, 115801, 112262, 110705, 113559, 116657, 114819, 109581, 106736, 107780, 108716, 106875, 104161, 103006, 103058, 103079, 103085, 103224, 102617, 100555, 97650, 95106, 93572, 92783, 91872, 90357, 88950, 88501, 88256, 86868, 84941, 84104, 83549, 81013, 77689, 77718, 81254, 82895, 79776, 76332, 77149, 79788, 79623, 77710, 77939, 79544, 78850, 76432, 76102, 77886, 78135, 76144]
12456G6144j265L88p4r96j91L02j274k115k08J050j105l106j280J124l85l187
12440F3822j941K076L281R88o35j47J64l64k39J81n87j489p11L02p15k102r04
12423F0980J460J380o70j316m24n91j628j081M10j91k501k851m90J277O69l46
12407E4087r8M68L01k30p84j371j248N9J164O02q21j600j853j806m32J715J361
12390D9514k256m477j834J934J646r43p91J359Q38j885j827J351K472k06k347
12375D2548j168O17M05l82p3K06o87j761j973j426j59J347J180j063j939Q96L560
12358D0128J247l331l585L26K079q7j395J57Q26r43j527N37J636J59o34N38K17
12341C6348k570l492p91J023p21j949M46K677R77j665j296Q4q07j969l89J585
$$ y = [76144, 74879, 75267, 75193, 74197, 74006, 74308, 73034, 70919, 70711, 71761, 70656, 67550, 66270, 67394, 67009, 63822, 61881, 63957, 67238, 68226, 67591, 67444, 67608, 67244, 67005, 67186, 66599, 65110, 64399, 64701, 63986, 61884, 60980, 62440, 63820, 63150, 61834, 61410, 60819, 59191, 58110, 58520, 58329, 55828, 52977, 52487, 53764, 54433, 54087, 53989, 54457, 54758, 54528, 53744, 52373, 51125, 51184, 52348, 52950, 52129, 50529, 48676, 46870, 46438, 48153, 49514, 47258, 42781, 40947, 42881, 44527, 43584, 42793, 44152, 44990, 43105, 41278, 42629, 45101, 44895, 42548, 41380, 41997, 42402, 42020, 41947, 42153, 41466, 39705, 37732, 36306, 36147, 37494, 38674, 37611, 35672, 36568, 40128, 41375, 38044, 34459, 34785, 36864, 36777, 35382, 35539, 36365, 35422, 33895, 34432, 36068, 36227, 35593, 36131, 36348, 33778, 30286, 29495, 30518, 29797, 27848, 28294, 30971, 31948, 30283, 28987, 29071, 28264, 26295, 25906, 27491]
12325B7491M13j813j092J122O59j761j864P67K390J396j22n99n80l56M64J243
12309B7758R00j97q52p19o5P79Q34o39k073j206R61J217m77r55L83P86j68J34
12291B6401J411M14j936r21K646K156k822m100J096M150l46m738j759K467j85
12276B3934m602j722M333L042l652m705N87K158k246l693R24L268j004m550j616
12261A0456K396J147k317k353p6N38j85j05P3o13o62M84O90m12k16J428J148j374
12243A0047j977M34J458p57j920L22J784m88k487m48K347J533r30j017L45K27
12227H473n77j15K26j035j563M85J975p6k629j389J897K579O21o57q13j604k236
12210C562q38J007M82j234r78N64J91j860k295m35J183J256P26j52j677k369o51
$$ y = [27491, 27904, 26091, 24999, 26121, 26780, 25019, 23155, 23922, 26312, 27708, 27586, 26987, 26407, 26051, 26515, 27758, 28658, 28461, 27609, 26890, 26825, 27604, 28438, 27799, 25726, 24520, 25481, 26698, 26221, 25266, 25649, 26435, 26267, 26401, 27812, 28226, 26290, 25369, 28015, 30171, 27349, 23249, 24345, 28495, 28149, 23411, 21652, 24119, 23934, 19332, 17610, 21943, 24985, 21333, 16628, 17215, 19373, 17127, 13434, 14358, 17626, 16622, 12072, 10456, 12852, 13999, 11682, 9329, 9253, 9791, 9606, 9501, 9574, 8961, 8299, 8783, 9473, 9061, 8845, 10273, 11421, 10047, 8070, 8504, 9962, 9205, 7285, 7607, 9391, 8903, 6416, 5968, 8315, 9848, 8918, 7901, 8246, 8473, 7896, 7781, 8007, 6972, 5409, 5894, 7869, 7793, 5164, 3775, 5672, 8251, 8872, 8215, 7402, 5798, 3562, 2724, 3731, 4213, 2979, 2001, 2565, 2756, 896, -1399, -1834, -651, 605, 1331, 1179, -498, -2867, -3518]
12193c518J657J493m82q75Q68J835N65j041j116j67N40N28j37r34r77l89n88j823
12175d561k087k36J739J698N44J41Q4p45j488r30l9j90o71m60l63q76m25J495
12157g370K229J89j774p81J186P73j131j580p05l00K75K053K852P16j442R0L176
12140a544K904m55k384j529l45M28J954K899R38j975j769P95J339n40j092M33
12124E7J047K95Q06K220J338j151r96J745K209o22k058k31Q37r07j891j69O99
12107C228j297k348J36K354N84k552k932j338m89j23P11N47j221k002o05J0j767
12090i104k602j12K354J223j424k072j446j360m39J992K410j056l743j434K129
12075a4684J245k221k524Q8Q89m94n48N59k74k002q24K058J827j065j312J569
$$ y = [-3518, -1861, -368, -850, -1725, -857, 978, 1543, 502, -614, -781, -241, 287, 150, -784, -1761, -2150, -2738, -4561, -6648, -6884, -5145, -3447, -2903, -2762, -2678, -3423, -4911, -5841, -5880, -6070, -6741, -7201, -7564, -8440, -8865, -7370, -5141, -4952, -6726, -7507, -6321, -5548, -6679, -8259, -8964, -9264, -8989, -6936, -4084, -3368, -4810, -4720, -1544, 1360, 905, -1479, -3008, -3353, -2925, -971, 1928, 2866, 891, -878, -83, 1256, 716, -376, 57, 1104, 1399, 2205, 4425, 5763, 4612, 3616, 5361, 7570, 6948, 4890, 4659, 5496, 4589, 2698, 2529, 3228, 1931, -417, -281, 2073, 2657, 105, -2827, -4165, -4654, -4777, -4066, -3519, -4740, -6742, -7347, -7337, -9104, -11706, -11818, -9464, -8241, -9665, -11737, -13183, -14543, -14982, -12990, -10580, -11636, -15379, -16813, -14684, -13439, -15660, -18184, -18096, -17207, -17701, -18249, -17690, -17964, -19966, -20790, -18732, -16905, -17970, -19282, -17713]
12059a7713K130j199l099o45J918R07r54l56Q49K9j101k92N33r12k317n85K170
12042b0637J493k117l711j255J822K029K37n53L40R48j33j636j339P43K048Q56
12026b0865j240j544M0J347J296O96O4r67j931j591k30L18m33p95J69J005L29
12009b4332q06o19O06R83j41j301r34M92J093J51p47%J383J108p25j599n44N30
11991b5402L24R4N32j9k007k597k51J793M18j860q72K033K180o38k172r69P6m08
11973b9745k88J222J759K57j142j000n29n00o1M48m90j915r99J683K097o89k596
11956c2488j084J130J193M48Q55J202K6j237j019l57k83L13J717J750k21j307
11940b9362J06J249k51k166j686n0M93Q05J970J897q04k856j114J636R79j656
$$ y = [-17713, -15583, -16782, -19881, -20526, -18608, -17701, -18655, -19011, -18162, -18133, -19234, -19526, -18993, -19905, -22222, -22807, -20637, -19144, -21261, -24972, -26227, -24405, -22376, -22139, -22692, -22352, -21404, -21537, -23173, -24512, -23769, -21721, -20865, -22105, -23649, -23609, -22262, -20966, -20270, -20206, -21173, -23104, -24695, -24925, -24607, -25040, -25835, -25666, -24661, -24332, -25138, -25757, -25151, -24168, -24309, -25610, -26544, -26052, -24959, -24808, -25555, -25555, -24172, -23064, -23789, -25388, -25932, -25402, -25078, -24984, -24452, -24471, -26478, -29075, -29326, -27533, -27115, -28975, -29847, -27814, -25634, -26272, -28444, -29413, -29337, -29745, -30033, -28811, -27052, -26795, -27937, -28937, -29466, -29966, -30027, -29579, -30069, -31984, -32983, -31300, -29203, -29892, -32488, -33572, -32442, -31249, -30801, -29946, -28744, -28718, -29955, -30974, -31331, -31614, -31301, -29584, -27834, -28055, -29362, -29256, -28007, -28258, -30424, -32110, -32160, -31667, -30862, -28892, -26995, -27799, -30655, -31769, -30133, -29154, -30810]
11924c0810j619P92J069j492k703o60J595J583P20P52R13K51m44m04j32NL23N41
11906b9720N5m91J3R83R43N2l82l31n30l34J118K292R11k077l259j402J342K717
11888b8100K266L00k229l164j239J525K098N91m64j63L74P59J182N22j775k994
11872c0511n04L016K588j161k552J90K238J69k733k070J162K963K054J05j307
11857b6353j430k2J631J322q05j849l42J573J587L12o30r98q73K00J486J104o62
11840b4749j003R05K177R64m69J07J013O7j209l44J518J615L09K9P85M31j272
11823a9126k277j537j9J281J892J140p85j795m20J486J232l96l25J671K515Q23
11807a4640q88k61J362J309k74q87L83J526O83r73q63J019J763j14k056j019J867
$$ y = [-30810, -32429, -31637, -30568, -32060, -34763, -35423, -33828, -32245, -31525, -30773, -29860, -29609, -30053, -30457, -30589, -30584, -30261, -29720, -29665, -30156, -30143, -29160, -28217, -28165, -28547, -28878, -29408, -29742, -28624, -26332, -25421, -27498, -30757, -32159, -30817, -28100, -25834, -25534, -27763, -30927, -32166, -30641, -28543, -27952, -28416, -28579, -28205, -27446, -26264, -25742, -27517, -30511, -31015, -27999, -25411, -26572, -29124, -28934, -26696, -26527, -29260, -31330, -30168, -27205, -25151, -25046, -26353, -27783, -27805, -26174, -24852, -25657, -27506, -27848, -26275, -24688, -24376, -25006, -26004, -26877, -26677, -25191, -24087, -24749, -25752, -24847, -22670, -21706, -22175, -22068, -21055, -20988, -22197, -22541, -21023, -19408, -19099, -19070, -18285, -17854, -19126, -21403, -22940, -22959, -21678, -19786, -18646, -19431, -21226, -21646, -20160, -18928, -19324, -19649, -17978, -15463, -14640, -15528, -15789, -14427, -13118, -13392, -14279, -13896, -12370, -11687, -12660, -13523, -12504, -10741, -10855, -12911, -13930, -12063]
11790a2063K982J575K31K43J67n25j89J424J965O10j54J123K154J034l03L87J727
11773B388J522O26O24M58j009j598Q50L937L868J330j32P4nj21J441L285K366
11756A9904k93o20J652K471N99k30K080M263L120M83j85J110K091K148K273K767
11740D3633L122L166K896K275J822K095K435J958J609K815M424M092K669L492
11726H2503O651Q081N879L494M259O413O575N232N262O977Q117P758P385Q357
11712A72943J0376J2160J2438J1003R640J0713J4050J6748J6992J6143J6093J6766
11700C36065J7690J9667K2881K5322K5423K4681K5638K8409L1197L3073L4501
11689F24547L6231L9086M3659M8914N2513N3911N5433N9013O3640O7362O9698
$$ y = [-12063, -9081, -7506, -7275, -7032, -6865, -7390, -7579, -6155, -4190, -3580, -3734, -2611, -457, 577, 274, 661, 2388, 3910, 4536, 5160, 5618, 4609, 3011, 3861, 7798, 11666, 12996, 12864, 12938, 12933, 12812, 14253, 17538, 19904, 19611, 18991, 20643, 23114, 23713, 23483, 25563, 29826, 32946, 33429, 33244, 34354, 36445, 38593, 40866, 43633, 46755, 49921, 52817, 55092, 56914, 59009, 61444, 63402, 65011, 67826, 72250, 76342, 79011, 82503, 89154, 97235, 103114, 106608, 110867, 117280, 123855, 129087, 134349, 141326, 149443, 157201, 164586, 172943, 183319, 195479, 207917, 218920, 228560, 239273, 253323, 270071, 287063, 303206, 319299, 336065, 353755, 373422, 396303, 421625, 447048, 471729, 497367, 525776, 556973, 590046, 624547, 660778, 699864, 743523, 792437, 844950, 898861, 954294, 1013307, 1076947, 1144309, 1214007]
11678A214007P0607O9551O7483O7145O9257P1024P0747P0880P3520P6152P5838
11667A996211P4513P5162P5124O9219N8501M9920M7151M7198M6620M5621M4765
11656B630005M2921M0297L8583L5928K6806J0125o869j6678k0109k2970k7407
11645B730632l1270l3842l6940m0950m4344m7550n3200o1528o8805p1821p1483
11634B168899p0565o9979o9049o7978o7977o9234p0357p0122o9035o8568o9033
11623A407002o8751o5973o1452n7981n7021n6872n5140n1929m9008m6699m3682
11612G92494l9629l5874l2943k9753k6093k3645k2944k1569j7755j3989j3854
11601E14446j6258j6564j3456j0714j0965j1743j0181q086q690j0802j0578p826
$$ y = [1214007, 1284614, 1354165, 1421648, 1488793, 1558050, 1629074, 1699821, 1770701, 1844221, 1920373, 1996211, 2070724, 2145886, 2221010, 2290229, 2348730, 2398650, 2445801, 2492999, 2539619, 2585240, 2630005, 2672926, 2713223, 2751806, 2787734, 2814540, 2824665, 2817796, 2801118, 2781009, 2758039, 2730632, 2699362, 2665520, 2628580, 2587630, 2543286, 2495736, 2442536, 2381008, 2312203, 2240382, 2168899, 2098334, 2028355, 1959306, 1891328, 1823351, 1754117, 1683760, 1613638, 1544603, 1476035, 1407002, 1338251, 1272278, 1210826, 1152845, 1095824, 1038952, 983812, 931883, 882875, 836176, 792494, 752865, 716991, 684048, 654295, 628202, 604557, 581613, 560044, 542289, 528300, 514446, 498188, 481624, 468168, 457454, 446489, 434746, 424565, 416479, 407789, 396987, 386409, 378583]
11589C78583o130o919p722o848n818n887n860n005m837o039o586n296m380n782
11575B95474p390o076k784j331l047n599o610n916m613l867m339n272m938l408
11561B30284l136m944n697k957J29j334o338q816o115k251j653l603m747l903
11547A74919k324j368j726l334m753m195k162j268k576l988l464j886j357k183
11533A38335k975k675j372J7K74q79j986j623q84j899l853l516m81J393l87k954
11517A14535k466J7M53j797l291j928K37N04q53j708j313q18j274k218k437j496
11501I4147k74J0q94k058k326j415k48k90j910l435k784l72J035J18j257j304
11485G6743j189k296k916r64J518P97k415l794k256j206k215k538o28P46m73j884
$$ y = [378583, 372453, 365534, 357812, 350964, 345146, 339259, 333399, 328394, 323557, 317518, 310932, 305636, 301256, 295474, 288084, 282008, 279224, 277893, 274846, 269247, 262637, 256721, 252108, 248241, 243902, 238630, 233692, 230284, 227148, 222204, 216507, 213550, 213679, 212345, 206007, 197191, 191076, 188825, 187172, 183569, 178822, 174919, 172595, 171227, 169501, 166167, 161414, 157219, 155057, 153789, 151213, 147225, 143761, 141875, 140518, 138335, 135360, 132685, 131313, 131330, 131604, 130725, 128739, 127116, 126232, 124333, 120480, 116964, 116483, 117876, 117489, 114535, 112069, 112086, 112539, 110742, 107451, 105523, 105760, 106264, 105411, 103703, 102390, 101572, 100298, 98080, 95643, 94147, 93873, 93883, 92989, 90931, 88605, 87190, 86942, 86652, 84742, 81307, 78523, 78151, 79186, 79304, 78047, 76743, 75554, 73258, 70342, 69378, 70896, 71693, 69278, 65484, 63228, 62022, 59807, 57269, 56641, 57387, 56914, 55030]
11469E5030j129j49j296k717j749mn44k329k085k06N8j667k566j745j293j975
11453C3634j923m18N25n28k208k582j459K75J648J526n24k856l049j136K54o26
11437B0553k465k921j566j79m31j728j647P80K864J386k335l585j188N46j196
11422F888l030j139J983J387k290m056k339l01K2k49l73q67q32R71K506O67k947
11405c999l528o55J061m17j888j192m20q62l36J794K207n53k789j640J60o68k377
11388a6102j881j96K04J15J220J985M88j392j129k82j344k480o68J993J148k118
11372b0439k567N26K267K93j831j050O76O99L3M81R09l55j969j562L19J099L8
11355b2433j202j375r40o36m30k02j68k55J85J230J618J14k279k927j012J036
$$ y = [55030, 53901, 53752, 52456, 49739, 47990, 47986, 47442, 45113, 43028, 42822, 42880, 41213, 38647, 36902, 35609, 33634, 31711, 31293, 31818, 31290, 29082, 26500, 25041, 25316, 26964, 28490, 27966, 25110, 22061, 20925, 21179, 20553, 18088, 15167, 13601, 13422, 12991, 11263, 9616, 10396, 13260, 14646, 12311, 8726, 7538, 8084, 6888, 3858, 2719, 4702, 6089, 3799, -257, -2596, -2897, -2875, -3124, -3497, -4364, -5196, -4225, -1719, -1052, -3999, -7527, -8182, -7121, -7538, -9426, -10618, -11038, -11900, -12236, -10442, -8235, -8788, -11577, -13217, -13057, -13725, -16102, -17983, -18179, -17975, -17860, -16640, -14655, -14167, -15559, -16688, -16970, -18314, -20794, -21462, -19469, -18321, -20439, -23006, -22480, -20213, -19920, -21751, -22801, -22125, -21426, -21393, -20912, -20003, -20358, -22327, -23889, -23570, -22471, -22433, -23635, -25010, -25950, -26586, -27016, -27218, -27386, -27641, -27456, -26226, -24608, -24494, -26773, -29700, -30712, -29676]
11339b9676R66J07R21K334J115k265l361n66K047J009j320j087Q02Q67q67j400
11323c0374l3J029P50K50J64J71N62J385R43j620l596k145P25R85p24l03K302
11306b9529K535q83l242j272J761J533q88j660k00J104J113N29l68j545j884n58
11290c3454R98P75o84j032L52J477O39j297k033o60J256J626N13q4P06J336O54
11273b8912J04J051J770P9k320j907Q88K060L48j087j96Q99R2j278j231l57j4
11256c0011j8M4l08p60p4J039J97k132k201Q64K704M04k604k044N73J193p3l56
11238c3563M23M29L74J811K665M8l622l208P12K228n28k571m79K306J704m44j61
11221c1876J901K074j08j589r65r6m41p55M88K414K815J155p06q50L20Q40J10
$$ y = [-29676, -28710, -28603, -27682, -25348, -24233, -26498, -29859, -30425, -28378, -27369, -28689, -29776, -28974, -28107, -28974, -30374, -30407, -29378, -28628, -28378, -28214, -28043, -27481, -26096, -25153, -26773, -30369, -32514, -31789, -30804, -31528, -31831, -29529, -26994, -27877, -31119, -32391, -30630, -29097, -29985, -31645, -31845, -30741, -29628, -29099, -29467, -31012, -32896, -33454, -32456, -31681, -32365, -33397, -33045, -31568, -30929, -32226, -34259, -34919, -33663, -32037, -31524, -31608, -30902, -29566, -28912, -28808, -27757, -25987, -25908, -28228, -30135, -29247, -27187, -26839, -27926, -28122, -27223, -27131, -28409, -29640, -29997, -30011, -30029, -29985, -30293, -31053, -31127, -30088, -29891, -32023, -34224, -33360, -30656, -30252, -32856, -34900, -34327, -33134, -33207, -33563, -33140, -32711, -32337, -30526, -27861, -27813, -31435, -34643, -33931, -31703, -32231, -34802, -35281, -32975, -31271, -31715, -31876, -29975, -27901, -28009, -29598, -30563, -30659, -31100, -31855, -31367, -28953, -26138, -24983, -25689, -26539, -26219, -25379, -25269]
11204b5269k34R54K143J347n35p46J054K106O36j532j673J8R97J4j334q03J603
11187b1254L441K594j35j840j053N94Q14l37j095p42k8O13J432J950J023j157
11171a5180k616j992m13m5j244k075q31J538K310M71j768j980r47j127k283j705
11155b9887R26K322O85j331j097j82r74j992o83J336N54k117k300P20K776J390
11139b9854r27j315m06K00P49J546J436J21o12P5L41r94j920o04J083L70j654
11122c2365j452J435L473K150o57j487J49J616R54p00j077k9O49L37N58K113L248
11105b1085K259L12l25L92Q87Q25J042J436J319J165J774K423K094J551J822K003
11089a06J275J381L667N605M367K104K809N463O017M974O320R452R749P536Q121
$$ y = [-25269, -25503, -24549, -22406, -21059, -21594, -22340, -21286, -19180, -18544, -20076, -21749, -21731, -20734, -20720, -22054, -22857, -21254, -17813, -15219, -15354, -17194, -18247, -17653, -16839, -17176, -18271, -19013, -19041, -18428, -16996, -15046, -14023, -15180, -17796, -19788, -20201, -20246, -21490, -23565, -24396, -22858, -20548, -20077, -21845, -23825, -24772, -25899, -28182, -29887, -28961, -26639, -25954, -27285, -28382, -28564, -29538, -31530, -32213, -30877, -30323, -32440, -34740, -34020, -31244, -29854, -30781, -32096, -32502, -32302, -31553, -30007, -28571, -28450, -29062, -28987, -28646, -29640, -31560, -32164, -31081, -30711, -32365, -33817, -32382, -28909, -26759, -27416, -28903, -28754, -27138, -26184, -26884, -27961, -27990, -27341, -27004, -26446, -24333, -21085, -18826, -18514, -18839, -18447, -17560, -16735, -15693, -14257, -12938, -11773, -9999, -7576, -5482, -3931, -2109, -106, 1169, 2550, 6217, 11822, 16189, 18293, 21102, 26565, 32582, 37556, 43876, 53328, 63077, 70613, 78734]
11074G8734J1235R461P15o520n789k400l798p602p480n047o529j1093j2054q111
11060B3722m684m597n114m470m279m722l606j144l44j691k418j585j165j627j157
11045a8881J55M7j449j756n23j50j058r54M46O21j013j844p95k4p90j472q79R
11027c0310N68J318J691M81j155r90J08n26k093j369J039J131j238j685P78J586
11011c0666j315l531j606J384J408l31p80k47k48k6J012J030o21j217N56J630
10995c3568n8j519l5J747O39j245o14P62m40k496j577J130J328r89j972p32Nm91
10977d0125j03J341J402l91j530o68P58J247P19n21j605q43J621K499j01k843
10961c9143j712J525K153J5j022J2L85o17p20M52P02j31NO91n76k823k035J685
$$ y = [78734, 89969, 99430, 100145, 93625, 87836, 85436, 81638, 74036, 66556, 61509, 54980, 43887, 31833, 23722, 19038, 14441, 9327, 4857, 578, -4144, -7750, -8894, -9238, -10929, -13347, -14932, -16097, -17724, -18881, -18726, -18679, -20128, -21884, -22407, -22557, -23615, -24569, -24123, -23502, -24515, -26359, -27154, -27178, -27968, -29440, -30319, -30310, -29742, -28424, -26733, -26252, -27407, -28397, -28289, -28815, -30908, -32277, -31238, -30107, -31345, -33030, -32252, -30666, -31981, -35512, -37118, -35734, -34326, -34657, -35437, -35684, -35932, -35958, -34946, -33916, -34537, -35754, -35198, -33568, -33626, -35145, -35180, -33433, -32794, -34039, -34653, -33891, -34331, -36827, -38404, -37274, -35946, -36935, -38907, -39639, -39634, -40125, -40228, -38887, -37485, -37876, -39406, -40074, -39316, -38069, -37350, -37871, -39476, -40319, -38698, -36199, -36300, -39143, -40855, -39330, -37177, -37162, -38184, -38172, -37787, -38404, -39124, -38672, -37970, -38101, -38096, -37405, -37981, -40804, -42839, -41154]
10943d1154L165K31k754j905O66J381P00P26R83J18j016j025l91Q0P78J437N79
10926c7401j321j411Q80K138M11j325j79J743J055j250j925r19m52n17M34J601
10910c8438R05p85n98J321J740l27j924q88R52R23n47j094j25O54q3j498j876
10893d1688p26R28K023K370J983N45j521k446j064J165J703K69j138j214n18K49
10877c9080R74J093L4j189r69J98M35k00L6R73N71r85j052O68J068r58k214n43
10859d1140J509J228K41R92K070R82j067j318k87l30j068l44J353J465k76j563
10843c7553j226k08N90Q59J60r54m93J673K185p94l359j085L435L700q13l869
10827c7752j886J512J961K95m92j43K6J56Q79J293K79j404k093j246L48J377O59
$$ y = [-41154, -37989, -37758, -40512, -42417, -41751, -40370, -39670, -38944, -37961, -37843, -38859, -39884, -40275, -40195, -39417, -37980, -37401, -38722, -40133, -39253, -37115, -36704, -38029, -38208, -36465, -35410, -36660, -38585, -39504, -39956, -40473, -40039, -38438, -37533, -38318, -38916, -37595, -35855, -36182, -38106, -38994, -38042, -37119, -37666, -38760, -38885, -38231, -38314, -39812, -41688, -42414, -41486, -39463, -37093, -35110, -34565, -36086, -38532, -39596, -38431, -36728, -36459, -37597, -38811, -39329, -39080, -38106, -37013, -36979, -38168, -39137, -38939, -38504, -38704, -38668, -37695, -37124, -38109, -39161, -38493, -37425, -38383, -40597, -41140, -39631, -38403, -38162, -37170, -35100, -34118, -35185, -36503, -36790, -37120, -38188, -38532, -37179, -35714, -35990, -37553, -38779, -38987, -38397, -37538, -37378, -38332, -38825, -37152, -34967, -35761, -39120, -40205, -36770, -33070, -33883, -37752, -39638, -38126, -36165, -35870, -36362, -36505, -36479, -36323, -35444, -34151, -33872, -35276, -37369, -38615, -38267, -36890, -36231]
10810c6231j538k808j075K202L449J680n84j226o80J23J182J961J219o81j590
10795c4597o63N19O71L02q3q71j666j200K65R25M62L61O80k74k118j958O84K222
10777c6339N42j411m54J690J534m49j085K38J281Q91o4q95j376n88J699L209J685
10760b9892j408k571j284k56q11j172qJ300J136O9n47o27o14j46R29J369Q0j705
10742c6158j583O25K247J252r12j325L55J717J301M23M12L81p37j682q05Q68J086
10725c2535O2j42O47O36l95o35L46Q60L11J07O48M72o29q95L7K93n31l20J299
10706c0364J496q42k495r42J470J580L07Q9L45n21j199K59K224J729n53j684j256
10689c0357r01l90J462L102J912r25j596M98K128J489J52m72q71j173n84M63N44
$$ y = [-36231, -37769, -40577, -41652, -39450, -36001, -34321, -34905, -36131, -36811, -36688, -35506, -33545, -32326, -33007, -34597, -35260, -34741, -34070, -33768, -33851, -34722, -36388, -37588, -37323, -36398, -35936, -35575, -34895, -35169, -37287, -39245, -38561, -36339, -35797, -37208, -37662, -35972, -34438, -34887, -35972, -35734, -34453, -33562, -33626, -34521, -35897, -36485, -34786, -31577, -29892, -31300, -33871, -35155, -35411, -36222, -37394, -37402, -36102, -34966, -34897, -35444, -36071, -36685, -36831, -35902, -34533, -34453, -36158, -37741, -37116, -34869, -33617, -34529, -35854, -35499, -33782, -32481, -32058, -31646, -31265, -32002, -33684, -34489, -33621, -32535, -32473, -32615, -31968, -31332, -31727, -32362, -32016, -31156, -30845, -30738, -30090, -29618, -30247, -31142, -31105, -30812, -31343, -31663, -30364, -28868, -29710, -32205, -33147, -31677, -30097, -29790, -29701, -29356, -29877, -31076, -30817, -28593, -26864, -27417, -29101, -30357, -31258, -31648, -30186, -27084, -25172, -26097, -27693, -27195, -25067, -23578, -23426, -23898, -24769, -25942, -26526, -26063, -25519]
10672b5519k03m84m97j157j354M21K453J891j32l0J866J648j126k297k79J188
10656b3611l27j895o67J327J352O62J299J714j29k245j475J129J964N09n69lQ42
10639b0123R28O80M05m1j79M78J075N40m88n15M41J036O81O0j75lL14M00M3k47
10619a4690J96Q68O45j30O8J156J165l47j099L00J876J325m39r47J12R67O67J9
10601h288J42J239K381K169M56p95j7J193L33j427o98K100K685%j629L92K569
10584B805J350j007q11Q73R67J00O01J496N44r34j90J784K077J085J117J441o0
10567A3238j833o77K252K970J294M38Q19J47q94N51L091K210j524k282J448M044
10551B5292J897j113n87J778K371J485R68M31n04j9K214L025Q64q89O11K776K164
$$ y = [-25519, -25722, -26206, -26703, -27860, -29214, -28793, -26340, -24449, -24581, -24611, -22745, -21097, -22223, -24520, -24799, -23611, -23938, -25833, -26500, -25173, -23821, -23159, -21860, -20146, -20275, -22520, -23995, -22866, -20902, -20393, -20962, -20965, -20123, -19195, -18515, -18110, -18151, -18330, -17852, -16777, -16237, -16725, -17240, -16799, -15763, -15082, -15022, -15197, -15200, -14886, -14486, -14443, -14690, -14494, -13626, -12981, -13111, -13043, -11887, -10722, -11069, -12168, -11868, -9992, -8667, -9106, -10053, -9941, -8974, -8307, -8288, -8146, -6907, -4526, -2357, -1901, -2696, -2713, -1520, -1187, -2614, -3312, -1212, 1473, 1473, -156, 236, 2805, 4155, 3148, 2337, 3210, 4177, 4277, 4878, 6374, 6918, 5984, 5794, 7578, 9655, 10740, 11857, 13298, 13238, 11405, 10728, 12980, 15950, 17244, 17682, 18501, 18648, 17754, 18305, 21396, 23606, 22082, 19800, 21248, 25292, 27189, 26076, 25489, 27267, 29638, 31123, 32091, 32522, 32018, 31999, 34213, 37238, 38102, 37213, 37824, 40600, 42764]
10534D2764K15J27J296J449J309K408L013J131q00O22L554L514O81q17N4M28o25
10517F0323q53L11P43J28P13K554K617P2j753n98J354J472P13J165K353K520J644
10500G5478Q69M63K88Q73K205K752J535Q8N34K454L534K827J695J441J657J432
10484A00125J048J451K467K778J944J347K033K602J036j717k381j76J747J001
10470A15305n09l7J420J120n68r92k3p1j397j442M49J480J27j036N01K930K915
10453A20172O01r61l37J134K161K840L151K473J272J322L119M495L331P49j51
10438A45371J394K826K212J167J977L442K480n57j721M69K339N35k673k870k08
10423A56183J158m48k292j959n75j96p33j002q03n50k00K52K99j87n24k09M91
$$ y = [42764, 42979, 43106, 44402, 45851, 47160, 49568, 52581, 53712, 52912, 53534, 57088, 60602, 61283, 60466, 60520, 60948, 60323, 59470, 59781, 60524, 60652, 61365, 63919, 66536, 66608, 64855, 64257, 65611, 67083, 67796, 68961, 71314, 73834, 75478, 76347, 76810, 77098, 77971, 80176, 82928, 84463, 84551, 85085, 87539, 91073, 93900, 95595, 97036, 98693, 100125, 101173, 102624, 105091, 107869, 109813, 111160, 113193, 115795, 116831, 115114, 112733, 112557, 114304, 115305, 114796, 114759, 116179, 117299, 116731, 115739, 115716, 115645, 114248, 112806, 113255, 114735, 114862, 113826, 114327, 117257, 120172, 120773, 119812, 119475, 120609, 122770, 125610, 128761, 131234, 132506, 133828, 136947, 141442, 144773, 145522, 145371, 146765, 149591, 151803, 152970, 154947, 158389, 160869, 160312, 158591, 159060, 161399, 161934, 159261, 156391, 156183, 157341, 156893, 154601, 152642, 152067, 151871, 151138, 150136, 149333, 148783, 148583, 148835, 149134, 148947, 148423, 148214, 148705]
10406A48705J208J780J811J093N22J234K764L386K512J331R50J264J879K704L328
10391A76471L083K120J327J134J320J650J562Q4k386l220q12K283K241n56k149
10376A84152r56N22K91n17n80m89n25L57J865J909L51nJ938L387K351J084K065
10359A97200L719L595K899M074O018N787L699K832M209N865O263N708M891M422
10345B61181N112O468O262L903K468M435P222O644L248J100J343J475O19P39K190
10330C14409K493O81r84r22n31j206k054j945j198j83J241K204J411j40N0J963
10314C15289L000K525K808M487N174M132M077O084P019N115L955O818J0584J0247
10300C91314O985O277R224J1347J0064Q144Q349R036P415M075J725J178Q88n28
$$ y = [148705, 149913, 151693, 153504, 154597, 155119, 156353, 159117, 162503, 165015, 166346, 167296, 168560, 170439, 173143, 176471, 179554, 181674, 183001, 184135, 185455, 187105, 188667, 188751, 186365, 183145, 182333, 184616, 186857, 186301, 184152, 183196, 183718, 184009, 183492, 182912, 182423, 181898, 182255, 184120, 186029, 186380, 186375, 188313, 191700, 194051, 195135, 197200, 200919, 204514, 207413, 211487, 217505, 223292, 226991, 229823, 234032, 239897, 246160, 251868, 256759, 261181, 266293, 272761, 279023, 282926, 285394, 289829, 297051, 303695, 306943, 308043, 309386, 310861, 311480, 312219, 314409, 316902, 317583, 316599, 315677, 315146, 313940, 311886, 309941, 308743, 308560, 309801, 312005, 313416, 313276, 313326, 315289, 318289, 320814, 323622, 328109, 333283, 337415, 341492, 347576, 354595, 359710, 363665, 370483, 381067, 391314, 398299, 404576, 413800, 425147, 435211, 443355, 451704, 460740, 468155, 472230, 473955, 475133, 476021, 475493]
10286D75493l009n777q022q987q455p200o498o935p839q099p428o505n708m493
10272C80538k800k116l485n074m008p21J196K04r86J58K177K582K116L073N033
10257C77887N624M602M107N138O531P208P046N806L580J855J795K011N64j600
10243D32154k265k149l733o303o548m515m275p239r553q344o171o167o860n701
10229C52331m288n382p268o087k459p85k534m739n119m393l325j609k73j138l134
10214B99798l083r30q3j363j339J356K854M03k503j568J328J477r67k040r43m65
10198B91932j171o79J043R79j365k615j324m69k036l485k373o10q57j944j486
10183B73540m75j247k961k963j355m60o72n86m36j609l091k309J74P83j458l197
$$ y = [475493, 472484, 466707, 458685, 449698, 441243, 434043, 427545, 420610, 412771, 404672, 397244, 390739, 385031, 380538, 377738, 375622, 372137, 367063, 363055, 362334, 363530, 363734, 362748, 362906, 365083, 367665, 369781, 372854, 377887, 383511, 388113, 392220, 397358, 403889, 411097, 418143, 423949, 427529, 429384, 431179, 433190, 433754, 432154, 429889, 427740, 424007, 417704, 411156, 406641, 402366, 395127, 385574, 377230, 371059, 364892, 358032, 352331, 348043, 342661, 335393, 329306, 326847, 326062, 323528, 318789, 313670, 309277, 305952, 304343, 304070, 302932, 299798, 296715, 295785, 295702, 294339, 293000, 294356, 297210, 297613, 295110, 293542, 294870, 296347, 295380, 293340, 292397, 291932, 290761, 290082, 291125, 292104, 290739, 288124, 286800, 286331, 284295, 280810, 278437, 277827, 276970, 275026, 273540, 273065, 271818, 268857, 265894, 264539, 264079, 263407, 262821, 262385, 260776, 257685, 255376, 255550, 256333, 254875, 251678]
10167B51678k052k96r17k881l073j235k5q39k113k030r94o36j360j880j168jJ40
10150B30318o71q24L28J419J212L19k91q70j517j005R34J876o9k653k345L04J642
10133B28107O80p3N59P96j93p65j83mp76q79O9J33j238k019j483j481k310j567
10115B17373Q87J466j015k584r02K97k105m392k172J526J036k396l099q69n07
10100B02544k519k397M45J052k046l699r39J856N16k001j102J608J328j902l544
10085A89200j701O21M33j441k178q04Q31M70j487k238n27J114N0k122k033j92
10069A77996o4j893k252k99N40j356k881j683j23q17k254k038j043j062j450j226
10053A58095j493k681k566k52J227k39j838p05Q16n12k605j648Q49O69j496j512
$$ y = [251678, 249626, 249330, 248413, 245532, 242459, 241224, 241199, 240360, 238247, 236217, 235223, 234587, 233227, 231347, 230179, 230178, 230318, 229647, 228823, 229151, 230570, 231782, 232101, 231810, 230940, 229423, 228418, 229352, 231228, 231159, 228506, 226161, 226465, 228107, 228787, 228714, 229273, 230069, 229876, 229111, 228928, 228924, 228148, 227269, 227338, 227471, 226233, 224214, 222731, 221250, 218940, 217373, 218260, 219726, 218711, 216127, 215225, 215522, 213417, 209025, 206853, 208379, 209415, 207019, 203920, 203051, 202544, 200025, 197628, 198073, 199125, 197079, 193380, 192441, 194297, 194813, 192812, 191710, 193318, 194646, 192744, 189200, 187499, 188120, 188553, 187112, 184934, 184130, 184961, 185431, 183944, 181706, 181179, 182293, 182343, 180221, 178188, 177996, 177932, 176039, 173787, 173488, 174028, 172672, 169791, 168108, 167985, 167168, 164914, 162876, 161833, 160771, 159321, 158095, 156602, 153921, 151355, 151103, 152330, 152091, 150253, 149548, 150364, 149852, 147247, 145599, 146448, 147117, 145621, 144109]
10037A44109M71M12j913k382j64O96j347k702j284l6j152k240j220j86j035j636
10021A28391l8J432K53j599j178J71m59k038j585K02J79j429j369P20J585L2j175
10004A22095l82K19j086k114n24J863J795j47o14R99J709r7k073j602M49J481
9988A21971R27J76j39n32r34o80q2r9m77j82L45l57j832j839j67M97j098k399
9970A13099j044J240J457M1l19Q29J523R33J34k24l73rJ114J675M16j312j264
9953A17916R0N95L64J259K806K409m6j501n14P83N09l64m67p3N54J882L037K013
9935A31252o89j794q6J720J602J242K189K515L89j929j222J552K780J523J6j73
9919A40887M39J132J726J736Q92J72O68J793K098J268K27j89L21J452K121J537
$$ y = [144109, 144580, 144992, 143079, 140697, 140533, 141229, 139882, 137180, 135896, 135860, 134708, 132468, 131248, 131062, 130027, 128391, 128353, 129785, 130038, 128439, 127261, 127432, 126973, 124935, 123350, 123552, 123731, 122302, 120933, 121653, 123238, 123270, 122095, 121713, 121932, 120846, 118732, 118208, 120071, 121866, 121719, 121105, 122104, 123813, 123716, 121643, 120041, 120490, 121971, 122898, 123074, 122935, 122403, 121469, 120789, 120707, 120608, 120131, 119949, 120294, 119937, 118105, 116266, 116099, 116596, 115498, 113099, 112055, 113295, 114752, 114793, 114474, 115303, 116826, 117759, 117893, 117669, 117296, 117287, 118401, 120076, 120492, 119180, 117916, 118006, 118601, 118965, 120224, 123030, 125439, 125393, 123892, 123378, 124161, 124670, 124306, 123839, 123766, 124320, 126202, 129239, 131252, 130563, 128769, 128683, 130403, 132005, 133247, 135436, 137951, 138340, 136411, 135189, 136741, 139521, 141044, 141060, 140887, 141326, 142458, 144184, 145920, 146812, 146984, 147652, 149445, 151543, 152811, 153038, 152849, 153170, 154622, 156743, 158280]
9903A58280P27J289K432J877k2l08J437J939r0j331L88J983N35j209N20L581L200
9886A75228k0j300L71J316M7n65J105K604J754nk54J204K991L832K960Q32n65
9869A91535K0J138R82L59P75J214J53q75K75J925J140o72N1K309J938p62j271
9852B00234Q91J131j630k474P91L249J123j874j118J345J168p75r25K56j05j367
9836A99920p23J057P06j581k237k69J407R23m7L13J203R83l13j262q31N99J588
9819B01436J315P77J228J744M97j471j059J726K997R89j126o53M17k61q56R13
9803B08613K898J984l31n99N72K59r29p8K152K190l14k130k051k054k757k467
9787B04958j156r10j800j704p25j372l514l829j609m06k102l673k489p05j258
$$ y = [158280, 159007, 160296, 162728, 164605, 164583, 164275, 165712, 167651, 167561, 166230, 166618, 168601, 169136, 167927, 168447, 172028, 175228, 175208, 173908, 174279, 175595, 175642, 175077, 176182, 178786, 180540, 180535, 180281, 181485, 184476, 188308, 191268, 192100, 191535, 191555, 192693, 193675, 194034, 194809, 196023, 196176, 195301, 195576, 197501, 198641, 197969, 198020, 200329, 202267, 201505, 200234, 201125, 202256, 200626, 198152, 198943, 202192, 203315, 201441, 200323, 201668, 202836, 202061, 201136, 201392, 201287, 199920, 199197, 200254, 200960, 199379, 197142, 196873, 198280, 199203, 199156, 199469, 200672, 201655, 201342, 200080, 199249, 199848, 201436, 202751, 203528, 204756, 206500, 206997, 205526, 204467, 206193, 209190, 210179, 209053, 208400, 208817, 208556, 207700, 208613, 211511, 213495, 213164, 212565, 213137, 213396, 212467, 212389, 214541, 216731, 216417, 214287, 212236, 210182, 207425, 204958, 203802, 202892, 201092, 199388, 198663, 197291, 193777, 189948, 188339, 187933, 185831, 182158, 179669, 178964, 177706]
9772A77706k711j832Q40J646p27l476l506j049R60L63j875k921j629J22K57q15
9756A61353j634k138k609j895N70K427J244j391k160j209j202k065j271R00J160
9741A50080j228l255l131k192j291J22Q24j265m174l349P42K303o43l048j411
9726A29084P90L5j155K21J565j24j983l68J920K46l400l508k33J481M76J09J145
9709A26301O63j727k722j193J56j63m52J70K55o46j089q69j211j650n66J021M80
9692A16758j491j540M13Q45j036j913m41N37k95j63K046K773l7k470o96K542K301
9675A18133o43j505O49J987M16j595j340M75J586J239K74l73l70%J53l9o0K95
9657A19282L42m27j282j080J30J008L14j688l140k265L54J975J046o60p27K91
$$ y = [177706, 174995, 173163, 174003, 175649, 174922, 171446, 167940, 166891, 167851, 168214, 166339, 163418, 161789, 161911, 162168, 161353, 159719, 157581, 154972, 153077, 153647, 156074, 157318, 155927, 153767, 152558, 151356, 149291, 148020, 148920, 150080, 148852, 145597, 142466, 140274, 138983, 139105, 139929, 138664, 134490, 131141, 131883, 134186, 133543, 130495, 129084, 129874, 129909, 128754, 128975, 130540, 130416, 128433, 128065, 129985, 130231, 126831, 123323, 123090, 124571, 125047, 125156, 126301, 126964, 125237, 122515, 121322, 121478, 121315, 120863, 121033, 121288, 120642, 119553, 118684, 117473, 115823, 115257, 116278, 116758, 115267, 113727, 114140, 114985, 113949, 112036, 111595, 112132, 111837, 111674, 113720, 116493, 116456, 113986, 113290, 115832, 118133, 117490, 115985, 116634, 118621, 119037, 117442, 116102, 116577, 118163, 119402, 119676, 119303, 118933, 118933, 119086, 119047, 118987, 119282, 119624, 119197, 117915, 116835, 116965, 117973, 118287, 116599, 113459, 111194, 111548, 113523, 114569, 113909, 113182, 113473]
9641A13473J88q95q18N11P81o91j698q85K59K63k07k45j57lP67J274j52k375j946
9622A07444J383L379J575j030j140j60p05j558k83J833J806j0j020q39p54l58
9606A09563J197K055J76k222j356J761K530R8j540k97J106L11j093j005j88n5
9590A11041n9N96J110O85N4r3j94l53K06J213J128k07r08j74L68l89j007k6J597
9571A14588K209J767R96n5j110j000O37K271K457J553O03jM8J044J920J002j050
9554A27879j392P79K817K808K279K658K283j92k155n20L000L954J435j253j592
9539A42788j03J919L703M133K603P73Q00K050K222J367J588K983L419K593K557
9524A75395L609L528K071K188M847O546M766K292K763M767M495K229J730M028
$$ y = [113473, 113661, 112766, 111948, 112459, 113240, 112549, 110851, 109966, 110225, 110488, 110281, 110036, 109879, 109876, 110643, 111917, 111765, 109390, 107444, 108827, 112206, 113781, 112751, 111611, 111451, 110746, 109188, 108905, 110738, 112544, 112534, 111514, 110675, 109921, 109563, 110760, 112815, 112991, 110769, 109413, 111174, 113704, 113802, 112262, 111965, 113071, 113382, 112289, 111284, 111096, 111041, 110982, 111578, 112688, 113373, 113427, 113334, 113140, 112787, 112993, 114206, 115334, 115127, 114219, 114045, 114413, 114024, 113017, 112991, 114588, 116797, 118564, 119560, 119505, 118395, 117395, 118032, 120303, 122760, 124313, 124916, 124915, 124963, 126007, 127927, 128929, 127879, 126487, 127266, 130083, 132891, 135170, 137828, 140111, 139919, 137764, 137244, 140244, 144198, 145633, 144380, 142788, 142685, 144604, 148307, 152440, 155043, 155816, 156616, 158666, 160888, 162255, 163843, 166826, 170245, 172838, 175395, 179004, 182532, 184603, 186791, 191638, 198184, 202950, 205242, 208005, 212772, 217267, 219496, 221226, 225254]
9510B25254O100N795M365L646L852M843O505P337N537K417J716M316O756O532
9496B94971N679O712Q036O861M520M774P818R975R445Q490R235J0636J1090J1208
9482D09450J2214J3588J4225J4384J4900J5619J6026J6304J6739J7236J8298K0777
9470E99760K3694K4433K2772K2338K5674K9919L0599K8132K7032K9455L3302L6625
9458I33735L9951M3687M6847M9608N3862N9755O4654O7068O8804P1224P2115O8571
9446A639881O0654M9852L6387K1012P385j115o017j1854k0068k7855l2798l5532
9434A679932l7443l8511l8203l6468l3308k9048k5215k3183k1847j8797j3985
9423A363924r921p786n862k619J123M257P347J1042J4760J8461K3627L0526L6561
$$ y = [225254, 231354, 237149, 241514, 245160, 249012, 253855, 260360, 267697, 273234, 275651, 277367, 281683, 288439, 294971, 300650, 307362, 315398, 322259, 326779, 331553, 339371, 349346, 358791, 367281, 376516, 387152, 398242, 409450, 421664, 435252, 449477, 463861, 478761, 494380, 510406, 526710, 543449, 560685, 578983, 599760, 623454, 647887, 670659, 692997, 718671, 748590, 779189, 807321, 834353, 863808, 897110, 933735, 973686, 1017373, 1064220, 1113828, 1167690, 1227445, 1292099, 1359167, 1427971, 1499195, 1571310, 1639881, 1700535, 1750387, 1786774, 1807786, 1815171, 1814056, 1808039, 1796185, 1776117, 1748262, 1715464, 1679932, 1642489, 1603978, 1565775, 1529307, 1495999, 1466951, 1441736, 1418553, 1396706, 1377909, 1363924, 1354003, 1346217, 1340355, 1337736, 1338859, 1343116, 1350463, 1361505, 1376265, 1394726, 1418353, 1448879, 1485440]
9410A485440L9632M1415M4644M8576N0176M8645M5228L9102K7648J1708l257j3131
9398A865826j9448k5767l2604l8498m3698m9232n3681n4476n2046m9317m7110
9387A399949m3580l8708l5567l5559l5752l3402l0295k9588l0466k9587k6562
9376A030883k4263k3861k3206k0777j8083j6912j6648j5733j4038j2397j1155
9365H33810j0252r691r226q641q576r573j0364r103o633o068q246j0187r372p155
9351G10723o213o848p718q247q298p376o056o220p844p978n444l752n916q898
9337F13915p800l803k672n837q422p016m237l692m703m721l779l630m536n372
9323E43695n540n010l785k594k802m452n865n894n154m341l223k028j786k515
$$ y = [1485440, 1525072, 1566487, 1611131, 1659707, 1709883, 1758528, 1803756, 1842858, 1870506, 1882214, 1878957, 1865826, 1846378, 1820611, 1788007, 1749509, 1705811, 1656579, 1602898, 1548422, 1496376, 1447059, 1399949, 1356369, 1317661, 1282094, 1246535, 1210783, 1177381, 1147086, 1117498, 1087032, 1057445, 1030883, 1006620, 982759, 959553, 938776, 920693, 903781, 887133, 871400, 857362, 844965, 833810, 823558, 813867, 804641, 796000, 787424, 777851, 767487, 758384, 751751, 745683, 737437, 727250, 717878, 710723, 704510, 697662, 689944, 681697, 673399, 666023, 659967, 653747, 645903, 637925, 632481, 628729, 622813, 613915, 606115, 602312, 599640, 593803, 585381, 578365, 574128, 570436, 565733, 561012, 557233, 553603, 549067, 543695, 538155, 533145, 529360, 526766, 523964, 519512, 513647, 507753, 502599, 498258, 495035, 493007, 491221, 488706]
9309D88706l004l054l738m831m726l648l879n560n808l739k690m790o864n412
$$ y = [488706, 485702, 482648, 478910, 474079, 469353, 465705, 461826, 456266, 450458, 446719, 444029, 439239, 432375, 426963]
$$ [...]
##END NTUPLES=NMR SPECTRUM
##END=
