##TITLE=1H ikalashn
ES-valerie
27.9.2024
##JCAMPDX= 6.0         $$ Bruker NMR JCAMP-DX V2.0
##DATA TYPE= NMR FID
##DATA CLASS= NTUPLES
##ORIGIN= UXNMR, Bruker Analytische Messtechnik GmbH
##OWNER= root
$$ TOPSPIN		Version 1.3
$$ 2024-09-27 12:20:22.734 +0400  Irina@DPX200
$$ Compression mode = diff/dup
##.OBSERVE FREQUENCY= 200.131392401
##.OBSERVE NUCLEUS= ^1H
##.DELAY= (6, 6)
##.ACQUISITION MODE= SIMULTANEOUS
##.ACQUISITION SCHEME= undefined
##.AVERAGES= 8
##.DIGITISER RES= 18
##SPECTROMETER/DATA SYSTEM= spect
##.PULSE SEQUENCE= zg
##.SOLVENT NAME= CDCl3
##.SHIFT REFERENCE= INTERNAL, CDCl3, 1, 17.95386
##AUDIT TRAIL= $$ (NUMBER, WHEN, WHO, WHERE, WHAT)
$$ ##TITLE= Audit trail, TOPSPIN		Version 1.3
$$ ##JCAMPDX= 5.01
$$ ##ORIGIN= Bruker BioSpin GmbH
$$ ##OWNER= Irina
$$ $$ F:/spectra/data/iren/nmr/1H/4/audita.txt
$$ ##AUDIT TRAIL=  $$ (NUMBER, WHEN, WHO, WHERE, VERSION, WHAT)
(   1,<2024-09-27 12:20:09.250 +0400>,<Irina>,<DPX200>,<TOPSPIN 1.3>,
      <created by zg
	started at 2024-09-27 12:19:31.812 +0400,
	POWCHK disabled, PULCHK disabled
       configuration hash MD5:
       BE 6D 3F 07 2A EA 11 49 91 17 2B D3 AF B3 58 0D
       data hash MD5: 16K
       8F 08 FA 8F 7F 24 6A F1 F9 62 A5 53 C7 9B B4 24>)
$$ ##END=
$$ 
$$ $$ hash MD5
$$ $$ 44 07 AE 76 E6 99 79 E0 C1 5F B9 0F 49 B2 B0 C7
##$RELAX= 
##$RELAX= 
##$RELAX= 
##$RELAX= 
##$RELAX= 
##$RELAX= 
##$RELAX= 
##$RELAX= 
##$RELAX= 
$$ Bruker specific parameters
$$ --------------------------
##$DU= <F:/spectra>
##$EXPNO= 4
##$NAME= <1H>
##$PROCNO= 1
##$TYPE= <nmr>
##$USER= <iren>
##$AMP= (0..31)
100 100 100 100 100 100 100 100 100 100 100 100 100 100 100 100 100 100 
100 100 100 100 100 100 100 100 100 100 100 100 100 100 
##$ANAVPT= -1
##$AQSEQ= 0
##$AQ_mod= 1
##$AUNM= <au_zg>
##$AUTOPOS= <>
##$BF1= 200.13
##$BF2= 200.13
##$BF3= 200.13
##$BF4= 200.13
##$BF5= 200.13
##$BF6= 200.13
##$BF7= 200.13
##$BF8= 200.13
##$BYTORDA= 1
##$CFDGTYP= 0
##$CFRGTYP= 5
##$CHEMSTR= <none>
##$CNST= (0..63)
1 1 145 1 1 1 1 1 1 1 1 1 1 1 1 1 1 1 1 1 1 1 1 1 1 1 1 1 1 1 1 1 1 1 
1 1 1 1 1 1 1 1 1 1 1 1 1 1 1 1 1 1 1 1 1 1 1 1 1 1 1 1 1 1 
##$CPDPRG= <>
##$CPDPRG1= <>
##$CPDPRG2= <>
##$CPDPRG3= <>
##$CPDPRG4= <mlev>
##$CPDPRG5= <mlev>
##$CPDPRG6= <mlev>
##$CPDPRG7= <mlev>
##$CPDPRG8= <mlev>
##$CPDPRGB= <>
##$CPDPRGT= <>
##$D= (0..63)
0 2 0 0 0 0 0 0 0 0.06 0 0.03 0 0 0 0 0.0002 0 0 0 0 0 0 0 0 0 0 0 0 0 
0 0 0 0 0 0 0 0 0 0 0 0 0 0 0 0 0 0 0 0 0 0 0 0 0 0 0 0 0 0 0 0 0 0 
##$DATE= 1727425205
##$DBL= (0..7)
120 120 120 120 120 120 120 120 
##$DBP= (0..7)
150 150 150 150 150 150 150 150 
##$DBP07= 0
##$DBPNAM0= <>
##$DBPNAM1= <>
##$DBPNAM2= <>
##$DBPNAM3= <>
##$DBPNAM4= <>
##$DBPNAM5= <>
##$DBPNAM6= <>
##$DBPNAM7= <>
##$DBPOAL= (0..7)
0.5 0.5 0.5 0.5 0.5 0.5 0.5 0.5 
##$DBPOFFS= (0..7)
0 0 0 0 0 0 0 0 
##$DE= 6
##$DECBNUC= <off>
##$DECIM= 32
##$DECNUC= <off>
##$DECSTAT= 4
##$DIGMOD= 1
##$DIGTYP= 9
##$DL= (0..7)
0 120 120 120 120 120 120 120 
##$DP= (0..7)
150 150 150 150 150 150 150 150 
##$DP07= 0
##$DPNAME0= <>
$$ [...]
##$SW= 21.9925939549014
##$SWIBOX= (0..15)
0 0 2 0 0 0 0 0 0 0 0 0 0 0 0 0 
##$SW_h= 4401.40845070422
##$TD= 16384
##$TD0= 1
##$TE= 300
##$TE2= 300
##$TE3= 300
##$TEG= 300
##$TL= (0..7)
0 120 120 120 120 120 120 120 
##$TP= (0..7)
150 150 150 150 150 150 150 150 
##$TP07= 0
##$TPNAME0= <>
##$TPNAME1= <>
##$TPNAME2= <>
##$TPNAME3= <>
##$TPNAME4= <>
##$TPNAME5= <>
##$TPNAME6= <>
##$TPNAME7= <>
##$TPOAL= (0..7)
0.5 0.5 0.5 0.5 0.5 0.5 0.5 0.5 
##$TPOFFS= (0..7)
0 0 0 0 0 0 0 0 
##$TUNHIN= 0
##$TUNHOUT= 0
##$TUNXOUT= 0
##$USERA1= <user>
##$USERA2= <user>
##$USERA3= <user>
##$USERA4= <user>
##$USERA5= <user>
##$V9= 5
##$VALIST= <valist>
##$VCLIST= <CCCCCCCCCCCCCCC>
##$VD= 0
##$VDLIST= <DDDDDDDDDDDDDDD>
##$VPLIST= <PPPPPPPPPPPPPPP>
##$VTLIST= <TTTTTTTTTTTTTTT>
##$WBST= 1024
##$WBSW= 25
##$XGAIN= (0..3)
0 0 0 0 
##$XL= 0
##$YL= 0
##$YMAX_a= 890204
##$YMIN_a= -722547
##$ZGOPTNS= <>
##$ZL1= 120
##$ZL2= 120
##$ZL3= 120
##$ZL4= 120
##$ABSF1= 10
##$ABSF2= 0
##$ABSG= 5
##$ABSL= 3
##$ALPHA= 0
##$AQORDER= 0
##$ASSFAC= 0
##$ASSFACI= 0
##$ASSFACX= 0
##$ASSWID= 0
##$AUNMP= <proc_1d>
##$AXLEFT= 0
##$AXRIGHT= 0
##$AXTYPE= 0
##$AXUNIT= <>
##$AZFE= 0.1
##$AZFW= 0.1
##$BCFW= 1
##$BC_mod= 2
##$BYTORDP= 1
##$COROFFS= 0
##$CY= 7568.61572265625
##$DATMOD= 1
##$DC= 2
##$DFILT= <>
##$DTYPP= 0
##$F1P= 17.9538593292236
##$F2P= -4.03888763876832
##$FCOR= 0.5
##$FTSIZE= 32768
##$FT_mod= 4
##$GAMMA= 1
##$GB= 1
##$INTBC= 1
##$INTSCL= 1
##$ISEN= 128
##$LB= 0.05
##$LEV0= 0
##$LPBIN= 0
##$MAXI= 945.577
##$MC2= 0
##$MEAN= 0
##$ME_mod= 0
##$MI= -402.1523
##$NCOEF= 0
##$NC_proc= 0
##$NLEV= 6
##$NOISF1= 8.587773
##$NOISF2= 6.764455
##$NSP= 1
##$NTH_PI= 0
##$NZP= 0
##$OFFSET= 17.95386
##$PC= 1
##$PHC0= 197.1588
##$PHC1= 2.685347
##$PH_mod= 0
##$PKNL= yes
##$PPARMOD= 0
##$PPDIAG= 0
##$PPIPTYP= 0
##$PPMPNUM= 100
##$PPRESOL= 1
##$PSCAL= 0
##$PSIGN= 0
##$REVERSE= no
##$SF= 200.13
##$SI= 32768
##$SIGF1= 18.5376
##$SIGF2= -6.396296
##$SINO= 400
##$SIOLD= 32768
##$SREGLST= <1H.CDCl3>
##$SSB= 3
##$STSI= 0
##$STSR= 0
##$SW_p= 4401.40845070423
##$SYMM= 0
##$S_DEV= 0
##$TDeff= 0
##$TDoff= 0
##$TI= <>
##$TILT= no
##$TM1= 0
##$TM2= 0
##$TOPLEV= 0
##$USERP1= <user>
##$USERP2= <user>
##$USERP3= <user>
##$USERP4= <user>
##$USERP5= <user>
##$WDW= 1
##$XDIM= 8192
##$YMAX_p= 0
##$YMIN_p= 0
$$ End of Bruker specific parameters
$$ ---------------------------------
##NTUPLES= NMR FID
##VAR_NAME=  TIME,          FID/REAL,        FID/IMAG
##SYMBOL=    X,             R,               I
##VAR_TYPE=  INDEPENDENT,   DEPENDENT,       DEPENDENT
##VAR_FORM=  AFFN,          ASDF,            ASDF
##VAR_DIM=   8192,          8192,            8192
##UNITS=     SECONDS,       ARBITRARY UNITS, ARBITRARY UNITS
##FACTOR=    0.0002272,     1,               1
##FIRST=     0,             0,               0
##LAST=      1.8609952,     -26,             12
##MIN=       0,             -722547,         -722547
##MAX=       1.8609952,     890204,          890204
$$ Real data points
##PAGE= N=1
##DATA TABLE= (X++(R..R)), XYDATA
$$ plain form
0 0 0 0 0 0 0 0 8 -8 8 -8 9 -16 16 -24 32 -40 48 -57 72 -81 100 -121 144 -170 195 -227 267 -308 356 -405
30 -405 466 -529 599 -680 769 -866 971 -1087 1216 -1354 1508 -1673 1856 -2058 2274 -2511
46 -2511 2770 -3055 3366 -3706 4083 -4500 4962 -5474 6050 -6703 7443 -8294 9288 -10461
60 -10461 11873 -13613 15814 -18697 22660 -28464 37797 -55222 98663 -425509 -381858 890204
72 890204 237216 -722547 -232252 624653 110495 -426986 -39769 283827 -74179 -123948
82 -123948 130677 37713 -180917 26463 163527 -22522 -121235 -1019 27003 62974 75460
93 75460 -120459 -190165 181043 276747 -215521 -332217 233924 332070 -223781 -282657 199717
104 199717 181498 -160619 -48451 121366 -101251 -84191 240510 57253 -349694 -38319
$$ packed form
0@%%%%%%Qj6J6j6J7k5L2m0N6p2Q8j05J29j53J81k21K65l14L65m22M94n75O64p61
30d05Q71r95J128j279J449j635J837k058K303k570K862l181L529l914M332m785
46b511N281n825O421p072P789q583R462j0436J1524j2753J4146j5737J7582j9749
60a0461K2334k5486K9427l4511M1357n1124O6261r3019J53885n24172M3651J272062
72H90204o52988r59763M90295Q56905n14158n37481L87217L23596l58006m9769
82a23948K54625r2964k18630K07380J37064j86049r8713J20216K8022L5971J2486
93G5460j95919o9706L71208R5704m92268j16696N66141R8146n55851n8876M82374
104A99717j8219l42117J12168J69817k22617J7060L24701j83257m06947L11375
$$ plain form
114 -38319 409058 27271 -410634 -18582 351787 7975 -242018 9187 96608 -34747
124 -34747 61863 67027 -211559 -101898 331517 132749 -407741 -153990 432099 159631 -406482
135 -406482 -147558 339431 118492 -246342 -78058 144136 34026 -49884 4140 -22588
145 -22588 -27391 64617 28776 -73782 -5102 54010 -41209 -13031 103570 -38633 -171058
156 -171058 90821 232099 -133770 -274163 161913 288303 -172738 -269191 168067 217941
166 217941 -151612 -140043 129182 46021 -106291 51287 87875 -137628 -76356 200858 71860
177 71860 -232355 -72516 228617 75339 -191607 -77468 127711 75898 -47858 -69646
187 -69646 -35537 58996 109803 -46309 -165260 34070 195132 -25327 -197532 22025 174492
$$ packed form
114c8319M47377l81787m37905L92052L70369l43812k49993K51205Q7421j31355
124c4747R6610N164k78586J09661M33415j98768n40490K53751N86089k72468n66113
135d06482K58924M86989k20939l64834J68284K22194j10110q3910N4024k6728
145b2588m803R2008l5841j02558O8680N9112r5219K8178J16601j42203j32425
156a71058K61879J41278l65869j40393M36076J26390m61041r6453M37258M9874
166B17941l69553J1569K69225q3161j52312J57578L6588k25503O1272K77214j28998
177G1860l04215J59839L01133j53278k66946J14139K05179n1813j23756k1788
187f9646L4109R4533N0807j56112j18951J99330J61062k20459j72205K19557J52467
$$ plain form
198 174492 -25405 -132497 34226 79833 -45958 -25832 56555 -21459 -62145 55764 59216
209 59216 -73738 -45671 75361 21510 -63309 11076 42484 -47644 -18020 83012 -4657
220 -4657 -111214 21782 127611 -30741 -128403 31626 112970 -25558 -82736 15422 41918
231 41918 -3835 4036 -6117 -48648 12502 85922 -14106 -110654 11211 120126 -4767
242 -4767 -113716 -3770 93197 12728 -62215 -20752 25601 26681 11018 -30444 -42992 32037
254 32037 66336 -32360 -79359 31801 81334 -31351 -73981 30986 59588 -30836 -41761
265 -41761 29880 23542 -27466 -7798 22550 -3814 -14784 10435 4031 -12426 9025 11001 -23078
278 -23078 -7716 36499 4309 -47191 -1966 53763 1844 -54832 -3890 50149 8065 -39774
$$ packed form
198A74492j99897j07092J66723M5607j25791K0126Q2387p8014m0686J17909L452
209E9216j32954K8067J21032n3851q4819P4385L1408r0128K9624J01032q7669
220d657j06557J32996J05829j58352r7662J60029Q1344j38528n7178R8158K6496
231D1918m5753P871j0153m2531O1150P3420j00028r6548J21865J08915j24893
242d767j08949J09946R6967q0469p4943M1463M6353J080j5663m1462j2548P5029
254C2037L4299r8696m6999J11160M9533j12685m2630J04967K8602r0424j0925
265d1761P1641o338n1008J9668L0348k6364j0970K5219o404j6457K1451J976l4079
278b3078J5362M4215l2190n1500M5225N5729n1919n6676N0942N4039m2084m7839
$$ plain form
290 -39774 -13197 25205 18566 -7896 -22895 -9824 25578 26300 -25846 -39445 23727 48297 -19291
303 -19291 -52106 13147 51084 -5909 -45875 -1811 37433 9281 -27144 -16090 16062 21638
315 21638 -5506 -25966 -4067 28553 11854 -29637 -18101 28852 22395 -26512 -25361 22379
327 22379 26876 -16910 -27426 10091 26840 -2524 -25346 -5444 22864 13132 -19395 -20055 14934
340 14934 25638 -9537 -29346 3601 31059 2806 -30462 -8967 27990 14833 -23584 -19591
352 -19591 18039 23340 -11526 -25524 4818 26328 1867 -25531 -7987 23413 13435 -19955
364 -19955 -17903 15491 21301 -10220 -23638 4334 24715 1751 -24658 -7910 23280 13588 -20808
377 -20808 -18729 17117 22686 -12573 -25522 7153 26686 -1421 -26377 -4598 24254 10256
$$ packed form
290c9774K6577L8402o639k6462j4999J3071L5402P22n2146j3599O3172K4570o7588
303a9291l2815O5253L7937n6993l9966M4064L9244k8152l6425J1054L2152N576
315B1638k7144k0460K1899L2620j6699m1491J1536M6953o457m8907J151M7740
327B2379M497m3786j0516L7517J6749k9364k2822J9902K8308r732l2527o60L4989
340A4934J0704l5175j9809L2947K7458k8253l3268K1495L6957j3157l8417L993
352a9591L7630N301l4866j3998L0342K1510k4461k7398J7544L1400r978l3390
364a9955K052L3394N810l1521j3418K7972K0381k2964k6409J6748L1190r692l4396
377b0808K079L5846N569l5259j2949L2675J9533k8107k4956K1779K8852j3998
$$ plain form
389 10256 -20754 -15453 15841 19745 -10015 -22992 3522 24998 3197 -25635 -9658 24919
401 24919 15576 -22765 -20385 19352 23984 -14618 -25895 8929 26142 -2329 -24465 -4607 21198
414 21198 11721 -16289 -18272 10339 23951 -3634 -28039 -3021 30214 9127 -30152 -14001
426 -14001 27775 17229 -23269 -18511 16954 17820 -9555 -15557 1593 12123 6111 -8336 -13005
439 -13005 4840 18510 -2360 -22510 1173 24703 -1549 -25435 3032 24658 -5219 -22842
451 -22842 7075 20077 -7888 -16570 6679 12314 -3075 -7340 -2902 1634 10868 4691 -19782
464 -19782 -11379 28301 17992 -34899 -23708 38178 27772 -37091 -29289 31342 27767 -21131 -22875
477 -22875 7662 14919 7526 -4663 -22363 -6517 34926 17177 -43440 -25499 46869 30249
$$ packed form
389A0256l1010N301L1294L904k9760j2977K6514K1476k1801k8832J5977L4577
401B4919r343l8341K380L9737M632l8602j1277L4824J7213k8471k2136J9858K5805
414B1198r477k8010j983K8611J3612k7585k4405K5018L3235k1087l9279J6151
426a4001M1776j0546m0498M758L5465Q66k7375o002J7150J0530o012j4447m669
439a3005J7845J3670k0870k0150K3683K3530k6252k3886K8467K1626k9877j7623
451b2842K9917J3002k7965q682K3249N635j5389m265M438M536R234o177k4473
464a9782Q403L9680j0309n2891J1191O1886j0406o4863P802O0631l575m8898j744
477b2875L0537P257p393j2189j7700J5846M1443j7749o0617J7941P2368j6620
$$ plain form
489 30249 -44731 -30358 37671 25824 -26738 -17306 13643 6340 -202 5006 -11985 -14636 21610
502 21610 20426 -28054 -21057 31103 15992 -31363 -6039 29464 -7335 -26501 21511 23036 -33924
515 -33924 -19779 41621 16645 -42791 -13587 36255 9978 -22562 -5624 3117 160 19221
527 19221 6141 -41251 -12803 59355 18684 -70503 -22518 72788 23126 -65499 -19470 49646
539 49646 11438 -27298 712 2049 -15331 22595 30603 -42879 -43818 56165 52848 -60636 -55647
552 -55647 56272 51621 -44088 -40956 26603 25557 -6669 -8154 -12547 -7779 28569 19039 -39591
565 -39591 -22919 44734 17876 -44516 -4195 39895 -16430 -32780 40578 24564 -64417 -16984
577 -16984 83384 10708 -93938 -6190 93389 2755 -81191 160 58454 -3592 -28244 7945
$$ packed form
489C0249p4980J4373O8029j1847n2562R432L0949p303o542N208j6991k651L6246
502B1610j184m8480O997N2160j5111m7355K5324L5503l6799j9166M8012J525n6960
515c3924J4145O1400k4976n9436K9204M9842k6277l2540J6938Q741k957J9061
527A9221j3080m7392K8448P2158m0671q9187M7985R5306m9662q8625M6029O9116
539D9646l8208l8736K8010J337j7380L7926Q008p3482r39R9983l317j13484M989
552e5647J11919m651r5709L132O7559j046l2226j485m393M768L6348r530n8630
565c9591J6672O7653k6858o2392M0321M4090n6325j6350P3358j6014q8981M7433
577a6984J00368p2676j04646Q7748R9579r0634q3946Q1351N8294o2046k4652L6189
$$ plain form
589 7945 -5121 -13376 36707 19305 -61773 -24454 76535 27539 -78824 -27039 68669 22419
601 22419 -47766 -13315 19752 778 10912 13788 -39142 -27820 60752 38877 -72447 -44515
613 -44515 72975 43454 -62537 -35233 43296 21062 -18566 -3404 -7652 -14313 31672 28347
625 28347 -50546 -35434 62139 33065 -66139 -20557 63143 -1247 -55204 29267 44359 -59595
637 -59595 -33083 87262 23088 -107899 -15660 117651 10968 -114698 -8604 99005 7527
648 7527 -72885 -6731 40281 5472 -6131 -3233 -24152 189 46008 3037 -55944 -5277
660 -5277 52680 5625 -36900 -3303 11494 -1643 19515 8745 -51068 -16595 78305 23369
672 23369 -97100 -27034 105028 26008 -101339 -19583 87123 7944 -65001 7517 38683
$$ packed form
589G945j3066q255N0083j7402q1078L7319J00989m8996j06363N1785R5708m6250
601B2419p0185L4451L3067j8974J0134K876n2930J1322Q8572k1875j11324K7932
613d4515J17490k9521j05991K7304P8529k2234l9628J5162m248o661M5985l325
625B8347p8893J5112R7573k9074r9204M5582Q3700o4390n3957Q4471J5092j03954
637e9595K6512J20345o4174j30987R2239J33311j06683j25666J06094J07609r1478
648G527q0412O6154M7012l4809j1603K898k0919K4341M5819m2971n8981N0667
660e277N7957m7055m2525L3597J4797j3137K1158j0770n9813L4473R4900n4936
672B3369j20469P0066J32062p9020j27347Q1756J06706p9179p2945P2518L1166
$$ plain form
683 38683 -24370 -12227 39517 -10868 -49949 27960 53039 -37634 -47575 39734 33388 -35560
695 -35560 -12176 27063 -13127 -16830 38535 6996 -60091 601 74089 -5000 -78115 5877
707 5877 71144 -4003 -54097 394 29552 3659 -1415 -7258 -25991 9802 48399 -11086 -62197
720 -62197 11558 65331 -11814 -57389 12543 39862 -14110 -15511 16504 -11853 -19412 38287
732 38287 22133 -59780 -23582 73668 22793 -78412 -18997 74156 12186 -62201 -2770 45005
744 45005 -8015 -25580 18577 7128 -26861 7834 31081 -17625 -30044 21593 23319 -19998
756 -19998 -11454 14051 -4026 -5672 20762 -3334 -36137 11264 47352 -16966 -52588 19621
768 19621 50538 -19361 -41358 16551 26102 -12244 -7084 7308 -12926 -2681 31037 -1126
$$ packed form
683C8683o3053J2143N1744n0385l9081P7909K5079r0673r941Q7309o346o8948
695c5560K3384L9239m0190l703N5365l1539o7087O0692P3488p9089p3115Q3992
707E877O5267p5147n0094N4491K9158k5893n074n843j8733L5793L8597n9485n1111
720f2197P3755N3773p7145m5575O9932K7319n3972j401L2015k8357p559N7699
732C8287j6154q1913L6198R7250n0875j01205N9415R3153o1970p4387N9431M7775
744D5005n3020j7565M4157j1449l3989L4695K3247m8706j2419N1637J726m3317
756a9998Q544K5505j8077j646K6434k4096l2803M7401L6088o4318l5622P2209
768A9621L0917o9899k1997N7909R551l8346N160J4392k0234J0245L3718l2163
$$ plain form
780 -1126 -44692 3751 51923 -5260 -51891 5920 44890 -6084 -32271 6081 16204 -5837
792 -5837 883 5474 -16370 -4658 28367 3206 -35228 -638 36640 -2893 -32867 7306 25123
805 25123 -11955 -14831 16362 4000 -19590 5814 20882 -13170 -19621 17436 15606 -18395 -9122
818 -9122 16361 804 -12293 8280 7141 -16967 -2112 23770 -2073 -27801 4664 28157
830 28157 -5611 -24932 4734 18218 -2648 -9179 -325 -1063 3455 10946 -6428 -19257 8789
843 8789 24862 -10370 -27208 11117 26164 -11036 -22044 10333 15807 -8953 -8380 7139 962
856 962 -4786 5609 2176 -10419 791 13258 -3796 -13927 6800 12855 -9341 -10418 11216
869 11216 7272 -12076 -4041 11760 1227 -10184 809 7359 -1991 -3625 2274 -736 -1965 5057
$$ packed form
780a126m3566M8443M8172n7183m6631N7811L8970n0974k6187L8352J0123k2041
792e837O720M591k1844J1712L3025k5161l8434L4590L7278l9533k9974M0173J7817
805B5123l7078k876L1193j2362k3590K5404J5068l4052o451L7057j830l4001R273
818i122K5483j5557j3097K0573j139k4108J4855K5882k5843k5728L2465K3493
830B8157l3768j9321K9666J3484k0866o531Q854p38M518P491j7374j2829K8046
843H789J6073l5232j6838L8325J5047l7200j1008L2377N474k4760N73J5519o177
856I62n748J0395l433j2595J1210J2467j7054j0131K0727O055k2196j077K1634
869A1216l944j9348Q035J5801j0533j1411J0993O550r350j634N899l010j229P022
$$ plain form
883 5057 1128 -9015 -273 11923 -542 -13592 961 13673 -1045 -12317 670 9673 72
896 72 -6161 -1156 2273 2419 1563 -3678 -4883 4948 7427 -6042 -9000 6897 9669 -7317 -9479
911 -9479 7324 8677 -6702 -7462 5558 6133 -3794 -4715 1542 3448 1027 -2204 -3640 1062 6053
926 6053 63 -8034 -1217 9267 2394 -9585 -3550 8929 4556 -7382 -5428 5048 5944 -2290
940 -2290 -6121 -611 5848 3331 -5206 -5578 4196 7093 -3034 -7835 1762 7777 -555 -7018 -521
955 -521 5818 1363 -4377 -2053 2944 2588 -1641 -3011 590 3387 161 -3755 -706 4098 1079 -4353
971 -4353 -1463 4459 1871 -4284 -2411 3748 3038 -2791 -3728 1425 4386 295 -4830 -2197 5013 4138
987 4138 -4807 -5851 4162 7173 -3107 -7933 1737 8029 -99 -7393 -1573 6197 3261 -4432 -4695
$$ packed form
883E057l929j0143Q742J2196j2465j3050J4553J2712j4718j1272J2987R003r601
896G2o233N005L429J46q56n241j205R831K479j3469k958J5897K772j6986k162
911i479J6803J353j5379p60J3020N75r927r21O257J906k421l231j436M702M991
926F053n990q097O817J0484o873j1979O035J2479m373j1938J954J0476Q96q234
940b290l831N510O459k517q537l72R774K897j0127m801R597O015q332o463O497
955e21O339m455n740K324M997l56m229j370L601K797l226l916L049M804l019n432
971d353K890N922k588o155J873O159p10n829r37N153K961m091n125K633P210q75
987D138q945j044J0013L011j0280m826R670O292q128p294N820P770k936p693k63
$$ plain form
1002 -4695 2389 5850 -193 -6590 -1874 6908 3661 -6722 -5030 6075 5824 -5022 -6074 3617
1016 3617 5742 -1990 -4972 171 3869 1613 -2605 -3367 1282 4812 -135 -5958 -759 6656 1221
1031 1221 -6910 -1345 6646 1043 -5988 -502 4959 -201 -3673 833 2219 -1244 -713 1262 -699
1046 -699 -749 2011 -212 -3114 1610 4040 -3126 -4634 4592 5095 -5611 -5115 5980 4881 -5380
1061 -5380 -4200 3846 3154 -1347 -1658 -1852 -200 5336 2262 -8660 -4358 11331 6234 -12991 -7679
1076 -7679 13179 8342 -12010 -8237 9367 7069 -5775 -5235 1563 2791 2602 -193 -6245 -2182
1090 -2182 8850 3865 -10145 -4509 9986 3927 -8545 -2154 6106 -519 -3082 3700 -10 -6702
1104 -6702 2864 9003 -5012 -9932 6490 9270 -7130 -6804 7188 2936 -6802 1890 6319 -6778
$$ packed form
1002d695P084L461o043o397M716Q782l247j0383J692J1105k51j0846j052R691
1016C617K125p732k982N143L698k256m218p62M649L530m947n823N199P415n435
1031A221q131N565P991n603p031N486N461n160l472M506J386l463N31J975j961
1046f99n0K760k223k902M724K430p166j508R226N03j0706M96J1095j099j0261
1061e380J180Q046o92m501l11j94J652N536l074j0922M302J5689n097j9225N312
1076g679K0858m837k0352L773J7604k298j2844N40O798J228j89k795o052M063
1090b182J1032m985j4010N636J4495o059j2472O391Q260o625k563O782l710o692
1104f702R566O139j4015m920J6422K780j6400L26J3992m252r738Q692M429j3097
$$ plain form
1118 -6778 -5811 11016 5429 -13670 -5118 14198 4791 -12313 -4238 8102 3315 -2214 -2022 -4641
1132 -4641 236 11350 1669 -16958 -3583 20451 4991 -21372 -5656 19441 5236 -15068
1144 -15068 -3720 8772 1188 -1674 1939 -5302 -5116 11115 7790 -14930 -9228 16353 9115 -15262
1158 -15262 -7142 12088 3560 -7383 1238 2118 -6395 3062 11126 -7245 -14395 10090 15536 -11327
1172 -11327 -14086 11146 10122 -9844 -4093 7963 -3013 -6013 10077 4420 -15837 -3395 19197
1185 19197 2963 -19388 -3022 16178 3276 -9902 -3455 1486 3363 7918 -2858 -16833 2112
1198 2112 23872 -1332 -27972 824 28466 -942 -25333 1974 19110 -3920 -10821 6656
1210 6656 1804 -9756 6659 12716 -13301 -14835 17243 15577 -18119 -14514 16020 11628 -11581
$$ packed form
1118f778R67J6827n587j9099Q552J9316r407j7104Q075J2340m787n529J92k619
1132d641M877J1114r681j8627J3375K4034j5460k6363J5716K5097j4205k0304
1144a5068J1348J2492p584k862L613p241J86J6231l325k2720N702K5581p238k4377
1158a5262Q120J9230q528j0943Q621Q80q513R457Q064j8371p150K4485N446k6863
1172a1327k759K5232j024j9966N751J2056j0976l000J6090n657k0257J2442K2592
1185A9197j6234k2351J6366J9200j2902j3178O447M941J877M555j0776j3975J8945
1198B112K1760k5204k6640K8796K7642k9408k4391K7307J7136k3030o901J7477
1210F656m852j1560J6415O057k6017j534L2078j666l3696L605L0534m392k3209
$$ plain form
1223 -11581 -7203 5695 1876 568 3482 -6193 -7885 10352 10451 -12591 -10483 12813 7783 -11286
1237 -11286 -2566 8530 -4412 -5206 12149 2024 -19264 596 24516 -2290 -26830 3102
1249 3102 25699 -3085 -21006 2623 13367 -1926 -3838 1387 -6127 -1074 15152 1030 -21863
1262 -21863 -1001 25351 826 -25145 -251 21422 -921 -14925 2681 6768 -4774 1619
1274 1619 6905 -9087 -8672 14395 9496 -16998 -9107 16537 7298 -13434 -4234 8317 235 -2237
1288 -2237 3944 -3914 -7665 9091 10114 -12655 -10712 14201 9125 -13743 -5337 11627 -115
1301 -115 -8328 6617 4698 -13094 -1152 18629 -1602 -22078 3436 22986 -4190 -20925 4061
1314 4061 16234 -3251 -9403 2146 1521 -958 6274 -87 -12848 891 17276 -1495 -18976
$$ packed form
1223a1581M378J2898l819j308K914r675j692J8237R9k3042K108K3296n030j9069
1237a1286Q720J1096j2942p94J7355j0125k1288J9860K3920k6806k4540K9932
1249C102K2597k8784j7921K3629J0744j5293j912N225p514N053J6226j4122k2893
1262b1863K0862K6352k4525k5971K4894K1673k2343j4004J7606M087j1542O393
1274A619N286j5992M15K3067m899k6494P891K5644r239k0732R200J2551q082k472
1288b237O181p858l751J6756J023k2769J943K4913n076k2868Q406J6964j1742
1301a15q213J4945j919j7792J1942J9781k0231k0476K5514J9550k7176j6735K4986
1314D061J2173j9485o152J1549o25k479P232o361j2761J3739J6385j8771j7481
$$ plain form
1327 -18976 1984 17742 -2485 -13978 2996 8321 -3611 -1797 4168 -4546 -4495 9739 4418
1340 4418 -13137 -3786 14191 2414 -13040 -447 9968 -1992 -5615 4534 772 -6765 3796
1353 3796 8323 -7449 -8758 9711 7916 -10356 -5594 9535 2238 -7475 1944 4731 -6226 -1711
1367 -1711 10119 -1056 -12902 3236 14180 -4539 -13622 4998 11300 -4697 -7509 3788 2749
1380 2749 -2566 2281 1167 -6954 110 10496 -1224 -12569 2070 12876 -2664 -11512 2942
1393 2942 8775 -3016 -5223 2824 1364 -2437 2106 1716 -4721 -706 6138 -544 -6257 2032 5172
1408 5172 -3527 -3135 4965 588 -6079 2090 6664 -4442 -6558 6220 5732 -7137 -4108 7236
1422 7236 1947 -6533 603 5300 -3167 -3730 5448 2093 -7143 -642 8010 -539 -7958 1274 6981
$$ packed form
1327a8976K0960J5758k0227j1493J6974N325j1932J814N965q714N1J4234n321
1340D418j7555R351J7977j1777j5454J2593J0415j1960l623J0149l762p537J0561
1353C796M527j5772j309J8469j795j8272M762J5129p297r713R419K787j0957M515
1367a711J1830j1175j1846J6138J0944j8719r083J8620O302j5997k812J1297j039
1380B749n315M847j114q121P064J0386j1720j1345J4639J0806j5540q848J4454
1393B942N833j1791k207Q047j460l801M543l90o437M015O844o682n713Q289L140
1408E172q699L92Q100m377o667Q169M574j1106k116J2778m88j2869L029J1344
1422G236n289q480P136M697q467n63R178l355r236O501Q652q549p419R232N707
$$ plain form
1437 6981 -1545 -5221 1425 2979 -975 -529 288 -1815 549 3692 -1414 -4893 2221 5365 -2876
1452 -2876 -5077 3372 4183 -3574 -2840 3525 1351 -3092 114 2338 -1300 -1253 2082 -55 -2394 1495
1468 1495 2273 -2915 -1806 4099 1072 -4962 -268 5369 -490 -5234 1100 4592 -1566 -3478 1794
1483 1794 2033 -1852 -473 1691 -1076 -1447 2339 1103 -3207 -741 3586 389 -3495 -70 2962
1498 2962 -193 -2095 349 1062 -383 -30 296 -813 -18 1461 -393 -1774 973 1848 -1566 -1666
1514 -1666 2204 1370 -2689 -1010 3014 723 -3023 -505 2715 413 -2086 -449 1162 529 -80 -627
1530 -627 -1138 652 2182 -608 -3015 433 3467 -217 -3560 -113 3161 407 -2471 -664 1482
1545 1482 832 -427 -925 -614 889 1453 -760 -1992 634 2209 -458 -2071 369 1702 -305 -1136
$$ packed form
1437F981q526l676O646J554l954M46Q17k103K364L143n106l479P114L144q241
1452b876k201Q449Q11p757P34O365k174m443L206K224l638M7L335k137k339L889
1468A495P78n188J109N905l027o034M694N637n859m744O334L492o158j912N272
1483A794K39l885J379K164k767l71L786j236m310K466M327l197l884L425L032
1498B962l155j902K444P13j445L53L26j109P95J479j854j381K747Q75l414j00
1514a666L870q34m059J679M024k291l746K518L220k302k499J637J611o33o09n47
1530f27n11J790J530k790k407L448L034l684l343L447L274k754k878J807K146
1545A482o50j259m98L11J503N64k213j232K626J575k667j613K440J333k007q31
$$ plain form
1561 -1136 319 553 -353 33 418 -416 -365 664 279 -646 -10 512 -324 -270 741 16 -1159 181 1506
1580 1506 -285 -1729 198 1725 19 -1548 -375 1083 752 -479 -1157 -309 1452 1052 -1641 -1741
1596 -1741 1673 2264 -1500 -2534 1194 2559 -776 -2272 312 1780 214 -1078 -666 368 1053 355
1612 355 -1280 -906 1467 1308 -1432 -1437 1367 1393 -1164 -1125 890 760 -565 -287 223 -139 138 468 -485
1631 -485 -696 787 698 -1045 -588 1231 276 -1358 69 1370 -486 -1337 806 1165 -1056 -973 1106
1648 1106 706 -997 -390 677 55 -159 320 -424 -655 1077 969 -1612 -1213 2019 1372 -2159 -1383 2049
1666 2049 1343 -1600 -1083 928 773 -5 -329 -965 -131 1878 586 -2645 -962 3092 1179 -3241 -1235
1683 -1235 3015 1085 -2480 -761 1677 279 -756 271 -188 -825 1010 1244 -1609 -1446 1931 1388
$$ packed form
1561a136J455K34r06L86L85q34N1J029l85r25O36N22q36N4J011p25j175J340J325
1580A506j791j444J927J527j706j567J173J458l31j231o78Q48J761m00k693j00
1596a741L414N91l764j034L728J365l335j496K584J468j566j292M12J034O85o98
1612C55j635L74K373j59k740nK804K6k557L9K015j30j325K78N10l62K77L30r53
1631d85k11J483q9j743M57J819r55j634J427J301j856q51K143L59k221Q3K079
1648A106m00j703O07J067o22k14M79p44k31J732j08k581L99L232o47l531P76L432
1666B049p06k943N17K011j55p78l24o36Q34K009j292l231J683M054j913m420K006
1683a235M250j930l565J719K438j398j035J027m59o37J835K34k853J63L377n43
$$ plain form
1699 1388 -1950 -1069 1713 506 -1273 254 731 -1024 -161 1726 -317 -2153 686 2270 -880 -1960
1715 -1960 966 1317 -921 -293 859 -883 -763 2041 722 -2995 -691 3586 700 -3685 -741 3239
1731 3239 697 -2304 -595 943 350 590 -63 -2154 -345 3391 675 -4221 -955 4484 1045 -4203
1747 -4203 -937 3376 615 -2184 -90 808 -540 577 1172 -1671 -1608 2411 1827 -2656 -1668 2458
1763 2458 1206 -1791 -366 926 -639 121 1722 -1032 -2582 1778 3182 -2225 -3242 2349 2852
1778 2852 -2266 -1947 1947 603 -1565 883 1141 -2410 -879 3618 716 -4345 -708 4437 777
1793 777 -3891 -908 2736 994 -1163 -1009 -645 925 2356 -733 -3707 543 4503 -381 -4630 360
1809 360 4147 -449 -3037 782 1567 -1205 92 1730 -1607 -2169 2784 2457 -3444 -2441 3573 2150
$$ packed form
1699A388l338Q81K782j207j779J527M77j755Q63J887k043j836K839J584l150j080
1715a960K926L51k238O28J152j742J20K804j319l717K304M277k886m385K944L980
1731C239k542l001J709J538n93K40o53k091J809L736k716m896L266N439l439n248
1747d203L266M313k761k799K094Q98j348J117N95k843O3M019n84m483R88M126
1763B458j252k997J425J292j565P60J601k754j550M360J404n407j017N591N03
1778B852n118L19L894j344k168K448K58l551J531M497k902n061L637N145l660
1793G77m668K983L644j742k157J54L64J570J431l089k974M250L960m884m249M990
1809C60L787m596k588L819P85k772J297J638l337n62M953l27n901J003O014j423
$$ plain form
1825 2150 -3170 -1473 2380 541 -1330 539 187 -1625 787 2419 -1502 -2922 1861 2885 -1901
1840 -1901 -2382 1607 1355 -1159 -62 597 -1409 -90 2703 -305 -3698 540 4175 -566 -4048 463
1856 463 3334 -297 -2050 109 536 59 1185 -140 -2643 205 3784 -211 -4316 279 4313 -355
1872 -355 -3692 583 2655 -873 -1300 1241 -109 -1575 1361 1813 -2261 -1891 2719 1710 -2742 -1316
1888 -1316 2283 651 -1533 150 617 -998 291 1700 -1073 -2187 1582 2305 -1814 -2052 1716 1430
1904 1430 -1394 -515 883 -575 -318 1661 -174 -2561 611 3177 -868 -3302 987 3018 -928
1919 -928 -2261 795 1237 -615 -37 384 -1151 -185 2155 4 -2850 147 3102 -331 -2946 476
1935 476 2376 -663 -1546 828 566 -955 388 980 -1216 -959 1712 764 -1951 -455 1842 16
$$ packed form
1825B150n320J697L853j839j871J869l52j812K412J632l921j420M783J024m786
1840a901m81L989k52k514J097O59k006J319K793l008l393M238L635m741l482M511
1856D63K871l631j753K159M27m77J126j325k503K848L579l995m105M595M034m668
1872c55l337M275K072l528m27K541j350j466K936M52m074L70M610j009m452J426
1888a316L599j632k184J683M67j615J289J409k773j114L769P23m119k38L768k86
1904A430k824Q79J398j458K57J979j835k387L172K566m045k434M289K031l946
1919i28j333L056M42j852N78M21j535R66K340k151k854K997K955l433k615L422
1935D76J900l039q83K374k62j521J343N92k196K57K671r48k715J496K297j826
$$ plain form
1951 16 -1472 517 928 -1054 -280 1518 -305 -1821 811 1937 -1113 -1820 1200 1501 -1097 -924 843
1968 843 280 -479 419 77 -1008 287 1439 -585 -1623 817 1525 -897 -1191 902 637 -811 39
1985 39 638 -752 -454 1385 186 -1896 27 2144 -304 -2202 493 2008 -700 -1663 827 1164
2001 1164 -934 -667 952 202 -858 196 711 -401 -438 485 115 -385 237 230 -551 32 859 -284 -979
2020 -979 538 1075 -714 -955 801 736 -814 -394 740 -8 -606 392 414 -749 -219 984 -14 -1107
2038 -1107 203 1058 -386 -907 482 629 -579 -297 558 -58 -532 336 388 -588 -233 735 44 -805 185
2057 185 772 -378 -664 592 571 -639 -355 690 261 -638 -140 536 87 -297 -29 57 57 201 -84 -452
2077 -452 127 645 -187 -753 221 758 -290 -676 306 508 -348 -299 323 41 -338 149 300 -386 -274 482
$$ packed form
1951A6j488J989M11j982P74J798j823j516K632J126l050p07L020L01k598J73J767
1968H43n63p59Q98l42j085J295J152k024j038K440P08k422k94K093k65j448Q50
1985C9N99j390K98J839j199k082J923K117k448j898K695J515k708r63K490L37
2001A164k098K67J619p50j060J054N15j112l7R23l70n00O22pp81N83Q27j143o95
2020i79J517N37j789k41J756o5j550M20J134p48n98R98K2j163N30J203r98j093
2038a107J310Q55j444n21J389J47j208K82Q55o16m74Q68N2r76L55R68o91q49R90
2057A85N87j150k86J256k1j210K84J045m29q99M98O76m49l84K68Q6%J44k85l68
2077d52N79N18q32n66R74N37j048l86R82K02q56M9O22k82l79M87J51o86J12P56
$$ plain form
2097 482 188 -552 -125 506 20 -447 81 298 -154 -155 224 74 -228 54 236 -75 -145 124 57 -94 90
2118 90 68 -213 -6 393 -2 -479 52 555 -45 -534 39 474 -6 -357 -37 186 54 -26 -104 -164 95 301
2140 301 -107 -388 44 425 -35 -410 17 333 -7 -221 -22 85 24 15 -28 -137 33 217 -36 -239 70
2161 70 221 -60 -171 106 140 -98 -44 175 8 -162 69 202 -43 -144 43 121 -18 -43 -12 -25 76 107 -105
2184 -105 -169 112 214 -129 -248 77 228 -59 -209 -1 127 30 -60 -97 -9 108 84 -132 -173 127 191 -116 -200
2207 -200 103 208 -65 -145 31 120 25 -60 -34 20 95 33 -79 -42 108 61 -94 -46 120 50 -91 -11 95 -2 -83
2232 -83 39 51 -50 -45 47 23 -47 16 2 -48 13 37 -36 -68 44 58 -70 -68 76 68 -76 -60 50 37 -23 -38 -1 25
2260 25 67 2 -75 -16 118 26 -87 -12 129 48 -99 -18 98 40 -71 -27 40 66 7 -59 -40 31 53 -52 -88 37
$$ packed form
2097D82k94p40M27O31m86m67N28K17m52jL79j50l02K82J82l11p0K69o7j51J84
2118I0k2k81K07L99l95m77N31N03o00m89N73M35m80l51L20K23j32q0p8o0K59K06
2140C01m08k81M32L81m60l75M27L16l40k14J99J07o1rm3j09J70J84k53k03L09
2161G0J51k81j11K77L4k38N4K19j67j70K31J33k45j01J87P8j39k5L1j3J01L1k12
2184a05o4K81J02l43j19L25J51k87j50K08J28r7r0l7Q8J17k4k16m1L00O4l07q4
2207b00L03J05k73q0J76Q9r5q5K6N4P5o2j12L7J50m7j55M8J66p0j41Q0J06r7q1
2232h3J22J2j01NR2k4p0O3j4n0O1K4p3l2J12J4j28KJ44qj44J6J10j3o0j5L7K6
2260B5M2o5p7N9J34r2j13P5J41q1j47Q1J16n8j11M4O7K6n9o6J9P1K2j05l6J25
$$ plain form
2286 37 78 -52 -98 36 57 -24 -53 -25 8 17 4 -53 -46 51 58 -65 -78 76 63 -41 -62 59 57 -33 -15 20 29 21 38 -24
2316 -24 -24 67 81 -41 -28 73 60 -20 12 48 -16 -5 60 -12 -76 24 104 -27 -104 32 79 -20 -56 13 -20 -15 49 -14 -105
2345 -105 7 125 -36 -163 3 143 -19 -147 -4 59 14 -1 -1 -63 19 152 9 -183 -4 235 38 -207
2367 -207 -33 186 54 -97 -32 22 23 89 23 -162 -36 223 82 -252 -76 228 69 -176 -64 86 12 5 31
2390 31 -106 -85 180 137 -241 -170 249 180 -241 -155 173 87 -91 -13 -16 -77 85 174 -150 -229 186 274 -160 -247 152
2415 152 207 -96 -83 31 -21 40 185 -64 -283 123 400 -99 -414 90 373 -80 -296 56 133 -34 25 14
2437 14 -228 -58 343 66 -462 -85 458 98 -436 -115 271 64 -126 -49 -68 -15 234 67 -366 -101 451
2458 451 122 -454 -123 388 78 -262 -1 110 -74 61 221 -197 -298 314 365 -346 -363 371 341 -291 -224
$$ packed form
2286C7M1j30m6J34K1q1k9K8L3Rj3n7PR7Pj23j3J54j3j04k1J21kr0J8L5RqJ7o2
2316b4%R1J4j22J3J01j3q0L2L6o4J1O5p2o4J00Q0j31p7J36M7r9l6O9l3NO4o3r1
2345a05J12J18j61j27J66J40j62j28J43O3m5j5%o2Q2J33j43j92J79K39j97k45
2367b07J74K19j32j51O5N4JO6o6j85J26K59j41l34J76L04j59k45J12J50p4pK6
2390C1j37K1K65m3l78P1M19o9m21Q6L28q6j78P8lo1J62Q9l24p9M15Q8m34q7L99
2415A52N5l03J3J14n2O1J45k49k19M06K77m99l15N04K83m53k16L52P7j67N9j1
2437A4k42J70M01k77n28L77N43l60n34L21L86k07j90P7j9N3K49j67m33K65N52
2458D51l29n76L31N11l10l40K61J11j84J35J60m18j01O12N1p11j7P34l0o32O7
$$ plain form
2479 -224 196 96 -80 93 -35 -259 121 367 -194 -466 209 462 -231 -397 180 227 -146 -21 78 -182 -64
2500 -64 364 19 -521 -11 605 4 -604 -32 472 24 -311 -13 104 17 136 32 -342 -39 506 54 -566
2521 -566 -21 591 -4 -471 108 323 -185 -90 289 -75 -366 246 459 -352 -469 416 427 -403 -335 312 183
2542 183 -224 -35 47 -160 72 283 -167 -382 241 383 -296 -347 300 176 -288 19 236 -249 -183 467 133
2563 133 -642 -67 764 27 -780 39 754 -42 -562 104 404 -100 -139 136 -50 -102 246 99 -342 -42 389
2584 389 -29 -367 127 223 -240 -105 330 -88 -423 237 423 -393 -434 454 346 -491 -236 471 75 -420 104
2605 104 297 -271 -186 388 75 -450 46 455 -131 -361 172 218 -210 -23 243 -158 -203 393 182 -543 -103
2626 -103 632 42 -650 36 613 -137 -476 177 323 -252 -158 289 -31 -289 148 233 -252 -148 282 11 -264
$$ packed form
2479b24M20j00j76J73j28k24L80K46n61k72O75K53o93j66N77M7l73J25R9k60J18
2500f4M28l45n40N10O16o01o08N72N04m48l35K98J17q7J19j04l74L03N45m52o20
2521e66N45O12n95m67N79K15n08R5L79l64k91O12K13q11j17Q85J1q30O8O47j29
2542A83m07J89Q2k07K32K11m50k15O23J42o79n1O47j24m64L07K17m85O6O50l34
2563A33p75N75Q31p37q07Q19P15p96n20O66L00n04l9K75j86n2L48j47m41L00M31
2584C89m18l38M94R6m63J35M35m18l35O60J86q16m1Q88j08q37K55P07l96m95N24
2605A04J93n68Q5N74l13n25M96M09n86k30N33M6m28J87K66m01m5N96k11p25M40
2626a03P35n90o92O86N77p50l39O53J46n75R4M47l20k58M37Q5m85J04M30k71k75
$$ plain form
2647 -264 128 143 -285 -81 404 -27 -489 136 512 -242 -478 306 385 -315 -211 356 -2 -335 199 324 -373
2668 -373 -255 501 218 -540 -132 534 88 -420 10 304 -48 -73 101 -117 -136 294 148 -424 -130 493 106
2689 106 -486 -18 419 -91 -302 188 151 -300 -19 365 -134 -442 193 387 -256 -340 247 205 -211 -21 139
2710 139 -149 -71 322 -15 -445 63 519 -82 -482 107 406 -104 -216 97 24 -31 212 43 -403 -20 573
2731 573 32 -646 -3 631 3 -554 17 382 -40 -172 63 -39 -103 221 142 -374 -170 441 150 -459 -132
2752 -132 354 42 -247 24 87 -117 56 197 -203 -270 287 298 -314 -251 297 201 -206 -47 139 -78 -4 265
2774 265 -65 -381 158 515 -148 -526 173 483 -125 -388 55 208 2 -9 -99 -197 130 354 -178 -504 179
2795 179 527 -179 -509 154 397 -121 -260 87 17 -59 144 35 -333 -28 449 21 -516 5 477 -19 -395
$$ packed form
2647b64L92J5m28K04M85m31m62O25L76p54k36P84P9p00J04N67l58l33N34J25o97
2668c73J18P56k83p58M08O66m46n08M30K94l52k5J74k18j9M30j46n72K94O23l87
2689A06n92M68M37n10k11M90l7m51K81L84m99l08O35J94o43q4N87m2m16J90J60
2710A39k88P8L93l37m30N08M56o01m00N89K99n10j12L13p3n5K43j69m46L83N93
2731E73n41o78O43O34o28n57N71L65m22j32K35j02o4L24p9n16K04O11k91o09L27
2752a32M86l12k89K71O3k04J73J41m00o7N57J1o12O3N48r6m07J59J86k17P4K69
2774B65l30l16N39L57o63l78O99L10o08k63M43J53k06j1r0r8L27K24n32l26O83
2795A79L48p06l30O63K43n18j39L47p0p6K03j09l68L05M77m28n37N21M72m96l76
$$ plain form
2816 -395 40 282 -45 -91 90 -74 -95 202 112 -252 -96 313 83 -249 -1 165 -66 -27 150 -114 -253
2837 -253 249 314 -374 -372 438 383 -435 -375 389 281 -294 -180 140 30 -4 111 -146 -264 247 347 -332 -419
2859 -419 328 428 -287 -364 211 235 -56 -79 -42 -78 189 285 -295 -397 374 475 -383 -465 406 425 -330 -258 261
2882 261 106 -147 98 86 -269 -2 384 -51 -440 50 415 -74 -339 34 131 -82 51 62 -293 -86 473
2903 473 75 -622 -102 630 91 -578 -105 434 61 -214 2 -37 -85 318 187 -495 -255 670 373 -671
2923 -671 -376 637 407 -456 -290 232 188 42 2 -315 -174 502 330 -651 -448 681 479 -648 -443 495
2943 495 308 -329 -132 118 -101 34 304 -187 -501 252 588 -244 -577 184 451 -90 -241 -21 -77 123
2963 123 375 -184 -632 209 845 -181 -891 166 828 -91 -618 87 328 -51 66 106 -412 -166 739 273
$$ packed form
2816c95M35K42l27m6J81j64k1K97r0l64J56M09k30l32K48J66k31L9J77k64j39
2837b53N02O5o88KQ10n5q18O0P64j08n75J14L20j10l4J15k57j18N11J00o79q7
2859d19P47J00p15p7N75K4k91k3L7l6K67R6n80j02P71J01q58q2Q71J9p55P2N19
2882B61j55k53K45j2l55K67L86m35l89M90L65m89k65L73R7k13J33J1l55K07N59
2903D73l98o97N20P32n39o69M73N39l73k75K16l9m8M03j31o82K40R25k97j044
2923f71K95J013k30q63J66N22m4j46m0l17J41O76j72r81K03J129k02j127K05R38
2943D95j87o37J97K50k19J35K70m91l14P53L36q32l33P61K67n41j51K20n6K00
2963A23K52n59m48Q41O36j026p10J057O62r19n27P05K41l79J17M0n18K46R05m66
$$ plain form
2983 273 -913 -379 964 447 -862 -462 619 427 -288 -340 -84 172 427 10 -712 -223 843 335 -906
3002 -906 -393 791 315 -607 -171 349 -48 -62 312 -172 -573 327 771 -391 -848 375 798 -279 -625
3021 -625 139 350 67 24 -155 -360 270 694 -320 -873 309 950 -250 -818 190 557 -118 -178 95
3040 95 -237 -106 645 144 -963 -235 1141 292 -1183 -393 998 381 -739 -351 302 212 76 -73 -487
3059 -487 -110 752 243 -930 -322 925 313 -821 -212 581 20 -320 222 53 -494 204 707 -330 -832
3078 -832 417 859 -363 -750 263 533 -91 -202 -88 -181 242 520 -356 -796 425 911 -443 -905 412
3097 412 693 -400 -403 334 -18 -350 413 313 -789 -352 1040 402 -1171 -405 1134 385 -951 -326 653
3116 653 270 -279 -153 -72 73 429 49 -647 -86 744 91 -735 27 628 -171 -418 419 186 -637 56
$$ packed form
2983B73j186N34J343n17j309M00J081j92p15n2K56K56K55m17p22M89J066n08j241
3002i06N13J184m76r22M36N20l97j4L74m84m01R00M44j162m57J223M23j077l46
3021f25P64K11k83m3j79k05O30M24j014n53J182O41j200n68J008L67o75o0K73
3040I5l32J31P51n01j107P28J376q49j475P90J391o17j120L88O53r0j36j49m14
3059d87L77Q62n09j173O08J247o12j134O09P93n61l40N42j69n47O98N03j037n02
3078h32J249M42j222l87J013K70o24j11J14r3M23K78q76m40J221M86j354m62J317
3097D12K81j093lP37l52l32P63j00j102M37J392o38j573P66J539p49j336O25R79
3116F53l83n49J26Q1J45L56l80o96N61Q30o53q26P62O01p99k47Q37k33q23O93
$$ plain form
3136 56 841 -243 -964 376 975 -423 -917 391 698 -331 -411 199 74 -76 220 -55 -520 140 646
3155 646 -254 -692 290 552 -355 -319 355 -2 -377 373 405 -698 -365 970 362 -1121 -283 1159 219
3174 219 -1041 -101 851 18 -537 125 270 -201 15 276 -222 -254 377 181 -426 -22 414 -195 -312 405
3194 405 148 -657 -4 807 -169 -940 245 910 -344 -818 375 602 -386 -330 328 11 -309 246 222 -479
3214 -479 -140 605 58 -618 50 535 -130 -302 253 46 -321 270 408 -531 -414 758 414 -875 -328
3233 -328 908 207 -836 -48 695 -143 -503 288 289 -452 -118 497 -46 -502 127 368 -189 -215 153 -78
3253 -78 -115 317 19 -595 38 783 -149 -897 183 883 -236 -747 276 556 -297 -237 316 -41 -306 369
3273 369 329 -569 -280 699 256 -689 -178 604 93 -399 14 147 -119 128 227 -372 -300 552 324 -641 -277
$$ packed form
3136E6P85j084p21J340N99j398m94J308L07j029q0O10j25j50K96k75m65O60N06
3155F46r00m38R82K62r07L6O74l57l75P50L2j103L33J335o08j483Q38J442r40
3174B19j260R40R52q33n55O62J45m71K16K61m98l2O31j96o07M04M36o09j17P17
3194D05k57q05O53Q11r76p71J185O65j254m74J193K27r88N6O58l17l20N55k4p01
3214d79L39P45n47o76O68M85o65j72N55k07l67N91J38r39J17J172l44j289N47
3233c28J236p01j043P88P43q38l60P91Jp41L34O15n43m56O29K41n57k6L68k31
3253g8l7M32k98o14O33P45r32p48J080P00j119n11J023K80q53O0N53l57k65O75
3273C69m0q98K89R79m43r45N11P82n11m92M13J33k66K47R9n99P2Q52k28r65L64
$$ plain form
3294 -277 637 187 -570 -42 391 -171 -247 337 69 -535 64 611 -183 -651 228 578 -214 -419 168 170 -109
3315 -109 85 32 -347 44 581 -50 -739 96 791 -75 -691 80 550 -2 -248 12 -29 12 306 10 -548
3336 -548 -18 672 25 -728 -34 646 -6 -480 37 243 -126 -6 203 -242 -308 425 327 -521 -354 526 311
3357 311 -476 -209 325 84 -160 86 -25 -244 166 385 -275 -454 318 445 -288 -377 237 250 -127 -22 39
3378 39 -196 99 462 -126 -600 194 710 -147 -723 113 654 -30 -463 -31 241 109 3 -168 -246 189 434
3399 434 -209 -554 199 555 -194 -498 145 311 -162 -134 144 -119 -179 316 202 -469 -192 538 228 -546 -185
3420 -185 464 180 -294 -108 124 5 97 72 -224 -130 358 210 -383 -196 366 164 -272 -59 137 -59 45
3441 45 227 -192 -379 311 502 -372 -634 374 637 -321 -604 201 469 -92 -329 -90 97 195 51 -297
$$ packed form
3294b77R14m50p57N28M33n62p6N84k68o04N99N47p94m68Q79L50p92k05N87Kk79
3315a09J94n3l79L91N37o31o89Q35O95q66o16P71M70n52k46K60m1M1K94k96n58
3336e48N30O90o47p53O94O80o52m74N17K06l69J20K09m45o6P33r8q48J67Q80k15
3357C11p87K67N34k41k44K46j11k19M10K19o60j79P72J27p33q9O14J3l77J05O1
3378C9k35K95L63n88m74P94N16q57n76Q36N41o84m33M32K72j32j06j71p8M35K45
3399D34o43l45P53L56p49l04O43J66m73K8K78k63o0M95j14o71K77P30l10p74L61
3420a85O49k84m74J86K32j19R2k5k96R4M88j48n93J87N62k02m36K13J96j96J04
3441D5J82m19j87O90J91q74k62J008K63r58k83Q05K68n61k37K39J87R8j44l48
$$ plain form
3461 -297 -253 335 373 -349 -406 296 391 -222 -249 138 106 -24 94 -20 -268 93 433 -90 -506 107 534 -64
3483 -64 -453 49 316 -11 -105 -7 -105 6 297 25 -445 -59 511 68 -525 -77 402 69 -254 -21 35 -50
3505 -50 155 142 -333 -275 442 362 -478 -427 411 456 -295 -437 115 347 137 -222 -303 79 493 111 -575 -187
3527 -187 605 288 -500 -249 405 229 -204 -80 35 -100 147 291 -246 -462 323 582 -320 -626 266 576
3547 576 -204 -451 72 234 -4 -34 -40 -218 31 379 -28 -519 -59 487 101 -407 -179 230 202 20 -192
3568 -192 -253 164 481 -70 -617 -18 672 115 -584 -152 441 203 -182 -118 -67 73 342 73 -571 -202 712
3589 712 352 -712 -406 654 436 -479 -396 281 247 -65 -119 -167 -83 276 242 -383 -399 354 432 -280 -410 135
3611 135 276 -21 -81 -109 -143 222 373 -258 -540 253 622 -165 -571 110 462 -4 -192 -40 -37 87 347 -42
$$ packed form
3461b97M4N88L8p22n7P02R5o13k7L87l2j30J18j14k48L61L40n23m16O13M27n98
3483f4l89N02K67l27r4R8r8J11K91k72m70L86N70m43n93M48M79l33l23K33N6q5
3505e0K05j3m75N8P17q0q40N1Q38M5p51j42N52K32k10l59q1L82M14l82o86L88
3527a87P92l17p88K51O54j76m33J24J15j35K47J44n37k16P85K59r02l06Q92L10
3547E76p80k47N23J62k38l0oj78K49L48m07m91M60N46l86n08K28M09k8j82k12
3568a92o1M17L17n51n47N99O90n57o99M32N93k38l85O4N1J40K69k69o44L69R14
3589G12l60j064L06J060k18r15Q3O77l4l12n4m8Q4L59l4o25j6P53P8p12j30N45
3611A35J41k97o0k8l4L65J51o31k82P93L69p87m06O81L52m66j88J52LJ24K60l89
$$ plain form
3633 -42 -584 -2 747 97 -789 -156 734 202 -544 -216 300 169 -25 -98 -240 -17 442 142 -562 -268 559
3654 559 301 -482 -310 276 246 -49 -163 -192 19 374 134 -560 -254 616 293 -592 -284 532 217 -374 -6
3675 -6 249 -160 -84 437 34 -578 63 751 -34 -754 23 701 54 -528 -72 300 152 -39 -139 -202 142
3696 142 422 -85 -515 31 527 5 -438 -42 250 -9 -8 15 -240 -62 455 118 -613 -153 694 175 -636
3717 -636 -175 526 101 -327 3 110 -95 115 221 -321 -293 452 368 -467 -277 512 238 -416 -50 340 -124
3738 -124 -234 339 135 -503 -62 633 16 -679 -2 629 42 -492 -69 308 87 -113 -138 -137 150 275 -167
3759 -167 -399 163 410 -174 -316 182 146 -203 48 225 -278 -269 514 292 -648 -274 749 250 -739 -165 688
3780 688 95 -519 81 379 -161 -177 308 38 -358 113 383 -176 -332 201 220 -193 -45 137 -120 -57 303
$$ packed form
3633d2n42N82P49o50q86O33Q90n32p46L28N16j31j94p3j42K23M59l00p04K94Q27
3654E59k58p83J72N86l0k95j14k9K11L55k40o94L06Q70l23q85L08Q16l15n91L68
3675fK55m09P6N21m03o12O41O88p85p20P77O78o47n82M56L72j48j91j00o3L44
3696A42K80n07m30N46M96n22m43L96K92k59JK3k55J78N17l37p31M60Q47n19q11
3717f36M61P01m25m28L30J07k05K10J06n42K8P45q4q35J90P89k74o54L66L90m64
3738a24j10N73k04o38M41O95o17o95O77O31n87n34M23L77k21k00k5JK87J25m42
3759a67k32N62K47n84j42M98l6l49K51J77n03RP83k22r40L74J023m99r89N74Q53
3780F88n93o14O00K98n40j6M85k70l96M71K70n59j56N33J9m13J48J82k57O3L60
$$ plain form
3801 303 0 -462 38 565 -108 -568 91 470 -104 -357 58 147 -43 36 9 -247 27 397 -63 -469 96
3822 96 465 -107 -377 159 215 -204 -14 301 -191 -322 432 391 -540 -349 656 336 -641 -224 594 122 -481
3843 -481 42 363 -158 -222 274 90 -357 -14 378 -35 -347 -1 197 17 -68 -102 -129 150 291 -206 -454
3864 -454 222 522 -269 -549 260 459 -239 -292 209 116 -171 124 173 -327 -149 517 157 -570 -116 634 127
3885 127 -514 -26 423 7 -202 87 47 -145 142 218 -273 -256 339 256 -352 -207 262 123 -184 -30 32 -100
3907 -100 79 209 -200 -307 246 339 -261 -331 222 226 -150 -90 86 -78 41 246 -91 -395 164 536 -148 -561
3929 -561 155 558 -92 -420 84 294 -20 -64 -2 -124 45 331 -20 -419 37 503 -17 -473 -22 370 -31
3950 -31 -255 33 52 -62 96 107 -225 -168 287 177 -312 -203 257 180 -159 -131 24 39 113 60 -230 -159 331
$$ packed form
3801C03l03m62N00N27o73m60O59L79n74k53M15Q9j90P9k7k56K74L70m60m06N65
3822I6L69n72k70N36N6m19J90L15m92j31P54m1r31J91J005l20r77M17Q18m72o03
3843d81N23L21n21o4M96j84m47L43L92m13l12L46J98j80q5l4k7K79J41m97k48
3864d54O76L00p91k80Q09J99o98n3N01r3k87K95M9n00J78O66l60p27M54P50n07
3885A27o41M88M49m16k09K89m0j92K87P6m91J7N95q3o08J45M69j39l07J54O2j32
3907a00J79J30m09j07N53R3o00p0N53Ml76O0J76j64J19K05l37l04N59L72o84m13
3929e61P16M03o50l28N04K10l14m4O2j22J69K86l51l99M56M66n20m56M51L92m01
3950c1k24K88J9j14J58J1l32N7M55j10m89J09M60p7l39K8J55J5P4n3k90P1M90
$$ plain form
3973 331 237 -360 -246 365 247 -266 -153 195 62 -68 103 0 -235 88 401 -102 -452 120 523 -54
3993 -54 -478 14 425 70 -274 -122 91 191 49 -228 -207 232 282 -230 -357 167 307 -158 -241 104 112 -89
4015 -89 18 85 -160 -125 237 134 -331 -170 316 212 -253 -197 172 193 -27 -132 -79 102 206 -12 -264 -28
4037 -28 328 95 -285 -77 248 60 -133 3 39 -84 88 189 -153 -304 188 382 -207 -473 157 459 -107
4058 -107 -419 1 322 67 -209 -152 56 197 55 -225 -160 206 222 -161 -230 121 203 -52 -120 32 26 16 116
4081 116 21 -184 2 270 78 -265 -99 273 140 -156 -158 58 170 70 -130 -169 89 271 -23 -331 -31
4102 -31 307 30 -287 -56 161 31 -70 34 -61 -134 159 235 -242 -340 260 416 -235 -460 195 457 -106 -399
4124 -399 11 315 84 -176 -155 67 175 48 -146 -109 143 156 -47 -117 0 70 78 41 -139 -148 175 249 -174 -333
$$ packed form
3973C31r4n97J14O11j18n13J13L48j33j30J71j03k35L23L13n03l50N72M03n77
3993e4m24M92M11l55l44J52K13J00j42k77K1M39N0n12j27N24J40m65q3L45Qk01
4015h9J07O7k45L5L62j03m65J61M86j04m65N6L69K1k20j05N3J81J04k18k52K36
4037b8L56k33l80K08L25j88j93J36L6j23J72J01l42j51M92J94n89k66O30L02n66
4058a07l12M20L21k55k76N7K08J41j42k80O5L66J6l83o9L51Q2k55o8J52oj0J00
4081A16r5k05J86K68j92l43J66L72j33k96kK16J12j00k00l9K58J82k94l08L00
4102c1L38k77l17K31K17j30j01J04r5p3K93P6m77r8O00J56o51k25O55K62n63k93
4124c99M10L04k31k60K1K22J08j27j94L7K52J3k03p0J17P0Ql7j80rL23P4m23j59
$$ plain form
4148 -333 151 377 -113 -339 48 253 -22 -145 24 -11 -52 120 37 -267 -133 315 149 -350 -237 284 227
4169 227 -216 -232 89 157 35 -72 -162 -23 230 133 -269 -195 267 263 -167 -248 104 230 39 -139 -138 53 226
4192 226 46 -293 -150 284 217 -279 -209 196 161 -122 -76 44 -69 10 190 -68 -311 60 370 -74 -443 34
4214 34 369 -23 -323 -8 179 14 -76 -11 -78 -7 175 58 -223 -108 219 139 -147 -157 49 166 121 -90 -217
4237 -217 88 365 20 -442 -54 511 117 -470 -127 406 104 -283 -34 158 -46 -34 133 -61 -235 116
4257 116 288 -156 -327 123 281 -84 -245 12 117 48 -25 -117 -81 153 168 -159 -212 167 206 -126 -146 104 46
4280 46 -66 114 36 -207 -20 328 22 -371 -6 401 37 -315 8 254 13 -94 38 -72 -52 204 81
4301 81 -323 -106 381 129 -416 -146 356 95 -298 -85 176 -7 -98 48 -35 -128 74 168 -125 -195 110 161
$$ packed form
4148c33M84K26m90k26L87K05k75j23J69l5m1J72q3l04J34M48j66m99J13N21n7
4169B27m43j6L21O8j22j07r0J39K53r7m02P4M62mm30q1L52J26j91j78JJ91J73
4192B26j80l39J43M34o7m96P0M05l5k83M6J20j13P9J80k58k43L71L10m44l69M77
4214C4L35l92l00L15J87j65r0O5o7P1J82j17k81J15L27q0k86j0K06J17m5k11j27
4237b17L05K77l45m62L88N65l94n87L43N33l02l87K49J92k04J2J67j94j74L51
4257A16J72m44j71M50J58l65j61K57J05o9p3r2L6K34J5l27n3L79L9l32k0K50n8
4280D6j12J80p8k43J87L48l06l93L65M07l64l52L23K46k41j07J32j10K0K56j23
4301H1m04K17M87k52n45K70N02k61l93K13K61j83r1J46q3r3K02R4k93p0L05N1
$$ plain form
4323 161 -75 -88 26 16 62 84 -127 -140 205 224 -226 -204 257 200 -228 -104 253 4 -197 138 182 -243 -150
4346 -150 362 136 -417 -100 453 88 -401 -74 302 6 -215 -7 67 -52 46 45 -169 -88 215 56 -250 -67
4368 -67 205 19 -146 -2 34 -55 42 110 -133 -132 180 137 -213 -106 226 64 -154 17 123 -106 -23 192 -19
4391 -19 -239 94 309 -134 -305 174 279 -182 -182 173 57 -169 50 138 -182 -147 284 115 -352 -118 355 93
4413 93 -342 -92 258 61 -158 -47 29 14 63 6 -135 -2 194 18 -169 20 136 -32 -53 91 -22 -109
4435 -109 162 188 -203 -187 282 216 -274 -169 301 115 -215 -13 197 -67 -111 179 67 -255 -6 311 -18
4456 -18 -338 18 312 -27 -245 8 140 -1 -45 -19 -75 29 158 -36 -220 14 225 -1 -205 -14 131
4477 131 32 -42 -7 -59 30 181 16 -218 4 304 35 -265 -2 255 25 -156 44 90 -86 23 142 -79
$$ packed form
4323A61k36j3J14j0M6K2k11j3L45J9m50K2M61n7m28J24L57k49k01L35M4m25R3
4346a50N12k26n53L17N53l65m89L27L76k96k21K08P4j19R8jk14Q1L03j59l06J83
4368f7K72j86j65J44L6q9R7O8k43JL12m3l50J07L32j62k18J71J06k29Q3K15k11
4391a9k20L33K15m43j71M79J05m61%L55j16k26K19Q8l20L5M31j69m67K34M73k62
4413I3m35K50L50j97k19J11P6j5M9n7j41J33J96j76j87J89J16j68k1J44j13q7
4435a09K71K6l91J6M69o6m90J05M70j86l30K02K10k64m4K90j12l22K49L17l29
4456a8l20L56K94l39k18K53J32j41m4K6n6J04J29j94j84K34K11k26k04J91J45
4477A31r9p4L5n2Q9J51j65k34K22L00k69l00K63K57k30j81K00M6j76J09J19k21
$$ plain form
4499 -79 -177 150 216 -157 -213 142 184 -120 -145 64 64 3 3 -58 -97 68 151 -81 -228 82 215 -53 -173 10 145
4524 145 34 -17 -38 -39 76 146 -67 -210 73 243 -9 -209 2 196 41 -95 -33 28 46 98 -31 -159 20
4547 20 219 3 -225 -18 223 33 -180 -19 130 -7 -38 31 -20 -103 42 124 -96 -180 63 164 -50 -178
4569 -178 4 143 55 -109 -86 49 140 49 -148 -68 159 130 -108 -126 71 118 0 -59 -16 16 68 74 -53 -130 82
4594 82 181 -27 -210 11 224 24 -176 -62 124 80 -56 -90 -20 66 60 -39 -136 13 135 26 -154 -50 117
4617 117 28 -91 -52 25 12 24 31 -59 -74 74 98 -49 -122 31 173 -4 -138 -30 103 76 -42 -109 23 149
4641 149 75 -106 -99 125 140 -37 -137 57 98 8 -55 -27 -21 25 51 -56 -136 -2 164 -1 -198 -35 160 59
4665 59 -154 -86 95 56 -38 -68 -25 28 85 2 -97 -32 127 50 -84 -52 87 63 -18 -6 -23 -14 90 75 -87 -81 113
$$ packed form
4499g9r8L27O6l73n6L55M2l04k5K09%o1%o1l9J65Q3k32j47L10J33k68j20J83J35
4524A45j11n1k1jJ15P0k13j43K83J70k52k00K11J94j55j36O2O1J8N2j29j28J79
4547B0J99k16k28K07K41j90k13J61J49j37l1O9n1q3J45Q2k20q4K43J01k14j28
4569a78J82J39q8j64K3J35R1r1j97Q0K27k9k38j8J97M7j18n9M3L2N2Oj27p7K12
4594H2R9k08j83K21K13k00k00J14J86m4j36l4P0Q6or9r7J49J22j09j80J04J67
4617A17q9j19L9P7j3J2Pr0j5J48K4j47p3J53J42j77j34J08J33k7j18o7J32J26
4641A49p4j81PK24J5j77j00J94M1r0o3K8OM6K6j07q0J34J66j65j97J63J95j01
4665E9k13O8J81l9r4l0M3N3N7q3r9O5J59p7j34L2J39k4q1J2j7RJ04j5j62OJ94
$$ plain form
4692 113 153 -85 -131 84 140 -25 -81 -5 55 54 28 -48 -76 40 130 -48 -170 4 166 16 -145 -42 116 74
4716 74 -53 -91 -12 95 51 -107 -124 98 140 -60 -107 55 107 -40 -30 28 -12 -21 117 59 -143 -61 210 67 -181
4741 -181 -71 201 94 -135 -47 106 41 -26 8 1 -31 27 75 -60 -100 70 97 -40 -88 -18 34 46 3 -91 -35 123
4767 123 100 -142 -114 143 130 -106 -136 85 78 -48 -36 4 -36 43 95 -75 -131 108 184 -73 -151 111 178 -63 -102
4792 -102 82 60 -65 22 63 -57 -32 131 61 -151 -40 146 56 -102 -55 81 19 -7 -45 -56 9 86 -10 -122 -11
4817 -11 139 -4 -115 -1 81 -25 -20 66 -55 -92 94 137 -147 -137 162 169 -164 -127 168 124 -88 -56 72 32 -1
4842 -1 46 -32 -55 78 111 -70 -95 98 100 -61 -48 63 27 -35 48 15 -105 7 124 -47 -146 28 111 -53 -118 38
4868 38 30 -54 20 39 -67 -60 130 50 -148 -33 172 30 -144 -12 127 -9 -44 52 16 -40 63 90 -81 -88 136
$$ packed form
4692A13M0k38m6K15N6j65n6P6O0jk6p6k8J16R0j78j22J74J62j50j61J03J58m2
4716G4j27l8P9J07m4j58j7K22M2k00m7J62N2j47J0N8m0rJ38n8k02Q2K71j43k48
4741a81J10K72j07k29Q8J53o5o7L4pl2N8M8j35m0J70K7j37m8P0N2J2m3r4N6J58
4767A23k3k42K8K57j3k36l0K21pj26J2M0m0P9N2j70n6K39P6k57p8K62O7k41l9
4792a02J84k2j25Q7M1j20K5J63p0k12J11J86r0j58M7J36o2k6l8j1O5P7r6j12J11
4817a1J50j43j11J14Q2j06NQ6j21l7J86M3k84J0K99Pl33L7K95m4k12L2J28m0l3
4842aM7p8k3J33L3j81k5J93Kj61J3J11l6o2Q3l3j20J12J17j71r9J74Q3j64o5J56
4868C8qq4P4J9j06PJ90q0j98J15K05j42j74J32J39j36l5R6l6n6J03K7j71pK24
$$ plain form
4893 136 108 -127 -72 116 59 -79 -14 41 -6 12 50 -87 -87 90 96 -152 -80 133 52 -132 -33 90 -31 -95 43
4918 43 35 -120 -36 136 -11 -160 30 146 -28 -102 49 67 -32 1 53 -52 -45 130 52 -116 -7 160 32 -107
4942 -107 9 110 0 -20 37 19 -35 62 75 -99 -56 121 46 -114 -45 114 8 -67 16 28 -64 20 75 -73 -99
4967 -99 95 100 -137 -103 127 44 -129 -15 103 -43 -101 77 58 -116 -28 150 25 -161 -3 140 1 -103 20
4990 20 72 -10 3 10 -31 28 93 17 -90 22 113 12 -81 9 70 -20 7 16 -33 -32 92 15 -134 -43 140 38 -165 -50
5018 -50 116 -11 -100 12 46 -60 -11 90 -34 -84 73 106 -70 -90 99 90 -68 -42 48 12 -22 37 22 -66 12 109
5044 109 -1 -97 4 106 3 -57 11 49 37 11 -21 -36 45 91 -37 -102 37 97 -30 -101 15 59 -21 -40 -5 -27
5070 -27 -23 55 32 -101 -41 103 45 -107 -32 104 42 -61 -24 43 10 -1 25 3 -31 38 52 -19 -52 48 72 -32 -55
$$ packed form
4893A36k8k35N5J88n7j38O5N5m7J8L8j37%J77Ok48P2K13q1j84R9J23j21o4J38
4918D3qj55Q4J72j47j49J90J16j74p4J51J8r9L3N2j05PJ75p8j68J09J67j28j39
4942a07J16J01j10k0N7j8n4R7J3j74M3J77p5j60O9J59j06p5Q3J2r2Q4N5j48k6
4967i9J94Nk37L4K30q3j73J14J18j46n8J78j9j74Q8J78j25j86J58J43j39j04J23
4990B0N2q2J3Pm1N9O5p6j07J12R1j01r3R0O1r0K7Rm9JJ24p7j49R1J83j02k03J15
5018e0J66j27q9J12L4j06M9J01j24n0J57L3j76k0J89rj58K6R0l6l4N9j5q8P8R7
5044A09j10r6J01J02j03o0O8L8j2k6l2j5Q1M6j28o5J39O0j27p1J16M4q0j9L5k2
5070b7MP8k3j33O0J44n8j52P5J36o2j03L7O7l3j1K6k2l4O9J4p1l3J00K4j04k3
$$ plain form
5097 -55 -5 28 13 7 -36 -6 30 57 -26 -70 20 47 -15 -69 -22 35 24 -27 -40 -24 36 53 -52 -82 40 87 -20 -77 -4
5126 -4 81 -1 -65 -24 13 25 18 -6 -27 7 53 21 -51 -18 48 68 -30 -51 44 63 24 -36 -16 36 43 -1 -40 -30 26 27 -12 -63
5158 -63 -9 57 7 -25 -47 13 23 4 -29 -40 12 34 -15 -68 -26 50 40 -46 -66 1 60 9 -56 -25 55 61 -22 -66 10 78 24
5189 24 -64 -26 64 59 -25 -43 30 40 8 4 7 7 6 37 10 -52 8 58 10 -71 -14 47 17 -32 -30 -9 10 15 -36 -55 4 58 -11 -64
5223 -64 -30 64 13 -45 -7 20 9 -2 7 -48 -37 41 46 -34 -52 52 79 -28 -46 26 73 25 -13 -33 4 79 15 -75 -46 96
5253 96 61 -87 -55 39 38 -54 -23 30 -14 -6 31 1 -67 -15 64 -11 -85 -31 49 2 -43 -22 7 -2 23 -23 -48 6 63 -7 -71
5284 -71 -6 70 5 -58 -5 50 12 -6 9 -3 4 58 30 -27 5 61 23 -19 -11 34 26 9 13 -27 -18 76 51 -90 -63 92 47 -101
5316 -101 -66 86 40 -83 -49 55 0 -74 1 16 -42 -25 38 15 -38 -39 41 30 -16 -47 -10 41 32 -63 -37 65 77 -58
$$ packed form
5097e5N0L3j5om3L0L6K7q3m4R0K7o2n4M7N7j1n1j3J6O0J7j05l0J22M7j07n7P3
5126dQ5q2o4M1L7J2pk4k1L4M6l2p2L3O6K0r8k1R5J9l9o0K0N2Pm4l9J0N6Jl9n1
5158f3N4O6n0l2k2O0J0j9l3j1N2K2m9n3M2P6j0q6k0O7N9n1o5L1Q0Oq3m4P6O8n4
5189B4q8L8R0nq4j8P3J0l2mL%jL1k7o2O0N0m8q1N7O1l0m9KK1J9Nn1j9N9N4o9n3
5223f4L4R4n1n8L8K7j1j1Rn5J1P8Nq0j8J04K7j07j8P2M7m8l8k0L7P5o4r0K9J42
5253I6l5j48L2R4jr2L1N3m4QL7l0o8N2P9p5p4N4Q0m7m5K1K9rK5m6k5N4N7p0o4
5284g1O5P6o5o3N3N5l8j8J5j2PN4k8n7L2N6l8m2QM5qj7Mm0RR4k5j41K7J55m5j48
5316a01L5J52m6j23L4J04n5p4P5J5n8J7O3k3n3jQ0j1m6l1L7N1rr5K6J02J2j35
$$ plain form
5344 -58 -60 93 66 -59 -29 67 42 -11 21 47 -20 -27 79 41 -86 -50 70 22 -80 -43 65 -2 -46 -9 9 -7 11 -7
5372 -7 -68 -34 44 9 -66 -26 33 27 -30 -8 24 4 21 23 -13 1 47 19 -36 7 32 3 -31 34 18 -29 26 81 -31 -71 72
5403 72 108 -55 -70 67 98 -58 -73 55 42 -56 -34 28 -30 -36 34 6 -75 -13 70 -9 -52 -27 13 -6 0 -17 -38 3 53
5432 53 -23 -58 35 86 -14 -68 39 94 -40 -20 67 21 -46 38 77 -32 -58 72 75 -63 -45 81 59 -61 2 58 13
5459 13 -9 39 -17 -47 32 41 -61 -64 54 41 -42 -25 51 3 -28 29 7 -47 12 74 -29 -95 30 64 -51 -68 53 66
5487 66 -41 4 66 -8 -30 52 33 -53 5 78 1 -75 23 78 -27 -17 47 29 -45 18 51 -37 -48 52 50 -70 -59 64
5515 64 10 -53 -2 27 -9 -8 24 -20 -56 33 42 -64 -46 52 29 -70 -15 60 -13 -35 31 30 -64 8 96 -15 -89 40 118 -30
5545 -30 -72 64 71 -40 -21 58 22 -34 27 31 -26 -16 61 25 -42 7 36 -21 -40 9 -2 -25 26 16 -60 -55 64 19 -75 -24
$$ packed form
5344e8kJ53k7j25L0R6k5n3L2K6o7pJ06l8j27L6J20m8j02L7J08o7m4L7J8j6J8j8
5372go1L4P8l5p5M0N9on7K2L2k0J7Kl6J4M6k8n5M3K5k9l4O5j6m7N5N5j12m0J43
5403G2L6j63j5J37L1j56j5J28j3r8K2O2n8oP0k8q1O2Q3p9m3K5M0j9Oj7k1M1N0
5432E3p6l5R3N1j00n4J07N5j34K0Q7m6o7Q4L9j09k6J30Lj38J8J26k2j20O3N6m5
5459A3k2M8n6l0P9Rj02lJ18j3q3J7P6m8l1N7k2n4N9O2j03o6J25L4j15j7J21J3
5487F6j07M5O2p4k2Q2j9q6N8P3p7p6R8N5j05J0O4j8p4O3L3q8j1J00kj20J1J23
5515F4n4o3N1K9l6JL2m4l6Q9Rj06J8R8k3r9N5P5p3k2O6jr4P2Q8j11p4J29P8j48
5545c0m2J36Pj11J9P9l6n6O1Mn7J0P7l6o7M9K9n7j9M9j1k3N1j0p6NJ19m5r4N1
$$ plain form
5575 -24 67 -4 -59 28 4 -36 -4 50 -21 -46 26 62 -66 -55 70 68 -48 -17 74 34 -37 16 37 -5 9 63 2 -51 30
5604 30 73 -17 -61 36 46 -13 -33 24 20 -7 9 4 -21 7 23 0 -47 9 17 -30 -6 0 -4 -19 26 30 -60 -24 76 8 -61 -18 82
5637 82 24 -52 -12 53 10 -26 28 27 -24 39 63 -9 -30 56 68 -16 -47 35 64 -13 -13 20 15 -5 -11 -7 -19 -5 25 4 -27 12 23
5670 23 -18 -27 1 -17 1 11 -8 -27 -7 47 2 -38 -3 36 -3 -32 -25 31 23 7 14 -6 11 29 24 -23 -13 48 35 -25 -10 50 31
5703 31 11 5 4 19 12 21 -13 -17 10 40 -26 -32 3 36 -20 -42 -11 22 1 -26 -17 -3 1 -31 -8 -3 -6 -1 13 -17 -25 17 27 0 -7 1 23
5740 23 24 6 -20 -7 31 30 -7 -10 31 30 12 -13 24 37 19 12 8 25 31 33 -27 -29 11 27 -33 -44 11 50 -15 -39 1 26 -18 1 -1
5775 -1 -23 -10 30 -7 -50 -25 25 31 -41 -33 46 15 -3 -5 11 11 28 33 -1 0 30 42 -16 -10 25 32 6 13 15 1 26 29 0 -15 11 61
5811 61 -13 -30 29 38 -22 -28 12 -2 -5 5 5 -38 10 54 -5 -66 -11 70 -11 -73 -12 48 -4 -31 21 2 -3 7 24 -10 -8 49 28
$$ packed form
5575b4R1p1n5Q7k4m0L2N4p1k5P2L6j28J1J25kj16L1R1m0p1N3K1m2J4N4o1n3Q1
5604C0M3r0m4R7J0n9k0N7mk7J6nk5K8J6k3m7N6Qm7K4Omj5M5Mr0L6J00o8o9M3J00
5637H2n8p6M0O5m3l6N4jn1O3K4p2k1Q6J2q4l1Q2K9p7%L3nk0oMj2J4L0k1l1L9J1
5670B3m1rK8j8J8J0j9j9K0N4m5m0L5L9l9k9PN6qj6Pk0J7J8nm7J0O1j3o0J5O0j9
5703C1k0ojJ5pRl4mK7L0o6oL5L3n6k2L1L3k1k7RJ4Ml2K3NlNJ4l0qM2J0k7pQK2
5740B3Jj8k6J3L8jl7lM1jj8k5L7J3j8pmJ7OKo0kM0J6o0j1N5L9o5k4M0K5m4J9k
5775ak2J3M0l7m3K5N0Op2QP9l1j8kJ6%J7Nl4JL0J2n8OL5Pk6PKj4K5Lk9j5K6N0
5811F1p4j7N9Ro0oM0j4lJ0%m3M8M4n9o1N5Q1q1o2O1O0n2k7N2j9nJ0J7l4KN7k1
$$ plain form
5844 28 -25 -5 42 25 -10 9 -1 6 47 39 -33 -7 64 38 -38 -32 44 14 -35 -13 26 -9 -12 13 -10 -45 17 38 -27 -42 19 43
5876 43 -22 -42 17 16 -8 17 -7 -30 -14 41 -6 -67 -2 61 10 -55 14 59 0 -11 16 26 8 21 21 -7 -2 35 25 -19 4 36
5908 36 19 5 17 -2 -24 51 23 -61 -25 54 31 -57 -33 43 12 -58 -23 23 -4 -12 2 1 -29 17 35 -27 -40 38 50 -19 -32
5939 -32 29 23 1 15 1 -13 21 58 -8 -40 38 56 -27 -28 15 37 -17 -7 6 -17 9 26 6 -35 17 30 -8 -35 10 28 -14
5970 -14 -18 25 -26 -23 27 5 -60 -39 60 5 -61 -35 30 20 -38 8 14 3 17 13 -22 -4 43 24 -37 6 55 22 6 7 25 3 12
6003 12 38 -19 -19 55 40 -39 -28 46 27 -44 -23 30 13 -26 22 11 -32 -4 55 -18 -69 7 27 -34 -59 24 26 -18 11 10 -31 11
6035 11 41 -2 -53 15 70 -1 -51 24 40 -17 -19 35 -7 -5 44 50 -45 -22 93 53 -46 2 65 12 -48 5 48 -18 -4 20 -22
6066 -22 -20 35 41 -47 -24 56 10 -49 8 19 -44 -28 34 -19 -68 7 70 -38 -65 49 81 -63 -25 55 26 -37 16 35 -25 1
$$ packed form
5844B8n3K0M7j7l5J9j0PM1qp2K6P1k6p6OP6l0m9K2L9l5lK5k3l5O2K1o5j5O1K4
5876D3o5k0N9jk4K5k4k3J6N5m7o1O5O3n1o5O9M5n9j1K7J0j8J3%k8NL7j0m4K3L2
5908C6j7j4J2j9k2P5k8q4L6P9k3q8K4P6l1p0L5M6k7qJ4jl0M6J8o2j3P8J2o9j3
5939c2O1ok2J4j4j4L4L7o6l2P8J8q3jM3K2n4J0J3k3K6J7k0m1N2J3l8k7M5J8m2
5970a4mM3n1LN0k2o5K1R9n5o6K6O5j0n8M6Oj1J4ml5J8M7j9o1M3M9l3j6JJ8k2R
6003A2K6n7%P4j5p9J1P4j9p1K1N3j7l9M8j1m3K8N9p3n1P6K0o1k5Q3Km4K9jm1M2
6035A1L0m3n1O8N5p1n0P5J6n7kN4m2KM9Or5K3J15m0r9M8O3n3o0N3M3o6J4K4m2
6066b2KN5Oq8K3Q0m6n9N7J1o3J6O2n3m9P5O3j08k7J14L2j44L8Q0k9o3N3J9o0K6
$$ plain form
6096 1 47 -2 -68 18 69 -21 -58 55 68 -16 -13 58 10 -36 36 45 -54 -36 82 31 -91 -7 81 1 -67 -2 31 -29 -28 16 -17
6127 -17 -21 31 19 -68 -21 46 -4 -59 26 42 -31 -28 50 6 -56 20 78 -21 -74 69 88 -68 -45 85 51 -48 -4 62 -2 -14
6157 -14 52 16 -50 -7 47 -6 -49 34 59 -35 -16 35 7 -36 43 12 -65 -23 52 8 -84 18 60 -30 -68 23 37 -33 -29 32
6187 32 -9 -33 29 41 -46 -11 66 21 -43 6 55 -10 -29 38 33 -27 19 59 -17 -42 52 72 -41 -49 53 43 -42 -32 40 -26
6217 -26 -28 9 -4 -47 -18 40 -21 -65 11 36 -29 -31 12 3 -16 9 -1 -51 -12 44 -6 -57 -6 42 -11 -38 35 53 -4 -18 46 32
6249 32 -8 6 61 -14 -20 36 59 -19 -20 53 30 -13 -13 -8 12 -3 9 -5 -13 24 5 -26 -27 15 0 -33 -13 7 -8 -20 11 -1 -36
6282 -36 -2 29 -6 -49 6 51 -7 -44 7 45 -1 -26 4 30 -15 -7 16 16 22 9 14 3 21 11 10 -1 6 -9 24 2 6 -10 -19 24
6316 24 13 -33 -20 23 28 -27 -23 1 2 -19 -20 -4 -12 -23 -12 -4 -18 4 15 -25 -29 -7 39 -8 -41 7 12 1 -7 -2 -8 -18 36 22 -5 -7
$$ packed form
6096AM6m9o6Q6N1r0l7J13J3q4LP1m8m6P2Rr9J8J18n1j22Q4Q8q0o8O5L3o0JM4l3
6127a7mN2j2q7M7O7n0n5Q5J6p3LP8m4o2P6N8r9n3J43J9j56K3J30l4r9M4O6o4j2
6157a4O6l6o6M3N4n3m3Q3K5r4J9N1k8m3P9l1p7M2P5m4r2J02M2r0l8R1J4p0MO1
6187C2m1k4O2J2q7L5P7m5o4M9M9o5j9O7no0M6M0p6k5R4K0j13qJ02j0q5J0P2o6
6217b6kL7j3m3K9N8o1m4P6K5o5kM3rj9K5j0n0L9N6n0n1N1M8n3k7P3J8n7j4O4j4
6249C2m0J4N5p5oN6K3p8jP3k3m3%NK0j5J2j4qL7j9l1jM2j5l3K0K0j5j2L1j2l5
6282c6L4L1l5m3N5M5n8l7N1L8m6k5L0K6m5QK3%Oj3Nj1J8j0jj1Pj5L3k2Mj6rM3
6316B4j1m6J3M3Nn5MK4Jk1jJ6qj1J1Qj4K2J1m0mK2M6m7l3M8Nj1qNoj0N4j4k7k
$$ plain form
6352 -7 55 26 -25 -21 34 19 -23 -20 27 14 -14 -2 6 -14 4 20 -5 -27 -1 22 -7 2 1 -22 -4 -8 -21 -39 -12 35 -27 -62 4 39
6386 39 -34 -49 15 36 -32 -25 34 16 -14 17 32 -20 -19 44 45 -44 -27 80 44 -12 -18 31 20 16 4 -17 -1 24 26 -45 -12 40 7
6419 7 -43 -2 31 -16 -25 12 -9 -69 -6 39 -38 -87 12 30 -46 -68 12 53 -21 -20 5 1 3 19 0 -29 26 42 -15 -29 27 44 -13
6452 -13 11 25 11 0 35 36 -55 -15 71 34 -46 4 79 11 -60 -14 30 -15 -15 -11 -16 -16 9 -12 -57 -16 27 7 -64 -14 10 -22 -24
6485 -24 9 -12 -36 3 39 -19 -44 45 52 -18 -54 42 38 -9 -11 13 6 16 17 -5 -8 29 37 -30 -16 59 42 -11 -21 31 -11 -7 20 8
6519 8 -45 -15 83 -12 -72 -7 65 -5 -67 -7 23 -9 -22 -23 -12 0 9 -16 -31 12 21 -18 -18 13 26 -15 4 24 -19 -10 59 43 -51
6552 -51 -39 63 41 -55 -17 39 30 0 12 29 11 14 22 -31 1 47 39 -31 -18 -1 0 -18 -8 -11 -27 9 23 -28 -35 40 34 -52 -43 21
6586 21 21 -46 -41 13 7 -9 4 -9 -20 18 37 -22 -43 53 33 -43 -16 27 1 -2 29 20 -26 5 76 16 -51 10 84 19 -48 23 47
$$ packed form
6352gO2k9n1MN5j5m2LM7j3k8J2Qk0J8J6k5k2K6K3k9Rjk3J8mj3j8K7M7o2l5O6L5
6386C9p3j5O4K1o8PN9j8l0L1J5n2JO3Jq9J7J07l6n6oM9j1mj2k1J6K5Kp1L3N2l3
6419Gn0M1L3m7rL7k1o0O3M5p7m9R9J8p6k2Q0M1p4JK5mKJ6j9k9N5J6n7j4N6J7n7
6452a3K4J4j4j1L5Jr1M0Q6l7q0N0P5o8p1M6M4m5%Mn%K5k1m5M1M3k0p1N0K4l2k
6485b4L3k1k4L9L6n8k5Q9Pp0l6R6mm7kK4pJ0Jk2lL7Qo7J4P5j7n3j0N2m2MK7j2
6519Hn3L0R8r5o0O5P2p0o2O0L0l2j3jJ1J2Rk5j5M3Rl9%L1J3m1J9K0m3RO9j6r4
6552e1J2J02k2r6L8N6rl0J2J7j8LQn3L2M6qp0J3J7Jj8J0lj6L6J4n1pP5oq6RO4
6586B1%o7NN4oj6J3j3j1L8J9n9k1R6k0p6K7M3k6lL1rm6L1P1o0o7O1P4o5o7P1K4
$$ plain form
6619 47 16 6 11 -11 -8 43 5 -48 -19 41 -8 -60 -25 35 -21 -13 4 -18 -24 19 24 -68 -29 68 26 -76 -35 84 15 -47 14 59
6651 59 -14 -4 79 0 -39 28 81 -41 -44 71 49 -36 -25 53 -6 -31 12 14 -18 -3 57 -24 -69 34 71 -37 -45 19 16 -44
6681 -44 -12 46 -41 -54 44 16 -92 -22 78 -33 -74 10 56 -32 -37 42 19 -55 32 54 -27 -17 73 40 -74 -6 76 -2 -60
6710 -60 48 55 -44 -8 71 3 -67 25 85 -50 -57 75 32 -67 -41 59 -10 -60 14 18 -59 -17 41 -12 -57 17 58 -60 -59 35
6740 35 18 -45 1 43 -31 -29 60 27 -85 -12 98 -3 -91 20 89 -21 -56 53 56 -30 5 57 -7 -42 55 46 -40 -18 64
6769 64 -5 -52 14 44 -51 -43 34 -9 -53 15 48 -54 -48 51 33 -69 -32 70 15 -52 6 61 -33 -18 53 18 -59 8 59 -30
6799 -30 -43 39 35 -35 -5 43 -8 -10 53 27 -35 12 81 1 -51 38 74 3 -51 49 30 -53 -13 43 -15 -38 16 41 -37 -46 36
6830 36 16 -53 -17 24 -19 -43 14 -12 -21 9 20 -41 -38 36 15 -25 -12 56 0 -28 20 33 -17 -36 38 29 -35 1 58 16 -50 26
$$ packed form
6619D7l1j0Nk2LN1l8n3K9O0m9n2L5O0n6QJ7k2oM3Nr2L9R7m2j02M1J19o9o2O1M5
6651E9p3J0Q3p9l9O7N3j22lJ15k2q5J1P8n9k5M3Kl2J5O0q1m5J03L7j08qO4lo0
6681d4L2N8q7j3R8k8j08P0J00j11m1Q4M6q8nP9k3p4Q7K2q1J0R0l3j14O8Q2p8n8
6710f0J08Pr9L6P9o8p0R2O0j35pJ32m3r9K6J00o9n0P4Mp7M2N8n3m5P4M1j18JR4
6740C5j7o3M6M2p4KQ9l3j12P3J10j01q8J11O9j10l5J09Lq6L5N2o4l5R7rq6K2Q2
6769F4o9m7O6L0r5QP7m3m4O8L3j02OR9j8j02L7J02n5o7N8N5r4J5P1l5p7O7N1q9
6799c0j3Q2mp0L0M8n1kO3k6o2M7O9q0n2Q9L6p1n4J00j9q3M0N6n8k3N4K5p8rQ2
6830C6k0o9L6M1m3k4N7k6rL0J1o1LP4k1m0J3O8n6k8M8J3n0j9P4ro4L6N7m2o6P6
$$ plain form
6862 26 69 0 -33 26 39 -10 -3 10 9 3 14 -4 -19 -3 29 -8 -32 23 23 -29 -20 16 4 -38 10 16 -25 -41 32 27 -39 -20 37 36
6896 36 -36 -3 35 14 -12 19 13 -11 6 32 2 -9 28 33 1 -3 40 15 -5 -8 23 2 -14 19 7 -35 0 10 2 -39 -18 26 -9
6929 -9 -43 -10 -13 -1 -5 -5 -3 -3 -4 -19 -20 -7 27 1 -33 -5 28 -29 -15 16 27 -14 12 43 10 -19 35 51 -23 -19 44 36 -14 -34 30
6964 30 20 1 17 38 -4 -8 25 25 -30 -12 16 -4 -39 -12 8 -8 -5 -18 -16 -27 10 8 -45 -21 27 -10 -59 -3 32 -9 -14 11 17 -16
6998 -16 2 41 -16 -20 47 43 -15 -33 44 41 -29 -30 33 24 -21 12 14 0 17 28 -15 -23 17 29 -18 -4 23 7 -38 2 2 -38 -17 36
7032 36 -16 -50 -8 33 -14 -62 5 43 -28 -32 6 11 -15 1 11 -25 -12 26 13 -38 3 53 6 -14 12 34 2 8 47 7 -5 43
7064 43 44 -28 0 49 37 -9 -17 38 23 -26 13 17 -16 2 15 -18 -43 25 13 -40 -44 18 -12 -29 -6 3 -8 -16 19 -4 -45 5 51
7097 51 -2 -57 -1 42 -3 -37 2 38 21 -1 -5 11 25 54 3 -19 18 41 9 -6 22 8 -6 24 17 -25 3 50 13 -37 -23
$$ packed form
6862B6M3o9l3N9J3m9PJ3joJ1j8j5J6L2l7k4N5%n2RL6j2m2M8Om1j6P3no6J9N7j
6896C6p2L3L8k1k6L1ok4J7K6l0j1L7Nl2mM3k5k0lL1k1j6L3j2m2L5J0qm1K1M4l5
6929il4L3lJ2m%K%jj5jJ3L4k6l4K8L3n7J4L1J1m1K6L1l3k9N4J6p4MO3qn0k0O4
6964C0j0j9J6K1m2mL3%n5J8K8k0l5K7K0j6Lj3Kj1L7kn3K4M8l7m9N6L5m1nK5Ol3
6998a6J8L9n7mO7mn8j8P7lp0jO3rm5L3Kj4J7J1m3qM0J2m7J4K7j6m5M0%m0K1N3
7032C6n2l4M2M1m7m8O7L8p1mL8Nk6J6J0l6J3L8j3n1M1N0m7k0K6K2l2OL9m0j2M8
7064D3Jp2K8M9j2m6qN5j5m9L9Ml3J8J3l3k5O8j2n3mO2l0j7K3Rj1qL5k3m1N0M6
7097E1n3n5N6M3m5l4L9L6j7k2mJ6J4K9n1k2L7K3l2j5K8j4j4L0pm2K8M7l7n0J4
$$ plain form
7128 -23 46 16 -38 -29 21 2 -23 4 -4 0 6 20 -25 0 24 17 -11 -2 24 23 -3 -6 8 12 22 37 -25 -13 46 44 -14 -19 41 47 2 1 26
7165 26 11 23 31 -6 -17 35 34 -33 -47 26 32 -28 -27 3 0 -25 20 -18 -52 -13 23 -33 -54 -4 38 -18 -36 -15 13 -21 -5 20 -12
7198 -12 10 47 -21 -46 9 51 -1 -18 27 24 -12 -1 24 -33 -2 54 37 -38 7 62 33 -46 -4 52 -7 -32 1 17 -22 2 19
7229 19 -27 -38 39 37 -48 -35 40 6 -30 -10 16 -5 -8 6 -25 -57 27 36 -30 -57 66 45 -52 -7 58 21 -36 28 29 -33 9 69
7261 69 13 -57 26 78 1 -44 43 54 -8 13 34 -1 -22 30 3 -48 -17 42 7 -73 5 61 -32 -25 24 1 -37 4 30 -23 -37
7292 -37 43 44 -60 -30 59 -1 -54 9 27 -21 -16 47 5 -34 27 66 -31 -40 60 41 -48 -4 76 5 -49 48 48 -35 -17 76 6
7323 6 -53 18 67 -24 -53 35 47 -46 -32 28 -10 -37 20 18 -63 -16 52 6 -54 3 73 -30 -53 42 41 -48 18 56 -7 -37 64
7354 64 71 -33 -26 61 33 -44 -1 72 3 -31 39 32 -24 11 46 9 -29 27 47 -43 -12 40 11 -43 7 34 -48 -39 56 -4 -68 10
$$ packed form
7128b3O9l0n4RN0j9k5K7qMOJ4m5K5K4pk8RK6jk6lJ4MJ0J5o2J2N9kn8nO0Om5jK5
7165B6j5J2Ql7j1N2jo7j4P3Oo0JL0lk5M5l8l4L9L6n6k1N0M2n6j8K1K8l4J6K5l2
7198a2K2L7o8k5N5M2n2j7M5ll6J1K5n7L1N6j7p5M5N5k9p9M2N6n9k5L3J6l9K4J7
7229A9m6j1P7kq5J3P5l4l6K0K6k1lJ4l1l2Q4Ro6k7J23k1r7M5O5l7n7O4Jo2M2O0
7261F9n6p0Q3N2p7m5Q7J1o2K1K1l5k1N2k7n1L1N9l5q0P8N6r3PM9k3l8M1K6n3j4
7292c7Q0Jj04L0Q9o0n3O3J8m8NO3m2l9O1L9r7rJ00j9q9M4Q0p1n4R7%q3J8R3p0
7323Fn9P1M9r1k9Q8J2r3J4O0l8k7N7kq1M7O8m6o0N7P0j03k3R5jq9O6L8o3l0J01
7354F4Pj04PQ7k8p7M3P3o9l4P0pn6L5L5l7l8N6K0r0L1N2k9n4N0K7q2RR5o0o4P8
$$ plain form
7386 10 64 -15 -87 36 57 -48 -42 54 38 -56 12 53 -29 -32 44 44 -54 -9 63 17 -17 21 47 2 -5 37 31 -19 32 42 -33 -6
7418 -6 47 15 -42 -5 44 0 -33 39 40 -46 -37 50 3 -44 24 50 -38 -50 -1 22 -42 -27 35 -22 -40 15 19 -30 -19 53 7 -53
7450 -53 13 44 -7 -37 43 12 -27 -2 64 4 -22 27 54 -20 -2 66 22 -12 0 57 10 -21 21 14 -24 13 23 -8 -18 24 25
7481 25 -30 -26 23 2 -53 -5 29 -25 -36 7 7 -28 -24 33 -12 -32 -21 36 -5 -21 24 10 -20 10 22 7 -3 39 9 -22 20 65
7513 65 23 -31 42 62 -9 -1 27 22 -16 16 48 -18 -30 12 44 -25 -35 8 8 -28 -8 25 -4 -15 0 -11 -33 -12 -10 -13 -16 18 8
7546 8 -35 -6 30 3 -23 8 33 -8 -15 29 13 -26 2 19 9 -33 23 50 -6 -21 34 26 -24 12 49 -3 -31 22 10 -33 -25 39
7578 39 1 -34 -1 18 -18 -22 3 -19 -28 -26 19 -5 -15 -4 1 -30 -16 9 -5 -26 -1 23 -4 -19 24 17 -31 24 31 0 -19 28 21 -7
7612 -7 -11 39 18 -3 18 32 0 -7 25 0 -24 10 46 -19 -29 6 9 -12 -17 7 -6 -19 -2 12 -19 -20 18 -6 -43 -11 8 -18 -40
$$ packed form
7386A0N4p9p2J23K1j05OR6j6r4O8M1q2lP6%r8M5P2m6l4L8K6m5pM2on0N1J0p5K7
7418fN3l2n7L7M9m4l3P2Jq6RQ7m7m7O8K6q8j2M9K3o4J5O2n7j8N5Mm9J1P2m6o0
7450e3O6L1n1l0Q0l1l9K5O6o0k6M9K7p4J8O8m4l4J2N7m7l1M2pl8L7J0l1j0M2J
7481B5n5MM9k1n5M8L4n4j1M3%l5MN7m5k0J1N7m1j6M5j4l0L0J2j5j0M2l0l1M2M5
7513F5m2n4P3K0p1QK8nl8L2L2o6j2M2L2o9j0M3%l6K0L3k9j1J5j1k2K1KllL4j0
7546Hm3K9L6k7k6L1K5m1pM4j6l9K8J7j0m2N6K7n6j5N5qn0L6L7n2k8N3j2m3QO4
7578C9l8l5L3J9l6mK5k2rKM5k4j0J1Nl1J4K5j4k1K5K4k7j5M3pm8N5Pl1j9M7pk8
7612gmN0k1k1K1J4l2pL2k5k4L4L6o5j0L5Lk1nK4j3j3J7J4l1jL8k4l7L2J9k6k2
$$ plain form
7645 -40 4 8 -18 -13 29 -27 -25 14 8 -27 -16 49 16 -28 -3 42 15 -17 2 28 -5 15 19 20 -9 31 27 -1 1 18 21 -5 -7 8 -3
7680 -3 12 12 -27 -23 11 12 -27 -21 9 18 -13 -9 8 -11 -33 16 15 -35 -10 30 -9 -47 9 44 13 -25 13 13 6 20 7 3 6 35 21 -13
7716 -13 6 38 15 -33 2 27 16 -7 21 -3 4 7 -6 -31 -23 16 -16 -30 -22 24 -10 -22 -2 1 -15 -4 -3 -22 -24 2 18 -32 -8 15
7750 15 5 -32 4 27 0 14 27 11 -7 17 50 27 -2 35 25 -16 -2 13 13 21 23 11 -18 12 37 -12 -16 25 27 6 -20 18 4
7783 4 -12 1 5 -12 -20 23 1 -36 -9 35 -19 -31 -6 13 -17 -13 2 -9 -15 14 19 -28 -16 18 9 -34 5 39 -3 -1 41 23 -5 22
7817 22 35 16 -8 31 30 -9 -4 45 18 -24 4 28 -22 -30 12 12 -29 2 36 -18 -33 29 22 -36 -15 9 19 -29 8 14 -22 -6 19
7850 19 -14 -25 15 21 -23 -32 23 11 -10 14 28 6 -21 41 36 -27 -1 60 22 -33 16 37 4 -16 15 8 -26 3 41 12 -16 22
7882 22 27 -30 -16 40 1 -44 -7 23 -37 -45 23 -5 -42 4 29 -44 -34 26 33 -34 -26 51 15 -28 17 10 -43 -7 36 1 -44 27 56
$$ packed form
7645d0M4Mk6NM2n6KL9ol5J1O5l3m4K5M5k7l2J9K6l3K0MJk9M0mk8KJ7Lk6kJ5j1
7680cJ5%l9ML4Jl9OL0Rl1MJ7j9k2M9jn0K5M0l9l8N6L5l1l8L8%pJ4j3mLK9j4l4
7716a3J9L2k3m8L5K5j1k3K8k4PLj3k5QL9l2j4QM6l4j2K0Lj6J1Jj9kK6J6n0K4K3
7750A5j0l7L6K3k7J4J3j6j8K4L3k3k9L7j0m1J4J5%QKj2k9L0K5m9mM1Kk1k6L8j4
7783Dj6J3Mj7qM3k2l7K7M4n4j2K5J9l0MJ5j1oK9Nm7J2L4rm3L9L4m2KM2j8k8K7
7817B2J3j9k4L9jl9NM9k7m2K8K4n0qM2%m1L1L4n4j5O2pn8K1K4J0m8L7Ol6J6K5
7850A9l3j1M0Om4rN5j2k1K4J4k2k7O2no3K6O1l8n5M9K1l3k0L1pl4K9L8k9k8L8
7882B2Nn7J4N6l9m5L7L0o0qO8k8l7M6K5p3J0O0Po7QP7l6m3M5pn3L6M3l5m5P1K9
$$ plain form
7915 56 8 -27 39 37 -28 8 53 -1 -20 32 35 -20 -24 49 33 -35 2 47 -1 -32 17 27 -27 5 27 -14 -35 22 13 -37 -15 32
7947 32 -2 -34 -6 18 -19 -34 41 25 -31 13 53 -12 -24 49 42 -30 -21 53 45 -28 17 49 -8 -20 42 26 -23 13 39 -7 -20 21
7979 21 19 -17 -26 24 4 -25 17 22 -32 -4 30 12 -36 -4 24 -18 -37 30 19 -29 -10 37 5 -53 32 33 -5 -48 47 16 -27 -5
8011 -5 39 -7 -24 43 44 -5 6 52 10 3 15 53 0 -16 46 28 -28 -5 23 3 -26 30 20 -32 -12 25 -9 -48 -3 18 -24 -19
8043 -19 17 15 -21 -12 13 -8 -19 5 13 -32 -13 25 10 -22 14 42 1 -23 39 34 -12 14 40 9 -19 19 41 -10 10 38 40 -14 10
8076 10 34 6 -9 42 15 -4 8 36 7 -16 17 16 -12 0 24 -5 -53 -2 46 -16 -16 18 10 -19 -6 26 -5 -21 5 32 1 -11
8108 -11 38 21 -9 33 37 -4 3 26 37 -15 13 41 14 -12 14 30 -7 12 37 18 -26 3 31 -6 -15 17 19 -19 -7 25 2 -44
8140 -44 -11 12 -12 -6 1 6 -13 -21 10 8 -24 4 10 -19 3 22 -5 -18 14 26 1 -13 26 13 -8 22 41 -1 -15 32 13 -6 0 28
$$ packed form
7915E6m8l5O6ko5L6M5n4j9N2Ln5mP3j6o8L7M5m8l1M9J0n4L2K2m1k1N7rn0K2M7
7947C2l4l2K8K4l7j5P5j6n6M4M0o5j2P3pp2RP4qp3M5L2n7j2O2j6m9L6K6m6j3M1
7979B1kl6rN0k0k9M2Nn4K8L4j8m8L2K8m2j9O7j1m8J9M7l2n8Q5Jl8m3R5l1m3K2
8011eM4m6j7O7Jm9J1M6m2pJ2L8n3j6O2j8n6K3K8k0k9N6j0n2K0L7l4l9M5K1m2N
8043a9L6kl6RK5k1j1K4Qm5J9L8j5l2L6K8m1k4O2nm6K6K6l1k8L8K2n1K0K8Kn4K4
8076A0K4k8j5N1k7j9J2K8k9k3L3jk8J2K4k9m8N1M8o2%L4qk9J3L2l1j6K6K7l1j2
8108a1M9j7l0M2Mm1PK3J1n2K8K8k7k6K6J6l7J9K5j9m4K9K8l7rL2Kl8J2L2k3m6
8140d4L3K3k4OPNj9qL1kl2K8Ok9K2J9k7j3L2J2k5j4L9j3k1L0J9m2j4M7j9j9OK8
$$ plain form
8174 28 5 -15 18 13 -22 -18 3 11 -10 -6 18 15 -18 3 7 -16 -26
$$ packed form
8174B8k3k0L3nl5MK1Qk1MK4ll3K1Mk3j0
8191b6
$$ Imaginary data points
##PAGE= N=2
##DATA TABLE= (X++(I..I)), XYDATA
$$ plain form
0 0 0 0 0 0 0 0 0 0 0 0 0 -8 8 -8 8 -9 16 -17 24 -25 33 -41 49 -57 67 -81 93 -107 125 -141 164 -190 214
33 214 -241 274 -312 351 -391 439 -493 550 -611 677 -754 834 -923 1018 -1124 1240 -1365
50 -1365 1504 -1655 1824 -2013 2219 -2451 2712 -3012 3352 -3749 4214 -4772 5457 -6308 7404
65 7404 -8877 10938 -13955 18376 -29814 627737 335325 -637147 -204233 495464 109714
76 109714 -373355 35233 217533 -152890 -104435 268457 13063 -331233 15893 354709
86 354709 -7215 -313565 -51085 229419 128384 -101218 -221170 -40352 300920 181950
96 181950 -362688 -293058 390473 362175 -387897 -373635 353264 330758 -297356 -237688 226889
107 226889 113334 -153863 23679 85013 -147969 -25658 241023 -23412 -286672 63300
$$ packed form
0@%%%%%%%%%%%qJ6j6J6j7K5l3M1m9N8p4R0j06J24j48J74k00K32k66L05l54M04
33B14m55N15n86O63p42Q30r32J043j161J288j431J588j757J941k142K364k605
50a365K869l159L479l837M232m670N163n724O364p101P963q986J0229j1765J3712
65G404j6281J9815k4893L2331m8190O57551k92412r72472M32914O99697l85750
76A09714m83069M08588J82300l70423M8455L72892k55394l44296L47126L38816
86C54709l61924l06350K62480K80504j01035k29602j19952J80818L41272j18970
96A81950n44638O9630O83531k8298p50072J4262P26899k2506o28114N9668M64577
107B26889j13555k67197J77542O1334k32982J22311K66681k64435k63260L49972
$$ plain form
117 63300 279677 -97302 -221253 129028 123000 -160802 -1946 192498 -120692 -220910
127 -220910 225379 241011 -296019 -247476 322934 235514 -304357 -202759 246321 149803 -161969
138 -161969 -82259 67384 8340 20008 60835 -86025 -115050 119735 144173 -117586 -142696
149 -142696 81625 109207 -20129 -48889 -56208 -29276 134864 112830 -204444 -188441 255843
160 255843 243592 -284267 -269307 289139 261869 -273297 -222935 242248 159345 -202320 -81448
171 -81448 160312 2398 -120852 65402 87198 -111162 -59250 129283 36493 -118199 -16842
182 -16842 81906 -1130 -27912 18867 -32630 -35718 88582 50117 -129785 -59423 149369 61056
194 61056 -144281 -53188 115707 34844 -69099 -7336 12616 -26378 44117 61344 -92565
$$ packed form
117F3300K16377l76979j23951L50281o028k83802J58856J94444l13190j00218
127b20910M46289J5632n37030M8543N70410q7420n39871J01598M49080r6518l11772
138a61969P9710J49643n9044J1668M0827j46860k9025K34785K4438k61759k5110
149a42696K24321K7582j29336k8760p319K6932J64140k2034l17274J6003M44284
160B55843j2251n27859J4960N58446k7270n35166N0362M65183q2903l61665J20872
171h1448K41760j57914j23250J86254K1796j98360N1912J88533r2790j54692J01357
182a6842R8748q3036k6782M6779n1497l088J24300l8465j79902P0362K08792q8313
194F1056k05337R1093J68895q0863j03943O1763J9952l8994P0495J7227j53909
$$ plain form
205 -92565 -92426 125305 114151 -138442 -122924 130651 116277 -104938 -95069 66057 61946 -20733
217 -20733 -22189 -24562 -18470 63839 53972 -92823 -79178 109325 90837 -113448 -88138 107067
229 107067 72895 -92780 -48609 73963 20497 -53467 6384 34000 -26769 -16606 37573
240 37573 2038 -37039 10180 26289 -20014 -7396 28438 -15438 -35353 38008 40974 -55637
252 -55637 -44477 65225 45258 -64886 -42649 54503 36142 -35605 -25802 11051 12071 15227
264 15227 3543 -39634 -19513 58588 33606 -70015 -44441 72498 50416 -66579 -51272
275 -51272 53326 46960 -35360 -38844 14971 28220 5061 -17017 -22763 6741 36511 1324
287 1324 -45629 -6485 50005 8753 -50043 -8638 46658 7314 -40545 -5605 32883 4756
$$ packed form
205i2565J39K17731j1154k52593J5518K53575j4374k21215R869J61126m111q2679
217b0733j456k373O092Q2309r867j46795J3645J88503j8488k04285K5310J95205
229A07067l4172j65675M4171J22572n3466p3964N9851K7616o0769J0163N4179
240C7573l5535l9077M7219J6109m6303J2618L5834m3876j9915P3361K966r6611
252e5637J1160J09702j9967j10144K2237R7152j8361p1747R803L6853J020L156
264A5227j1684m3177K0121P8101k4982j03621K5574J16939k2082j16995J5307
275e1272J04598o366q2320l484N3815J3249k3159k2078n746K9504K9770l5187
287A324m6953L9144N6490m1252n8796M1405N5296l9344m7859L4940L8488k8127
$$ plain form
299 4756 -24187 -5203 15283 7579 -6223 -11229 -2395 15903 10608 -20335 -17882 23869 24231 -25356
313 -25356 -29078 24406 32346 -20698 -33633 14517 32961 -6442 -30339 -2750 25921 11980
325 11980 -20184 -20461 13368 27173 -6243 -31738 -970 33681 7601 -33211 -13612 30256
337 30256 18492 -25484 -22387 19134 24992 -11935 -26528 4186 26721 3501 -25718 -10778
349 -10778 23353 17249 -19735 -22592 14901 26584 -8978 -28916 2370 29579 4713 -28354
361 -28354 -11601 25492 17999 -20993 -23177 15361 26942 -8765 -28808 1898 28826 5007
373 5007 -26811 -11239 23191 16688 -18028 -20848 11929 23676 -5213 -25020 -1655 24927 8221
386 8221 -23520 -14150 20813 19017 -17166 -22660 12637 24749 -7643 -25381 2268 24297 3010
$$ packed form
299D756k8943J8984K0486p704j3802n006Q834J8298n295l0943K453M1751L62m9587
313b5356l722N3484P940n3044j2935M8150J8444l9403k3897K7589K8671j3941
325A1980l2164k77L3829J3805l3416k5495L0768L4651k6080m0812J9599M3868
337C0256j1764m3976L097M1521N858l6927j4593L0714K2535k3220k9219J4940
349a0778L4131o104l6984k857L7493J1683l5562j9938L1286K7209k4866l3067
361b8354J6753L7093p493l8992k184L8538J1581l5707k0043L0706K6928k3819
373E007l1818J5572L4430o503l4716k820L2777J1747k8889j9807K3365K6582j6706
386H221l1741R370L4963j796l6183n494L5297J2112l2392j7738K7649K2029k1287
$$ plain form
399 3010 -21829 -8152 17940 12694 -13134 -16601 7601 19534 -1992 -21584 -3469 22512 8205
412 8205 -22538 -12051 21524 14803 -19586 -16411 16705 17056 -12836 -16750 8065 15930 -2329
425 -2329 -14586 -4099 13047 11203 -11162 -18325 9098 25136 -6560 -30734 3657 34565 -161
438 -161 -35744 -3730 33859 7886 -28583 -11921 20202 15470 -9269 -18070 -3155 19380 15721
451 15721 -19220 -26971 17483 35365 -14536 -39907 10631 39761 -6454 -35187 2364 26522
463 26522 1048 -15280 -3791 2831 5728 8752 -7425 -18173 9138 24008 -11499 -25775 14725
476 14725 23493 -18868 -18055 23597 10790 -28093 -3251 31335 -2953 -32058 6724 29347 -7311
489 -7311 -22392 4904 11390 -7 3063 -5981 -19152 11874 35022 -16230 -48006 18155 56007
$$ packed form
399C010k4839J3677K6092n246k5828l467K4202J1933k1526j9592J8115K5981j4307
412H205l0743J0487L3575o721l4389L175L3116L51k9892l914K4815P865j8259
425b329j2257J0487J7146j844k2365p163K7423J6038l1696k4174L4391L0908l4726
438a61l5583L2014L7589k5973l6469J6662L2123m732k4739q801J4915K2535l659
451A5721l4941p751M4454J7882m9901k5371N0538K9130m6215k8733L7551K4158
463B6522k5474j6328J1489O622K897L024j6177j0748K7311J4870l5507j4276M0500
476A4725Q768m2361Q13M1652j2807l8883K4842L4586l4288k9105L8782K2623l6658
489g311j5081K7296O486j1397L070r044j3171L1026K3148n1252l1776O6161L7852
$$ plain form
502 56007 -17067 -57156 13239 50734 -7282 -37043 370 17699 6359 4781 -11849 -27318
514 -27318 15282 46494 -16371 -59476 15253 64053 -12775 -59691 9415 46806 -6256 -27639
526 -27639 3535 4882 -1636 17546 -26 -36587 1909 49051 -5191 -53533 10467 49575
538 49575 -18335 -38441 28493 22409 -40137 -4694 51601 -11374 -60687 23036 65390 -28201
550 -28201 -63833 26276 55266 -17694 -39701 4485 18950 10909 4469 -25544 -26822 36982 44596
563 44596 -43208 -54277 43546 53809 -38092 -42407 28236 21272 -15735 6721 2774 -37608 8785
576 8785 66704 -17620 -89446 22962 102138 -25060 -102782 24565 91113 -22759 -69143
587 -69143 20505 40117 -18604 -8836 17013 -20038 -15513 42017 12927 -54069 -8368 54834
$$ packed form
502E6007p3074m0089P0395L7495n8016k9761L7413J7329j1340j578j6630j5469
514b7318M2600L1212o2865m3105P4729M8800p6828m6916O9106L7391n3062k1383
526b7639L1174J347o518J9182j7572l6561L8496M7142n4242m8342O4000L9108
538D9575o7910k0106O6934o084o2546L5443N6295o2975m9313Q3723M2354r3591
550b8201l5632R0109K8990p2960k2007M4186J4465q041o440l0013j278O3804P614
563D4596q7804j1069R7823J0263r1901m315P0643o964l7007K2456l947m0382M6393
576H785N7919q4324p1826J12408P9176j27198p7722J27347O6548j13872m6384
587f9143Q9648J9612n8721R768K5849l7051M525N7530k9090o6996M5701O3202
$$ plain form
599 54834 1015 -44946 9264 26693 -21948 -3851 35792 -19080 -48726 37856 58301 -48972
611 -48972 -62190 50504 58823 -42102 -47529 25312 29199 -2841 -5947 -21366 -18607 43746 40674
624 40674 -60844 -56038 70623 61743 -71958 -55802 65546 38327 -53111 -11213 37182 -21745
636 -21745 -20421 55869 5302 -86121 6467 107912 -13940 -118009 17155 114961 -17051
647 -17051 -99725 14665 74967 -11227 -45102 7522 14944 -4224 10250 1122 -26664 2209
659 2209 31714 -6600 -25080 12528 8339 -20146 15257 29014 -41412 -38014 65309 45412
671 45412 -82703 -49209 90671 47770 -87880 -39930 74839 25810 -53596 -6341 27624
682 27624 -16075 -899 38393 -22677 -56985 40191 68786 -49611 -71431 50554 64081 -43743
$$ packed form
599E4834n3819m5961N4210J7429m8641J8097L9643n4872k9646Q6582K0445j07273
611d8972j3218J12694Q319j00925n427P2841L887l2040l106j5419K759O2353l072
624D0674j01518M806J26661q880j33701J6156J21348k7219r1438M1898M8395n8927
636b1745J324P6290n0567r1423R2588J01445j21852j04069J35164R7806j32012
647a7051q2674J14390O0302q6194l3875N2624P422j9168J4474r128k7786K8873
659B209K9505l8314j8480L7608m189k8485L5403J3757p0426L398J03323j9897
671D5412j28115L3494J39880m2901j35650M7950J14769m9029p9406M7255L3965
682B7624m3699J5176L9292o1070l4308R7176K8595j18397k1820J21985J3527j07824
$$ plain form
694 -43743 -47236 31369 23306 -15985 4124 412 -30962 13048 53073 -22701 -67104 27696 70938
707 70938 -28194 -64276 25030 48509 -19539 -26695 12779 2686 -5933 19210 -585 -35394
719 -35394 6520 42930 -12196 -40730 17908 29212 -23959 -10594 30201 -12084 -36269 34999
731 34999 41386 -54390 -44612 67149 44778 -71453 -41031 66926 33109 -54450 -21271 36369
743 36369 6697 -15493 9080 -4694 -23730 21445 35167 -32510 -41409 36922 41476 -34487
755 -34487 -35108 26374 23233 -14240 -7626 467 -8969 13024 24015 -24370 -34944 32401 40034
768 40034 -36537 -38465 36811 30574 -33974 -17897 28879 2576 -22588 12598 15815 -25154 -9308
781 -9308 32962 3283 -34822 2098 30396 -7080 -20721 11508 7493 -15468 6986 18664
$$ packed form
694d3743l493P8605q063l9291K0109l712l1374M4010M0025p5774m4403R4800M3242
707G0938r9132l6082Q9306K3479o8048p156L9474j0093q619K5143j9795l4809
719c5394M1914L6410n5126k8534N8638J1304n3171J3365M0795m2285k4185P1268
731C4999O387r5776R778J11761k2371j16231L0422J07957l3817q7559L3179N7640
743C6369k9672k2190K4573j3774j9036M5175J3722o7677q899P8331M554p5963
755c4487o21O1482l141l7473O614Q093r436K1993J0991m8385j0574O7345P633
768D0034p6571j928P5276o237o4548J6077M6776k6303k5164L5186L217m0969J5846
781i308M2270k9679l8105L6920K8298l7476j3641L2229m015k2961K2454J1678
$$ plain form
793 18664 -20400 -20810 30554 21463 -35839 -20184 35600 16772 -29999 -11375 20130 4422 -7517
806 -7517 3358 -5767 -10982 17977 17486 -27343 -21775 32846 23318 -34048 -21754 31171 17466
819 17466 -24931 -11006 16562 3520 -7343 3768 -1414 -9687 8822 13292 -14208 -14061 17284
832 17284 11944 -18096 -7432 16953 1411 -14429 4869 10925 -10325 -6950 13863 2806 -14961
845 -14961 1156 13303 -4840 -9202 8095 3351 -10868 3230 12943 -9545 -14253 14602 14627
858 14627 -17655 -14021 18262 12423 -16405 -9917 12455 6751 -7014 -3271 881 -106 5204 3119
872 3119 -10359 -5303 14215 6586 -16290 -6825 16678 6213 -15391 -4955 12814 3450 -9302
885 -9302 -1968 5352 943 -1355 -526 -2397 799 5618 -1607 -8101 2801 9731 -3990 -10514 4923
$$ packed form
793A8664l9064m10N1364r091n7302J5655N5784j8828m6771J8624L1505j5708j1939
806g517J0875r125n215K8959m91m4829N568N4621r528n7366J2294N2925j3705
819A7466m2397J3925K7568j3042j0863J1111n182q273J8509M470k7500J47L1345
832A7284n340l0040J0664K4385j5542j5840J9298O056k1250L375K0813j1057j7767
845a4961J6117J2147j8143m362J7297m744j4219J4098R713k2488m708K8855K5
858A4627l2282L634L2283n839k8828O488K2372n704j3765L743M152r87N310k085
872C119j3478N056J9518p629k2876R465K3503j0465k1604J0436J7769r364j2752
885i302P334P320m409k298Q29j871L196M819p225o494J0902O930j3721o524J5437
$$ plain form
900 4923 10443 -5305 -9565 4895 7960 -3741 -5824 1880 3272 351 -626 -2767 -1987 4960 4302
915 4302 -6647 -6066 7679 7229 -7883 -7642 7339 7439 -6109 -6664 4403 5573 -2439 -4318 461
930 461 3174 1487 -2200 -3093 1564 4502 -1138 -5488 978 6232 -865 -6626 688 6734 -190 -6438
946 -6438 -561 5823 1690 -4761 -3043 3345 4500 -1599 -5807 -412 6804 2488 -7193 -4475 6878
961 6878 6186 -5887 -7409 4183 8021 -2024 -7988 -436 7266 2798 -6042 -4951 4397 6544 -2633
976 -2633 -7586 851 7828 694 -7453 -1939 6497 2766 -5156 -3232 3568 3432 -1934 -3399 359
991 359 3285 1090 -3112 -2211 3019 3158 -2930 -3744 2924 4156 -2835 -4259 2651 4247 -2241 -3972
1007 -3972 1630 3604 -667 -3043 -478 2431 1897 -1722 -3331 1015 4747 -280 -5970 -431 6867
$$ packed form
900D923N520j5748m260J4460L065j1701k083P704J392k921r77k141P80O947o58
915D302j0949N81J3745m50j5112K41J4981J00j3548n55J1067J170q012j879M779
930D61K713j687l687q93M657K938n640m350O466N254p097n761P314O046o924o248
946f438N877O384m133o451J718O388J155o099m208N395P216m316r681K718J1353
961F878o92j2073j522J1592L838j0045n964P552P702m468q840J091R348K147r177
976b633m953Q437O977p134q147N514Q436l731p922J924O800j36n366j465L758
991C59K926k195m202R01N230J39o088q14O668J232o991j424O910J596o488j731
1007c972N602J974m271k376K565K909n34l619j609M346L732n027n690N539P298
$$ plain form
1022 6867 1064 -7270 -1656 7077 2172 -6266 -2649 4743 2985 -2689 -3290 91 3396 2676 -3416
1037 -3416 -5451 3168 7907 -2753 -9822 2077 10844 -1237 -10864 275 9795 817 -7726 -1869
1051 -1869 4883 2813 -1584 -3586 -1767 4129 4780 -4414 -6968 4581 8114 -4580 -8017 4545
1065 4545 6837 -4475 -4662 4453 1957 -4376 920 4177 -3398 -3702 5211 2877 -6012 -1546 5782
1080 5782 -275 -4608 2468 2762 -4840 -669 7059 -1242 -8812 2545 9555 -2997 -9134 2422
1094 2422 7230 -985 -3986 -1186 -378 3592 5355 -5873 -10322 7639 14510 -8577 -17275 8550
1108 8550 18033 -7567 -16585 5900 13007 -3772 -7712 1625 1525 316 4730 -1768 -10034 2696
1122 2696 13657 -3104 -14903 3151 13704 -3031 -10168 2974 5039 -2971 900 3095 -6618
$$ packed form
1022F867n803q334N614Q733m905q438L617P392j758n674o01L381L305p20o092
1037c416k035Q619M739j0660p069J1899Q767j2081r627J1139R520q978q543N857
1051a869O752k070m397k002J819N896O51r194k554J1549L533j2694l437J2562
1065D545K292j1312j87R115k496o333N296L257p575l04Q913k334q889M466P328
1080E782o057m333P076K94p602M171P728q301p570J1357P010j2552o137J1556
1094B422M808q215l001K800Q08L970J763j1228m449J7961O871k3087q698K5825
1108H550R483k5600r018K2485P107j6779l940R337j00j209M414o498q266J2730
1122B696J0961j6761j1799J8054J0553j6735p137J3142K065q010L871K195r713
$$ plain form
1135 -6618 -3144 11172 2958 -13804 -2266 14088 815 -12075 1451 8122 -4413 -3011 7779
1148 7779 -2320 -11106 7004 13743 -10178 -15085 11290 14626 -10205 -12131 7121 7629 -2635
1161 -2635 -1617 -2543 -5252 7462 11977 -11453 -17593 13879 21064 -14514 -21763 13390 19450 -10868
1175 -10868 -14396 7495 7299 -3931 725 705 -8392 1773 14434 -3300 -17836 3890 17987
1188 17987 -3691 -14820 3076 8884 -2242 -1142 1472 -7061 -767 14444 72 -19683 857
1201 857 22055 -2224 -21086 4266 17038 -7090 -10701 10510 3174 -14237 4269 17705 -10426
1214 -10426 -20332 14250 21465 -15234 -20639 13293 17617 -8931 -12688 2906 6246 3635 676
1227 676 -9736 -7194 14344 12171 -16912 -14770 17152 14414 -15260 -11107 11648 5224 -7084
$$ packed form
1135f618L474J4316q214j6762J1538J6354j3273j2890J3526O671j2535J402J0790
1148G779j0099q786J8110O739k3921m907K6375L336k4831j926J9252N08j0264
1161b635J018r26k709J2714M515k3430o140L1472P185l5578p249L5153O060l0318
1175a0868l528K1891j96j1230M656k0r097J0165J2661j7734j4536K1726J4097
1188A7987k1678j1129J7896N808j1126J100K614q533O294J5211j4372j9755K0540
1201H57K1198k4279j8862K5352J2772k4128l611K1211p336j7411J8506J3436k8131
1214a0426r906L4582P215l6699n405L3932M324k6548l757J5594L340k611k959
1227F76j0412K542K1538k173k9083K142L1922k738k9674M153K2755o424j2308
$$ plain form
1240 -7084 2264 2301 -10186 2002 17180 -5375 -21993 7610 23843 -8629 -22200 8711 17384
1253 17384 -8068 -10035 7112 1414 -6014 7110 4947 -14192 -3760 18761 2429 -20063 -691
1266 -691 18075 -1521 -13149 4251 6335 -7301 1230 10400 -8187 -13012 13443 14659 -16141
1279 -16141 -14925 15888 13490 -12795 -10418 7521 5889 -967 -672 -5889 -4601 11923 9068 -16369
1293 -16369 -11953 18564 12648 -18508 -10975 16280 7068 -12462 -1520 7721 -4817 -2789 10983
1306 10983 -1615 -15933 5065 18778 -7318 -19042 8383 16632 -8388 -11896 7623 5613
1318 5613 -6382 1192 4935 -7411 -3413 12081 1892 -14419 -344 14181 -1236 -11386 2907
1331 2907 6651 -4576 -782 6222 -5190 -7603 10273 8461 -13680 -8570 14850 7754 -13672
$$ packed form
1240g084R348L7j2487J2188J5178k2555j6618K9603J6233l2472j3571L0911Q673
1253A7384k5452j967J7147n698p428J3124k163j9139J0432K2521j6332k2492J9372
1266f91J8766j9596j1628J7400K084j3636Q531R170j8587m825K6455J216l0800
1279a6141J216L0813k398k6285K377J7939j632o856K95n217J288J6524k855k5437
1293a6369M416L0517n916l1156P533K7255r212j9530J0942R241j2538K028J3772
1306A0983j2598j4318K0998J3713k6096j1724K7425Q249k5020l508J9519k010
1318E613j1995P574L743j2346L998J5494j0189j6311J4075J4525j5417j0150J4293
1331B907L744j1227L794P004j1412k413J7876j812k2141N110K3420p096k1426
$$ plain form
1344 -13672 -6011 10374 3392 -5598 -317 49 -2961 5412 5814 -10023 -7919 13182 8783 -14547
1358 -14547 -8259 14090 6320 -12027 -3297 8804 -416 -4925 4159 987 -7428 2553 9592 -5299
1372 -5299 -10320 7115 9437 -7932 -7078 7883 3600 -7127 444 5937 -4368 -4474 7585 2961
1386 2961 -9554 -1407 10005 -17 -8913 1314 6476 -2416 -3117 3331 -527 -3953 3953 4224
1400 4224 -6493 -4091 7851 3458 -7822 -2434 6401 987 -3885 610 654 -2250 2839 3626 -6066
1415 -6066 -4535 8664 4869 -10345 -4526 10976 3481 -10523 -1953 9221 105 -7273 1694 4983
1429 4983 -3268 -2641 4265 448 -4594 1333 4168 -2663 -3104 3503 1543 -3794 238 3705 -1953
1444 -1953 -3183 3275 2418 -4011 -1457 4091 400 -3438 655 2271 -1613 -655 2380 -1075 -2899
$$ packed form
1344a3672P661J6385o982q990N281L66l010Q373M02j5837K104K1101m399k3330
1358a4547O288K2349p770j8347Q730J2101r220m509R084l172q415R981P039j4891
1372e299n021J7435K322j7369Q54J4961m283j0727P571N493j0305j06J2059m624
1386B961j2515Q147J1412j0022q896J0227N162q892p01O448l858l426P906K71
1400D224j0717K402J1942m393j1280N388Q835n414m872M495M4k904N089P87r692
1415f066J531J3199l795j5214N819J5502p495j4004Q570J1174r116p378Q967L289
1429D983q251O27O906l817n042N927K835o831m41O607j960n337M032L467n658
1444a953j230O458q57o429K554N548l691l838M093J616l884R58L035l455j824
$$ plain form
1459 -2899 2683 3115 -3894 -2923 4604 2402 -4712 -1601 4203 593 -3234 468 1870 -1451 -338
1474 -338 2179 -1181 -2621 2550 2639 -3658 -2287 4415 1659 -4792 -844 4804 -16 -4537 696 3960
1490 3960 -1166 -3207 1230 2279 -989 -1318 390 302 409 626 -1267 -1391 2063 1999 -2598 -2307 2807
1507 2807 2351 -2666 -2100 2215 1591 -1438 -847 544 21 411 787 -1217 -1472 1858 1933 -2218 -2099 2318
1525 2318 1972 -2167 -1581 1815 984 -1386 -346 903 -283 -407 708 -3 -934 359 875 -664 -547
1542 -547 926 36 -1187 506 1394 -1039 -1607 1362 1699 -1447 -1757 1231 1689 -733 -1456 41 1082
1559 1082 784 -574 -1577 -28 2230 664 -2612 -1237 2728 1689 -2501 -1937 1985 1992 -1269 -1796
1575 -1796 456 1450 353 -969 -1068 473 1555 -26 -1844 -312 1853 457 -1694 -483 1337 332
$$ packed form
1459b899N582M32p009R71P527k202p114L111N804l610l827L702J402l321J113
1474c38K517l360j440N171Q9o297J371O702k756o451L948N648m820m521N233L264
1490C960n126k041M437J049l268l29J708q8J07K17j893j24L454o4m597K91N114
1507B807m56n017N66M315o24l029N91J391n23L90L76k004k55L330P5m151J19M417
1525B318l46m139N86L396q31k370J040J249j186j24J115p11r31J293N16j539J17
1542e47J473q90j223J693Q88k433n68K969L37l146l10K988M58k422p23J497J041
1559A082k98j358j003J549K258j566l276J375L965j039m190N64L922Pl261n27
1575a796K252R94j097j322r9J541J082j581j818J532K165j396k151J211J820j005
$$ plain form
1591 332 -916 -95 460 -180 -47 374 -299 -490 541 430 -684 -241 763 -117 -784 533 753 -944
1609 -944 -756 1281 715 -1460 -713 1426 704 -1189 -674 723 627 -88 -565 -610 465 1319 -349 -1937
1627 -1937 221 2355 -82 -2575 -69 2508 234 -2164 -367 1595 484 -817 -576 -44 628 917
1643 917 -645 -1652 648 2229 -595 -2531 540 2557 -446 -2292 345 1777 -239 -1089 140
1658 140 301 -30 453 -113 -1114 228 1503 -404 -1662 600 1504 -810 -1171 1020 561 -1222 66
1675 66 1342 -701 -1372 1193 1257 -1479 -998 1508 521 -1307 58 849 -772 -275 1537 -283 -2208
1692 -2208 801 2707 -1104 -2971 1198 2901 -1006 -2474 611 1725 -56 -695 -575 -462 1172 1621
1708 1621 -1625 -2531 1917 3151 -1968 -3332 1816 3072 -1473 -2329 1062 1278 -605 -16 174 -1225
$$ packed form
1591C32j248Q21N55o40J33M21o73j91J031j11j114M43J004q80o67J317K20j697
1609i44J88K037n66k175P47K139p22j893N15J397r6p15m77m5J075Q54j668j588
1627a937K158K134k437k493K506K577k274k398J797J962j111j301K41N32O72K89
1643I17j562j007K300J581k824j936L071K017l003j846K637J432k016q50J229
1658A40J61l31M83n66j001J342J275j907j258K262R04k314l61K191m59j783J288
1675F6J276k043o71K565O4k736M81K506r87j828J365P91j621M97J812j820j925
1692b208L009J906l811j867M169J703l907j468L085J114j781o39J20J13J634M49
1708A621l246r06M448J234n119j364N148J256m545q56L391K16j883N89J90j399
$$ plain form
1724 -1225 192 2235 -417 -2859 587 3030 -719 -2673 789 1837 -936 -711 1048 -547 -1190
1739 -1190 1732 1293 -2610 -1305 3066 1178 -3022 -844 2517 285 -1596 433 484 -1281 657 2082
1755 2082 -1623 -2735 2212 3081 -2390 -3080 2093 2644 -1380 -1769 384 609 783 755 -1863 -2071 2712
1772 2712 3136 -3252 -3768 3447 3869 -3231 -3405 2783 2449 -2167 -1094 1451 -431 -819 1875 304
1788 304 -3005 30 3625 -209 -3609 232 3012 -217 -1905 173 451 -171 1065 193 -2397 -205
1804 -205 3302 149 -3646 -19 3358 -312 -2525 779 1262 -1427 219 2136 -1666 -2824 2828
1819 2828 3293 -3511 -3559 3665 3408 -3254 -2877 2404 1973 -1220 -767 -94 -528 1270 1728 -2205 -2640 2752
1837 2752 3112 -2902 -3089 2652 2522 -2135 -1535 1413 230 -675 1094 -35 -2276 588 3062 -947
$$ packed form
1724a225J417K043k652k442L446K443l749j954L462J048k773K25J759j595o43
1739a190K922m39l903J305M371j888m200K178L361k232j881K029N1j765J938J425
1755B082l705j112M947Q69n471o90N173N51m024l89K153K25J74k8k618k08M783
1772B712M24o388n16P215M22p100j74O188l34m616J073K545j882l88K694j571
1788C04l309L035L595l834l400L841K780l229j688K078K78o22J236q72k590K192
1804b05L507l153l795L627L377l670k213L304M83k689J646J917l802j158N652
1819B828M65o804m8P224k57o662L77N281m31l193M53O73m34J798M58l933m35N392
1837B752L60o014j87N741j30m657O00K948j183r05J769j129k241K864K474m009
$$ plain form
1853 -947 -3339 1091 3051 -1126 -2254 1047 1014 -966 416 839 -1786 -737 2909 601 -3562 -425
1869 -425 3684 190 -3259 165 2346 -640 -1092 1204 -281 -1767 1555 2248 -2498 -2539 3023 2595
1885 2595 -3060 -2373 2633 1872 -1816 -1103 758 182 369 762 -1369 -1529 2130 2025 -2557 -2154 2630
1902 2630 1925 -2367 -1325 1845 476 -1197 504 482 -1425 186 2126 -706 -2494 1089 2462 -1300
1918 -1300 -2035 1364 1247 -1324 -277 1196 -797 -1034 1730 856 -2392 -623 2704 385 -2618 -133
1934 -133 2104 -210 -1319 521 335 -847 645 1118 -1498 -1286 2104 1312 -2381 -1182 2269 898
1950 898 -1885 -439 1250 -96 -472 626 -328 -1117 1021 1442 -1491 -1579 1786 1501 -1821 -1191 1631
1967 1631 750 -1268 -213 832 -318 -338 731 -133 -974 538 1004 -835 -796 1034 351 -1125 203
$$ packed form
1853i47k392M430J960m177j128L301l3j980J382M23k625J049L646k308m163L137
1869d25M109l494l449L424K181k986m52K296j485j486L322O93m746m1N562m28
1885B595n655O87N006p61l688P13J861n76J87L93k131j60L659j05m582M03M784
1902B630p05m292J042L170j369j673J701k2j907J611J940k832j788L583J373l762
1918a300p35L399j17k571J047J473j993k37K764q74l248J769L327k319l003K485
1934a33K237k314j109J840j86j182J492M73k616K12L390p92l693J199L451j371
1950H98k783J446J689j346l76J098r54p89K138M21k933q8L365k85l322O30K822
1967A631q81k018J055J045j150k0J069q64q41J512M66j839L9J830o83j476J328
$$ plain form
1984 203 1113 -826 -1047 1375 876 -1814 -676 2050 414 -2093 -174 1858 -110 -1473 354 947
2000 947 -619 -395 787 -151 -894 566 892 -829 -830 930 642 -830 -371 598 85 -240 176 -123 -395
2019 -395 522 547 -859 -576 1075 487 -1219 -292 1254 46 -1173 233 1016 -501 -790 676 521
2036 521 -744 -238 694 -40 -547 312 299 -510 18 649 -333 -733 614 723 -813 -679 920 539 -923
2055 -923 -375 819 160 -654 39 427 -245 -198 398 -16 -427 216 446 -315 -378 393 248 -370 -97 286
2075 286 -92 -204 229 65 -331 56 355 -227 -342 369 209 -481 -77 565 -99 -636 272 668 -383 -646
2095 -646 469 598 -462 -518 385 379 -266 -256 95 80 65 80 -210 -211 333 288 -409 -341 391 309 -340 -246 245 152
2119 152 -146 -42 21 -98 84 193 -182 -250 224 269 -269 -236 266 171 -239 -82 224 -19 -177 126 156 -196
$$ packed form
1984B03R10j939k21K422m99k690J138K726j636k507J919K032j968j363J827N93
2000I47j566K24J182r38p43J460L26j721jJ760k88j472M59R69n13l25M16k99k72
2019c95R17K5j406K83J651n88j706R27J546j208j219J406P83j517k89J466j55
2036E21j265N06R32p34n07Q59j3q09N28O31r82m00J347J09j536J34J599l81j462
2055i23N48J194o59q14O93L88o72M7N96m14m11O43K30p61o3P71j45o18K73L83
2075B86l78j12M33j64l96L87K99n82j15P11j60o90M04O42o64n37R08L96j051k63
2095f46J115J29j060n6R03oo45J0L51j5j5J5k90jN44m5o97O8P32q2o49R4M91r3
2119A52k98J04O3j19J82J09l75o8M74M5n38L3N02r5m10J57L06k43j58L03L0l52
$$ plain form
2141 -196 -139 180 109 -187 -79 88 31 -2 24 -99 -71 215 120 -278 -155 331 193 -321 -211 252 202 -169 -153
2164 -153 53 119 74 -51 -167 -32 240 98 -291 -151 295 158 -259 -170 193 155 -130 -112 31 62 30 -22 -92
2187 -92 -4 147 19 -155 -23 150 15 -144 15 130 -54 -100 59 60 -117 -58 107 32 -107 -29 61 15 -20 -8
2211 -8 -32 18 93 -3 -145 -7 151 18 -169 -23 148 32 -105 -44 49 32 -4 -49 -53 45 99 -53 -160 39 172
2236 172 -35 -183 12 164 -7 -136 3 96 32 -51 -38 2 45 24 -80 -60 56 72 -75 -93 64 79 -63 -71
2260 -71 50 36 -60 -31 15 0 8 12 -32 -45 38 34 -53 -26 54 19 -62 1 57 -1 -45 8 30 -18 -22 -1 5 3 13 -14 -42 15 27
2293 27 -63 -63 50 24 -84 -36 78 9 -82 -21 61 -1 -51 -17 6 7 4 -22 -30 7 67 -31 -107 31 90 -20 -100 5 75
2322 75 -8 -67 -15 1 20 35 -44 -82 62 127 -64 -122 60 127 -53 -115 14 65 -19 -23 -19 -58 46 94 -55 -151 74
$$ packed form
2141a96N7L19p1k96J08J67n7l3K6j23K8K86r5l98J23M86j38n14J10M63n0l71J6
2164a53K06O6m5j25j16J35K72j42l89J40M46j37m17Q9L63l8k85J8J43L1l2n2p0
2187i2Q8J51j28j74J32J73j35j59J59J15j84m6J59Jj77N9J65p5j39P8R0m6l5J2
2211hk4N0P5r6j42J38J58j33j87J46J71j16j37O1R3j7l6m5mR8N4j52j07J99J33
2236A72k07j48J95J52j71j29J39R3o4q3J3M0M3k1j04K0J16J6j47j8J57J5j42q
2260g1J21j4r6K9M6j5QMm4j3Q3mq7K7Q0l5q1O3N6n8m4N3K2m8mK1OkJ0k7k8N7J2
2293B7r0%J13k6j08M8J14o9r1O1Q2o2n0L4K3Jlk6qL7O0r8p6J38N9j10q0J05P0
2322G5q3n9N2J6J9J5p9l8J44O5j91n8J82O7j80o2J29N1q4mMl9J04M8j49r6K25
$$ plain form
2349 74 162 -63 -151 27 99 -41 -60 9 3 -16 82 -6 -155 3 184 -3 -213 -12 182 -4 -142 -24 47 -27
2373 -27 7 20 -121 -57 190 61 -235 -81 219 83 -195 -72 115 17 -49 17 -74 -90 158 143 -235 -188 250 196
2397 196 -241 -208 164 157 -127 -71 9 -52 81 122 -143 -219 209 279 -226 -304 194 257 -131 -190 61 57 13 82 -74
2422 -74 -208 117 326 -148 -401 135 398 -135 -342 110 230 -81 -79 58 -92 -73 229 34 -366 -77 401
2443 401 55 -408 -87 315 41 -183 -8 11 -36 153 76 -317 -148 407 165 -445 -170 391 123 -298 -64
2464 -64 145 -54 29 150 -201 -281 292 349 -381 -407 377 408 -362 -352 251 210 -126 -50 -5 -117 130 273 -219
2487 -219 -389 294 457 -305 -440 264 336 -244 -184 164 -7 -111 210 44 -382 -32 508 5 -526 28 488
2508 488 -19 -353 41 163 -63 51 89 -260 -119 419 130 -516 -101 526 77 -465 1 316 -117 -120 230
$$ packed form
2349G4Q8k25q8J78P2j40j9O9oj9R8q8j49J58J81j87k10K01J94j86j38J18P1p4
2373b7L4J3j41O4K47j29k96J54L00j36k78J23J87r8o6O6r1j6K48j5l78M7M38n4
2397A96m37L3L72pk84N6Q0o1J33M1k65p6M28P0n05p8M98O3l88n9K51mm4O9j56
2422g4j34L25K09m74k53N36K63n33k07M52J20l11KJ37j50J9L02j95m00K89M78
2443D01l46m63L21M02k74k24J75J9m7J89p7l93J69N55k42o10K75N61k68m21K34
2464f4K09j99Q3J21l51q0N73N7p30k6P84L1p70J0O03m1l36P6M5j12K47J43m92
2487b19j70O83J63p62j35P04P2n80O0L48j71j04L21j66m26L50N40n03n31N54M60
2508D88n07l34L94J22k26J14L8l49J41N38k89o46M15O27m49n42M66L15m33lL50
$$ plain form
2529 230 -67 -343 248 453 -381 -511 455 527 -457 -466 405 348 -277 -200 133 6 37 126 -198 -274 314 339 -386
2552 -386 -344 400 256 -400 -93 365 -98 -281 286 207 -485 -141 606 49 -683 21 675 -66 -552 123 391
2573 391 -172 -186 209 -5 -216 172 210 -315 -181 351 97 -334 -3 234 -112 -58 238 -117 -349 280 422
2594 422 -443 -487 535 446 -601 -381 572 243 -513 -108 374 -88 -238 204 86 -325 33 360 -181 -350
2614 -350 254 247 -333 -111 339 -47 -343 232 303 -404 -240 469 141 -524 -37 509 -74 -425 183 261 -287
2635 -287 -115 336 -41 -374 169 366 -261 -316 283 217 -266 -95 152 -82 -61 218 -91 -378 198 455 -336
2656 -336 -476 405 435 -458 -344 482 180 -456 -17 401 -151 -345 301 238 -409 -147 409 60 -366 32 250
2677 250 -118 -77 196 -84 -268 230 293 -362 -309 403 237 -425 -157 339 39 -226 59 67 -224 64 349 -209
$$ packed form
2529B30k97k76N91K05q34j30R66P2r84rQ71n7o25P7L33j27L1Q9l24p6N88K5p25
2552c86M2P44j44o56L07M58m63j83N67p9o92L44P47n57p32P04O54p41m86O75K68
2573C91n63j4L95k14k11L88L8n25J34N32k54m31L31K37l46N4K96l55k32O29J42
2594D22q65m4J022q9j047K20R53l29p56M05M82m62j50M42j18m11L58L27n41j69
2614c50O04pn80K22M50l86k96N75P1p07J64P09l28o65M87N46n83l51O08P8n48
2635b87J72M51l77l33N43J97o27n5N99o6m83J71K47k34K1K79l09k87N76K57p91
2656c36j40Q81L0q93J14Q26l02o36M39M18n52j94O46o3o47K62N56l49m26L98K18
2677B50l68M1K73k80j84M98O3o55N3P12j66o62K68M96l00k65K85Qk91K88K85n58
$$ plain form
2699 -209 -471 297 497 -386 -488 335 378 -281 -271 163 70 -92 87 -52 -247 124 356 -230 -425 227 395
2720 395 -260 -319 247 137 -233 32 165 -218 -145 367 115 -473 -90 484 17 -440 40 303 -82 -141 148
2741 148 -58 -220 204 253 -376 -317 436 321 -449 -314 322 232 -210 -146 26 23 136 98 -315 -233 417 314 -480
2764 -480 -364 458 336 -387 -266 244 127 -105 18 -34 -162 144 291 -221 -377 267 391 -269 -354 233 240
2785 240 -180 -118 96 -62 -63 225 -12 -356 53 385 -96 -381 104 273 -112 -145 121 -25 -120 206 130 -381
2807 -381 -177 490 168 -550 -187 511 166 -424 -163 248 105 -62 -63 -115 0 299 25 -438 -87 476 95
2828 95 -460 -123 380 81 -230 -43 52 -45 133 106 -322 -169 452 227 -516 -218 518 172 -470 -128 384
2849 384 31 -248 68 94 -177 27 243 -136 -288 187 279 -231 -222 190 94 -118 39 32 -193 57 352 -125
$$ packed form
2699b09k62P68K00q83j02Q23M3o59J0M34r3j62J79j39j95L71K32n86j95O52J68
2720C95o55n9N66j10l70K65J33l83P3N12k52n88L83N74m67m57M80K63l85n9K89
2741A48k06j62M24M9o29N9P53j15p70J35O36r0m42O4J72lJ13l8m13Q2O50j03p94
2764d80J16Q22j22p23J21N10j17k32J23n2j28L06J47n12j56O44J24o60q5N87P
2785B40m20O2K14j58jK88k37l44M09L32m81k85M85J69l85l3K66j46r5L26p6n11
2807c81K04O67l22p18L63O98l45n90K61M11j43j67jn2J15K99k74m63L51N63l81
2828I5n55L37N03k99l11J87R5r7J78k7m28J53O21k25p43K98P36l46o42L42N12
2849C84l53k79L16K6k71K04K16l79j52M75R2n10RM12r6k12J57pk25K50K95m77
$$ plain form
2871 -125 -462 216 532 -227 -528 206 449 -154 -301 108 96 -37 108 -12 -317 59 495 -88 -612 83
2891 83 640 -58 -566 -12 394 31 -201 -87 -71 114 315 -125 -529 99 660 -88 -725 52 632 -61 -485
2912 -485 54 249 -103 -35 123 -206 -203 398 233 -515 -275 507 231 -452 -180 281 46 -59 99 -145 -280
2933 -280 337 414 -481 -545 533 587 -510 -553 384 386 -222 -205 37 -57 132 322 -280 -584 328 730 -325 -801
$$ packed form
2871a25l37O78L16p59l01P34K43o03j47M09j2j33J45j20l05L76M36n83n24O95
2891H3N57o98n08N54M06l63k32J14J6J85K01m40m04O28N61p48o37P77N80o93m24
2912d85N39J95l52O8J58l29LO01j65p48K40P82k76o83K72M61k35j05J58k44j35
2933b80O17P7q95o4J078N4j097m3R37Ko08J7K42r4J89J90o02l04R12M02j055m76
$$ [...]
8191A2
##END NTUPLES=NMR FID
##END=
