##TITLE=1H ikalashn
ES-suberic-Me
22.10.2024
##JCAMPDX= 6.0         $$ Bruker NMR JCAMP-DX V2.0
##DATA TYPE= NMR FID
##DATA CLASS= NTUPLES
##ORIGIN= UXNMR, Bruker Analytische Messtechnik GmbH
##OWNER= root
$$ TOPSPIN		Version 1.3
$$ 2024-10-22 09:22:49.625 +0400  Irina@DPX200
$$ Compression mode = diff/dup
##.OBSERVE FREQUENCY= 200.131300845
##.OBSERVE NUCLEUS= ^1H
##.DELAY= (6, 6)
##.ACQUISITION MODE= SIMULTANEOUS
##.ACQUISITION SCHEME= undefined
##.AVERAGES= 8
##.DIGITISER RES= 18
##SPECTROMETER/DATA SYSTEM= spect
##.PULSE SEQUENCE= zg
##.SOLVENT NAME= D2O
##.SHIFT REFERENCE= INTERNAL, D2O, 1, 15.99637
##AUDIT TRAIL= $$ (NUMBER, WHEN, WHO, WHERE, WHAT)
$$ ##TITLE= Audit trail, TOPSPIN		Version 1.3
$$ ##JCAMPDX= 5.01
$$ ##ORIGIN= Bruker BioSpin GmbH
$$ ##OWNER= Irina
$$ $$ F:/spectra/data/iren/nmr/1H/4/audita.txt
$$ ##AUDIT TRAIL=  $$ (NUMBER, WHEN, WHO, WHERE, VERSION, WHAT)
(   1,<2024-10-22 09:22:33.953 +0400>,<Irina>,<DPX200>,<TOPSPIN 1.3>,
      <created by zg
	started at 2024-10-22 09:21:56.500 +0400,
	POWCHK disabled, PULCHK disabled
       configuration hash MD5:
       BE 6D 3F 07 2A EA 11 49 91 17 2B D3 AF B3 58 0D
       data hash MD5: 16K
       76 1B 11 C9 BD 69 53 2C EC D3 C0 77 82 D9 3E 55>)
$$ ##END=
$$ 
$$ $$ hash MD5
$$ $$ 2E 6F 12 1F D0 A7 F6 D7 2A C3 94 B2 CA 3E DB 4E
##$RELAX= 
##$RELAX= 
##$RELAX= 
##$RELAX= 
##$RELAX= 
##$RELAX= 
##$RELAX= 
##$RELAX= 
##$RELAX= 
$$ Bruker specific parameters
$$ --------------------------
##$DU= <F:/spectra>
##$EXPNO= 4
##$NAME= <1H>
##$PROCNO= 1
##$TYPE= <nmr>
##$USER= <iren>
##$AMP= (0..31)
100 100 100 100 100 100 100 100 100 100 100 100 100 100 100 100 100 100 
100 100 100 100 100 100 100 100 100 100 100 100 100 100 
##$ANAVPT= -1
##$AQSEQ= 0
##$AQ_mod= 1
##$AUNM= <au_zg>
##$AUTOPOS= <>
##$BF1= 200.13
##$BF2= 200.13
##$BF3= 200.13
##$BF4= 200.13
##$BF5= 200.13
##$BF6= 200.13
##$BF7= 200.13
##$BF8= 200.13
##$BYTORDA= 1
##$CFDGTYP= 0
##$CFRGTYP= 5
##$CHEMSTR= <none>
##$CNST= (0..63)
1 1 145 1 1 1 1 1 1 1 1 1 1 1 1 1 1 1 1 1 1 1 1 1 1 1 1 1 1 1 1 1 1 1 
1 1 1 1 1 1 1 1 1 1 1 1 1 1 1 1 1 1 1 1 1 1 1 1 1 1 1 1 1 1 
##$CPDPRG= <>
##$CPDPRG1= <>
##$CPDPRG2= <>
##$CPDPRG3= <>
##$CPDPRG4= <mlev>
##$CPDPRG5= <mlev>
##$CPDPRG6= <mlev>
##$CPDPRG7= <mlev>
##$CPDPRG8= <mlev>
##$CPDPRGB= <>
##$CPDPRGT= <>
##$D= (0..63)
0 2 0 0 0 0 0 0 0 0.06 0 0.03 0 0 0 0 0.0002 0 0 0 0 0 0 0 0 0 0 0 0 0 
0 0 0 0 0 0 0 0 0 0 0 0 0 0 0 0 0 0 0 0 0 0 0 0 0 0 0 0 0 0 0 0 0 0 
##$DATE= 1729574550
##$DBL= (0..7)
120 120 120 120 120 120 120 120 
##$DBP= (0..7)
150 150 150 150 150 150 150 150 
##$DBP07= 0
##$DBPNAM0= <>
##$DBPNAM1= <>
##$DBPNAM2= <>
##$DBPNAM3= <>
##$DBPNAM4= <>
##$DBPNAM5= <>
##$DBPNAM6= <>
##$DBPNAM7= <>
##$DBPOAL= (0..7)
0.5 0.5 0.5 0.5 0.5 0.5 0.5 0.5 
##$DBPOFFS= (0..7)
0 0 0 0 0 0 0 0 
##$DE= 6
##$DECBNUC= <off>
##$DECIM= 32
##$DECNUC= <off>
##$DECSTAT= 4
##$DIGMOD= 1
##$DIGTYP= 9
##$DL= (0..7)
0 120 120 120 120 120 120 120 
##$DP= (0..7)
150 150 150 150 150 150 150 150 
##$DP07= 0
##$DPNAME0= <>
$$ [...]
##$SW= 21.9926040160658
##$SWIBOX= (0..15)
0 0 2 0 0 0 0 0 0 0 0 0 0 0 0 0 
##$SW_h= 4401.40845070422
##$TD= 16384
##$TD0= 1
##$TE= 300
##$TE2= 300
##$TE3= 300
##$TEG= 300
##$TL= (0..7)
0 120 120 120 120 120 120 120 
##$TP= (0..7)
150 150 150 150 150 150 150 150 
##$TP07= 0
##$TPNAME0= <>
##$TPNAME1= <>
##$TPNAME2= <>
##$TPNAME3= <>
##$TPNAME4= <>
##$TPNAME5= <>
##$TPNAME6= <>
##$TPNAME7= <>
##$TPOAL= (0..7)
0.5 0.5 0.5 0.5 0.5 0.5 0.5 0.5 
##$TPOFFS= (0..7)
0 0 0 0 0 0 0 0 
##$TUNHIN= 0
##$TUNHOUT= 0
##$TUNXOUT= 0
##$USERA1= <user>
##$USERA2= <user>
##$USERA3= <user>
##$USERA4= <user>
##$USERA5= <user>
##$V9= 5
##$VALIST= <valist>
##$VCLIST= <CCCCCCCCCCCCCCC>
##$VD= 0
##$VDLIST= <DDDDDDDDDDDDDDD>
##$VPLIST= <PPPPPPPPPPPPPPP>
##$VTLIST= <TTTTTTTTTTTTTTT>
##$WBST= 1024
##$WBSW= 25
##$XGAIN= (0..3)
0 0 0 0 
##$XL= 0
##$YL= 0
##$YMAX_a= 373513
##$YMIN_a= -373377
##$ZGOPTNS= <>
##$ZL1= 120
##$ZL2= 120
##$ZL3= 120
##$ZL4= 120
##$ABSF1= 10
##$ABSF2= 0
##$ABSG= 5
##$ABSL= 3
##$ALPHA= 0
##$AQORDER= 0
##$ASSFAC= 0
##$ASSFACI= 0
##$ASSFACX= 0
##$ASSWID= 0
##$AUNMP= <proc_1d>
##$AXLEFT= 0
##$AXRIGHT= 0
##$AXTYPE= 0
##$AXUNIT= <>
##$AZFE= 0.1
##$AZFW= 0.1
##$BCFW= 1
##$BC_mod= 2
##$BYTORDP= 1
##$COROFFS= 0
##$CY= 7568.61572265625
##$DATMOD= 1
##$DC= 2
##$DFILT= <>
##$DTYPP= 0
##$F1P= 17.9538593292236
##$F2P= -4.03888763876832
##$FCOR= 0.5
##$FTSIZE= 32768
##$FT_mod= 4
##$GAMMA= 1
##$GB= 1
##$INTBC= 1
##$INTSCL= 1
##$ISEN= 128
##$LB= 0.02
##$LEV0= 0
##$LPBIN= 0
##$MAXI= 945.577
##$MC2= 0
##$MEAN= 0
##$ME_mod= 0
##$MI= -402.1523
##$NCOEF= 0
##$NC_proc= 0
##$NLEV= 6
##$NOISF1= 8.587773
##$NOISF2= 6.764455
##$NSP= 1
##$NTH_PI= 0
##$NZP= 0
##$OFFSET= 15.99637
##$PC= 1
##$PHC0= -141.1481
##$PHC1= -15.31324
##$PH_mod= 0
##$PKNL= yes
##$PPARMOD= 0
##$PPDIAG= 0
##$PPIPTYP= 0
##$PPMPNUM= 100
##$PPRESOL= 1
##$PSCAL= 0
##$PSIGN= 0
##$REVERSE= no
##$SF= 200.13
##$SI= 32768
##$SIGF1= 18.5376
##$SIGF2= -6.396296
##$SINO= 400
##$SIOLD= 32768
##$SREGLST= <1H.CDCl3>
##$SSB= 3
##$STSI= 0
##$STSR= 0
##$SW_p= 4401.40845070422
##$SYMM= 0
##$S_DEV= 0
##$TDeff= 0
##$TDoff= 0
##$TI= <>
##$TILT= no
##$TM1= 0
##$TM2= 0
##$TOPLEV= 0
##$USERP1= <user>
##$USERP2= <user>
##$USERP3= <user>
##$USERP4= <user>
##$USERP5= <user>
##$WDW= 1
##$XDIM= 8192
##$YMAX_p= 0
##$YMIN_p= 0
$$ End of Bruker specific parameters
$$ ---------------------------------
##NTUPLES= NMR FID
##VAR_NAME=  TIME,          FID/REAL,        FID/IMAG
##SYMBOL=    X,             R,               I
##VAR_TYPE=  INDEPENDENT,   DEPENDENT,       DEPENDENT
##VAR_FORM=  AFFN,          ASDF,            ASDF
##VAR_DIM=   8192,          8192,            8192
##UNITS=     SECONDS,       ARBITRARY UNITS, ARBITRARY UNITS
##FACTOR=    0.0002272,     1,               1
##FIRST=     0,             0,               0
##LAST=      1.8609952,     -28,             2
##MIN=       0,             -373377,         -373377
##MAX=       1.8609952,     373513,          373513
$$ Real data points
##PAGE= N=1
##DATA TABLE= (X++(R..R)), XYDATA
$$ [...]
1541B56k836r72J201K519K414R35j275k929k580l84K089L120K062l15k504l107
1557b306j470J113K789K573P33j238k533k534q32J702L323K420k58k646l022j432
1573c618Q37K570K633J130j171k757k518n85J537K847K393K33k250l205j764Q58
1589b830K615K507R71r10k350k458j002J353K862K369J96j984k870j785M24K295
1605e97K653J164r65k256k213q69R51K464K421N72j782k915j756M08K111K300
1621A691J241n45k033k324j079R37K320K182O65j340k560k093j9K062K492J201
1637B798o03j720j922j220K68J997K549J094j275k648j992j17J666K219J520j34
1653B480j700k163j235L48J702K153J384n66k487k549n86J848K579J430l53j508
$$ plain form
1541 256 -2580 -3552 -2351 168 2582 3517 2242 -687 -3267 -3651 -1562 1558 3620 3305 801 -2306
1557 -2306 -3776 -2663 126 2699 3432 2194 -339 -2873 -3705 -2003 1320 3740 3482 836 -2186 -3618
1573 -3618 -2781 -211 2422 3552 2381 -376 -2894 -3479 -1942 905 3298 3531 1281 -1924 -3688 -2830
1589 -2830 -215 2292 3263 2353 3 -2455 -3457 -2104 758 3127 3323 1339 -1531 -3316 -2892 -597
1605 -597 2056 3220 2255 -1 -2214 -3083 -2132 332 2753 3325 1543 -1372 -3128 -2720 -609 1691
1621 1691 2932 2387 354 -1970 -3049 -2112 208 2390 3055 1715 -845 -2938 -2957 -895 1597 2798
1637 2798 2195 475 -1447 -2667 -2399 -402 2147 3241 1966 -682 -2674 -2791 -1125 1094 2614 2480
1653 2480 780 -1383 -2618 -2270 -568 1585 2969 2403 -84 -2633 -3219 -1371 1208 2638 2285 777
1669G77j796j357m6J572K354J508n59k346k433p70J407K595J869j80j856k052
1685a313r66K56J192J859J586j4k040k780j081J439K723J817j59j655k002j158
1701b296K41J369J749J148M2j435k302j537O48K708K403Q6k030k094q04M30R81
1718f93J323J222L27j199k168j490M00K151K307O73j436k405j387M95J511J256
1734H87N71J71n41j582j778l22J896K622J009j320k361j533K31J365J547P36r2
1751A506o86j127j304o57J000K425J825o67k634k086J08J616J534O21Qn36j154
1768b08j351n15Q49J861J703J10j849k561r20J465K462J060o63j054o77o18p86
1785a692R5J744K203L49j983k524q84J157K051J408J1j208j426p28O0M99R14J349
$$ plain form
1669 777 -1019 -2376 -2422 -850 1504 3012 2453 107 -2326 -3096 -1689 906 2775 2595 739 -1313
1685 -1313 -2279 -2023 -831 1028 2614 2600 560 -2220 -3301 -1862 861 2678 2519 864 -1138 -2296
1701 -2296 -2055 -686 1063 2211 2253 818 -1484 -3021 -2373 335 2738 2824 794 -1300 -2104 -1674 -693
1718 -693 630 1852 2179 980 -1188 -2678 -2278 -127 2180 2853 1417 -988 -2375 -1880 -369 887
1734 887 1458 1629 1088 -494 -2272 -2594 -698 1924 2933 1613 -748 -2281 -2050 -685 862 1598 1506
1751 1506 820 -307 -1611 -2268 -1268 1157 2982 2315 -319 -2405 -2297 -681 853 1474 1482 946 -208
1768 -208 -1559 -2074 -1225 636 2339 2449 600 -1961 -2881 -1416 1046 2106 1443 389 -288 -906 -1692
1785 -1692 -1597 147 2350 2699 716 -1808 -2692 -1535 516 1924 1935 727 -699 -1427 -1367 -868 46 1395
1803A395Q91q75k482j844P24K577J935k08j592j329m64O5M04Q81J159O72o34j830
1821e55j699m8J931K271N35j469j853o60M33O28O21P38O74k66j478j594l48J351
1839g88K065J069q18j950j393K69J245Q30K02J68J98o49j679j052R97K315J376
1856B405p70j897j278j2Q23J008P47J80m31p61q79o29K00J371J781L79j619k213
1874a595n78J315J491N11k40k48m16q75q92J29J419J560M04j174j782j006N39
1891a438J565J268Pp90q00m85l96p2Q25J468P77q23j794j260L46J504J348K95
1909A545p65j041o50j01K46N63R57P72k45j498j550k5J471J595L27q09j012o26
1927h46j99K88P06Q23M64k73j044j094m25Q33J528R36n14j375r26Q1N50N03M69
$$ plain form
1803 1395 2286 1411 -1071 -2915 -2191 386 2321 2113 521 -808 -1272 -1207 -803 78 1237 1909 1275 -555
1821 -555 -2254 -2302 -371 1900 2435 966 -887 -1547 -1114 -486 135 873 1547 1281 -197 -1791 -2139 -788
1839 -788 1277 2346 1528 -422 -1815 -1546 -301 529 731 899 1097 448 -1231 -2283 -1286 1029 2405
1856 2405 1635 -262 -1540 -1552 -729 279 1026 1206 775 14 -865 -1494 -1294 77 1858 2237 618 -1595
1874 -1595 -2173 -858 633 1144 904 656 240 -635 -1527 -1398 21 1581 1985 811 -971 -1977 -1438
1891 -1438 127 1395 1402 612 -188 -673 -1069 -1141 -316 1152 1929 1106 -688 -1948 -1602 -98 1250 1545
1909 1545 780 -261 -911 -1012 -766 -203 754 1526 1281 -217 -1767 -1792 -321 1274 1601 792 -220 -846
1927 -846 -1045 -757 -51 772 1236 963 -81 -1175 -1600 -767 761 1697 1183 -192 -1118 -1037 -487 16 485
1946D85M57P6q28j182n07O82J333Q51j42j016j043l89M34Q43O00J92j14n12q21
1965f01o53K51J131J116J17r70j109m50L38P45O93L21j57o25p38m38J47P86J001
1984I05M13o08j224p19K38Q72P75K38k00m85o91n13J14P82R14L65m78r67p70n2
2004a091P14R56M68k55o95o55l01J31N51P71M65k76r13q32p0N94Q92M96j05o35
2024B10p39l60K02N86O67L23k13o53p70k65N14Q30N65q6n86o67l87J21N50O74
2044E16L11k24o23n78k36L06O77O03J09n22p30l94J30N05N66L17o3n50o48k47
2064g75K42O28N19J42l29o29m82o5M45O68L76j44m70n37k73J33N13N63K22k64
2084D83n97m70j00L31N96M17J0m75n78l20J67M67N11K16j77m94n40j67K93N98
$$ plain form
1946 485 942 1018 190 -992 -1499 -817 516 1367 1225 209 -834 -1223 -789 54 654 846 732 220 -601
1965 -601 -1254 -1003 128 1244 1361 391 -718 -1168 -830 -85 608 929 772 147 -591 -1029 -882 -96 905
1984 905 1318 710 -514 -1233 -995 -123 652 890 690 205 -486 -999 -885 -103 811 1176 698 -269 -1039 -1091
2004 -1091 -377 579 1047 792 97 -558 -859 -728 -177 594 1059 783 -130 -962 -1032 -438 454 950 845 210
2024 210 -529 -889 -687 -101 566 889 676 23 -747 -1012 -498 332 897 811 225 -442 -829 -708 -158 516
2044 516 827 603 -20 -598 -834 -528 149 752 861 339 -391 -785 -655 -150 416 733 670 120 -528 -775
2064 -775 -533 95 614 756 427 -202 -684 -749 -304 364 740 596 126 -411 -684 -551 -38 525 747 483
2084 483 -114 -584 -684 -353 243 660 670 195 -383 -703 -536 -69 442 658 481 -13 -553 -720 -427 171
2104A71M46K7m03n79l61J37M90N03K12j97m27m59k14K13N39N13N4m00n57l53R8
2125e47M18M59K86j55m24m57j63K07M11M41J50k81n19m00NM15M73K45j17l37m34
2146c24k09J51L95L91J34j85m63l76p8L40M63K97j32l52l72j30Q2L25L56K25j78
2167C60m04l61q4K67L92K74nl10l97j57N7L22K96J88r0l26m01j08K33L77K95k4
2189C94k58k91k21J4K44L52J79r5k91k89j50P4L58L46O1k37l67k07K7K29K75K11
2211C58l2k34l66j39J61K75L17J7j79l16j85qK28L07J14k7k33k80j24L4L36K96
2233C20K8k01k37j96j5K05K41J46j3k22k57j11P5K22K65J01j78k81j79K4J73K34
2255A44P3%j11k60j46N2K48K26L0j27j98j86RJ71J85J22m7j49j58q1j1J67K53
$$ plain form
2104 171 617 644 241 -338 -699 -562 -72 431 643 446 19 -440 -654 -441 98 611 665 265 -292 -645 -547
2125 -547 -129 330 616 461 37 -420 -583 -376 35 476 626 345 -174 -574 -569 -154 319 564 447 110 -324
2146 -324 -533 -382 13 404 538 353 -110 -486 -564 -224 239 536 404 52 -320 -450 -368 -43 313 538 360
2167 360 -44 -405 -489 -222 170 444 439 129 -268 -425 -368 -46 250 438 348 22 -379 -487 -254 123 418 394
2189 394 136 -155 -376 -362 -118 234 413 318 27 -262 -412 -338 20 366 427 190 -177 -384 -357 -128 147 358
2211 358 326 92 -274 -413 -252 23 340 357 178 -138 -323 -331 -103 204 318 291 58 -222 -346 -312 24 320
2233 320 348 147 -90 -286 -301 -96 145 291 278 56 -201 -312 -237 -15 250 351 173 -108 -287 -263 -90 144
2255 144 217 217 106 -154 -300 -248 0 226 256 129 -69 -255 -246 -75 110 232 185 36 -122 -203 -214 -47 206
2278B06R6j24k70j66L2J62J83R4l3j22j92o4J3J33K18Q8q1k12k23J8J84K04N2
2301A96m3j35j17q9J8J32K12R2j02k07j65l2J58K21R9p6j95q7l1L0J00J04J24
2324B07j6k32k16J9J84J87O9n8j57j26m2N7J54R8K3k9j31j60o1J30K19J32j23
2347A28j75q7k6O2Q1J16L5k3j54j33k5J40J49J35n3j81j66QJ17J23L9Jj3j14j18
2372a34o3R8J90J24p8j67r4m0R8J32O5oj02o5q8qM9J60J49k9k04j60k0J56J08
2397G1O3j2q1r4p7k5R9J44O7kj48j52n7J44J56P4l9j35q0l8kQ0J55Q4o8j63j42
2424a78l4J29K02P9m9j42j63k3Q6J01Q7N7k0j61j80k0J73K01Q0r6j51j21j3M3
2448a13J53J10J7n4j41j58l9J35K53J02r1k12j87K7J42J61M2K7p2j75j00n5J53
$$ plain form
2278 206 302 178 -92 -258 -226 -64 119 213 180 58 -134 -198 -185 -52 166 254 173 -39 -262 -244 -60 144 196
2301 196 153 18 -99 -188 -170 -38 174 266 164 -43 -208 -240 -82 139 238 162 -33 -120 -151 -121 -21 83 207
2324 207 191 -41 -257 -238 -54 133 202 144 -13 -139 -181 -124 30 128 151 122 -9 -169 -230 -100 119 251 128
2347 128 -47 -134 -160 -98 -17 99 134 111 -43 -176 -201 -61 88 223 170 -11 -177 -169 -52 71 110 111 98 -16 -134
2372 -134 -197 -99 91 215 137 -30 -124 -164 -66 66 131 125 23 -42 -130 -138 -89 71 220 191 -13 -173 -193 -37 71
2397 71 134 122 41 -53 -130 -155 -56 88 155 153 5 -147 -204 -60 96 170 131 -4 -84 -122 -124 -44 111 195 127 -36 -178
2424 -178 -212 -83 119 198 149 7 -156 -179 -93 8 95 152 132 -29 -209 -229 -56 145 225 129 -22 -143 -156 -113
2448 -113 40 150 167 113 -28 -186 -225 -90 163 265 174 -38 -225 -198 -56 105 147 174 102 -73 -173 -228 -75
2471g5K40J07p3k27k19PJ67J70O5j2p1j38j47k8J40K26J44q7j98k18l2J50K04
2494I5J24j6j54j24j29J6Q2K29J58j3k48k72o5J54K81J44o3j01j87j39j9J41K28
2517A22J99o2k06k74j43J51K83K55J3k31k46j25PJ49K13J95J3k40l16j46J27L40
2539G8K75Qk53k63j64M4J53K68J77j2k41l10j65J16L34L04N7k25l58j86M1K41
2561h1K82J40o0k04k76j86O9K98L58J19k45l55k53N4K62K54J69m1k02k91j95M8
2583c36L24L23J03j84l19k90j2K30L48J81p2k42k34j92M9K55L33J47j00l69l18
2604c75l3K31L26J93Jj90k99k42J9K78L24J66r6k55l49j53J85L37L02M9k18l57
2626a56k27J1K30L46K00j0l35l70j84J87L56L33P0k25l80k71J6K71L80J81n2k76
$$ plain form
2471 -75 165 272 199 -28 -247 -240 -73 97 162 150 79 -59 -206 -234 -94 132 276 189 -9 -227 -259 -109 95
2494 95 219 203 49 -75 -204 -188 -106 123 281 268 20 -252 -317 -163 118 262 199 98 -89 -228 -247 -106 122
2517 122 321 259 53 -221 -364 -213 70 325 338 107 -139 -264 -257 -108 105 300 313 73 -243 -389 -262 78
2539 78 353 361 108 -155 -319 -275 -122 146 323 311 70 -240 -405 -289 45 349 406 181 -177 -363 -322 -81
2561 -81 201 341 281 77 -199 -385 -316 -18 340 459 214 -141 -394 -340 -78 176 345 304 102 -189 -384 -336
2583 -336 -12 311 414 230 -89 -379 -391 -161 187 368 296 54 -180 -372 -323 -68 265 412 312 -57 -375
2604 -375 -408 -177 149 342 343 153 -146 -388 -369 -91 233 399 303 48 -301 -454 -269 68 370 419 201 -156
2626 -156 -383 -372 -142 204 404 394 59 -311 -495 -308 48 381 451 226 -154 -425 -409 -138 242 423 371 95
2648I5m05j75J33L40L81J09k15l86l21rK74M14K29o7l30l62j79J25L42L77J28
2669D98k27l75l23m2K62M01K76n1l32l55k06J11L46L10J79j39l90l44p7K52M29
2690B03K66n7l12l51k08J17L04L33J54j69l19l17r2J81L88L23J0l10l69k21Q1
2711c65L05K93J86q5l08l45j74J87L76L25O7k23m11k77K1K82L83J71n2k64l75
2732b83j70J00L41L94J64k21m52l46l2L35L74K58n7l04l79k04Q9L49L97K00j87
2753C66m39l81p3L10M38K94q3k89m02k33P5L56M20K08j79m60l91j04L03M57L14
2774E07m7l21m19k53J04L45M34K11j74m13m07j40K73M59L58pl54m24k44J10L05
2795i7L94K06q3l83m15j67J95M47L94j5k98l78k52L4K63M04K18o4l26m12j87J37
$$ plain form
2648 95 -310 -485 -352 -12 369 478 263 -123 -444 -453 -179 235 464 397 67 -295 -474 -349 -7 370 498
2669 498 271 -104 -427 -469 -207 194 470 419 87 -268 -474 -363 -17 293 472 333 -57 -401 -478 -226 203
2690 203 469 412 100 -251 -459 -342 -38 295 449 280 -39 -356 -448 -267 121 444 454 144 -225 -446 -365
2711 -365 -60 233 419 334 26 -319 -493 -306 70 395 462 239 -172 -449 -428 -146 237 408 356 92 -283
2732 -283 -453 -353 -12 382 546 325 -127 -473 -505 -170 204 462 405 101 -278 -482 -393 -44 353 553 366
2753 366 -73 -454 -527 -217 221 515 432 143 -259 -492 -417 -61 359 567 388 -72 -463 -567 -264 193 507
2774 507 460 139 -280 -533 -429 -84 350 561 387 -26 -433 -573 -300 159 517 510 156 -268 -512 -402 -97
2795 -97 297 503 420 37 -378 -545 -350 97 491 476 178 -200 -452 -418 -155 249 467 403 77 -335 -522 -385
2817c85M09M27Q2k82l75l18MK48M02K44Ol26m17k82J26L77M45J58j98m38l41m4
2839d78K30L90K77P7k56m27l19lL85M86J95j37m41l91j17K15M16L31O7k51m08
2860a59l72l0L56N27L12j71m62m58p0K09M00L50P6k12m17l99m3L30N26L01r3m58
2882D3m92j25K63M45L12L5k11l86l18j16K99M82L43n5m41m95j59K20M34L50N9
2903D87k44l58k57j10K12M13L86L2m04n17k41K15M05L59R0j74l58k81r4J69L41
2924G1L38J21k69m92l40J02M21M29J03j80l50k77j01J06L13L99J42k04m92l68
2944e28kL94M43K19j77l88l03q9J37K91L21J96j32m75m08r7L69N03L11j24l90
2965G1m20j37J45L41L19J71j17l52m48k11K92N68M06r6m74m26j36J47L30L29J82
$$ plain form
2817 -385 24 451 533 251 -124 -442 -438 -190 212 456 462 136 -281 -563 -437 -60 385 543 345 -93 -434 -478
2839 -478 -248 142 419 496 240 -187 -506 -509 -124 362 557 420 -21 -412 -529 -314 102 433 500 249 -159
2860 -159 -531 -561 -205 322 634 463 1 -457 -527 -318 82 432 508 296 -121 -520 -563 -233 293 594 501 43
2882 43 -449 -574 -311 134 446 481 270 -116 -434 -550 -251 231 574 519 78 -417 -576 -356 78 428 487
2903 487 243 -115 -372 -482 -270 143 529 561 157 -360 -601 -386 19 378 468 294 -64 -345 -439 -270 71
2924 71 409 530 261 -231 -571 -469 -48 381 484 304 -46 -323 -424 -318 -5 394 536 332 -160 -528
2944 -528 -530 -136 307 526 349 -39 -342 -431 -294 -3 318 514 382 -93 -501 -598 -229 274 585 461 71
2965 71 -349 -486 -341 0 319 490 373 21 -427 -638 -346 222 628 532 58 -368 -504 -357 -27 302 484
2986D84j09l73m08j68K03N11M44J5m59n05k11K16L73L23R1j13k79l89j86J45M83
3007H8M39N6l71n19k34J14M36L42J15j88k90k63j72P9L51M63J43k88n44l20J05
3028d58M18L68J02j34k71k79j90Q7L09L98K18j92m85m08m0L95M54K05j39l14k76
3049b32j70L3K29M21K46r0m33m89q2L08M71L20o4m04l16j57N7K38L38K86l7m10
3071F3n07j78K66N15L90k1l64m10k26P1L08L57K26o1l21m52k67J69N33M58O3m05
3093B07m86k16O7L26L36K38m3l10m41k42J57M59M46J09k99n19l37P4L89L51J80
3114D46q3k60l51k51P0L90M49J81l06m35l44RL37L97J90m2l01l22k16N2K97M00
3136C07K36j82m18l81o4K61L88L04l1k80l55k04M8K48L43K33l6l82m47j36K44
$$ plain form
2986 484 375 2 -406 -574 -371 140 584 599 140 -365 -576 -360 13 336 427 314 35 -354 -540 -395 88
3007 88 527 583 212 -307 -541 -427 9 351 466 278 -12 -275 -447 -368 -17 446 589 301 -243 -563 -458
3028 -458 -40 328 430 296 25 -254 -444 -357 -48 350 568 376 -109 -517 -557 -162 292 497 358 44 -232
3049 -232 -402 -369 -140 281 527 437 4 -485 -567 -259 212 532 468 64 -252 -409 -352 -114 224 510 473 63
3071 63 -444 -622 -356 159 549 528 164 -246 -472 -401 -93 264 490 429 108 -344 -611 -442 91 549 612 207
3093 207 -279 -495 -428 -102 234 472 429 119 -322 -564 -407 52 498 607 308 -211 -548 -474 -85 266 446
3114 446 363 103 -248 -499 -429 -39 410 591 285 -150 -494 -485 -148 249 439 397 96 -226 -442 -390 -93 307
3136 307 543 361 -57 -438 -502 -241 147 451 420 140 -215 -419 -371 -123 220 453 417 35 -412 -548 -304
3157c04M29L20%k51l45k55k2K46L89K60o8l11l79k03R1L97M27J09k51m45k65n
3179d36K75L14K77L0k83m65k72J67L88M07J15k11m42l06m1K49M02K94ll25l80
3200b46k37M8L66M39J93k01m33m01m0K79M12K75qk75m06k25L7L39M06K06j48l91
3222a1l91j06K56L80K99L0k93l91k36O0L31L69J63j24k84m18j29J83L97L45J7
3243D47k86l53j91j1K41L55K24l4l29l35j74J26L24L26J36j52m48k97K7K48L13
3264A57K16J9k33l66k56O7L42L88J71j93l56l24r2J92M09K94pk55l56k16n0L15
3286a34M08K48j33l87l87j22K42L71K99N0k54l92k36k1K90L86K45n7l65m01j81
3307e31J89M45K98N4k20m00k57j9K87L76K38m4l26l91k17J47M18L44J22k87m00
$$ plain form
3157 -304 125 445 445 194 -151 -406 -428 -182 207 467 399 88 -291 -494 -403 -6 421 530 279 -166 -431 -436
3179 -436 -161 153 430 460 177 -288 -560 -393 -5 402 517 306 -136 -442 -483 -234 168 462 459 134 -246
3200 -246 -483 -435 -69 370 563 362 -71 -472 -512 -233 179 454 446 171 -235 -460 -423 -84 322 528 380 -11
3222 -11 -402 -508 -252 128 427 457 164 -227 -463 -403 -72 297 460 336 52 -366 -495 -312 85 430 447
3243 447 161 -192 -383 -394 -153 202 426 392 63 -272 -446 -320 4 330 466 314 -134 -431 -404 -156 157
3264 157 373 392 159 -207 -463 -396 -54 334 505 312 -44 -368 -460 -268 141 435 428 173 -183 -399 -449 -134
3286 -134 274 522 389 2 -385 -507 -265 106 405 455 201 -191 -427 -448 -158 228 473 416 51 -350 -531
3307 -531 -342 103 401 455 235 -165 -422 -441 -154 222 460 416 90 -301 -518 -371 47 391 513 226 -174
3328a74k45K2K13L56K74k1k97l91k45J65L42L67J06k20l26l32OK22L44K13Mk03
3350A80l69k57N3L20M24R6j62l44l09k2J64L08K90L5k34l33k27%K68L28K42q7
3372C64l20l59j14J82L22K36P0j38l48k70p1K74L78K49n7l11l67j75J44L02L38
3393C29Q9j68k89l32o8K00M08L00k7l39l83j59J02L29L32J42j58l62l11n6J53
3414b68M03L00L0k89m30k29J14L76L06J04j39l08k94r9J44L68L00L3k51l66k39
3435d34N1L15L75J30j22l36l01n3J53K86K61J03k20l93k50K7L45L01J58j00k94
3456Bk52j24J08K80L04Q4j57l16k83n1K42L41K07o0k61k73j04M7K30K73J25r0
3478B72l19k55q3J73L45K52m6k47l02j30P7J74K91J47m6k24l75j44J72L69K57
$$ plain form
3328 -174 -419 -397 -184 172 446 425 128 -263 -508 -343 -1 366 472 252 -74 -406 -400 -178 166 379 383 180
3350 180 -189 -446 -393 -73 351 447 285 -59 -368 -390 -226 82 372 407 173 -160 -387 -387 -119 209 451 364
3372 364 44 -315 -429 -247 75 311 381 243 -105 -375 -446 -172 206 455 398 87 -280 -455 -311 -9 329
3393 329 418 250 -39 -371 -439 -239 169 469 442 103 -280 -439 -337 -8 324 466 308 -54 -365 -421 -268
3414 -268 135 435 465 176 -254 -483 -369 7 313 417 278 -30 -324 -423 -279 89 389 422 171 -195 -434
3435 -434 -383 -68 307 437 315 -21 -322 -375 -222 64 325 428 208 -185 -435 -408 -63 238 396 296 2
3456 2 -250 -374 -266 14 318 402 245 -71 -354 -405 -163 178 385 325 64 -209 -313 -266 -36 237 362 272
3478 272 -47 -302 -385 -212 133 385 339 92 -210 -340 -263 -89 202 349 303 79 -296 -440 -268 101 358
3499C58Nk26k78k17K5K44K88J70o1k32k96j75R0L44L05R0k34l57k01L8K30K71
3521A81J77ok77l07j84J17K87L39O6j71l25k90L4K72K61J59k4k29k56k03Q1K75
3543b3K90J51k02l21k45OK12K92J58l2j99k77j11K3K15K93J39j36k80k61n7J96
3565a69L35J29j7j83k04j58JJ52K86J76n9k44k97r7J34K94K26%k23j87j45lJ27
3588a26K27K09jk24l00j26P9L17J91R4j62k61j81k8J51K46J77K0k12k47j96O0
3610b93K72K62R8j49k65j90l0J57K09J96M2j60k79j76l0K64L11J56j46k93k28
3631b72o1J71K31J73O4j63k34k12j1K46K73J48r2k39k99p2J83K33J82L0j33k36
3653i0j70l6J68K96J76p7k47k55q3J48K15J76L3j27j83j69l7J41K38J67j0j99
$$ plain form
3499 358 363 137 -141 -358 -333 -89 199 369 308 76 -220 -395 -305 39 344 434 200 -157 -358 -320 -90 181
3521 181 358 352 75 -232 -416 -299 -12 327 393 222 -103 -393 -359 -87 174 333 309 80 -176 -379 -298 -23
3543 -23 267 418 216 -105 -350 -344 -132 160 318 286 87 -190 -301 -278 -63 230 369 233 -47 -308 -365 -169
3565 -169 166 295 278 95 -109 -267 -266 -114 172 348 289 45 -252 -349 -215 79 305 305 82 -105 -250 -253 -126
3588 -126 101 310 309 85 -215 -341 -262 55 246 340 178 -83 -264 -292 -141 105 282 302 90 -157 -353 -293
3610 -293 -21 241 339 190 -75 -265 -295 -138 71 267 309 149 -130 -306 -336 -72 239 395 249 -44 -272
3631 -272 -333 -162 69 242 306 143 -91 -303 -314 -68 205 353 261 22 -277 -349 -166 67 249 279 146 -90
3653 -90 -260 -296 -128 168 344 267 20 -235 -318 -170 45 221 254 127 -56 -225 -262 -121 117 284 274 75
3675G5k57j39J32K07J81O6j26j82j45m3Q1K21J76J7j35k76j40M1J89K29J00p6
3697A96k12j87m5P4J81K08P7j14k99j76K6K02K16J16l4k05j72j21P0J88K16O0
3719B65r6k03k17m9J62K48J85l1k32j85r2P5J49J95Q2n5k19k22o3J44K73J67p
3742B74j86k24j45O9J94J92R1j00j71k07o0J00K49J81M5j97k45j42N2J86K37Q2
3764B75q6k19j30j26R9K32J77R3j94k22j73M3J40K23J31m3j76j98r4P4J84J83
3786A93O1q5k11k01k5J64K27J19l1j54j91q3J4J49K09J21p7k40j37n9R9K13J41
3809B16O0k00j88j32L2J73J55J46l4j63k41r6J05J83K15J8j15k25j49k0J63K22
3831A25J24m2j74j82j18M9K21K23N6j12k21k05%J54K18J41k2j83k02j32Q1J80
$$ plain form
3675 75 -182 -321 -189 18 199 265 139 -43 -188 -231 -150 71 247 264 129 -147 -287 -246 -57 172 272 196
3697 196 -16 -203 -248 -174 7 215 292 178 -121 -297 -271 -69 147 263 229 24 -148 -269 -199 -11 205 265
3719 265 169 -34 -251 -300 -138 110 295 264 32 -153 -245 -170 -21 174 256 201 -18 -240 -303 -159 114 281 274
3742 274 88 -136 -281 -212 -18 174 265 165 -6 -213 -273 -173 76 257 302 105 -140 -282 -230 -44 193 275
3764 275 189 -30 -160 -286 -187 45 222 315 121 -101 -274 -231 -91 132 263 220 44 -154 -248 -174 10 193
3786 193 254 169 -42 -243 -268 -104 123 242 211 57 -134 -217 -203 -54 155 276 199 -41 -178 -237 -138 75 216
3809 216 276 76 -112 -244 -212 -39 116 262 228 65 -176 -272 -167 16 231 249 134 -91 -240 -260 -97 125
3831 125 249 207 33 -149 -267 -218 3 226 282 170 -51 -256 -256 -102 116 257 235 52 -150 -282 -201 -21
3853b1K31R9r8k74j93l6J98K21J33qj91j89j22OK25J90Q8o3k08j93n3J16K31J55
3877B44j0j55j94j19kJ78J88J54q3j82j80r1J09J92J82J9j33k09j24J1J28J86
3899A09J19j5j66j85j01J6K16K09M0j03j72j59k9J15J98R6J7j18k01j06rJ77J82
3922A30J31p3j94j87m2Q0J87J85L8j37k09j67K2J81J92J53p0k01j82j13J09K39
3944G2J22L0j21j77j51l0J47J96J87p5j65k03r8Q3J94J90N4j51j59j44k8R4K04
3967G1J66Pk11j98j09R4K03J49N9q7j94j61j5J05K00J44k7j23j74j49O7J51K11
3990A79O2j11j52j39pM2J73J67J3j06k14j04jJ59J75J20o5k13j12p8P3J29J81
4013A71O4q5k36j34JJ37J86J23k5j76j74q6O6J82J15N7l0j66j56p5Q4K26J90n2
$$ plain form
3853 -21 210 309 211 -63 -256 -292 -94 127 260 252 61 -128 -250 -244 -19 171 259 196 -12 -205 -258 -142 89 244
3877 244 234 79 -115 -234 -236 -58 130 284 201 19 -161 -252 -143 49 231 250 117 -92 -216 -205 -77 109
3899 109 228 213 47 -138 -239 -223 -7 202 242 139 -33 -192 -221 -106 92 188 205 87 -114 -220 -229 -52 130
3922 130 261 188 -6 -193 -235 -155 32 217 255 118 -91 -258 -236 -55 137 290 220 19 -163 -276 -167 72
3944 72 194 224 103 -74 -225 -255 -108 88 275 200 35 -168 -266 -183 11 201 255 104 -55 -199 -227 -133 71
3967 71 237 244 33 -165 -274 -180 23 172 231 144 -50 -211 -226 -121 79 223 196 73 -101 -250 -183 -32 179
3990 179 241 130 -22 -161 -168 -126 47 214 227 121 -93 -197 -198 -39 136 256 191 -22 -134 -212 -139 -10 171
4013 171 235 150 -86 -220 -219 -82 104 227 202 26 -148 -234 -168 14 129 186 156 -10 -166 -241 -157 69 259 207
4037B07j56j58j03L8J39J67P2k1j71j69p7J07J82J65L1j49j95j48M2J48J60R7
4059B08k9j40k16q6J05J90J85J4j31j93j46K0J56J69J03k4j49j66r7N0J79K03
4081B05L2p4k22j52PJ37J72J03l6j08j97r2N6J49J72Q3p3j56j95l0J45J65R2J0
4105A93j16j43j24L3Q1J83J13k6j66j82o7Q8J86J23J5j21j19j14k9J07J60J37
4127B12Nj46k00r9O3J55J83K3o2j44j59j5Q1J73J02K8q9j90j55M9J63J92P9j10
4151A39j72j14o5J03J52J41N3j14k19j14k0J50K14J32r2k13j16o7J13J52J59M
4173B06r8j67j49j3J31K28J18p6j60j99m3P3J74J44K2n6j77j34o3J26J80J51J0
4196B28j95j70q9J06J25J59L7q1j60j00m8N8K02J26M8j58j86j23M5J59J59L7n5
$$ plain form
4037 207 51 -107 -210 -172 -33 134 206 185 14 -155 -232 -125 57 222 253 104 -91 -239 -197 -49 111 208
4059 208 179 39 -177 -263 -158 32 217 231 100 -93 -239 -219 -63 106 209 185 36 -130 -227 -177 2 205
4081 205 237 163 -59 -211 -204 -67 105 208 172 64 -133 -225 -169 -20 152 235 162 6 -189 -219 -74 91 183 193
4105 193 77 -66 -190 -157 -76 107 220 194 28 -154 -221 -133 53 176 191 70 -49 -163 -192 -85 75 212
4127 212 217 71 -129 -228 -165 -10 173 196 134 -10 -169 -184 -103 70 172 200 111 -79 -234 -185 -22 170 249 139
4151 139 -33 -147 -212 -109 43 184 237 123 -96 -210 -230 -80 134 266 174 -39 -155 -222 -109 43 202 206
4173 206 108 -59 -208 -221 -90 138 256 180 20 -179 -222 -149 25 169 191 135 -42 -176 -239 -113 67 218 228
4196 228 33 -137 -226 -120 5 164 201 120 -40 -140 -188 -130 72 198 246 88 -98 -221 -176 -17 142 179 124
4219A24j12j36j02Q0J74J48M1r8j75j51M5R6J86Q0o5j21j46n0O7J11J51Q5j01
4242A31j65j47l0J13K22R0k1j28j82r2M2J49J48Q4n2j63j83n5J30J65J49j2j36
4265E7j59j01J4J40J94O4n3j56j40j15J07J90J89Lj57j78j07J9J39J73R5l1j78
4288Ij74r1R7J94J64L8j38j85j34RJ51J78R4j9j68j50j15O8J72K04O3j43j84j35
4312a95j9J23J54J20kj24j83p6L2J32J76O8n7j96j39l0R6J98J19j8j14j65q9K9
4336a60R3J69R8l4j49j77p1J07J66J44J6j22j41j17j7J24J63J28k5j69j63p5N9
4359a53J38K03P0j25j78j80J5J20J68J37j9j33k01j26O2J94J92O2r6j89j70KQ2
4382a25J98J42K4j59k02j30K9J73K01J04r7j87j72l9J26J83J68J3j63j89j28J4
$$ plain form
4219 124 12 -124 -226 -146 28 176 217 119 -56 -207 -162 -66 120 200 135 14 -132 -182 -115 -4 147 232 131
4242 131 -34 -181 -211 -98 124 214 193 65 -117 -209 -167 -18 130 214 162 -1 -184 -239 -109 56 205 193 57
4265 57 -102 -203 -189 -49 145 209 156 0 -140 -255 -148 42 231 234 77 -101 -208 -189 -50 123 218 187 9
4288 9 -165 -256 -159 35 199 237 99 -86 -220 -211 -60 118 212 193 25 -125 -240 -172 0 204 267 124 -60 -195
4312 -195 -214 -91 63 183 181 57 -126 -202 -170 -38 138 206 149 -47 -186 -216 -120 78 197 179 65 -100 -189 -160
4336 -160 -67 102 200 166 17 -160 -231 -124 42 186 202 80 -61 -178 -195 -71 92 220 195 26 -137 -212 -153
4359 -153 -15 188 258 133 -45 -225 -210 -90 78 215 196 63 -138 -264 -202 -8 184 246 150 -39 -209 -207 -125
4382 -125 73 215 239 80 -122 -252 -223 -50 151 255 158 -29 -201 -240 -114 69 237 250 87 -102 -230 -216
4404b16J66K15J04r2j94j59q7Q7K14J63Kr4j96j43K1J32K13P5jj73k02j08J05
4427a68J84J76N1j50j78r0k1P4J95J68pj59k17j21R3J76J67M0q9j53j66k9J02
4450a22J80J27M4j41j91q6n0J87K06R7q8j59j65n2Q1J57J46O1r1j99j75j6J88
4473f1J70J49m7j87j83r8Q7J92J64N0r2k05j55n1J50K23J77k4k17k13r7Q0K09
4496B1J90K9j17k01j14m9J31K11J64k3j84k30j09P6K13J91N8r8k09j61k3J14K04
4519H4J31L6j27k50j21L8K09J68N7q6j89j29p3J15K00J62Jj24k05j58M3J49K00
4542A31J12n5j89j53o2Q5J43J57M8r0j95j64NJ49K01J34l5j74j94p4N4J54J85
4565A73Q4r5j81j73o9R9K48J27K0j75k21r7O1J66J91R7q0j93j99n5J14K07K05
$$ plain form
4404 -216 -50 165 269 177 -17 -176 -263 -176 38 201 203 109 -87 -230 -209 -77 136 211 210 37 -165 -273 -168
4427 -168 16 192 243 93 -85 -175 -196 -122 73 241 234 75 -142 -263 -170 6 173 213 124 -29 -195 -224 -122
4450 -122 58 185 229 88 -103 -189 -239 -52 154 251 163 4 -161 -213 -132 25 171 232 141 -58 -233 -249 -61
4473 -61 109 258 211 24 -159 -257 -170 22 186 236 144 -61 -216 -267 -117 106 283 259 42 -171 -268 -188 21
4496 21 211 240 123 -78 -192 -241 -110 101 265 242 58 -172 -281 -205 8 199 257 159 -50 -211 -234 -120 84
4519 84 215 251 124 -126 -247 -209 0 168 225 139 -50 -179 -252 -137 63 225 226 102 -103 -261 -218 -69 131
4542 131 243 188 -1 -154 -216 -131 12 169 217 127 -68 -232 -227 -78 123 257 222 48 -146 -220 -166 -12 173
4565 173 257 162 -19 -192 -261 -162 86 213 233 58 -163 -260 -199 -33 158 255 175 -18 -217 -272 -158 49 254
4588B54j1j33k40j59N3J73K23Q7l1k14k16p1R1K72J83Qj84k15j51M0K07J93J17
4611B76o9k03k07o0P6K13K18M1j41k61j97R4J81J65J15m2j71k08r1J04J93K06
4633B32K7r3k26k02J1J50K53O2j3j59j69j11P9J28K18J00j19k13j68l4J31J82
4655F6J62j1j58j74j46R4J25J74J14l4j94k05r8J48K21J40J7j43j99j17jJ33K18
4678A32J10l6j71k07j08Q5K05K19M8j50k19j27j5J05K18J75k0j57k30j62R0K36
4700B1J87R0j42j96k27j6J83J89J49lj64k04j59N2K01K74P0j48j88k16%J43K01
4723I7J77k4j63k23j14J1J83K53J13j05k14k33rJ46J99J27kj50j71j32oJ98J90
4746A48J16p2j93k15m2J05K12J76k0j37j50j04n3J66J65J64n2j75k26o8J05J95
$$ plain form
4588 254 243 110 -130 -289 -236 -63 160 247 216 2 -214 -285 -194 78 261 269 85 -130 -281 -241 -34 159 276
4611 276 207 4 -203 -263 -187 26 244 285 144 -117 -314 -220 -39 126 241 199 28 -180 -271 -167 26 232
4633 232 259 166 -60 -262 -251 -101 152 214 201 42 -127 -238 -159 -31 187 287 168 -45 -213 -247 -116 66
4655 66 228 217 59 -115 -261 -167 -42 132 246 212 18 -187 -285 -137 84 224 241 98 -101 -218 -219 -86 132
4678 132 242 206 35 -172 -280 -195 10 229 277 127 -92 -219 -234 -129 89 264 244 87 -143 -305 -215 21
4700 21 208 298 156 -40 -267 -283 -100 89 238 235 71 -133 -292 -240 -39 235 305 157 -31 -247 -247 -104 97
4723 97 274 250 87 -136 -250 -239 -56 197 310 205 -9 -242 -251 -105 94 221 219 69 -102 -234 -240 -42 148
4746 148 264 192 -1 -216 -258 -153 59 235 215 78 -72 -176 -229 -63 102 266 214 39 -187 -255 -150 45
4768D5J69K0j00j98j40PR3J97R1J4j21j77j45O8J85J77N3q2j76j38r1R8K02J78
4792B29J5j69j70j52mJ97K06R8o6j97j63l5P6J88J35P4j15k27j78J5K04K02P0
4815B33l5j90k19j7J04J87J34K7r6k06j55jJ53K29J22p4j84k10l4J12J54J66K3
4838B23q1j98j54k2J50J97J37k6j95k11o3J08J65J35M6p4j49j99j5J06K07J27
4860B14j4j51j56r3J0K06J54N1n3j87j18m4N5J67J52K0j21j92j21M6J28J48J25
4883B26k7j91j59m4R1J19J58O0r5j77k16%J98J47J28k1j50j59q9L7J64J87L7n8
4907A66j95j72m8J45J87J68k5k00j79n2M8J35J81Q0o7j87j98m2J20K10J17O1j72
4930H1j97j13K2J93J99L3r9j22j98l5J27J52J73Kj49k09r2K2J88J95O4o6j71j93
$$ plain form
4768 45 214 234 134 -64 -204 -197 -104 93 184 198 77 -100 -245 -177 8 185 238 156 -20 -158 -249 -151 51 229
4792 229 244 75 -95 -247 -251 -54 152 250 184 -13 -176 -211 -135 53 188 262 147 -80 -258 -243 -39 163 233
4815 233 198 8 -211 -228 -124 63 197 224 128 -78 -233 -234 -81 148 270 196 12 -198 -232 -120 34 200 223
4838 223 142 -56 -210 -232 -82 115 252 226 31 -180 -243 -135 30 165 211 137 -12 -211 -226 -120 87 214
4860 214 200 49 -107 -200 -190 16 170 221 168 -19 -137 -181 -126 41 193 213 92 -100 -221 -175 -47 101 226
4883 226 199 8 -151 -195 -104 15 173 233 138 -39 -255 -255 -57 90 218 197 47 -112 -201 -164 0 187 224 166
4907 166 -29 -201 -249 -104 83 251 226 26 -153 -205 -157 -22 159 239 172 -15 -213 -255 -135 75 192 253 81
4930 81 -116 -229 -207 -14 185 218 119 -3 -201 -236 -109 43 216 218 69 -140 -232 -210 -22 173 237 171 0 -193
4954a93l2J05J51J63K6j03k29j21M4J59J58Q4n4j45j66p6Q7J71J43L5r0j61j27
4977a71n0J42J96J00n4j45j21p4J6J33J74N7n9j86j29m4J00J61J29L2j38j66j11
5000b08L3J05J68J09l6j29k10o4O4J95K02nj32j53j61LJ50J85J13n3j30j74q4
5023b12N1J79J71N9j23j93j13l1J64J63J22l5j67j66r4N1J72J53O0p3j97j58j2
5046b29J66J61J16m2j35j18j21J2J65J84L7n2j88j34k7J09J35J72Qj82j58o0M6
5069a35Q8J54J11k6j99j87rJ12J63J02J6p9j94j26N4J28J43P0j6j47j44q7O2J56
5093A0J65Rj00j19j29m4J16J61J00J8j51j64q7M0J37J70R4r7j68j40RR5J40Q5
5117A50K4r5j90r3K1J51J83M9n3j54j51m6P7J74J57k7q7j44j20kR0K21J15p5j62
$$ plain form
4954 -193 -225 -120 31 194 220 117 -112 -233 -189 -30 128 212 158 13 -153 -229 -142 29 172 207 117 -44 -171
4977 -171 -221 -79 117 217 163 18 -103 -177 -161 -28 146 203 144 -42 -171 -215 -115 46 175 207 69 -97 -208
5000 -208 -175 -70 98 207 171 42 -168 -232 -168 27 229 224 92 -61 -222 -219 -69 116 229 176 46 -128 -212
5023 -212 -161 18 189 248 125 -68 -181 -212 -48 115 237 202 35 -131 -225 -174 -2 151 211 138 -59 -217 -229
5046 -229 -63 98 214 172 37 -81 -202 -190 -25 159 196 144 -44 -178 -205 -96 39 211 219 37 -121 -181 -135
5069 -135 -47 107 218 192 -7 -194 -203 -91 72 174 190 111 -83 -209 -155 -27 116 186 170 23 -121 -208 -146 10
5093 10 175 184 84 -35 -164 -208 -92 69 169 187 36 -128 -215 -175 -38 132 226 129 -39 -179 -170 -75 65 150
5117 150 174 79 -111 -204 -183 -32 151 200 147 -7 -158 -204 -127 47 204 177 90 -54 -174 -176 -86 135 250 175 13
5142A3j83k5O6J65J41M4j27j80j39M4J54J53Q9l2j75j46q9J20J59J30K7j05j57
5165e3j17j6J04J94J06n0j31j62r8R6J53J44K6j10j42j39NJ05J46J05J8j31j72
5188a19q6P7J38J35M7q1j30j34k7Q0J50J28k3q6j70j13M5J26J66O6n8j19j26o1
5212a75M8J63J22L2j08j57q6KR9J63J00l6j26j93k6N9J46J06P7p3j65j64l1J36
5236h7J95J20j3j99j51n6L8J38J62P3q5j64j24n7J26J74J28k9j40j70r8M2J83
5259FJ16Q9n2k00j26m1J11J40J71k1j41j63r1N4J61J29M0l6j52j54j6Q5J58J14
5283A81Lj15j59r4K0J44J29O1l8j37j17o3Q8R7J49K9q2j50j12J1J30J15Q5m3j06
5308B6j15r5N2J34J40Mn3j15j30rQ7J63P9k2r3j73l6PJ02J78N1k9j26j50o3R6
$$ plain form
5142 13 -170 -195 -129 36 177 221 94 -86 -225 -181 -27 126 215 183 8 -138 -227 -107 52 182 209 104 -53
5165 -53 -170 -186 -82 112 218 168 37 -125 -223 -127 26 170 196 86 -56 -195 -190 -85 61 166 184 53 -119
5188 -119 -205 -128 10 145 192 111 -19 -153 -180 -100 50 178 155 69 -101 -214 -169 -43 123 189 131 12 -114 -175
5212 -175 -127 36 158 190 82 -75 -161 -159 -60 103 203 167 41 -152 -178 -119 27 133 210 137 -28 -192 -223 -87
5236 -87 108 228 215 16 -135 -191 -153 -15 147 220 135 -29 -153 -210 -84 90 218 189 49 -121 -219 -177 6
5259 6 122 211 159 -41 -167 -208 -97 43 214 193 52 -111 -202 -148 13 142 182 146 -6 -160 -176 -91 67 181
5283 181 184 69 -90 -184 -164 -20 109 170 132 -5 -122 -185 -97 0 149 178 96 -54 -166 -155 -25 90 175 132 26
5308 26 -89 -184 -132 2 142 146 93 -22 -152 -161 -74 89 168 146 53 -120 -156 -149 -47 131 182 153 27 -123 -186 -90
5334i0J26J55Nj34j43r1L8R2J20R3l6j20j53p5J18J25J38L2j25j54q3J4J10J38
5358A00O4l8j15j52m8O0J74J06N3j09j72p6LJ07J36Q4k8j25j56n1L8J68J36N5
5382B14j04j64j29J3J41J29P1l8r0r9j07O5J16J10N1o9j65r3j7J07J21J28o1r8
5406C2j03o1J4J04J00P8n5j20j33j3P7R8J14K5q7j26q0K1R4Q7P2j8j04j15n7J
5432a55J52J34L1r3j11q3k0R6J06O3K1r1j51o8O2J11J35J6o5j48p5j3J13Q1J00
5457A48Kj07j40r0N9J34J38L7q5j43j09kR1J44O9Lj00j39p9J0J72J24L5p1j15
5482a4j27j8Q2J37J17k4r8j27p2L2P8J53N8p0j27j01l8N6J45R5Qr5j08r4M2P1
5508c9J13M4j3q4j20o6N4J28J01K5n4j11j12jO2J32P7k2r7j01o7L6R2J34J7n7
$$ plain form
5334 -90 36 191 196 62 -81 -172 -134 -42 78 171 135 15 -138 -213 -95 30 168 200 75 -79 -162 -148 -38 100
5358 100 164 126 11 -141 -189 -129 45 151 204 95 -77 -153 -150 -43 93 177 149 24 -132 -183 -145 23 159 214
5382 214 110 -54 -183 -170 -29 100 171 133 43 -56 -163 -98 18 128 179 110 -55 -148 -165 -58 63 191 130 32
5406 32 -71 -132 -118 -14 86 164 109 -11 -144 -157 -80 18 132 157 70 -56 -136 -115 -21 66 138 120 16 -99 -156 -155
5432 -155 -3 131 162 69 -42 -125 -145 -49 57 120 141 50 -101 -169 -107 4 139 155 90 -58 -133 -146 -33 48 148
5457 148 150 43 -97 -187 -128 6 144 181 96 -47 -156 -158 -67 77 146 149 49 -90 -169 -159 13 137 172 101 -14
5482 -14 -141 -159 -77 60 177 153 55 -72 -144 -112 -34 119 177 107 -20 -121 -159 -103 42 137 145 50 -58 -152 -110 -39
5508 -39 74 118 105 21 -99 -165 -111 17 118 143 89 -22 -134 -135 -73 59 136 114 17 -84 -151 -115 -23 111 128 71
5534G1j16o5j2M6J13O2L6o2j53r6O7J15J01N1p3r4o9q1M5J44P9J8p2j31p6RR8
5561d5J26O6k9j35j18mM3J24P9M3p9j27p0oQ3R9J02pj40j07m2L8J33R4L5r6j01
5588d1q3k1R9R8J19n6q9j18p1P4Q3J27J6n1j20r6J2O7J28M5Pj19q5l4MJ04Q5O0
5616A44o0j17p5k8R5P9P6J7j01j02m3jJ04R3M2m2r9r4k5P0Q0Q7J7p5p9j08K0Q9
5644c6J10M9l1q1j04rM1J00O9M5q2p3j13mO1J39M6j0r5r1o6M3J11Q7J2k3j28q8
5672a21l9Q5J44M5Or9j10l7L2Q9J04L3o0o3j04l9P3J16P3%q7j28o2M9R5R1N8o0
5700H4j00p1l4N5J33O0nj17r2k5M1M6R0N8l4p1j02k8N6Q0P4L4p4j03p5rR7R3L4
5729I5k5p1n8m1J7Q4Q3K5n6p1r2mQ4P8M1%p5q9l0K9N1P3O8o9n3r3mK8J14M8Qo8
$$ plain form
5534 71 -45 -110 -122 -76 37 99 135 73 -80 -176 -109 6 107 158 85 -9 -78 -159 -114 30 109 127 55 -76 -152 -143 -45
5561 -45 81 147 118 -17 -135 -139 -96 28 107 150 71 -56 -126 -132 -49 50 152 145 5 -102 -144 -106 27 121 156 60 -41
5588 -41 -124 -145 -46 52 171 115 26 -92 -163 -89 -6 121 137 86 -34 -130 -118 -51 77 122 129 10 -75 -109 -105 -1 84 144
5616 144 84 -33 -108 -136 -41 38 114 131 30 -72 -115 -116 -12 81 123 81 -18 -112 -137 -67 13 100 117 42 -37 -145 -125 -36
5644 -36 74 123 92 11 -93 -102 -61 39 108 153 71 -2 -115 -119 -58 81 127 117 22 -69 -135 -92 19 106 118 95 -33 -121
5672 -121 -160 -75 69 114 120 21 -89 -126 -94 -5 99 132 72 9 -95 -134 -61 55 128 128 41 -87 -149 -100 -5 86 144 84
5700 84 -16 -87 -121 -66 67 127 122 5 -87 -112 -71 -25 65 123 89 18 -84 -112 -56 24 98 132 58 -45 -120 -129 -32 61 95
5729 95 70 -1 -59 -100 -83 1 84 109 53 -18 -110 -114 -30 48 89 89 14 -75 -105 -76 -25 48 116 47 -6 -99 -103 -75 39 87 95 27
5761B7o5q6K7Q3O8M7j4q5p5l3J9J10R2%o8o7p4PO5P6N3m1o1o7o2M4R4Q6K8o7r5
5792c4p1K0P5O4N9k6p7j13NJ6R8Q9jn2r7p6K8Q8O1P2l6o9q0l1J6P8O3L9m3q9p0
5823i4j1P3N6P5No9q6n4K0P1P0N0m4r6m2k6N3P1M0L9o3o6o4J8M8R0K3j8o8p9j5
5854i3L3R8N6k8k3n6n5k8O0Q2L1J1m6p7p5L5P7O6Lj2p4p9QO0N8M5ol4n4j07L2
5885i2Q2O6L9o5m5n5j8M0N5O9J5p7l8o3J1N7R3L1K4j40q6oO2O1N9J0n7n9n5K0
5915f2N4P3L7l8n0q5k1M6N3O7j3m8n9m0J2L8R3K1j6o7n4j9J5P2O0J7l8q3n9J3
5945h1O5L4Q0k4o1o9k0K5O6O0Jl3j04pj2O0N0O4j1n4o6j7RRJ00J6j8q6n0LJ9N8
5977FN1J8n5n3n1K7K4O7L3j4l6q5k1K3P7N1J5k8o6p2QM6P4Q2n6n8p6j7K9O1O2
$$ plain form
5761 27 -38 -124 -97 -14 54 101 87 2 -73 -106 -87 23 115 115 47 -20 -94 -87 -22 54 107 66 5 -62 -124 -80 14 100 128 61 -34
5792 -34 -105 -85 -10 54 113 87 10 -103 -98 -82 16 105 104 52 -45 -121 -93 -5 56 128 92 23 -57 -88 -72 6 69 108 65 -24 -94
5823 -94 -105 -32 24 99 104 35 -51 -105 -85 -14 56 106 62 -34 -76 -102 -49 22 62 101 38 -28 -92 -74 -26 64 87 69 1 -78 -93
5854 -93 -60 38 94 66 43 -13 -68 -96 -36 46 77 88 42 -35 -110 -75 2 68 71 59 -15 -94 -86 -26 32 77 71 37 -17 -124 -92
5885 -92 -10 56 95 30 -15 -70 -88 -48 7 76 91 14 -24 -87 -76 -19 74 105 129 -11 -97 -103 -41 20 79 89 32 -27 -82 -62
5915 -62 -8 65 102 64 14 -71 -92 -46 7 74 61 13 -46 -86 -74 -36 57 78 62 -5 -59 -78 -63 9 69 86 48 -35 -94 -81
5945 -81 -16 18 98 74 13 -56 -76 -51 15 75 76 43 -61 -68 -80 -20 30 94 83 29 -37 -54 -45 -36 64 80 62 -24 -74 -71 -52 6
5977 6 57 75 20 -33 -84 -57 -33 34 67 53 17 -68 -89 -66 11 62 77 49 -17 -89 -81 -35 39 121 65 7 -69 -86 -57 4 66
6008F6Lk5m8o1JJ7O1R1m8j8j01j4M7K3Q3j5oo3n7k4O5N1K3K0p1p1k0J4Q1L7M1
6039H2n5n0l7k6K1P8L2K3l6p3k5J2N1M1J0ll5o7j5L0P6M4k5j7o9l9J3L9M8L5j9
6070D4n0m2lJ1R0k4L9k6l3p4k5O8M3L0J6n3n5l9K8M1M9J5k3k3o7%K0M4P0l7qo1
6102c5k6J1M5N4K6m0m2n4lJ6Q7L0om3n8l1jQ0J0N9k7o2l1oJ5L5K9M9m6n7l4pL9
6135b4N3oL3l7p1j8K4M1M2J7k7m8o5L4K5L1O0k2n2k1l3K4M7L9K4m3k2m9j0L7M8
6166C1Rkj5p5k9O6kN1L5mn2m3qK7M5K8k5k4l6l6L3N6j6J4J8j3o1j7J6M7M6k9k0
6199A5k7k7J1kM2M0ok9n2l2L4P2J0llo8k2j2M7N5Mjm1k3k4MM5M6l2qm4mj1N4K1
6234B9N2l4m4k8j5j9N7K9Kll1k3j7J7M6K1j9k2j1m2K1L4L3Rj4l7m4L1NM3J6pj4
$$ plain form
6008 66 69 44 -4 -65 -64 -47 14 105 57 39 -62 -76 -29 -6 77 62 56 -7 -64 -88 -23 28 51 71 0 -71 -91 -77 4 41 82
6039 82 27 -23 -60 -86 -65 13 45 68 32 -41 -66 -54 -3 38 48 45 10 -57 -72 -42 34 78 53 36 -33 -72 -59 -20 28 63 44
6070 44 -6 -48 -51 -40 50 26 65 39 6 -68 -93 -25 18 48 64 11 -44 -83 -55 -14 35 50 27 4 -63 -63 -43 1 71 34 26 -35
6102 -35 -61 -50 -5 49 75 35 -7 -61 -64 -48 39 69 63 20 -38 -69 -70 10 20 79 52 -10 -41 -47 -32 3 32 81 35 -22 -56 -63 -24
6135 -24 29 23 56 19 -52 -70 -46 -5 37 54 27 -21 -86 -52 -27 4 64 42 -10 -31 -64 -40 7 46 70 27 5 -44 -54 -17 31
6166 31 40 38 23 -52 -81 -15 -17 34 69 65 13 -30 -38 -11 34 62 37 13 -23 -59 -26 30 14 28 46 33 -28 -45 -29 18 64 35 15
6199 15 -12 -39 -28 -30 12 52 46 17 -35 -67 -33 39 49 46 43 -25 -47 -59 -12 43 47 46 5 -18 -42 -38 7 53 21 13 -31 -35 -46 8 29
6234 29 81 47 3 -25 -40 -59 -2 27 29 26 -5 -28 -45 -28 18 39 20 -2 -13 -55 -34 0 33 42 28 -9 -53 -22 -17 26 42 35 21
6267B1k0l8ORL9K4Ln0k4j8LM8L4J5k8n3J6lK1LL8m2j6k1pk2M1M9Kj1k7l8K8kK3
6302CL0J0k8no4QL0L8M1n3J1m6qPM5ORk5k4lNJL9J9pm7k4Q%K9L7J0l8l2k9QJ8
6339b1L5M3l5m7Nj3J6M2J4j7j0j8j1k0M0K5J6j3k5m0%kL7M1l0jj9qLk1M2L8j5
6372C1pn2j3ML1K6lj2l7J1j5K6K8K7k3j4l8OJ2RK3J9k2j6l2J1PRL9j5Rm9PqJ4
6407gK7J4Mn5qR%L9j1J8j7k3kj8J8L6J6J5l3n7lK5J9PkJ7m0j9J3J1Rj2L9j8k3
6442a2k6j2L0K9J3k5mk4k6K0M0M1ql9j7k7J8J1K8K6k1j3k6qK4J8%K1j0l3pk6M4
6475aOL3j6k0ok3J6L3%Prl5j4J8qM2J6Mj3m6K1j8J5K4pQm3j8L6j5L2Nk2j9J5j8
6511b0MJ6K9j5Ll3Kk3K6K4J8Qk6l1KK9l4N8k8K0o1M1j5J0RoJ0poLlK8k7OK8j7
$$ plain form
6267 21 1 -37 -31 -22 17 41 44 -6 -30 -48 -45 3 37 52 24 -29 -13 -16 5 8 46 4 -12 -33 -40 -62 -21 28 30 19 -8 -46 -18 -20 3
6302 3 33 43 15 10 -54 -46 -16 22 63 10 21 -25 -33 -26 19 25 34 9 -15 -18 -13 -12 27 46 39 -8 -32 -24 -24 5 42 52 14 -18 -47 -39 -21
6339 -21 14 57 22 -25 -20 -33 -17 25 39 22 12 -6 -17 -37 3 28 44 31 6 -34 -34 -36 1 42 12 11 -8 -16 -13 -34 8 46 31
6372 31 24 -28 -41 -37 -6 20 17 5 -32 -21 -36 -10 18 45 22 8 -30 -24 -12 -3 20 39 17 1 -31 -20 -13 -4 35 20 29 -20 -13 -21 -7
6407 -7 20 34 38 -17 -25 -16 -16 23 12 30 13 -10 -12 -30 -12 24 40 55 22 -35 -38 -13 6 13 11 28 -12 -31 -18 -7 2 -10 29 11 -12
6442 -12 -38 -50 -20 9 22 -3 -7 -31 -57 -37 3 44 36 -3 -20 -47 -29 -18 10 36 15 2 -24 -32 -8 10 10 31 21 -12 -19 -45 -1
6475 -1 5 38 22 2 -4 -27 -11 22 22 29 20 -15 -29 -11 -19 23 39 43 30 -16 5 -13 2 26 19 27 -16 -34 2 -13 19 24 2 -17 -2 -20
6511 -20 -16 0 29 14 17 -16 -14 -37 -11 13 31 39 13 -18 -16 13 -21 37 9 29 -32 9 -6 4 13 7 17 10 4 7 4 32 5 11 39 22
6547B2l3k8M9j5M1m4M3n2nqJ4kM7j2j9j2j9PK2K2K9l3J4l0lj8L8QJ5k1k6J4m3
6580c8L7K5Mj4k0%npK0Qnj0J6l5JJ5L0%l2J5j0Jj5K6RnMm5L0mJJ4rnk2mpL7J8
6619A9J0J9l8Mm1jL5Rk6M1k7l4L9kj2K8Nj2k6jJ1K1l1kJ5l0K2JMj5K0PNk7Oj6
6655b0J6jNJ9nj6j0jL6k7NJ9j3Mk7MMK5l0K3j1k8OM5k7L5k2K6k8rpJ5Jjk0OMK
6693cJ8Oj1pj7%MJ0jJ1nmPnpJ4j4klj0qqM6k1NJ5l4J6K9k1QQOj2%n4O1j4Rk5K3
6734A0J0k3j4K4Nk6QLoK0j2J7k1K4qm1M9j7%K1k2Pj5LnJ6nj1L0j5J7j8Rm9K2K2
6770Ik0J8Mk2kK9j4J5roK9j6j2j7L2j3Qj8L7j7k8M4l1j6OL5j3l0K4j7K0k4J9R
6804A3lJk2L5j2j4Jj8K0JlLJ2K1k2k5lK2k1LKQJ1j4J9k1jNJ5rj8J5pNkJ1k0K6
$$ plain form
6547 22 -11 -39 10 -5 36 -8 35 -17 -22 -30 -16 -18 29 17 -2 -14 -33 -26 -4 18 47 14 28 -2 -5 -23 15 23 38 17 -9 5 -38
6580 -38 -1 24 28 14 -6 -6 -11 -18 2 10 5 -5 11 -24 -23 -8 22 22 -10 5 -5 -4 -19 7 16 11 15 -30 0 -4 -3 11 2 -3 -25 -29 -36 1 19
6619 19 29 48 10 14 -27 -28 7 16 -10 31 4 -30 9 7 -5 23 28 16 -10 -11 0 21 -10 -12 3 -27 -5 -4 0 -15 5 12 17 -10 -4 -20
6655 -20 -4 -5 0 19 14 -2 -12 -13 23 -4 1 20 7 11 -16 -12 -8 17 -13 10 -1 -29 -23 22 -5 30 8 34 6 -3 -10 5 6 5 -15 -9 -5 -3
6693 -3 15 21 10 3 -14 -14 -10 0 -1 10 5 1 8 3 -4 10 -4 -6 -9 -19 -27 -35 11 -10 -5 10 -24 -8 21 0 8 16 22 10 10 -44 17 3 12 -13 10
6734 10 20 -3 -17 7 12 -14 -6 -3 -9 11 -1 16 -5 19 11 -30 19 2 2 23 1 8 -7 -4 -9 7 2 -9 21 6 23 5 14 -35 -13 9
6770 9 -11 7 11 -11 -13 16 2 17 8 2 31 15 3 -14 18 5 13 -5 32 15 -13 31 0 -16 -10 25 12 -18 6 -11 9 -15 4 13
6804 13 10 11 -11 24 12 -2 -1 -19 1 2 -1 2 14 35 13 -12 -15 7 -14 -11 -9 -1 10 -4 15 -6 -7 -2 13 4 -14 1 -6 -1 -3 8 -12 14
6842A4NLpj3RoQrlJ6k8Pml0N3qOk1Rj8M5j7k4L5k6NkrJ4RNpnk1j2J3K0pKqjj2
6884b0J1PnL2k9J0k3K4MNJ7mj9LNOnj9jJJ2Pl5J7kJ4nK7k8l0J0J3kk2J9J7Ll1
6922a6K0Lj5J4K0k0k1OnJ8K0k3J3j6Lj3RRkJ0%j3jl4L7J6j6K8%k5k8K2JL4km3
6958a0oK9rk3K9J7k4J7nm2qL5J0mKj7nRJK7kJ0j0j2m2PK7J1L1pn3qK8LK7oklj
6997B1k7j2J5RK9j5j1j2JKnL5k9Kk9K9J2l7K4J1J3j3k8nL1ljPNpk6qKK1K0k3J
7034aknOJ7j6M4rl6j8%LQN4k1kk1j6j8L1L1j5kMk2k8K5M1j2k1J6k2j9oM7k2M6
7070C9Nk2m2lJ8J6NMj7knm2K3K4J8Rj3o3J5PM8Mj0K6n4rmK3K2J0jk4J6k8Qj8L4
7107A7K5l3j3lj9K2J2Mkrj2Kj1K2OK0k9lj9kL1mJ3j3J5j2j2jMJ0J7k1j3k9M5k7
$$ plain form
6842 14 19 22 15 2 11 5 13 4 1 17 -11 -4 -8 -38 15 7 13 -8 1 -17 28 11 -13 22 -4 1 -1 -10 4 13 18 11 6 -15 -27 -14 6 -1 1 -7 -8 -20
6884 -20 -9 -2 -7 25 -4 6 -17 7 11 16 33 29 10 13 18 24 19 0 -1 0 12 19 -16 1 -1 13 8 35 7 -23 -13 0 -2 -24 -5 12 15 -16
6922 -16 4 7 -8 6 26 6 -15 -9 -14 4 24 1 14 -2 1 -12 -3 6 4 14 14 1 0 -34 3 19 3 31 31 6 -22 0 1 35 33 -10
6958 -10 -16 13 4 -19 10 27 3 20 15 -27 -35 0 10 6 8 -9 -14 -5 -4 23 21 31 21 9 -33 -26 1 12 43 36 -17 -25 3 6 33 27 25 22 21
6997 21 -6 -18 -3 6 35 20 9 -3 -2 0 -5 30 1 3 -26 3 15 -22 2 13 26 13 -15 -20 11 8 7 14 19 12 -14 -22 -20 1 21 -2 -1
7034 -1 -3 -8 -2 15 -1 43 34 -2 -20 -20 -17 -9 45 24 22 1 -15 -33 -2 29 14 12 16 -6 -34 -9 32 20 -1 15 -7 -26 -32 15 -7 39
7070 39 44 22 -20 -23 -5 11 16 20 3 1 -4 -46 -23 1 19 28 15 -48 -33 -26 22 26 16 42 -12 -21 -25 -2 20 30 29 5 21 -7 1 -17 17
7107 17 42 9 -4 -7 -26 -4 8 12 10 1 -11 -9 -20 2 8 28 -1 -4 -23 -25 6 2 15 2 17 5 -7 -8 -4 6 23 2 -11 -40 5 -22
7143b2J1L2LL4m5k9L8j3J3njLjj7Kj1K4K6k1l8oK1R%K3PJn7pJ4K3Nknm0Rl0L2
7181b0K0L3k4kk7MnJ9K6J1k7l7NO%L5K0j1ko0J1K9PQL0l4j9l0KK1J3pM5k5k8m
7217a7J0J8K2Nl5k9LRlN0nj8Rm5l0L3M6m%K6o3j0NRL1Rl1K0k8k3K0L7k1M5j0j7
7253A8k4j3nJ7L3MJ2k9n1MNJ4L5j5K9m9oj2K2L3Mjk1nl4LL5K5Kl3k4Oj1K9RL7
7289D3l5nm0QJ1M8Qj6pm1nMK1L1L8l1l3j8k9J7K7N4k8j0l6mJ2J3L9Kl0rk4j2L5
7324bL4j9Kk2pkj0J5lK0rQj7lOK2J6j7Kj9l3K4K4pK5J1k8l4J4k8L2RJ8ql5mlj4
7362d2M7L0ll9P%m3N1jJ2J4o9J2j0K0J6J4Rj7k7k3LJ7RL2J6k9k5l4J0N7MM2l0
7396C0m9j6MJ4L2K3j2k4j8j8MM6J5J5l6jm5OJ3K8J5K3l0m5JJ3MK3K6j4l0k0J5
$$ plain form
7143 -22 -11 21 24 58 13 -16 22 9 22 17 16 19 18 1 3 -8 16 42 21 -17 -23 -2 7 7 30 37 38 -19 -26 -12 11 16 14 9 -31 -22 -52 -20
7181 -20 0 33 9 7 -20 -16 -21 -2 24 35 8 -29 -24 -18 -18 17 37 26 24 -36 -25 4 11 19 49 15 -4 -34 -32 -11 2 -5 40 15 -13 -17
7217 -17 -7 11 33 38 3 -26 -23 -14 -17 33 28 10 19 -26 -56 -23 23 19 19 45 -18 -28 -23 -14 17 26 -5 15 -13 -36 -16 21 0 45 35 18
7253 18 -6 -19 -24 -7 26 30 42 13 -38 -34 -29 -15 20 5 34 -15 -21 -33 -11 22 26 25 4 -1 -35 -32 3 28 30 -3 -27 -21 -32 -3 6 43
7289 43 8 3 -37 -29 -18 30 38 22 15 -26 -31 -27 -6 25 63 32 -1 -19 -48 -31 -4 50 22 12 -24 -28 -16 -3 36 38 8 -1 -25 -37 -2
7324 -2 32 13 15 -7 -14 -16 -26 -11 -14 6 -3 5 -12 -15 -9 13 29 12 14 -5 -38 -14 10 3 28 39 11 -23 -9 -37 -5 4 22 14 -21 -25 -28 -42
7362 -42 5 35 32 -7 0 0 -43 8 7 19 33 -36 -24 -34 -14 2 16 25 8 -19 -42 -39 -22 -13 19 35 6 -19 -53 -43 14 18 60 30
7396 30 -19 -35 -31 -17 15 38 26 2 -16 -34 -30 16 31 46 10 9 -36 -30 -17 11 26 49 19 -26 -25 -12 -8 15 41 27 -3 -23 -8
7429hmK0K8j6rl4J3k8K7M0lKm9rPK0lK3R%n2rL7k5K6L6j6m6qmlJ8K3N2m3J8n1
7466b1J3jJ0L9Pl1nk7J8k%L9j9ql2j7M0kM7J3n8k0l5J3KO7jk0ml1k8M7lL4J8j9
7502B3k9l5MPN2K7%n3k5j7ON2M6nm5j9lm7M5M4L2%o7k4j4K0M7L4k3j6k3n0L2K7
7536CLL3k3j3m3K1K1KL8k9j1j9rJM6J0Pj3l5Kj6j9M6JL3k6qm9J7J6J5K0j3J4k3
7571@m5J8K4J8J7qj4k1k5J9K9j8L1Pl2j3qJ7J0K0ll1jk9J8j4M3NOm8Pj9K8K9j3
7606DK5k7k1%lL4j5L2j0m0ol0N1K1J2J9l0l0l8J1M5L5jj2on5mL6J9M3k4j7o8J0
7640d0J9K9L4Kk1m9opRM7J9j1Ll6l2rN7kL0k1ml3LPM1k3K0jl3k3NL8lRK0rl6k0
7678b7j0N0J5Rk1j0l6Pj4K6O4j9km1j7RKK8Kmmj9l7J3L4L7J3m7j0m3N1j7N3Lm
$$ plain form
7429 -8 -12 8 36 20 11 -23 -10 -38 -11 29 26 28 -21 -30 -23 -3 -6 17 26 26 -26 -35 2 -23 3 39 23 -23 -31 -35 -38 -20 3 55 12 30 -21
7466 -21 -8 -9 1 40 47 16 11 -16 2 0 0 39 20 12 -20 -37 3 1 48 61 3 -17 -52 -39 -37 30 29 9 5 -26 -54 -7 -10 24 42 23
7502 23 -6 -41 -37 -30 22 49 49 -4 -29 -46 -40 12 58 53 8 -11 -14 -61 -16 28 60 60 -7 -31 -45 -25 22 56 33 17 -6 -56 -24 3
7536 3 6 39 16 3 -40 -19 2 4 42 13 2 -17 -26 -25 21 31 38 25 -10 -8 -24 -43 3 4 37 11 3 -46 -29 -13 2 22 9 23 0
7571 0 -45 -27 -3 15 32 24 10 -11 -36 -17 12 -6 25 32 0 -13 -21 -4 6 26 23 -8 -9 -38 -20 -34 9 14 20 -28 -21 -40 -12 17 4
7606 4 29 2 -19 -19 -22 12 -3 29 19 -21 -27 -57 -6 15 27 46 16 -14 -52 -41 4 39 38 26 20 -35 -39 -3 16 59 35 18 -50 -40
7640 -40 -21 8 42 44 23 -26 -32 -39 -30 17 36 25 28 -8 -40 -49 8 6 36 15 11 -22 -19 -12 29 6 26 25 -8 -31 -26 12 9 18 38 29 -7 -27
7678 -27 -37 13 28 37 16 6 -30 -23 -37 -11 53 34 32 -9 -26 -17 -15 13 15 11 7 -12 -49 -36 -2 35 48 1 -9 -52 -1 -18 35 38 34
7713C4j6m0k1K0L0K9qk3j6m0J0M7k1L6K1n2j5j8OM0M8k7rpm8rK9N7K3o1Kk8k2
7746d9K7K8K7Qk3l3j0rL3L1kkk7j1Ql0K1M2Nk0j6m3J5RK0K3M2n0n1QM5l1N0L1
7780F6j4m7l0j4N1J5lJ9k5oMm0NL2K6lo5M8m5J9J1J8K0ln1Nj7K0oL6J6k9pk6q
7815b8L0K5qK2m9k1k1K1J4K4M3l3l0k9K0K8J9L9m1k3n0PL2K3K7Jl7j2m6OO1J7
7847C1L7k3n1k8j1L4L9j2K7k9m1j6K4PL7J9j5n1k9K5K7NL0%k7j9rkQK2K2k3k5
7880a7Rj7J9PM2nk3j0l8K9pM8J2k7j4k2j3J4J8NL5j0n3j6QM%L0L0l7mj4Jj2K5
7915cM7j9j0k9j2kqO4k0L6l0m2j1L7J6L0j8mn1m6O5K0lL9k9l4k3LL1N4ql1Pm2
7949b6l7M7K8J0L1l6k4Pm0LN8JJ6k5k5n1J0P9kJ4j6m9pJ3KM4Mj0jm1Lj5M2kM1
$$ plain form
7713 34 18 -22 -43 -23 7 36 28 5 -11 -51 -41 6 -15 21 42 -10 -25 -43 -37 3 51 24 15 8 -40 -49 -20 37 60 -1 1 -27 -49
7746 -49 -22 6 33 41 18 -15 -25 -34 -1 30 28 26 -1 -12 -4 -34 -13 29 34 14 -2 -45 -30 -21 -1 22 64 14 -37 -29 16 -15 35 66
7780 66 52 5 -25 -39 12 27 24 43 18 12 16 -24 -19 13 39 36 -29 19 -26 -7 4 22 42 39 -12 -7 -24 -4 -10 26 42 13 6 -20 -28
7815 -28 2 27 19 41 -8 -29 -50 -29 -15 9 52 19 -11 -40 -20 8 27 66 25 2 -48 -41 -9 14 41 42 5 -7 -53 -47 14 31
7847 31 68 45 -6 -34 -45 -11 28 16 43 14 -27 -43 -19 -12 25 44 29 -22 -51 -26 1 6 36 36 9 -10 -19 -21 -13 9 31 8 -17
7880 -17 -8 -25 -6 1 43 38 15 5 -33 -4 -11 37 49 22 8 -14 -27 -13 5 10 45 35 -18 -34 -26 -22 -22 8 38 1 -3 -17 -16 -28 -3
7915 -3 44 25 15 -14 -26 -28 -36 28 8 44 14 -28 -39 -2 14 44 26 22 -29 -75 -10 10 7 46 17 -17 -40 -37 -6 48 40 9 16 -26
7949 -26 -63 -16 12 22 53 17 -7 0 -40 -37 21 22 38 13 -12 -63 -53 26 24 38 22 -27 -34 -21 -19 25 29 19 18 -23 -20 -35 7 5 46
7984D6l0Jn2J4L7QL8k0n0k6ML2K5NPl2Mm1%mN1nmJ0l0k3JK9M3n5L9kl0l1NL8J
8021CL3ok8k2j0jM7K5Jk3m3j9L6J0K3L3l6k6nj4pK5N6l6K4p8K3j6K6K7jJ7n6j7
8055c5QoL5J0J6m3K2o1J7K2L4RKm3l4K7NK8K1Nl9J6p5O4k0P0m7Jk1Jkj1K7J0j3
8090@J5j8j3l1K5L9PJk9njJ0KJ7J6k6j4kklM7k4j0k3J0j4j1J7M7k0%jj8pJ9j2
8126a2M0L2l7l1qJLM8jJk3j8Kk7J9N2jrk0m3nj1O5jkJ7o3J6qM7QJ4ql6pj6J1M3
8164C2Lj6l2l3J0J7L7OK0l4l6j2MLM8L1k6l0m2L0KM9Njk4j9k0
$$ plain form
7984 46 16 17 -35 -21 16 24 62 42 -8 -34 -30 2 27 32 39 7 11 -30 -30 -34 17 12 8 18 -12 -35 -34 -5 38 -17 22 20 -10 -41 -36 2 3
8021 3 36 30 2 -20 -30 -31 16 41 42 19 -24 -43 -7 3 26 59 23 -3 -8 -22 -29 -4 52 16 40 -38 -15 -31 -5 22 21 38 -18 -35
8055 -35 -27 -33 2 12 28 -15 7 -54 -37 -15 19 28 30 -13 -47 -20 -15 13 34 39 0 16 -59 5 -15 55 8 9 -12 -11 -13 -24 3 13 0
8090 0 15 -3 -16 -47 -22 17 24 25 -4 -9 -10 0 2 19 35 9 -5 -7 -9 -12 35 11 1 -22 -12 -26 -37 -20 27 7 7 6 -12 -19 0 -12
8126 -12 28 60 23 -8 -16 -15 -12 36 35 36 13 -5 -3 -30 -11 41 40 31 11 -32 -37 -48 17 16 14 31 -32 -16 -24 23 31 45 37 1 -6 -22 -11 32
8164 32 35 19 -13 -46 -36 -19 18 24 44 10 -26 -38 -34 -31 17 48 22 -8 -50 -20 -18 31 36 35 11 -8 -28
8191b8
$$ Imaginary data points
##PAGE= N=2
##DATA TABLE= (X++(I..I)), XYDATA
0@%%%%%%%%%%%%JrJ6j6J6j7K5l2M0m8N6o6P5r0J06j22J38j62J88k13K44k76L12
35A66l53L98m49N01n59O24o96P77q60R49j053J166j283J414j560J718j890K084
53A094k300K538k803L103l447L840m298M839n488O287p296Q615j0426J3089j7410
68a0063K5834o7167K76469J48440l73880k01214J53021J54477j63146j29832J70855
79a6206K40153o6013k23345o8867Q2135N748j0228J34174J53936j15018k81759
90a65290p1801K16663J56138q8254j05134R1056J08543j06731k09453j8393J96949
101D293J70918k0527j39970j16640j9112O9723R0836K5788l7824j2060L6270k1808
113B9887j20546o9417J14481J79857K8723j28310j07761q629J9507K2172P3237
$$ plain form
0 0 0 0 0 0 0 0 0 0 0 0 0 0 1 -8 8 -8 8 -9 16 -16 24 -24 32 -34 41 -49 57 -65 73 -89 99 -114 130 -146 166
35 166 -187 211 -238 263 -296 328 -368 409 -451 498 -555 611 -672 742 -818 900 -990 1094
53 1094 -1206 1332 -1471 1632 -1815 2025 -2273 2566 -2922 3365 -3931 4684 -5742 7347 -10063
68 -10063 15771 -51396 225073 373513 -367 -201581 -48560 105917 -57229 -187061 -16206
79 -16206 223947 157934 -65411 -134278 -52143 -46395 -56623 77551 231487 116469 -165290
90 -165290 -237091 -20428 135710 47456 -57678 33378 141921 35190 -174263 -192656 4293
101 4293 175211 154684 14714 -101926 -121038 -51315 39521 65309 27485 15425 51695 29887
113 29887 -90659 -160076 -45595 134262 162985 34675 -73086 -81715 -62208 -40036 33201
124C3201P7297l5775j15031k9967O7832J594q5158K7661J89732Q1471k04144k36642
136b27929N8018K46367P4961j41093o9562J03499M4070j40199j10559J02937J65624
147A06134R943r5526l7188J267n7579l8513J08497J50699k3560j66737o8272R1190
159a9645N4687p4365l3982J22447J11871q6950j84983m5953J20262J09963K499
170G5851l8692k0703k8696m3352o418M4204M4280J8837J2354q360o8096q6335
182a05126L754J10586R6175j5914q1709n1468n372N912J7517M2647L8262k811
194E2453l1782l4371l8918k8298L8289J05678O1737o9999j21645k7052P0929M5858
206B2879k0483q65N3331J4670q0684q3398J8785Q4219M7638n240j3925k5291n7508
$$ plain form
124 33201 110498 74723 -40308 -70275 -2443 -849 -86007 -58346 131386 212857 8713 -227929
136 -227929 -169911 76456 151417 10324 -59238 44261 88331 -51868 -162427 -59490 106134
147 106134 116077 20551 -16637 -15370 -72949 -111462 -2965 147734 124174 -42563 -110835 -19645
159 -19645 35042 -39323 -73305 49142 161013 74063 -110920 -156873 -36611 73352 75851
170 75851 37159 16456 -12240 -55592 -62010 -17806 26474 45311 57665 49305 -18791 -105126
182 -105126 -101372 9214 105389 89475 7766 -43702 -49074 -43162 -25645 17002 55264 52453
194 52453 20671 -13700 -52618 -80916 -42627 63051 124788 54789 -66856 -93908 -22979 22879
206 22879 2396 1531 54862 69532 -11152 -94550 -75765 8454 56092 50852 36927 11636 -45872
219d5872l8774M5578Q6704K2884m8609l1351J2471j2155n3039l881Q8590Q1018
231A03564l1235r8435m7021K8170L6008J4100K1345K6348j3700n5452l9485R059
243d6734L1281K8780L1227J8769l3379p4820l8996M1510O9955K6106j7554j9367
255A6778j5884l1130k6883J8722N6924M0629p266l7878m1479k9356L501M7608
267e714N7836J1905m1355m5153j4076K637N172K5307M7393K2994l8293o5347k7604
280f4298K5018M1324K9967J5677p153l9664m7536j0280L5038M2085J8878p4j3261
293B5721l4749m3357p869M6703N8110J4529l0578l7321k2702j0450P765L5714
305A516M3353J0024l3757m4233k1445N195K3490L5969L0534m275m2979m4484q436
$$ plain form
219 -45872 -84646 -39068 47636 70520 21911 -9440 3031 -9124 -62163 -66044 22546 103564
231 103564 72329 -26106 -73127 -44957 -8949 5151 26496 52844 39144 -16308 -55793 -46734
243 -46734 -15453 13327 44554 63323 29944 -44876 -83872 -42362 27593 53699 36145 16778
255 16778 894 -30236 -57119 -38397 18527 59156 51890 14012 -27467 -56823 -53322 -5714
267 -5714 52122 64027 22672 -22481 -36557 -33920 -28748 -3441 43952 66946 28653 -36694 -64298
280 -64298 -39280 2044 32011 47688 40535 871 -46665 -56945 -21907 20178 39056 38982 25721
293 25721 -9028 -52385 -60254 -13551 44559 59088 28510 -8811 -31513 -41963 -34198 1516
305 1516 44869 54893 21136 -23097 -44542 -39347 -15857 20112 50646 46371 3392 -41092 -49528
318d9528K5249L1769K3162J0871j1292l7263l8186l671L4165L9729J7031p911
330C4125k3987l1919k3364P193L7486L7164P586k1453l0389k4204q936J5563L6848
343A1713L1818j057l2015l4868j5145P365K4006L1572K0795r568l6772l4707o243
356d3106K2039L1608K3927N248j9178l5744k7582L103L0933L4369J5750r225k8110
369D032l2462j6166J4536L6556L0973L663k2614l1814k3227k143K2561L5535K3691
382D3121o746l1891l3005j2691J3223K9997K9250J0112j7432l4058k6720j415
394c8255K3273L1944K1102k886k6274l3198j6905J1554L0937K8287Q195j5179
406B2595k8893k5730n999J9390L2814K3495k427k5972l1182j5861Q973K7205K7565
$$ plain form
318 -49528 -24279 7490 30652 41523 30231 -7032 -45218 -48889 -14724 25005 42036 34125
330 34125 10138 -21781 -45145 -37952 -466 36698 44284 22831 -7558 -31762 -40698 -25135 11713
343 11713 43531 42474 10459 -24409 -39554 -32189 -8183 23389 44184 34616 -2156 -36863 -43106
356 -43106 -21067 10541 34468 39716 20538 -15206 -42788 -39685 -8752 25617 41367 32142 4032
369 4032 -28430 -44596 -30060 6496 37469 41132 18518 -13296 -36523 -38666 -16105 19430 43121
382 43121 36375 4484 -28521 -41212 -27989 2008 31258 41370 23938 -10120 -36840 -38255
394 -38255 -14982 16962 38064 35178 8904 -24294 -41199 -29645 1292 29579 37774 22595
406 22595 -6298 -32028 -38027 -18637 14177 37672 35245 9273 -21909 -37770 -28797 -1592 25973
419B5973J0482j2719k7375k4984p256J5733K9670K4422J707k3046l1525j7736
431c6654P460K5731K6083J0605r868k3446k3383r611J0850K6164K5347O487j8620
444A7145l1117k0746M468K4509K5728J0753q005k0013k1159j1435O017K2383K5675
457B4203J0803j3948k9822k3989k09K3002K8101J3274p919k0449j9655j0123L669
470b3062J7664K4494J5248q390k9302k8464m607K2587L0934J6161p610k2245k0842
483a7434r026M808J5778K1006J5600l000k5030l1168j1226K0267L5081K0449q037
496B8068k4992k1447p221N823J4518J8574J4175j452k0550k7990j4308J3078L2477
509H753K6371j706k7086k7945p492J2281J6652J1775Q031K562j1709k5656k0201
$$ plain form
419 25973 36455 23736 -3639 -28623 -35879 -20146 9524 33946 35653 12607 -18918 -36654
431 -36654 -29194 -3463 22620 33225 23357 -89 -23472 -33083 -22233 3931 29278 35765 17145
444 17145 -13972 -34718 -30250 -5741 19987 30740 22735 2722 -18437 -29872 -23855 -1472 24203
457 24203 35006 21058 -8764 -32753 -32962 -9960 18141 31415 23496 3047 -16608 -26731 -23062
470 -23062 -5398 19096 34344 25954 -3348 -31812 -36419 -13832 17102 33263 25653 3408 -17434
483 -17434 -26460 -21652 -5874 15132 30732 27732 2702 -28466 -39692 -19425 15656 36105 28068
496 28068 3076 -18371 -25592 -19769 -5251 13323 27498 26046 5496 -22494 -36802 -23724 8753
509 8753 35124 33418 6332 -21613 -29105 -16824 -172 11603 19634 22196 10487 -15169 -35370
522c5370P429L2495K9334Q46k5716k8325j0026J0419J8606J4310N538k263r789
535G488j7064j7036j500K2483L2024J2497k0968l5286j7343J2258K4438J4723
547A6714Q38m586o194j1761j5756o186J5625L0179J8841j2584l4824k5330O165
560b8859K7454K0850Q21r454p255o920j1941q803R369K6413K1416m938k8915k8611
574b9373m484K2329K8816J1093j1980j8319q319n42k945j205J4735K6518R423
587C5747k5875l9012j1842K5786L3904J0910j2689j6829r676m740j819N441J4710
600D016J6843N971j4022k8447k1004Q805L5016K8841n163l0213k1943K464J1768
613g068M084K185J2457J4129o735k9903k5668O237L3577K9289m84k5828k5150
$$ plain form
522 -35370 -27941 4554 33888 34734 9018 -19307 -29333 -18914 -308 14002 19540 17277 7488
535 7488 -9576 -26612 -28112 -5629 26395 38892 17924 -17362 -34705 -22447 1991 16714
547 16714 17552 12966 6772 -4989 -20745 -26931 -11306 18873 37714 25130 -9694 -35024 -28859
560 -28859 -1405 19445 20266 10812 3557 -3363 -15304 -24107 -14738 11675 33091 28153 -762 -29373
574 -29373 -33857 -11528 17288 28381 16401 -1918 -10237 -10779 -13724 -14929 -194 26324 35747
587 35747 9872 -29140 -40982 -15196 18708 29618 16929 100 -9576 -14316 -16135 -10694 4016
600 4016 20859 26830 12808 -15639 -36643 -27838 7178 36019 30856 643 -21300 -18836 -7068
613 -7068 -2984 -799 11658 25787 19052 -10851 -36519 -30282 3295 32584 32100 6272 -18878
626a8878m776J2071J2269M902L927O726o91j7850k3925m669K4168L2034R847k0230
640A4925k9716j3286J0416J9503J0637j365l078M38n048j7327j5019J0814L4038
653A5932K2870j4898l6545j9308J2315K2279R242j925n77K60q324j5547q590R013
667a3803K1794J8791l47k2729k8173p367K1259K7328O107j4190j1234J168j215
680b611j2404o228J8393K9195O677k5805l1554o945J9392K3374Q891o113j1038
693C224q052m500l012K71R384J7633J1559j0695k8210j9763R174K8698J9882m449
707B1144j8296j2973j659K478J598N066J2582J2058m076k3330k3272J242K6791
720f47K6035Q71k0280j7969k652N272L655M595J0495R533m144j8538j8183j885
$$ plain form
626 -18878 -23654 -11583 686 5588 9515 16241 15550 -2300 -26225 -30894 -6726 25308 35155 14925
640 14925 -14791 -28077 -17661 1842 12479 11114 8036 8474 3426 -13901 -28920 -18106 15932
653 15932 38802 23904 -12641 -31949 -19634 2645 11887 9962 9385 9645 1321 -14226 -22816 -13803
667 -13803 7991 26782 26435 3706 -24467 -31834 -10575 16753 22860 8670 -2564 -1396 -2611
680 -2611 -15015 -21243 -2850 26345 33022 7217 -24337 -31282 -11890 11484 20375 14262 3224
693 3224 -4828 -9328 -12340 -12069 -2685 14948 26507 15812 -12398 -32161 -22987 5711 25593 21144
707 21144 2848 -10125 -11784 -9306 -7708 -2642 9940 21998 17922 -5408 -28680 -27438 -647
720 -647 25388 26259 5979 -11990 -14642 -9370 -5715 -1120 9375 18908 14764 -3774 -21957 -23842
734b3842J7064K2982J0487j1175k3009j3964N574J4762Q007K33J943L146p555
747D653j9297j1502J3300K7253J3571j2080k2362j1918L549J0165Q844N458J962
760A1596l031q370j0919o926M908J7076J6964L05j8903k0660l417J3915J5025
773G563M667k876l446m471q855q595K175J5457J6929K745j5043j9834q016R242
787a2358J6336R949r86o820p285o759n421J294J1321J5181N828j0439j8871j1599
801b0629M721J5983J3816K412q154j0729p118k240K485Q031J1925P590n854j7341
815e102j4576J435J5730J5654L939p622j1210q318k816L534R206J0697N270n212
829A0609j3591j2720j871J1479J6196Q257n759j3746j0819j811N715Q911Q543
$$ plain form
734 -23842 -6778 16204 26691 15516 -7493 -21457 -15883 -1121 6886 7119 9062 12208 4653
747 4653 -14644 -26146 -12846 14407 27978 15898 -6464 -18382 -14833 -4668 4176 9634 11596
760 11596 8565 195 -10724 -17650 -12742 4334 21298 21603 2700 -17960 -21377 -7462 7563
773 7563 12230 9354 5908 1437 -7418 -16013 -13838 1619 18548 21293 6250 -13584 -21600 -12358
787 -12358 3978 13927 12941 6121 -1164 -7923 -13344 -12050 -729 14452 20280 9841 -9030 -20629
801 -20629 -15908 75 13891 16303 8149 -2580 -9698 -11938 -9453 -1422 10503 18093 12239 -5102
815 -5102 -19678 -18243 -2513 13141 17080 9458 -1752 -10070 -12886 -9352 -146 10551 15821 10609
829 10609 -2982 -15702 -17573 -6094 10102 18359 12600 -1146 -11965 -13776 -8061 850 9393
842I393M466l670j1824j2394k895R904J5090Q689l532j2136j1652l898N182J0217
856I40R054L213m444r966j0092l423O739J3007R785r25j0722j2111n197M128R662
871c52R209L826l718r378r614l550N443J1188R370J025q133j1642p109K075R356
886b004J0147M710l263r095r592m091M440J0461R547K053o949j1114p945L97Q382
901c916J0812O288k340r376j0317m620M194J0317R668K632o138j0723q283o85
915a2487P384J0793P324j211r138j0929n361L786J0114R723L096n441j0330q521
929a1198j161O751J0227P293j76p912j0758o413K803J0138J0109L197n361r633
943b094p965j697N666R724P604K67p446j0175o178J804Q865J0076M390m626j0043
$$ plain form
842 9393 13859 10189 -1635 -14029 -16924 -7020 8070 16759 13227 1091 -10561 -14459 -9277 940
856 940 9994 13207 8763 -1203 -11295 -14718 -7979 5028 14813 13888 3166 -8945 -14142 -10014 -352
871 -352 8857 12683 8965 -413 -10027 -13577 -8134 3054 12424 13449 5316 -6326 -13435 -11360 -2004
886 -2004 8143 12853 9590 495 -9097 -13188 -8748 1713 11260 13313 6364 -4750 -12695 -12298 -3916
901 -3916 6896 13184 10844 1468 -8849 -13469 -9275 1042 10710 13342 7204 -3519 -11802 -12487
915 -12487 -5103 5690 13014 11803 2665 -8264 -13625 -9839 275 9998 13094 7653 -2677 -11198
929 -11198 -12359 -5608 4619 11912 11736 3824 -6934 -13347 -10544 -406 9703 12900 7539 -2094
943 -2094 -10059 -11756 -6090 3634 11238 11505 4059 -6116 -12294 -10490 -1625 8451 12841 8215 -1828
958a828q200j191N653Q488O791J277n795r872p122J188Q636R606M137l436q547
973b15q324k805M770Q933O958Q34n254q037o645q69O590R953N820k749q666p868
989g574k566L322P208P385K835m300q785o978n19N747Q278O029l52p180r237m314
1005a1001L460P896O766K410k795p231q009k789N576R906O421j226o914p772m578
1020i880J317P077Q592L810l738q134p058k202L950Q541P889Q22p507r631m307
1035a0459K828O533O502L959j183p231q919l404N008R154O625L28n618q364n824
1050a0065J221P421P674K731k527n445o323m511J660Q730R173J354p367q909l911
1065i094J889N153O216M380r34o316p159l016K392O191P122L663l938r764p401
$$ plain form
958 -1828 -10028 -11219 -5566 2922 9713 10990 5195 -4677 -11799 -10611 -1975 7631 11768 8332 -215
973 -215 -8539 -11344 -6574 2359 9317 10151 4897 -3140 -9785 -10654 -4064 5889 11709 8960 294 -7574
989 -7574 -10140 -6818 390 7775 10610 6310 -2475 -9453 -9972 -4225 4053 10082 9730 2550 -6687 -11001
1005 -11001 -7541 355 7121 9531 6736 -495 -8504 -11293 -5717 4189 10610 9384 2470 -5302 -9880
1020 -9880 -8563 -1486 7106 10916 7178 -956 -8014 -10216 -6266 2275 10164 10986 3479 -6152 -10459
1035 -10459 -7631 -1098 5404 9363 8180 949 -7970 -11374 -6366 2788 9413 9741 4123 -4241 -10065
1050 -10065 -8844 -1423 6251 8982 6455 1010 -5313 -9824 -8164 566 9739 11093 3726 -5183 -9094
1065 -9094 -7205 -2052 4164 8544 7610 1294 -5865 -8881 -6489 -298 6824 10487 6549 -3215 -10616
1080a0616J716Q136O436J239j691k968n110n396k93O980Q782L107m490q034o212
1095h414p08N529Q106M265k503n716m147j970p90K521P219O983j241r707r027
1110i600l42O943P171L174r83m063n414l616L84L782N321M718J121n601r848n250
1126a2103N501J1023N681l287o365l769j530r43J821N981O172M47o232q171m429
1141a0203K643Q594Q423P59p781q402j665L676L066J803L589L679k698r705p403
1156a1625K932J0216P767j08o034o980l878J383N280M742J356n43j181l883o769
1171g325k963O996J1732L968p848j0327k772M017M297K258K069J372j956n200
1185a682m707q32L972P279N872j709r579q646J180Q670N876j143k619N9q01n141
$$ plain form
1080 -10616 -8900 -764 5672 6911 5220 2252 -2858 -8254 -8547 -1567 7215 10322 5832 -2202 -8414
1095 -8414 -9122 -3593 4513 8778 6275 559 -3588 -5558 -6348 -3827 3392 10375 9134 -573 -9600
1110 -9600 -9942 -2999 4172 7346 6363 2300 -3114 -6730 -6346 -2564 2757 7475 8596 2995 -6853 -12103
1126 -12103 -6602 4421 10102 6815 450 -3319 -4849 -5792 -3971 2010 8182 8629 2397 -5774 -10203
1141 -10203 -7560 1034 9457 10216 2435 -5967 -7632 -3956 -890 913 4502 8181 5483 -4222 -11625
1156 -11625 -8693 1523 9290 9182 3148 -3832 -7710 -6327 -1047 3695 5051 4508 3327 -556 -7325
1171 -7325 -10288 -3292 8440 12408 4560 -5767 -8539 -4522 -225 2033 4102 5474 3518 -1682
1185 -1682 -6389 -7221 -3249 4030 9902 8193 -1386 -10032 -8852 -182 5694 4551 1932 1991 1190 -3951
1201c951m480L106R153O149k456q012o933j157N011P258L520k486m610k047m11
1216b346j920j205M710Q612K709p886j0625k482O558P624K703j620l161l329k341
1231c999n04J276L069M593L599k336r098p722K726J0803P082k762o787l008L84
1246b684o26p67L103N979K859l622p136n244K98O335Q307K893n754q465k577L838
1262c263L449Q4J105M102J122o690q679p10Q301Q438J291m901o021l428L54L609
1278a837M096J741m25q22k045m730m003K804R193O276l651r211m891K340M559
1293f06K464R22R33l65l066m196k201J933N667N717M59o449p804j424N692N809
1309C485P82j941o88n22l270l800P68O118N826K23n101o158k908K368O020M516
$$ plain form
1201 -3951 -8431 -5325 3828 9977 7521 -491 -7424 -8581 -3570 3688 7208 4722 112 -1935 -2346
1216 -2346 -4266 -5471 -761 7851 10560 2674 -7951 -10433 -3875 3749 6452 4832 1671 -1658 -3999
1231 -3999 -4503 -3227 -158 4435 8034 5698 -3400 -11122 -8396 2407 9489 6727 -60 -3068 -2684
1246 -2684 -3310 -4077 -974 5005 7864 4242 -2894 -8138 -7840 -1505 6802 9695 3941 -4524 -7101 -3263
1262 -3263 186 270 1375 5477 6599 -91 -8770 -9480 -1179 7259 8550 3649 -2372 -5800 -5446 -1837
1278 -1837 2259 4000 3575 2753 708 -4022 -8025 -5221 3972 10248 6597 -2614 -7505 -5165 -606
1293 -606 1858 2780 3713 3348 282 -3914 -6115 -4182 1485 7202 7661 1212 -6592 -8016 -2324 3485
1309 3485 4267 2326 1638 1116 -2154 -5954 -5186 932 6758 6981 1880 -4278 -7186 -4818 1202 5718
1325E718n83l916k760n86r17j120K368O306L818m085q394m145L295O163L540M2
1341D744k001l099l044j128J443L131L328K150j003n222o065p14O161O979J176
1356F836m221m330j579j34L40K163M050K743j670n169m756o62M011N946L270k128
1372D710n581l918K23K596K435K051J834j81l894n254j637L874N982L027j569
1387D698m535m186j209K190L863K723L88j257k513l389k239J620N355M566m99
1402E576m900m597r98J957L109K738J275r68l136l358j274J445L665L728J068
1417E330k917n038k865J449M012L194P57j147k300k963j966Q66L721L882J011
1432E026k418m225l045J46L284M070J826j320l102k950j344P47K919L674J734
$$ plain form
1325 5718 5135 1219 -1541 -2127 -3044 -4164 -1796 4510 8328 4243 -4151 -8296 -5001 1162 4702 4744
1341 4744 2743 -356 -3400 -4528 -3085 46 3374 5524 4521 -701 -6766 -7480 -1319 5660 6836
1356 6836 2615 -1715 -3294 -3428 -3088 -925 3125 5868 4198 -971 -5727 -6389 -2378 3568 6838 4710
1372 4710 -871 -4789 -4566 -1970 465 2516 4350 4169 275 -4979 -6616 -2742 3240 6267 4698
1387 4698 163 -4023 -5232 -3042 821 3544 3932 2675 162 -3227 -5466 -3846 1509 6075 5576
1402 5576 676 -3921 -4919 -2962 147 2885 4160 3192 56 -3302 -4576 -3131 534 4262 5330
1417 5330 2413 -2625 -5490 -4041 -29 3165 3922 2775 475 -2488 -4454 -3588 133 4015 5026
1432 5026 2608 -1617 -4662 -4516 -1232 2838 4664 3344 242 -2708 -4052 -3305 -386 3288 5022
1447E022j852m371l400n3K983L906K253n59l096l646j691J157L204L248J389j354
1463C140l580l569q20K598M152K599m95k963l510j922Q28L118L482J403j479l396
1479d14l166q13J998L721K860Jk773l671k034P80K980L378J515j349l351l049
1495c387p13J847L245K652L55k277l578k307N22K948L281J452j085k987k983r76
1511c991J627L151K509L94j901k993k368j17K408L422J900r28k924k865j041J262
1527b455K732K565P97j540k962k369l01J907L051K257k06k640l210j416J174K730
1543A14K438Q99j124k616k587q25J747L144K303l2k275l118j836O80K792K896
1559B600J014j316k620k327q34J280K912K676M07k337l340j874P26K586K718J295
$$ plain form
1447 5022 3170 -1201 -4601 -4654 -1671 2235 4488 3929 833 -2813 -4504 -3347 -143 3105 4494 3140
1463 3140 -440 -4009 -4829 -2231 1921 4520 4025 1062 -2448 -4370 -3542 -424 3058 4461 2982 -414
1479 -414 -3580 -4393 -2395 1326 4186 4187 1414 -2257 -4291 -3511 -531 2847 4362 3013 -338 -3387
1495 -3387 -4100 -2253 992 3644 3999 1722 -1856 -4163 -3641 -693 2588 4040 2955 -32 -3015 -3991
1511 -3991 -2364 787 3296 3690 1789 -1204 -3572 -3689 -1281 2141 4041 3113 189 -2676 -3717 -2455
1527 -2455 277 2842 3639 2099 -863 -3232 -3533 -1626 1425 3682 3476 836 -2374 -3790 -2616 114
1543 114 2552 3451 2327 -289 -2876 -3701 -1954 1190 3493 3461 1186 -1932 -3768 -3088 -296 2600
1559 2600 3614 2298 -322 -2649 -3483 -2203 709 3385 3792 1455 -1885 -3759 -3033 -447 2271 3566
1575C566r67k625k679q53J458K733K377N17j807l071k259K93K635K936J248j046
1591B456k388k298j054J016K567K558O41j753k939k017J18K152K782J484o99k440
1607A86k381r07R63K226K273Q93j309k799k270K0K085K641J374n31j972k270j179
1624b957O75K232K274Q24j103k410k164m76J690K728J687m52k066k047j015L91
1640b189J623K221J387o66k506k431n27J635K466J611l2j590k211j401K94J716
1656f00K065J222l15j922k519j177J159K812K113j29j875k058j078N9J300K023
1672A080J594j39j981k540j161J027K525K243L53j774k476j373M73J555J668J131
1688B205J04j375k434j666P05K711K427L16j764k344j376K74J533J808J063j87
$$ plain form
1575 3566 2599 -26 -2705 -3558 -2100 633 3010 3527 1720 -1351 -3610 -3317 -682 2254 3502 2456
1591 2456 68 -2230 -3284 -2268 299 2857 3498 1745 -1194 -3211 -3093 -941 1841 3325 2626 186
1607 186 -2195 -3102 -2139 87 2360 3253 1944 -855 -3125 -3105 -1020 1621 2995 2464 492 -1778 -2957
1624 -2957 -2282 -50 2224 3048 1945 -465 -2629 -3105 -1415 1313 3000 2548 482 -1565 -2580 -2189
1640 -2189 -566 1655 3042 2376 -130 -2561 -3088 -1453 1013 2624 2592 1002 -1209 -2610 -2316 -600
1656 -600 1465 2687 2372 450 -2069 -3246 -2087 725 2838 2709 834 -1224 -2302 -2243 -943 1080
1672 1080 2674 2535 554 -1986 -3147 -2120 405 2648 3001 1227 -1249 -2622 -2149 -594 1074 2205
1688 2205 2309 934 -1500 -3166 -2461 250 2677 2993 1229 -1115 -2491 -2217 -684 1124 2187 2000
1704B000j227j860j427O1J974K687J074j591k783j561N59J657J401P77P4q38j741
1721g64j580l5J721K371J150r12k448j965m4J763J949P07m71q32j004j172o21
1738b187R87K348J759n82k466k171k58J551J967R96k50j102j194q09l15N13J628
1755D15J869L88k019k717r01J571K331J107l97j034j032r04l98N42J532J546L89
1772B288j238k280j558N87K438K157j09j756j528l26J69J69P80J629J064r99k575
1789a088j720O41K269J917L07j285j742j031J59R97J009P27M35k63j545k005m68
1806b686K031K674Q10j615k173r20N18R16Q10O94M31l16j305j557n81J221K292
1823A244J409q64k286j569K90J368J020L71Q4j29q18j397p14P89J910J478j68
$$ plain form
1704 2000 773 -1087 -2514 -2453 -479 2208 3282 1691 -1092 -2653 -2094 -437 964 1741 1815 977 -764
1721 -764 -2344 -2379 -658 1713 2863 1951 -497 -2462 -2506 -743 1206 1913 1442 610 -394 -1566 -2187
1738 -2187 -1200 1148 2907 2325 -141 -2312 -2570 -1019 948 1944 1694 592 -602 -1411 -1726 -1213 415
1755 415 2284 2672 653 -2064 -2965 -1394 937 2044 1647 613 -419 -1323 -1721 -1179 353 1899 2288
1772 2288 1050 -1230 -2788 -2201 237 2394 2285 529 -999 -1325 -1156 -987 -207 1422 2486 1487 -1088
1789 -1088 -2808 -2167 102 2019 2326 1041 -701 -1732 -1573 -576 433 1160 1595 1332 -213 -2218 -2686
1806 -2686 -655 2019 2829 1214 -959 -1879 -1361 -445 365 1059 1490 1174 -131 -1688 -2269 -1048 1244
1823 1244 2653 1789 -497 -2066 -1776 -408 612 983 1067 938 120 -1277 -1991 -1202 708 2186 2018
1840B018j790j939m39J287J679N70m42n08l11o87r67l7J664K003J74j824k035
1857a584m46J058J364Q30L5n29r11p16l31K45Q29J331Q29p28k126j486N87K054
1875C05J364k34j003p03l44m14j36Q25J459P86o92j759j336N7J475J663M94q68
1893I39j321o70M8K94M76Q99Q63j39j485j563k57J303J735P25o93j353r62p6O24
1912f13O97N74M70k3q94j426o70R24J862R88n90j459j000m2N53P06O66L73k35
1931H61q14r80m91M62J261J208O1j274j439l53P74J013M50L7o6m63q74o68K56
1950a039J196J133J20q81j218o05L37R62Q03J82l55n92n52m38J4P49J109N05o69
1969G61j276p94K57Q87Q34L36k94o13o81l73J74O32Q41M72k87j034r99j06Q90
$$ plain form
1840 2018 228 -1711 -2150 -863 816 1386 944 436 125 -562 -1529 -1566 98 2101 2275 451 -1584
1857 -1584 -2030 -972 392 1222 1257 728 -183 -899 -1230 -985 -156 1175 2004 1276 -850 -2336 -1749 305
1875 305 1669 1435 432 -271 -615 -1029 -1165 -340 1119 1905 1213 -546 -1882 -1825 -350 1313 1807 939
1893 939 -382 -1052 -1004 -710 -234 665 1528 1389 -96 -1659 -1916 -613 1122 1847 1154 -199 -1161 -1237 -613
1912 -613 84 658 1128 1105 211 -1215 -1885 -961 901 1889 1299 -160 -1160 -1202 -649 57 723 1096 861
1931 861 47 -933 -1424 -962 299 1507 1568 294 -1145 -1498 -724 289 739 776 710 247 -627 -1295 -1039
1950 -1039 157 1290 1410 529 -689 -1294 -957 5 808 990 635 43 -509 -947 -933 -184 925 1430 761
1969 761 -515 -1309 -1052 -165 669 1005 711 98 -583 -956 -782 -150 691 1163 876 -158 -1157 -1263 -373
1988c73J044M25l57o55n89l72P6N70Q74M66l03q98q49j95N95R76O40r0p96q09
2008f20k97K66N34O11M65j20p42q84l58N15R64O37m7o31p74m57J68O34O44L63
2028H71k12n85o87l48K99Q21O93J08o16p60m54R7N93O34L54j48n74o43k89K87
2048e59O05N95K19l89p81n37Q6N59O38L23j39m90n53l45J83O01N95J81l12o03
2068a23n05r4L77O08M73o9n02n88k77J52M54M85L12j66n83n60j23L00N98M68O9
2089G06l97o28l99Q1N22N34K73j65m88n08k14K34N43N02P8l59n76m01N1M37N87
2110D13K53j54m79m49j99J75M68M74J94l14n58m41L2L91N31K61q2m35m43k30J66
2131d26M33L91K12k47m47m60q0L38N36L35j24l79m10j93J13L69L91K01j84m22
$$ plain form
1988 -373 671 1096 739 84 -505 -877 -801 -231 643 1109 806 -92 -941 -1136 -541 435 1075 985 189 -620
2008 -620 -917 -651 -117 494 959 839 97 -787 -1145 -630 334 971 924 293 -481 -938 -770 -136 508 871
2028 871 659 74 -613 -961 -662 159 852 960 344 -416 -870 -773 -180 454 808 660 86 -557 -846 -559
2048 -559 46 641 860 471 -310 -847 -761 -202 436 759 620 130 -423 -768 -585 16 611 792 480 -123
2068 -123 -628 -722 -345 263 736 667 165 -423 -700 -548 -94 391 703 537 -46 -606 -729 -429 169 637 706
2089 706 309 -319 -718 -637 -115 419 692 527 39 -469 -683 -449 94 596 674 315 -261 -662 -611 -174 413
2110 413 666 512 33 -416 -615 -440 28 502 696 382 -176 -617 -585 -194 337 598 516 81 -362 -592 -426
2131 -426 7 398 610 363 -84 -544 -624 -286 250 585 461 82 -328 -521 -408 -39 352 553 369 -53
2151e3l94j15K74M90L26j8l68m38j88J17L06L60J91j18l65l86j13K19M13L04N3
2172D97k89m12k53Q9K93L22J92q8k93l25k21J65L78L46O0k73l89j96qK71K92K12
2194C70k3k95k90j66J15K93L13J16j53l86k74L5K35K80J58l2j92k93k00P5L14
2215@K86J23j70l45k38j2K34K54K09m6k28k25j69K6K55L02J48j90k99k31k0K06
2237a30K51J56jj95k64j33O3K06K44J22r3k49k57k2K06K40J23m4j34j84j32j1
2259b38J89K74J08j26k69j63rJ23K12J27J2j89j70r9N7Q8K14J60p6k35k29l5J98
2282g6J90R5k9j33j56j04M9J33J58Q7m3j58k31m4J30K27J41p8j53j19p1J0J10
2305f5J81J12m5j82k01l2J44J71J35Ok02j51p5R3J28P6R6k2j41j83p9J04K58Q1
$$ plain form
2151 -53 -447 -562 -288 202 528 510 142 -296 -484 -367 -61 299 490 372 7 -379 -492 -273 140 444 497
2172 497 208 -204 -457 -368 -75 247 439 351 58 -267 -488 -323 55 401 461 188 -201 -397 -405 -134 158 370
2194 370 347 52 -238 -404 -289 4 317 433 280 -106 -380 -345 -110 170 328 296 104 -189 -389 -314 0
2215 0 286 409 239 -106 -344 -356 -122 132 341 295 67 -158 -327 -301 -46 256 404 214 -85 -316 -336 -130
2237 -130 121 277 276 81 -183 -316 -253 -47 197 319 226 -23 -280 -302 -96 144 267 223 89 -95 -227 -238
2259 -238 -49 225 333 207 -62 -225 -234 -111 101 228 240 51 -119 -218 -161 -73 141 301 225 -10 -239 -274 -76
2282 -76 114 209 180 47 -109 -213 -164 -31 127 214 171 13 -218 -262 -132 95 236 158 5 -114 -185 -175 -65
2305 -65 116 228 183 1 -200 -232 -88 83 218 224 22 -129 -204 -111 17 93 189 167 26 -157 -236 -132 126 207
2329B07k3j83j37m0O3J18J40J9m7j12j63o1Q2K02J54j9k10j68m1J28J62M2L1l4
2353A10j32j31k0Q3J60J18J1j49j95m8O9K21O3l0r8n1o4o9N1J41J53Jj67j63m3
2378a79Q1J26J28or8j03q6J2O5Q6J22J9j07j86q1R2J77J01l5r3j11m2pP2J31Q3
2404A61Jj23j70p5O9J83J40nj23j78l2N8J08P8O5Oj12j81p9P6K44J10m7j49j58
2429a33k8P2J04R5M7l4j10j47r5J03J96J60j6k14j72n1J21J29J11J3m9j47j07
2452a52l0Q1J95J59n9k21j78m0J29K21N7Lj05j05j25k1R1K20J38n5j65k24o4J20
2476a30K40J03%j61j52o1MN1J86J72l2j85k13j11J66J82K02l7j64j61j23LJ38
2499h3J62J41M0j94k39j76J29K55K72o4j59j82j34oJ57J79J68J1j56k97j42N7
$$ plain form
2329 207 184 1 -136 -176 -113 5 145 164 117 5 -158 -219 -137 65 219 200 -10 -178 -219 -91 71 113 144 110
2353 110 -22 -153 -173 -90 70 188 199 50 -145 -193 -124 97 160 130 32 -19 -83 -152 -101 40 193 194 27 -136 -179
2378 -179 -98 28 156 150 52 -51 -137 -125 -60 26 148 167 60 -126 -207 -115 62 163 128 35 -76 -118 -125 -53 78 161
2404 161 162 39 -131 -206 -137 46 186 181 58 -120 -152 -94 14 92 157 163 51 -130 -209 -133 111 221 174 25 -133
2429 -133 -161 -89 15 110 157 123 13 -134 -229 -126 70 230 214 0 -172 -223 -102 27 138 151 102 -45 -152
2452 -152 -182 -101 94 253 194 -27 -205 -245 -116 105 162 165 60 -45 -170 -191 -100 120 258 203 38 -186 -250 -130
2476 -130 110 213 213 52 -100 -161 -157 -106 80 252 220 35 -178 -289 -123 59 261 224 60 -101 -224 -221 -83
2499 -83 79 220 260 66 -173 -349 -220 35 307 243 84 -98 -232 -238 -81 98 266 277 121 -176 -318 -261
2521b61K62K73Q9k27k55j61J2K11K15J29Rj81k56k25N9L15L00J07k17l44j75K2
2543b99J94K55J52rk03k62k15N0K86L38J33j82l72k13k5K48K83K02n2k16k82j85
2565c74N2K89L01J90j76l59l26rL00L08J78o0k35k40j91O0K63K83J75j26l22l23
2587c42r7K41L83J84j7k71k70j51L6K33K78J48n1k75l19j46K13L28K86m5j92l19
2609a65k02K7K29L21J80k2l10l25j63J43L20L19P8j81l81k33j3K46L24K12qk97
2631I9l59j85Q4L65L45J20j94l76k94k9K45L74K36l1k83l81k13J04L25L70J70
2652D92j70m08l34n4K47L83K98l7k98l95k02J20L20L49J61j49l55l82q7K71M06
2673A76K76nk84m20j96Q1L43L27J62j18l55l37j38J88M28L16Mk88l77k16P0K85
$$ plain form
2521 -261 1 274 363 136 -119 -280 -268 -57 158 287 296 115 -141 -366 -307 8 308 415 198 -146 -321 -299
2543 -299 -105 150 302 293 90 -172 -387 -337 -51 287 420 238 -134 -347 -372 -124 159 361 309 93 -189 -374
2565 -374 -322 -33 268 458 282 -77 -403 -412 -112 196 374 314 79 -161 -352 -292 -29 254 429 303 -19 -342
2587 -342 -439 -198 185 369 352 81 -189 -340 -304 -71 207 355 304 29 -290 -436 -223 105 391 346 154 -165
2609 -165 -367 -340 -111 210 390 368 58 -267 -430 -287 33 352 430 249 -132 -365 -378 -132 192 404 396 99
2631 99 -260 -445 -361 4 349 469 275 -101 -395 -424 -179 195 431 400 117 -264 -477 -373 -48 322 492
2652 492 322 -86 -420 -474 -227 156 454 417 119 -276 -478 -358 -38 311 472 323 -32 -414 -501 -230 176
2673 176 452 447 163 -257 -453 -372 -29 298 460 342 -13 -350 -488 -300 128 444 448 160 -217 -433 -363 -78
2695g8L45J81j36l09l75q3J64L42L39Q0k41m14k57RL38L71J35r4k59l37j72J24
2717c27L50L31J35k08m06l05j3K76L56K62o2k91l33j88N5L21L65K06j57m08l85
2738d26q8K76L98K86j4k79m10k10O2L14L85K15j21l92m00j37K45M53L38k6l01
2759A68m09k48O1L23M06K07j05m11l87j64K19M86L63K3l39m55k28N5L44L71K42
2780E22o9m12m11j97K09M87L58M0k88m61k89P7L39L79K12p7l56l81k03J28M35
2801D2M13J01k90m37l19L7K99L59K51n3l10l80k53J21L70M19J85k44m13l40l3
2822d75K81L62K64Rk78l88k53J5L55M56K10j71m42l72j07K88M06K73L0k08m11
2843a56l22j8L21M55K90j18m24m34j73K63L87L68P0k29m29l25n8K64M64L73m0
$$ plain form
2695 -78 267 448 312 3 -372 -455 -291 51 390 470 229 -185 -442 -433 -95 276 411 317 58 -279 -451 -327
2717 -327 23 354 489 281 -125 -430 -443 -167 189 451 389 98 -235 -423 -368 -47 318 524 367 -41 -426
2738 -426 -514 -238 160 446 432 153 -257 -467 -405 -91 294 509 388 -4 -404 -541 -296 157 495 469 168
2759 168 -241 -489 -428 -105 301 508 403 -8 -395 -559 -340 146 509 532 193 -262 -490 -435 -91 280 522
2780 522 453 41 -370 -567 -358 129 487 527 239 -222 -511 -434 -95 284 496 419 63 -318 -521 -393 42
2801 42 455 556 266 -171 -490 -453 -154 205 456 403 93 -287 -540 -419 -49 370 555 311 -102 -442 -475
2822 -475 -194 168 432 441 163 -225 -478 -463 -108 348 558 387 -55 -427 -534 -246 160 433 463 255 -156
2843 -156 -478 -496 -175 280 570 452 28 -406 -579 -316 71 439 509 280 -149 -474 -532 -268 196 569 529
2864E29m43m84k18K44M42L25J43k69l85l54l6K50M38L82k1m14n18k30K04M97L63
2885D45J01k54l83l29q3K28M13L80K7l76m86k62J31M33M45J27k58m08l03m1J84
2906b69L51L43R9k65n03l25Q8M25M52J18k21l46l22j05K11L18L12J23j97m40l45
2927d98n4M02M88K16j94l74l08q8J32K98K97J50j08l93m14r8L37M55L14p7m34
2948D9m12q7J52L22K63J76r5l29m55j57K37N22L81l9m13m36k15J64L67L27J51
2969D73j19l27l76k00J57M52M70J13m46n51k30J62L96L77J19j06l24l83j81J37
2989c87M49M50J06l21n77l47J52M79L85R5j53l19k99j82J18L46M68J49l05n46
3009b39l30N1M39M20J75k06l73k48j13R1K89L66K26j74n09m18%L82M95J56j02
$$ plain form
2864 529 86 -398 -616 -372 70 395 538 269 -116 -470 -506 -256 182 564 543 129 -389 -619 -415 82 445
2885 445 546 292 -91 -420 -503 -275 138 518 545 169 -317 -579 -448 -15 430 557 299 -109 -412 -453 -269
2906 -269 82 425 524 259 -244 -569 -481 -56 396 514 293 -53 -375 -480 -269 49 361 484 287 -153 -498
2927 -498 -552 -150 338 554 360 -14 -322 -410 -278 20 317 467 359 -34 -448 -546 -209 246 560 483 49
2948 49 -363 -450 -298 24 287 463 368 39 -416 -573 -336 186 567 528 115 -321 -536 -372 -5 322 473
2969 473 354 27 -349 -549 -392 60 530 643 197 -354 -584 -422 -26 351 470 364 40 -343 -524 -387
2989 -387 62 512 618 297 -280 -627 -475 4 389 484 331 12 -287 -469 -351 -5 463 612 307 -239
3009 -239 -569 -518 -79 341 516 310 -63 -311 -424 -333 -44 322 548 374 -135 -553 -553 -171 324 480 378
3030C78l51l22j32J13K59L09K22r5l72m46j60L23M84L38q5l85l69j20R8K43K86
3051B16K37l6l27m80k11K55M35M51Kl78m24k27J27K80L00K01l5k62m38k90J54
3072d50M85M82M3l12m96k88P2L53L82J95p5k78l72k49M1M25M88J96k89n44m00
3093e91R8L81L86J87l7k78m01k48N7L83M84J66k17m79m33l5L59M97K23j12l30
3114F0l31j72L6L00L98K42j37m56m19p7L18M31K68n6l13l28j87N1K50L82K26r2
3136C94l50m47j03K31L93L46k3k74l69k10O5K37L37J98k4k71m08k61J73M24L77
3157D35P7k94l66k41k3K12L51K65J5k96m25k05O7L44L95K17j80m53l62PK75L71
3179A86K15J4k36l78k95M3L45M54J83j70m38l27q2K10M09L27J3l06l98k36J9L22
$$ plain form
3030 378 27 -295 -427 -314 -55 254 476 381 9 -437 -597 -274 210 548 463 78 -291 -411 -313 -70 216
3051 216 453 417 90 -390 -601 -346 89 540 542 164 -260 -487 -360 -80 220 421 386 124 -314 -604 -450
3072 -450 35 517 560 248 -248 -536 -464 -111 271 466 391 113 -259 -508 -467 -42 446 642 353 -191 -591
3093 -591 -493 -112 274 461 424 146 -255 -503 -446 -63 421 587 370 -109 -542 -577 -218 279 502 390 60
3114 60 -271 -443 -407 -107 291 533 396 -60 -479 -556 -238 193 461 405 92 -236 -423 -372 -122 260 486 394
3136 394 44 -403 -506 -275 118 464 441 167 -202 -412 -347 -110 227 425 401 130 -278 -539 -366 58 435
3157 435 512 218 -148 -389 -412 -200 151 416 431 135 -290 -495 -428 -84 311 528 348 -105 -467 -460 -185 186
3179 186 401 415 179 -199 -494 -451 -106 348 531 361 -77 -404 -486 -276 133 460 473 167 -231 -467 -448 -126
3201a26M15K48j18m19m08j19K45M31L07N6l28l93k79P0K74L99K42p3l66m50j68
3222e60K14M34L49L2k77l67k76k4L42L87K08j03l27l16j95J22L89L64Q5k41l95
3243a55k69P4K10L23K28j6k70l95j71J01K84L71J57j57l61l30j01K50L75K84k9
3264D03k75k90k52J8K88L89J76j51l12l57j41K07L69L15M2k41l53k68JK61L58
3285A87K60l8l42m00j89J78L87L43J00k54l84k70J0K37L81K46m6l04l99k13J35
3306c75M27L65P6k17m06k96k0K74L74K53k4l12l87k24R6M00L56J41k25m02l21
3327d47JK64L20K57nk49l85k66R9L46L70J81j94l48l20j00K39L89K42j0k43l08
3349a67k32KK63L87K37j30l72l49o1J94K97K92K8j80l44k33k7K41L23K38l0l07
$$ plain form
3201 -126 289 537 419 0 -408 -527 -282 149 456 512 184 -209 -488 -418 -144 255 497 424 58 -392 -560
3222 -560 -346 88 437 469 192 -175 -451 -475 -133 254 462 359 32 -284 -479 -357 32 396 481 240 -155
3243 -155 -424 -350 -140 183 411 395 125 -270 -441 -340 -56 315 472 315 -46 -376 -477 -227 148 432 403
3264 403 128 -162 -414 -396 -108 281 457 306 -6 -363 -504 -297 72 387 429 188 -165 -433 -432 -171 187
3285 187 447 409 67 -333 -522 -344 43 386 486 232 -152 -422 -412 -175 206 452 406 102 -297 -510 -375
3306 -375 52 417 493 276 -130 -426 -446 -172 202 455 431 119 -268 -492 -396 4 360 501 276 -126 -447
3327 -447 -446 -182 138 395 390 141 -244 -510 -411 -65 305 486 292 -56 -376 -476 -237 152 394 384 141 -167
3349 -167 -399 -397 -134 253 490 360 -12 -361 -422 -228 69 361 389 209 -135 -368 -395 -154 169 407 377 70
3371G0l55j86J72L41K81N7j62k99k46q8J45M08K52J8l02l58k25Q9L81L22R7j32
3393B80l53k68q9J43L63L39L7k64m07k49Q1L26L64J51j39l33l11q2J61L25L01
3414C76R9k30l87l15J3L47M19J55k00k89l02j32J49L45K91R3k11m03k54M8K69
3435a19L22K27p3l52l11r5J45K92K59P4j31l43k91k2K69L89J87j10k61k97j47
3456c88J02K91K51J23j28l06k50o9J63L64K49j5l03k99j40Q1K28K41J38p4k70
3477a1k73j07J57L01K75L3k49l07j88M9K55K43J30l9k25k75j72Q9L42K83Q5k07
3499A89l42j85PK23K67K06p2j98k82j80P5K46L40J47j63l90k77J3K57L00J69l7
3521C13k01k95j79J3L17L28J17j47l28l01k0K35L31J67n3k20k56j69L0K52K62
$$ plain form
3371 70 -285 -471 -299 42 323 380 218 -81 -327 -415 -270 138 390 408 106 -252 -477 -388 -7 315 412 280
3393 280 -73 -341 -430 -287 76 415 452 188 -219 -468 -387 -61 303 454 315 -18 -329 -411 -250 75 376
3414 376 475 245 -142 -457 -444 -97 322 477 277 -12 -314 -446 -297 48 339 432 221 -182 -436 -388 -119
3435 -119 203 430 357 5 -306 -401 -256 36 295 369 238 -105 -396 -418 -149 240 427 317 56 -241 -388
3456 -388 -286 5 256 379 251 -55 -305 -374 -211 153 402 387 84 -215 -355 -274 -46 195 333 259 -11
3477 -11 -284 -391 -234 67 342 375 126 -181 -369 -320 -65 178 308 269 44 -231 -403 -314 28 311 396 189
3499 189 -153 -338 -331 -108 159 365 293 95 -187 -367 -292 -46 294 441 278 -112 -389 -376 -119 181 350 313
3521 313 112 -183 -362 -349 -32 296 413 266 -62 -363 -383 -148 183 350 297 77 -179 -348 -318 -66 196
3542A96J83r9k99l30j6J97K63K47m0k09k67j32N6K06K37J45k1k75l06j11J73L31
3564A29K15k0k12k09j67j3J93K25J85k7k18l01j29J06K59L05j3j67k48j41pJ16
3586a39K37J48M2j66k75k00M2K82K72P3j01k78k04m0J45K41J71J7j15k48k25Q
3608c13K49K66J68j10k77k31m3J37K31J69L8j14k62k02PJ69K70K27p1l04k88o2
3630c46J28K96J74L9j63j98k13n1K00K77K12o4k62k65j18J48K74J84K6j31k28
3651h1j70l9J46K32K04Ok17k90j33J44K39K10J9r9k07j59o0J27K17J68J3j34k33
3674i7k07N8K37K37O2j11k34j36n4Q1J76J99M9j04k57j68J2J69K33J35o0k09k34
3697b23m4R5K03J46Q1m8k43k10n7J70K60J32qk07j96j12M7J92K10Q2r9j71j78
$$ plain form
3542 196 379 280 -19 -349 -365 -168 95 342 302 93 -174 -306 -250 -44 193 338 317 42 -264 -375 -202 129
3564 129 344 324 112 -97 -264 -277 -84 141 326 299 81 -220 -349 -243 16 321 308 141 -107 -248 -255 -139
3586 -139 98 246 288 122 -153 -353 -311 -29 243 316 215 -63 -267 -307 -162 79 250 267 152 -96 -321 -313
3608 -313 -64 202 370 260 -17 -248 -291 -154 77 246 284 170 -92 -294 -287 -118 152 379 308 4 -284 -346
3630 -346 -218 78 252 291 128 -70 -283 -334 -134 143 355 291 29 -236 -354 -206 68 252 278 147 -81
3651 -81 -251 -290 -144 88 292 298 81 -209 -342 -198 41 251 270 171 -36 -195 -255 -128 89 257 270 136 -97
3674 -97 -304 -246 -9 228 290 179 -55 -191 -245 -164 12 211 260 156 -101 -269 -257 -88 145 280 220 11 -223
3697 -223 -267 -172 31 177 258 210 -33 -243 -300 -130 130 262 254 47 -149 -261 -214 -22 188 270 171 0 -178
3720a78r4J08K40K13j2j80k19j79R6J81J58J39p5j99k14o0R5K21J99M0j68k44
3742a32j63L1K22J90J05o4j67k26o2N6K12J90R8j41k75j61L3J90K25J08m7j86
3764C6k00p6O7J59K12J03j32k13k13kJ80K03J39o2j57j99j01Q8J58J81Q5j21j81
3787d6j64l7J05K13J98n3j98j63r4L3J35J82J16n0j86j71m6P0J83J79M9j28k23
3810i6j57QJ75K06Q3k6j57j80j29O6K31J92Q2j29k29j61l7J87J75J56m0j61j95
3833a36j40M8J95K41O4p3k28k18m4J72K04J71n0j39k47j00O4J51K36J09n7k30
3855gk22o7J40K22K11k3j47k05j42KJ65K39Q8m8j80k24o5Q6K21K09Pj32k39j33
3879b44M2J72J73R3k5j83j93r0N8J92J90N6j17j87j49l2J62J79J04kj32k12j01
$$ plain form
3720 -178 -272 -164 76 289 277 97 -122 -301 -205 -24 134 273 198 -1 -215 -275 -180 41 240 280 112 -132
3742 -132 -295 -264 -42 148 253 189 22 -204 -266 -210 2 192 290 149 -126 -287 -254 -64 161 269 222 36
3764 36 -164 -240 -173 -14 198 301 169 -44 -257 -259 -79 124 263 201 44 -155 -256 -168 -10 171 256 135 -46
3787 -46 -210 -247 -142 71 269 216 18 -145 -239 -206 -71 111 227 177 -9 -180 -226 -156 27 206 255 127 -96
3810 -96 -253 -245 -70 136 219 193 36 -144 -273 -207 24 216 298 169 -60 -221 -258 -71 104 260 220 59 -136
3833 -136 -276 -228 -33 208 272 199 -29 -247 -291 -119 85 256 206 67 -180 -280 -216 -65 171 280 223 -7
3855 -7 -229 -296 -156 66 277 254 107 -98 -240 -238 -73 166 254 206 26 -198 -263 -177 44 253 260 128 -111 -244
3879 -244 -202 -30 143 236 211 28 -165 -255 -197 -5 185 241 124 -63 -212 -244 -82 97 201 199 67 -145 -246
3902b46QJ72K29J05j40j71j58o9J69J44J46qr4j47j50%J15K07J44n4j98k01p1
3925b68J07K10J33N0j07j92j36jJ09J83J56j9j74k12j05Q2K15J84L0j24j88j45
3947b12k8R9K19J59k3j75k15p9L9J76K28O2j14j88j57k8R4K21J05O4j56k14j46
3970b69M1J90K28M3r6j67j57m3J28J92J26J3j22k06j47J9J69K23N9r6j57j50o8
3993b47J21J53J36L0p3j93j44rJ47J83J08j1j83j71q0O7J77J17Q8j20j32j59l2
4016b27R2K00J48j9j32j88p7L7J64J36O5m7j33j73p4P9J81J93J6j10k14j48M0
4039a91J58J52R2l8j32j91p9O4J70J62M6o0k33j45qJ46J99R0m3j40j48r7K8J63
4063c5J93Q6r7k06j75mJ46J98J03j2j38j77j27P4J42J79J02p3j94j70m2J29K00
$$ plain form
3902 -246 -238 -66 163 268 128 -43 -201 -270 -101 43 189 181 87 -60 -210 -210 -95 112 256 202 4 -197 -268
3925 -268 -161 49 182 232 125 -67 -203 -204 -95 88 244 225 51 -161 -266 -184 31 215 245 121 -67 -212
3947 -212 -240 -141 78 237 214 39 -176 -255 -216 -40 188 250 136 -52 -209 -237 -143 78 183 247 91 -123 -269
3970 -269 -228 -38 190 233 137 -30 -187 -230 -102 90 216 229 107 -99 -246 -227 -58 165 224 128 -29 -179 -247
3993 -247 -126 27 163 193 120 -73 -217 -226 -79 104 212 201 18 -153 -233 -166 11 128 216 96 -36 -195 -227
4016 -227 -135 65 213 194 62 -126 -203 -166 -2 134 199 152 19 -154 -228 -149 32 225 241 131 -83 -231 -191
4039 -191 -33 119 211 173 41 -150 -229 -165 5 167 213 153 -80 -225 -233 -87 112 202 159 19 -129 -226 -198 -35
4063 -35 158 244 147 -59 -234 -238 -92 106 209 197 59 -118 -245 -171 -29 150 252 179 -15 -185 -227 -98 102
4086A02J21oj65j46j17M5J44J39P3j0j82j77l9J02J77J45k1j22j71p4mJ20J41
4109G5J14l8j28j91q1R4J71J53K2r9j28j54LJ15J42Q7N3j21j97j08OK05J88O1
4133B44j12j70j21m2J33J27R6N1r0j73j42KJ35J75J15o6j97j26m6R0J34J52N1
4156B20j00j72j56l1J30K36R7l2j77k20n2J09J91J02N5o7j54j71k9J07K20J58
4178B64m3j61k04q2N4J84J81N2j09j96j27k6J06J77J60Oj39j96j48N8J64J85M7
4201B07p5j43j42o2J02J47J46J0j13j60j44K8J47J67O6o0j54j34k6P0J16J32O9
4224A94p8j62j38k2J28J93R9l7j36j60p1N6J41J37P4o2j72j60m0J04J77J45rj35
4248F6j91r5N6J29J56O3l6j43j45r3N8J96J82J3r3k32j22J9J48J57J14m1j45j73
$$ plain form
4086 102 223 217 52 -94 -211 -166 -22 117 190 180 -2 -179 -218 -116 61 206 185 63 -108 -182 -186 -66 75
4109 75 189 151 23 -168 -249 -155 16 169 191 92 -36 -190 -187 -72 70 157 210 89 -108 -216 -210 -5 183 244
4133 244 132 -38 -159 -201 -68 59 155 206 116 -57 -199 -197 -62 113 228 162 -35 -161 -207 -117 17 169 220
4156 220 120 -52 -208 -239 -109 127 224 192 15 -205 -257 -148 43 145 200 133 -21 -192 -221 -114 106 264
4178 264 221 60 -144 -226 -172 12 193 245 136 -60 -187 -213 -107 70 230 236 97 -99 -247 -189 -25 160 207
4201 207 132 -11 -153 -215 -113 34 180 190 77 -83 -227 -199 -52 115 181 121 -33 -167 -193 -123 -7 125 194
4224 194 116 -46 -184 -206 -78 115 214 177 41 -119 -190 -134 7 144 218 156 -16 -176 -216 -112 65 210 201 66
4248 66 -125 -220 -164 -35 121 184 148 5 -140 -233 -175 21 203 216 123 -109 -231 -212 -64 93 207 166 21 -152
4272a52q1M8K03J53O0j41j65j58K9J51J62J24n4j13k00p3J3J94K06M6r4k06j67
4295b15nJ45J78J39j8j63j82q8P1J23J75O7n3k23j84K1R4K04R5J3j29j84j00P0
4319a49Q2J85R4m5k02j40n2R3J76J57j3j46j31j04K1J37J40J09n4j07j76n9K5
4342a59J67J90J5r8j59j23j7J03J85J08Oj58j86r1M0J60J66P9r1j78j65l3J08
4365a31J88J62j3j29j70j57L3J67K12R3q0j91j85k7R6J71J76Rj42j88j34K0J47
4388g3K24Q3k4j67k36q4J51J75J56M2j45j82j30J6J22K15Q3Nk03j93r4R5J75K01
4412B12K2j43j67j57j4J75J57J50n0j46j86j27P7J71J85Q1j01j84j78j1J50J78
4434I4J20kj10j94j12J3J65K12L3n7j68j76m9J01J82J50K4j12k11j05QJ04K23
$$ plain form
4272 -152 -233 -185 18 171 231 90 -75 -233 -204 -53 109 233 179 66 -134 -207 -194 0 206 252 158 -48 -215
4295 -215 -220 -75 103 242 224 61 -121 -209 -138 -15 160 227 174 -49 -233 -212 -118 86 181 194 65 -119 -219 -149
4319 -149 -67 118 212 167 -35 -175 -227 -134 42 199 186 40 -91 -195 -174 -37 103 212 158 51 -125 -184 -159
4342 -159 8 198 213 115 -44 -167 -184 -81 104 212 218 60 -126 -217 -177 -17 149 228 137 -41 -206 -239 -131
4365 -131 57 219 206 77 -93 -250 -217 -50 162 255 175 -16 -201 -228 -132 39 215 224 82 -106 -240 -220 -73
4388 -73 151 234 210 43 -193 -277 -126 49 205 247 102 -80 -210 -194 -72 143 226 231 28 -165 -259 -164 11 212
4412 212 234 91 -76 -233 -247 -72 85 235 185 39 -147 -274 -197 -26 159 240 139 -45 -223 -234 -84 94
4434 94 214 212 102 -92 -204 -191 -26 186 219 162 -6 -182 -231 -130 52 202 226 114 -97 -202 -194 -90 133
4457A33J20m8j71k11l3N0J56J46O9p5j77j78l7J47K03J50j2j84j94j31Q9J99J62
4480A73R3j31j92j76l0J32K14J81l2j26k38j51P7K03J76J04j07k03j65o4J22K09
4502F9J46M0j52k42j28N5J79K00P7q3k03j78p4J56J66J77J6j51j65j95M5J60K39
4525A54R3p9k03j78m1R7J89J67M3j32k14j35mJ82J73J38n4j61k18n1Q3J77J49
4548A75K9o1j64j74k5J04K13J66j7j99j37j42L0J93J59Q4m6j82j90q4J24K03J53
4571B12Qj32k29j07M7J24K07J05n9j81j84q1J12K02J98K1j26k36j76K5J88K29
4593A67J03n1j95j71j20Q1J94K07J01j66k54j58J0J79K05J17j0k16j73r6P0J94
4615A8J90O8j02k72j74qJ74K53J04k8k19j92q2P6J92J80P6j06k00k01mJ32K38
$$ plain form
4457 133 253 205 34 -177 -210 -160 -4 142 211 136 -41 -219 -256 -109 94 244 232 48 -146 -277 -188 11 173
4480 173 266 135 -57 -233 -263 -131 83 264 232 106 -132 -283 -206 -3 173 277 170 -33 -198 -262 -140 69
4502 69 215 255 103 -139 -267 -212 -33 167 244 161 -42 -220 -294 -138 28 205 221 70 -95 -290 -245 -85 154
4525 154 247 168 -35 -213 -254 -157 32 199 242 110 -104 -239 -243 -61 112 250 196 35 -183 -234 -151 26 175
4548 175 204 143 -21 -195 -220 -116 97 263 246 47 -90 -232 -202 -9 150 234 188 6 -184 -268 -144 59 212
4571 212 220 88 -141 -248 -201 -77 130 235 176 -5 -189 -270 -158 44 242 263 137 -99 -275 -250 -62 167
4593 167 270 219 24 -147 -267 -186 8 215 316 150 -104 -262 -252 -73 132 249 239 23 -150 -246 -176 18
4615 18 208 276 174 -98 -272 -280 -106 147 251 223 4 -188 -270 -194 -2 178 254 148 -52 -253 -257 -125 113
4638A13J44n0j54j95q9O8J45J39J47r2j92k05m5J33K18J46Jj45j79j24lJ78J76
4661A35J13n5j46k21r4J01K12J52L6j08k00j22m4J49J95J08J0j61k08j28N6K23
4683CJ79J01j49k16j51k1J24K15J21J4j25k15j47L6K04J91J25o5k31k26l6J35
4705a34K31J58j8j50j98j40L6J51K49J33j01k49k13m8J54K30J71J5j90k03j59
4726b75O5J46K17J11n7k03k18r0J53K40J55l2j14j90j37JJ45K27J10n7j98j81
4748a82j01J09K20J74K2j20k01j29J9J04J78J42J5j43k49j26J03J73J57P3j12
4769A26j59j68l7J21J89J07J7j14j72j45K1J35K43Q5j11j54j73n1Q6J57K00M5
4791B48j42j70j59k1J77K00J19m0j99j97o9J23J73J40N5q8j97j37n4J52K38J07
$$ plain form
4638 113 257 207 53 -142 -231 -163 -18 121 268 176 -16 -221 -266 -133 85 231 232 87 -92 -216 -219 -41 135
4661 135 248 193 47 -174 -268 -167 45 197 233 125 -75 -197 -241 -92 103 211 221 60 -148 -276 -220 3
4683 3 182 283 134 -82 -233 -254 -130 85 206 220 95 -120 -267 -231 -27 164 289 224 -7 -233 -269 -134
4705 -134 97 255 237 87 -111 -251 -215 -64 185 318 217 -32 -245 -293 -139 91 262 277 87 -116 -275
4726 -275 -210 -64 153 264 207 4 -214 -304 -151 89 244 212 98 -92 -229 -228 -83 144 254 197 -1 -182
4748 -182 -283 -174 46 220 242 122 -79 -208 -189 -85 93 235 250 107 -142 -268 -165 8 165 238 126
4769 126 -33 -201 -238 -117 72 179 196 82 -90 -235 -214 -79 164 249 138 -16 -189 -240 -154 3 203 248
4791 248 106 -64 -223 -244 -67 133 252 212 13 -184 -253 -130 43 183 238 150 -47 -184 -238 -86 152 259
4813B59l5j86j94q4O3K19J89J5j31j69j81OR1K55J39rk12k17j10J11J94J55O8
4836B36r5j99j48m4J24J92J33L4j70k10j24R2J77K04J4r7j37j50n2Q1J99J66O
4859B32j47j89j08K0J60K06O0q4j64j65LN8J30J70J7o9k02j46K2J48J54J22n0
4882A78j50j69r0P5J79J35N7o6j99j42n0J10K31J22j6j56j84o1J0J78J59R0p9
4905A62j83j51l8Q9J76J79L5j85k10r1O1J38J77N3n1j49k25l7J34K03J18L3j34
4928A04k12j30J5J60K07R8o0j74j80p3Q6J76J79N2j51k02j45M3J68J64Q2k8j82
4951cj80p0J13J62J53N9j10j81j69J2J56J77J15o3j29j28j25O2J46J89L0p8j86
4974d8j11m5J02J54J49Qj74j53p4N0J11J29Q1k5j59j65n2J16J64J05J6o0j91j27
$$ plain form
4813 259 224 38 -156 -240 -177 42 231 246 115 -54 -235 -229 -138 117 256 247 35 -182 -292 -181 13 168 236
4836 236 141 -58 -206 -250 -126 66 199 233 63 -147 -271 -179 -2 202 216 119 -18 -168 -220 -139 60 226 232
4859 232 85 -104 -212 -192 -32 174 234 150 -14 -179 -176 -118 12 182 199 130 -72 -218 -196 -48 106 228 178
4882 178 28 -141 -231 -156 23 158 215 149 -50 -192 -242 -132 99 221 205 49 -135 -196 -186 -8 151 241 162
4905 162 -21 -172 -210 -121 55 234 269 84 -126 -217 -156 -18 159 212 161 12 -213 -250 -116 87 205 238 104
4928 104 -108 -238 -223 -63 144 242 182 8 -172 -245 -159 17 196 248 97 -105 -250 -207 -39 125 207 179 -3
4951 -3 -183 -253 -140 22 175 234 124 -57 -226 -214 -58 119 234 171 42 -86 -211 -149 -3 186 216 138 -48
4974 -48 -159 -204 -102 52 201 209 35 -118 -192 -142 -31 98 179 154 -5 -170 -222 -106 58 163 179 119 -72 -199
4998a99lJ83J32P2k7j29j45q8M9J91J64L6j09j79j21qJ03J64J55j8j59j91p4M0
5022a61J32K04Q0q5k16j74OJ13J82J36J8j52k01j09K8J73J67Q0q0j88j74k2J10
5045a33J93J48j7j53j59n0j3J07K13J07r9j54j78lP2K10Q4L7j38j65j12O2J24
5068a7J48Q3l7j30j80q0J09J70R6N1j16j52j20j3J13J77J01k5j49j37q6K1J72
5091aJ61N4j25j33j34oP8J50J39oj17j55j08J5J47J83M6l4j33j92l9J12J71J13
5115A86j2n6j74j23j5J60J92O8n6j70j45n1O6J64J69K0j13j72j24JJ14J84J05
5138B18l6j51k12m1Q5J61J55Pp5j69j34j2J63J48Q8kj60j88o5M9J87J52M6j07
5162A07j81r9OP9J79J20jj43j85q1P0J44J45N7r4j55j45PJ10J38R0M1j41j30j50
$$ plain form
4998 -199 -202 -19 113 185 158 29 -116 -204 -155 36 200 236 127 -52 -173 -181 -78 86 241 223 64 -127 -201 -161
5022 -161 -29 175 255 170 -46 -220 -214 -101 81 217 235 83 -118 -227 -199 -26 141 221 141 -47 -221 -243 -133
5045 -133 60 208 191 38 -121 -171 -184 -77 136 243 144 -10 -188 -191 -119 91 175 212 74 -91 -203 -141 -17
5068 -17 131 214 177 47 -133 -213 -104 66 162 213 97 -55 -175 -188 -75 102 203 178 29 -108 -194 -173 -1
5091 -1 160 214 89 -44 -178 -184 -106 44 183 177 60 -95 -203 -188 -41 142 188 154 21 -171 -210 -98 73 186
5115 186 174 118 -56 -179 -194 -34 158 226 170 0 -145 -196 -130 34 203 223 110 -62 -186 -185 -71 113 218
5138 218 182 31 -181 -222 -137 24 179 186 111 -58 -192 -204 -41 107 195 193 33 -155 -220 -171 16 168 214 107
5162 107 -74 -173 -167 -88 91 211 210 67 -118 -199 -129 15 160 217 123 -32 -177 -170 -60 78 168 209 68 -62 -212
5187b12N3J35J59O0q7j18j32n7R6J49J04Kq0j51q4j9J18J71O7k4j66j22k8L6J58
5212B8Q5P1n6j53j67j9J47J32J39j7j23j97o9O8J34J50L0o4j12j87l1J14J69J41
5236B13k8j34j64q8K5J28J73J10q7j56j40p5J05J43J38N5j48k10p1M3J42J54N4
5259A82k8j75j32l7P8J76J15J6j16j33j30jJ84J47P4q4j66j02l8P0J34J48K5j07
5283A00j79j02M3J00J67M8k7j32j34k0N0N6J41N9q3j41j28lJ08J51J04m9r3j50
5307a14n4L1J17J34L8k4j36j05o9Q7J29J46oj30j14p8J8R0J39P3k8j10j34o6N4
$$ plain form
5187 -212 -159 -24 135 195 108 -10 -142 -199 -103 46 150 152 72 -79 -163 -182 -64 107 174 150 -16 -138 -166 -130 28
5212 28 113 184 128 -25 -192 -211 -64 68 207 190 67 -130 -199 -131 3 153 183 119 7 -180 -211 -97 72 213
5236 213 185 51 -113 -201 -176 -48 125 235 148 -8 -148 -223 -118 25 163 218 70 -140 -211 -168 -26 128 182
5259 182 154 -21 -153 -190 -112 64 179 195 79 -54 -184 -185 -1 146 220 136 -30 -132 -170 -100 34 182 207 100
5283 100 -79 -181 -138 -38 129 177 150 18 -116 -136 -86 -30 111 170 87 -54 -182 -185 -77 74 178 129 36 -114
5307 -114 -168 -137 -20 114 152 128 -8 -113 -182 -95 34 180 174 44 -70 -148 -130 -40 99 172 144 34 -100 -166 -112
$$ [...]
8191B
##END NTUPLES=NMR FID
##END=
