##TITLE=1H ikalashn
ES-steavie
16.9.2024
##JCAMPDX= 6.0         $$ Bruker NMR JCAMP-DX V2.0
##DATA TYPE= NMR FID
##DATA CLASS= NTUPLES
##ORIGIN= UXNMR, Bruker Analytische Messtechnik GmbH
##OWNER= root
$$ TOPSPIN		Version 1.3
$$ 2024-09-16 13:37:48.390 +0400  Irina@DPX200
$$ Compression mode = diff/dup
##.OBSERVE FREQUENCY= 200.131392401
##.OBSERVE NUCLEUS= ^1H
##.DELAY= (6, 6)
##.ACQUISITION MODE= SIMULTANEOUS
##.ACQUISITION SCHEME= undefined
##.AVERAGES= 16
##.DIGITISER RES= 18
##SPECTROMETER/DATA SYSTEM= spect
##.PULSE SEQUENCE= zg
##.SOLVENT NAME= CDCl3
##.SHIFT REFERENCE= INTERNAL, CDCl3, 1, 17.95386
##AUDIT TRAIL= $$ (NUMBER, WHEN, WHO, WHERE, WHAT)
$$ ##TITLE= Audit trail, TOPSPIN		Version 1.3
$$ ##JCAMPDX= 5.01
$$ ##ORIGIN= Bruker BioSpin GmbH
$$ ##OWNER= Irina
$$ $$ F:/spectra/data/iren/nmr/1H/4/audita.txt
$$ ##AUDIT TRAIL=  $$ (NUMBER, WHEN, WHO, WHERE, VERSION, WHAT)
(   1,<2024-09-16 13:37:33.546 +0400>,<Irina>,<DPX200>,<TOPSPIN 1.3>,
      <created by zg
	started at 2024-09-16 13:36:25.625 +0400,
	POWCHK disabled, PULCHK disabled
       configuration hash MD5:
       BE 6D 3F 07 2A EA 11 49 91 17 2B D3 AF B3 58 0D
       data hash MD5: 16K
       59 86 12 BA FF 75 28 AD FE 11 DB F8 CF 15 44 5E>)
$$ ##END=
$$ 
$$ $$ hash MD5
$$ $$ 92 A1 E7 79 05 2F 19 81 82 D2 DE 19 6B 3F 03 07
##$RELAX= 
##$RELAX= 
##$RELAX= 
##$RELAX= 
##$RELAX= 
##$RELAX= 
##$RELAX= 
##$RELAX= 
##$RELAX= 
$$ Bruker specific parameters
$$ --------------------------
##$DU= <F:/spectra>
##$EXPNO= 4
##$NAME= <1H>
##$PROCNO= 1
##$TYPE= <nmr>
##$USER= <iren>
##$AMP= (0..31)
100 100 100 100 100 100 100 100 100 100 100 100 100 100 100 100 100 100 
100 100 100 100 100 100 100 100 100 100 100 100 100 100 
##$ANAVPT= -1
##$AQSEQ= 0
##$AQ_mod= 1
##$AUNM= <au_zg>
##$AUTOPOS= <>
##$BF1= 200.13
##$BF2= 200.13
##$BF3= 200.13
##$BF4= 200.13
##$BF5= 200.13
##$BF6= 200.13
##$BF7= 200.13
##$BF8= 200.13
##$BYTORDA= 1
##$CFDGTYP= 0
##$CFRGTYP= 5
##$CHEMSTR= <none>
##$CNST= (0..63)
1 1 145 1 1 1 1 1 1 1 1 1 1 1 1 1 1 1 1 1 1 1 1 1 1 1 1 1 1 1 1 1 1 1 
1 1 1 1 1 1 1 1 1 1 1 1 1 1 1 1 1 1 1 1 1 1 1 1 1 1 1 1 1 1 
##$CPDPRG= <>
##$CPDPRG1= <>
##$CPDPRG2= <>
##$CPDPRG3= <>
##$CPDPRG4= <mlev>
##$CPDPRG5= <mlev>
##$CPDPRG6= <mlev>
##$CPDPRG7= <mlev>
##$CPDPRG8= <mlev>
##$CPDPRGB= <>
##$CPDPRGT= <>
##$D= (0..63)
0 2 0 0 0 0 0 0 0 0.06 0 0.03 0 0 0 0 0.0002 0 0 0 0 0 0 0 0 0 0 0 0 0 
0 0 0 0 0 0 0 0 0 0 0 0 0 0 0 0 0 0 0 0 0 0 0 0 0 0 0 0 0 0 0 0 0 0 
##$DATE= 1726479450
##$DBL= (0..7)
120 120 120 120 120 120 120 120 
##$DBP= (0..7)
150 150 150 150 150 150 150 150 
##$DBP07= 0
##$DBPNAM0= <>
##$DBPNAM1= <>
##$DBPNAM2= <>
##$DBPNAM3= <>
##$DBPNAM4= <>
##$DBPNAM5= <>
##$DBPNAM6= <>
##$DBPNAM7= <>
##$DBPOAL= (0..7)
0.5 0.5 0.5 0.5 0.5 0.5 0.5 0.5 
##$DBPOFFS= (0..7)
0 0 0 0 0 0 0 0 
##$DE= 6
##$DECBNUC= <off>
##$DECIM= 32
##$DECNUC= <off>
##$DECSTAT= 4
##$DIGMOD= 1
##$DIGTYP= 9
##$DL= (0..7)
0 120 120 120 120 120 120 120 
##$DP= (0..7)
150 150 150 150 150 150 150 150 
##$DP07= 0
##$DPNAME0= <>
$$ [...]
##$SW= 21.9925939549014
##$SWIBOX= (0..15)
0 0 2 0 0 0 0 0 0 0 0 0 0 0 0 0 
##$SW_h= 4401.40845070422
##$TD= 16384
##$TD0= 1
##$TE= 300
##$TE2= 300
##$TE3= 300
##$TEG= 300
##$TL= (0..7)
0 120 120 120 120 120 120 120 
##$TP= (0..7)
150 150 150 150 150 150 150 150 
##$TP07= 0
##$TPNAME0= <>
##$TPNAME1= <>
##$TPNAME2= <>
##$TPNAME3= <>
##$TPNAME4= <>
##$TPNAME5= <>
##$TPNAME6= <>
##$TPNAME7= <>
##$TPOAL= (0..7)
0.5 0.5 0.5 0.5 0.5 0.5 0.5 0.5 
##$TPOFFS= (0..7)
0 0 0 0 0 0 0 0 
##$TUNHIN= 0
##$TUNHOUT= 0
##$TUNXOUT= 0
##$USERA1= <user>
##$USERA2= <user>
##$USERA3= <user>
##$USERA4= <user>
##$USERA5= <user>
##$V9= 5
##$VALIST= <valist>
##$VCLIST= <CCCCCCCCCCCCCCC>
##$VD= 0
##$VDLIST= <DDDDDDDDDDDDDDD>
##$VPLIST= <PPPPPPPPPPPPPPP>
##$VTLIST= <TTTTTTTTTTTTTTT>
##$WBST= 1024
##$WBSW= 25
##$XGAIN= (0..3)
0 0 0 0 
##$XL= 0
##$YL= 0
##$YMAX_a= 1781611
##$YMIN_a= -1682710
##$ZGOPTNS= <>
##$ZL1= 120
##$ZL2= 120
##$ZL3= 120
##$ZL4= 120
##$ABSF1= 10
##$ABSF2= 0
##$ABSG= 5
##$ABSL= 3
##$ALPHA= 0
##$AQORDER= 0
##$ASSFAC= 0
##$ASSFACI= 0
##$ASSFACX= 0
##$ASSWID= 0
##$AUNMP= <proc_1d>
##$AXLEFT= 0
##$AXRIGHT= 0
##$AXTYPE= 0
##$AXUNIT= <>
##$AZFE= 0.1
##$AZFW= 0.1
##$BCFW= 1
##$BC_mod= 2
##$BYTORDP= 1
##$COROFFS= 0
##$CY= 7568.61572265625
##$DATMOD= 1
##$DC= 2
##$DFILT= <>
##$DTYPP= 0
##$F1P= 17.9538593292236
##$F2P= -4.03888763876832
##$FCOR= 0.5
##$FTSIZE= 32768
##$FT_mod= 4
##$GAMMA= 1
##$GB= 1
##$INTBC= 1
##$INTSCL= 1
##$ISEN= 128
##$LB= 0.02
##$LEV0= 0
##$LPBIN= 0
##$MAXI= 945.577
##$MC2= 0
##$MEAN= 0
##$ME_mod= 0
##$MI= -402.1523
##$NCOEF= 0
##$NC_proc= 0
##$NLEV= 6
##$NOISF1= 8.587773
##$NOISF2= 6.764455
##$NSP= 1
##$NTH_PI= 0
##$NZP= 0
##$OFFSET= 17.95386
##$PC= 1
##$PHC0= 303.4566
##$PHC1= 7.694227
##$PH_mod= 0
##$PKNL= yes
##$PPARMOD= 0
##$PPDIAG= 0
##$PPIPTYP= 0
##$PPMPNUM= 100
##$PPRESOL= 1
##$PSCAL= 0
##$PSIGN= 0
##$REVERSE= no
##$SF= 200.13
##$SI= 32768
##$SIGF1= 18.5376
##$SIGF2= -6.396296
##$SINO= 400
##$SIOLD= 32768
##$SREGLST= <1H.CDCl3>
##$SSB= 3
##$STSI= 0
##$STSR= 0
##$SW_p= 4401.40845070423
##$SYMM= 0
##$S_DEV= 0
##$TDeff= 0
##$TDoff= 0
##$TI= <>
##$TILT= no
##$TM1= 0
##$TM2= 0
##$TOPLEV= 0
##$USERP1= <user>
##$USERP2= <user>
##$USERP3= <user>
##$USERP4= <user>
##$USERP5= <user>
##$WDW= 1
##$XDIM= 8192
##$YMAX_p= 0
##$YMIN_p= 0
$$ End of Bruker specific parameters
$$ ---------------------------------
##NTUPLES= NMR FID
##VAR_NAME=  TIME,          FID/REAL,        FID/IMAG
##SYMBOL=    X,             R,               I
##VAR_TYPE=  INDEPENDENT,   DEPENDENT,       DEPENDENT
##VAR_FORM=  AFFN,          ASDF,            ASDF
##VAR_DIM=   8192,          8192,            8192
##UNITS=     SECONDS,       ARBITRARY UNITS, ARBITRARY UNITS
##FACTOR=    0.0002272,     1,               1
##FIRST=     0,             0,               0
##LAST=      1.8609952,     -4,              21
##MIN=       0,             -1682710,        -1682710
##MAX=       1.8609952,     1781611,         1781611
$$ Real data points
##PAGE= N=1
##DATA TABLE= (X++(R..R)), XYDATA
$$ [...]
$$ plain form
1645 -19715 7770 18802 -9616 -17978 10754 16527 -11826 -15045 12357 13033 -13149 -11094 13681
1658 13681 9159 -14421 -7257 15174 5862 -15948 -4506 16717 3789 -16999 -2909 17458
1670 17458 2475 -17108 -1496 17019 756 -16269 895 16047 -2497 -15321 4727 15330
1682 15330 -6841 -15023 9186 15138 -10952 -14990 12643 14698 -13733 -13767 14516 12322 -15072
1695 -15072 -10373 15398 7819 -15972 -5278 16341 2262 -17177 12 17567 -2374 -18325
1707 -18325 3692 18158 -4938 -18027 5434 16869 -6042 -15526 6417 13440 -7338 -11548
1719 -11548 8361 9662 -9789 -8294 11364 7472 -12736 -7053 14008 7146 -14567 -7129 14950
1732 14950 7183 -14423 -6480 14104 5495 -13426 -3475 13383 1404 -13318 1378 14039 -3526
$$ packed form
1645a9715K7485J1032k8418q362K8732N773k8353l219K7402O76k6182K055K4775
1658A3681m522k3580P164K2431r312k1810J1442K1223j2928k0788J4090K0367
1670A7458j4983j9583J5612J8515j6263j7025J7164J5152j8544j2824K0048J0603
1682A5330k2171q182K4209N952k6090m038K7633K055k8431l4K8283k194k7394
1695a5072M699K5771p579k3791J0694K1619j4079j9439J7189J7555j9941j5951
1707a8325K2017J4466k3096j3089K3461J1435k2911r484K1943P023k0778m210
1719a1548J9909J301j9451J495J9658l892k0208N683K1061o862k1713P438K2079
1732A4950p767k1606P943K0584q609j8921R951J6858j1979j4722J4696J2661j7565
$$ plain form
1745 -3526 -14800 5860 15804 -7297 -16328 8443 16419 -9000 -15622 9451 14044 -9859 -11822
1758 -11822 10496 9116 -11719 -6495 12864 3916 -14623 -2177 15779 710 -16873 -296
1770 -296 16960 -206 -16660 178 15217 -784 -13679 1420 11717 -2824 -10329 4567
1782 4567 9038 -6555 -8715 8346 8981 -9823 -9584 10730 10384 -10889 -10779 10725 10716 -10293 -9582
1797 -9582 10060 8124 -9905 -5727 10733 3443 -11645 -888 13338 -901 -14758 2473 16195
1810 16195 -3171 -16649 3864 16495 -4137 -15300 4739 13459 -5653 -11108 7083 8654
1822 8654 -8924 -6681 10773 5090 -12641 -4373 13810 3873 -14539 -4082 14092 3879 -13465
1835 -13465 -3798 11849 2849 -10633 -1649 9291 -268 -8908 1980 8786 -3847 -9675 5112
$$ packed form
1745c526j1274K0660R944k3101r031K4771P976k5419o622K5073M593k3903j963
1758a1822K2318j380k0835N224J9359q948j8539J2446J7956j5069j7583J6577
1770b96J7256j7166j6454J6838J5039j6001j2895J5099J0297j4541p505J4896
1782D567M471j5593k160J7061O35j8804K39K0314l46k1273J10K1504rk1009P11
1797i582J9642j936j8029M178J6460p290j5088J0757J4226j4239j3857J7231J3722
1810A6195j9366j3478K0513J2631k0632j1163K0039Q720j9112n455J8191J571
1822H654j7578K243J7454n683j7731Q268J8183r937j8412J0457J8174j0213j7344
1835a3465R667J5647r000j3482Q984J0940r559q640J0888O806j2633n828J4787
$$ plain form
1848 5112 10538 -6097 -11596 6356 12452 -6219 -12534 6121 12005 -5974 -10681 6526 8932
1861 8932 -7327 -6842 9057 5029 -10711 -3173 12846 2325 -14231 -1335 15361 994 -15228
1874 -15228 -353 14782 -254 -13323 1449 11665 -2948 -9833 4858 8379 -6869 -7437 8582
1887 8582 6803 -9948 -6752 10554 6736 -10618 -6850 9946 6420 -9190 -5910 8189 4653
1900 4653 -7792 -3510 7521 1827 -8108 -469 8817 -661 -10083 1205 11139 -1616 -12135 1741
1914 1741 12440 -1879 -12226 2313 11593 -2985 -10335 4418 9194 -5999 -7686 7985 6747
1927 6747 -9663 -5675 11365 5231 -12176 -4451 12826 4069 -12470 -2927 11975 1897 -10806
1940 -10806 -204 9937 -1332 -8990 3082 8432 -4501 -8074 5605 8016 -6316 -8125 6317
$$ packed form
1848E112N426j6635n499J7952O096j8671o315J8655N884j7979m707J7207K406
1861H932j6259M85J5899m028j5740P538J6019j0521j6556J2896J6696j4367j6222
1874a5228J4875J5135j5036j3069J4772J0216j4613o885J4691L521j5248n68J6019
1887H582j779j6751L196J7306l818j7354L768J6796l526j5610L280J4099l536
1900D653j2445M282J1031n694r935P639R286r478r422J1288R934j2755j0519J3876
1914A741J0699j4319j0347J4539R280j4578p350J4753M776j5193j687J5671j238
1927F747j6410L988J7040o134j7407P725J7277q757j6539R543J4902j0078j2703
1940a0806J0602J0141j1269p658J2072N350j2933l573J3679K411j4332j809J4442
$$ plain form
1953 6317 7975 -6326 -7806 5739 7099 -5550 -6650 5284 5534 -5814 -4854 6264 3864 -7388
1967 -7388 -3356 8299 2724 -9501 -2573 10244 2156 -10841 -1716 11080 1008 -10965 0
1980 0 10604 -1337 -9968 3073 9510 -4625 -8798 6310 8381 -7547 -7630 8685 7176 -9157
1994 -9157 -6102 9627 5292 -9293 -4057 9233 2872 -8763 -1404 8659 391 -8321 729 8233
2008 8233 -1456 -8110 2014 7969 -2285 -7936 2362 7628 -2541 -7429 2599 7058 -3057
2021 -3057 -6848 3381 6426 -4278 -6434 4914 6027 -5915 -5971 6643 5527 -7576 -5237 8210
2035 8210 4505 -8902 -3778 9324 2576 -9657 -1466 9844 91 -9813 1318 9748 -2440
2048 -2440 -9317 3697 8953 -4497 -8153 5524 7495 -5954 -6432 6597 5618 -6695 -4529 7088
$$ packed form
1953F317J658j4301j480J3545J360j2649j100J1934K50j1348R60J1118k400j1252
1967g388M032J1655n575j2225O928J2817q088j2997R125J2796j0072j1973J0965
1980@J0604j1941q631J3041O437j4135m173J5108K071j5928q3J6315j509j6333
1994i157L055J5729m335j4585N236J3290o361j1635P359J0063q268q712R050P504
2008H233r689o654J0124N955j0254n651J0298N266j0169m888J0028M459j0115
2021c057l791J0229L045j0704k156J1348J113j1942n6J2614j116j3103K339J3447
2035H210l705j3407N124J3102o748j2233Q191J1310r753r904J1131Q430j2188
2048b440o877J3014N256j3450l656J3677J971j3449m78J3029r79j2313K166J1617
$$ plain form
2062 7088 3795 -7016 -2964 7131 2416 -7019 -1872 7017 1558 -6768 -1112 6676 779 -6681
2076 -6681 -520 6610 -59 -6736 407 6854 -1054 -7155 1512 7303 -2288 -7564 2847 7382 -3723
2091 -3723 -7318 4352 6829 -5261 -6386 6031 5538 -6973 -4704 7661 3702 -8252 -2729 8736
2105 8736 1777 -9002 -739 8926 -215 -8660 1130 8257 -1926 -7509 2756 6940 -3318 -6081
2119 -6081 4151 5592 -4433 -4943 4909 4686 -4942 -4165 5171 4013 -5026 -3604 5042 3472 -4954
2134 -4954 -3016 5069 2801 -5201 -2272 5582 1818 -5980 -1337 6414 883 -7005 -386 7270 -294
2149 -294 -7624 776 7510 -1674 -7506 2334 7018 -3357 -6718 4176 5975 -5316 -5397 5903 4562
2164 4562 -6688 -3843 7146 3059 -7349 -2212 7418 1475 -7259 -692 7010 -4 -6491 879
$$ packed form
2062G088l293j0811M052J0095m715r435N147Q889n459q326N656P788n897p460
2076f681O161P130o669o677P143O447p908o101Q667N791r591n276J0411M535j1105
2091c723l595J1670K477j2090j125J2417m93j2511K269J2365l959j1954N523J1465
2105H736o959j0779Q263R665r141q445R790P127j0183n583J0265M184j0258k763
2119f081J0232J441j0025n10R852k23r628P77R336j158r039J422Q646j570q426
2134d954J938Q085k268q002K929P854l764p798M643P751n531p888O619P656p564
2149b94p330Q400O734r184n832R840M684j0375l361J0894J799j1291q1J1300j341
2164D562j1250K845J0989m087j0408N137R630n943q734O567P702p014o487P370
$$ plain form
2178 879 6160 -1320 -5662 1960 5403 -2267 -5011 2766 4942 -2838 -4601 3116 4648 -3072 -4447
2193 -4447 3308 4379 -3394 -4153 3701 4009 -3983 -3605 4496 3325 -4971 -2829 5582 2346 -6145 -1926
2209 -1926 6511 1153 -6987 -645 7057 -166 -7226 783 6875 -1763 -6739 2390 6093 -3388 -5694
2224 -5694 3959 4903 -4761 -4396 5193 3697 -5597 -3103 5806 2573 -5821 -2032 5740 1581 -5444
2239 -5444 -1029 5260 551 -4849 30 4735 -292 -4493 805 4533 -982 -4497 1455 4800 -1481
2254 -1481 -4809 1866 5111 -1912 -4908 2268 4965 -2459 -4604 2900 4219 -3492 -3774 4176 3272
2269 3272 -4857 -2800 5500 2179 -6112 -1752 6438 1215 -6732 -794 6475 54 -6280 484 5683
2284 5683 -1406 -5287 2060 4646 -2937 -4295 3546 3824 -4211 -3622 4408 3345 -4451 -3122 4380
$$ packed form
2178H79N281p480m342P622L443p670k744P777K176p780j763P717J532p720j375
2193d447P755J071p773p59P854L08p992L78Q101j171q296K142Q411l236q491M219
2209a926Q437n358q140O342P702p223p060Q009O092q638m976R129L703r481k306
2224e694R653R44r664L65R589j496r294K494Q909l233q394L789P772m159p025
2239e444M415O289m709n400M879M705n027m201N298L728n515l515N952L345o281
2254a481l328O675L245p023k996P176K697p424k145P504J319p711k82P950r04
2269C272q129K057Q300l321q291M360Q190n223p947N938P269o421o334O764N199
2284E683p089l881P347K586p583j358P841K78q035N89Q030j063p796J329P502
$$ plain form
2299 4380 2928 -4051 -2492 3866 2027 -3535 -1476 3499 958 -3493 -430 3906 156 -4246 275
2314 275 4802 -189 -4992 350 5301 -333 -5223 450 5188 -718 -4770 1240 4397 -1986 -3902
2329 -3902 2875 3499 -3800 -3211 4597 2952 -5287 -2805 5636 2421 -5705 -2250 5431 1573 -5165
2344 -5165 -989 4628 -61 -4367 877 3933 -1844 -3936 2440 3848 -2972 -3996 3062 3971 -3001
2359 -3001 -3904 2722 3637 -2367 -3188 2089 2661 -2149 -2060 2401 1530 -2687 -1097 3403 1016 -3890 -895
2376 -895 4532 1196 -4747 -1190 5028 1369 -4798 -1053 4625 663 -4173 142 3965 -1033 -3665
2391 -3665 2147 3679 -3054 -3659 3788 3714 -4302 -3711 4381 3478 -4353 -3159 3974 2380 -3845 -1592
2407 -1592 3476 523 -3467 231 3421 -1099 -3730 1456 3916 -1718 -4086 1495 4106 -1282 -3944
$$ packed form
2299D380j452o979J559O358j839n562K059M975k541m451L063M336l750m402M521
2314B75M527m991m803N342M951n634m890N673M738n906m052O010L157o383j916
2329c902O777O24p299N89P808j645q239K482Q441l215q126L455P681l858o738
2344e165M176N617m689m306N244L056n777k092O376J408o820j024P058R09o972
2359c001r03O626R15o004q21N277N72m810Q9M461q71m217J590M500k387m906K995
2376h95N427l336n943L557O218l659o167L745N678l962m836M315L823m998k632
2391c665N812J532o733o05P447p4q016N91Q092r03p831J194P133j594o225K253
2407a592N068k953l990L698L190m520k631N186K460n634k368N581K611n388k662
$$ plain form
2422 -3944 990 3625 -737 -3028 810 2543 -1055 -2088 1630 1931 -2273 -1759 2949 1915 -3436
2437 -3436 -2105 3931 2449 -3950 -2426 4090 2388 -3789 -1884 3807 1333 -3569 -322 3608 -558
2452 -558 -3693 1590 3916 -2242 -4076 2696 4170 -2967 -4122 2919 3690 -2868 -3198 2681 2421 -2714
2468 -2714 -1595 2690 770 -2982 -309 3181 -246 -3554 276 3538 -285 -3777 -45 3567 119
2483 119 -3417 -353 2990 249 -2665 39 2372 -533 -2269 1097 2403 -1641 -2563 2223 2903 -2492
2499 -2492 -3070 2827 3257 -2835 -3026 2996 2818 -2918 -2119 3184 1470 -3183 -619 3536 -17 -3746
2515 -3746 730 4088 -1082 -4137 1430 4077 -1533 -3831 1607 3355 -1739 -2797 1801 2151 -2038
2530 -2038 -1716 2168 1138 -2535 -1048 2685 848 -2819 -978 2769 999 -2821 -1196 2555 1114
$$ packed form
2422c944M934K635m362k291L838J733l598j033L718L01m204N14M708j034n351
2437c436J331O036j482o399J524O516j702o177J905N691k474m902L247L930m166
2452e58l135N283K326o158j834O772J474p137j155P041P71o558l30N879k60n135
2468b714J119M285j920l752K673L490l427l308L830L262l823l492L732L612l448
2483A19l536L064L343k741k914K704K333k905j736L366J306m044r22M786O80n395
2499b492n78N897M30o092j91O022j78n736P99N303j714m653K564M155l553l729
2515c746M476L358n170l055N567K647n610k298N438J748n094j058M598L50m189
2530b038L22L884j030l673J487L733j837l667J841L747j770l820J625L751j441
$$ plain form
2545 1114 -2495 -1053 2342 814 -2366 -481 2468 46 -2655 375 2954 -741 -3158 1137 3428
2560 3428 -1328 -3401 1674 3470 -1825 -3069 2210 2747 -2404 -2199 2813 1799 -3039 -1069 3485
2575 3485 668 -3596 -294 3696 -13 -3620 312 3428 -629 -3106 771 2769 -994 -2461 1154
2590 1154 2039 -1454 -1905 1542 1694 -1707 -1776 1652 1608 -1786 -1724 1623 1574 -1682 -1660 1696 1462 -1867
2608 -1867 -1458 2024 1154 -2326 -1006 2567 813 -2875 -549 3040 280 -3192 94 3329 -380
2623 -380 -3199 835 3106 -1199 -2887 1791 2659 -2084 -2299 2489 2070 -2645 -1567 2917 1402 -2895
2639 -2895 -1001 2881 686 -2596 -297 2603 -14 -2352 248 2280 -486 -2127 639 2025 -687
2654 -687 -2046 666 1986 -679 -2003 593 1882 -700 -2027 688 1759 -975 -1855 1161 1776 -1526
$$ packed form
2545A114l609J442L395j528l180J885K949k422k701L030K579l695k417M295K291
2560C428m756k073N075J796n295j244N279N37n151K05N012j014m838J970M554
2575C485k817m264L302L990l709l607L932L116m057k477L877J998l763j467L615
2590A154Q85l493m51L447J52l401o9L428m4l394O2L347m9l256K2L356k34l329
2608a867M09L482q70l480J320L573j754l688K326L589k760l472L286L235l709
2623c80k819M034K271m305j688M678Q68m743k15M788m19m715J078M484j515m297
2639b895J894L882k195l282K299K900k617k338K600K032k766j641K766J386k712
2654f87j359K712J320k665j324K596J289k582j327K715J071k734q80L016O15l302
$$ plain form
2670 -1526 -1868 1783 1675 -2197 -1674 2385 1569 -2666 -1378 2759 1024 -2851 -648 2908 177 -2901
2686 -2901 384 2886 -764 -2751 1289 2622 -1571 -2435 1886 2319 -1903 -1943 2113 1703 -1913 -1280
2702 -1280 2005 1059 -1871 -543 1907 440 -1872 -197 1902 90 -1824 -125 1954 128 -1956
2717 -1956 -283 1864 194 -1930 -223 1846 61 -1858 62 1827 -469 -1977 669 1922 -1144
2732 -1144 -2221 1377 2144 -1704 -2132 1943 1961 -2197 -1809 2273 1440 -2412 -1011 2432 546 -2544
2748 -2544 -53 2559 -363 -2528 729 2510 -985 -2321 1154 2229 -1189 -1869 1341 1731 -1199
2763 -1199 -1356 1248 1159 -1168 -825 1325 746 -1357 -591 1457 677 -1430 -659 1546 755 -1549 -802
2780 -802 1590 768 -1701 -746 1759 586 -1856 -409 1836 14 -2116 198 2106 -663 -2270 845
$$ packed form
2670a526l42L651j08l872N23M059q16m235J288M137j735l875K203L556k731l078
2686b901L285K502l650j987M040J333m193q64M321M33m222m0M056m10l616O33
2702a280L285r46k930J328K450j467k312J675K099j812j914J699K079j826k084
2717a956J673K147j670k124J707K069j785j919J920J765k296j508K646J253l066
2732a144j077L598P67l848m28M075J8m158L88M082q33l852J401L443j886l090
2748b544K491K612k922k165L257J781l495j336L475J075l418o80L210L90k930
2763a199j57K604q9k327L43K150n79k103P66K048p80k107P71K205p91k304P47
2780h02K392q22k469R55K505j173k442J447K245j822k130K314J908k769j607L115
$$ plain form
2796 845 2226 -1244 -2242 1437 2115 -1693 -1928 1800 1514 -1995 -1191 2013 811 -2096 -409 2204
2812 2204 49 -2149 282 2185 -348 -1988 591 1974 -497 -1726 698 1666 -593 -1395 696
2827 696 1237 -553 -1058 737 990 -717 -860 903 1006 -1019 -1049 1177 1119 -1266 -1226 1377 1232 -1463
2845 -1463 -1149 1576 976 -1719 -837 1701 494 -1929 -259 1978 -180 -2180 435 2181 -786 -2286
2861 -2286 1018 2088 -1212 -1970 1317 1690 -1478 -1386 1549 1056 -1572 -677 1720 380 -1674 -51
2877 -51 1848 -58 -1694 198 1704 -67 -1505 133 1549 -20 -1243 55 1162 28 -999
2892 -999 211 1056 -169 -962 503 1109 -518 -1167 809 1312 -907 -1487 1057 1522 -1154 -1498 1254
2909 1254 1376 -1334 -1259 1418 762 -1627 -563 1731 37 -1904 184 2023 -495 -2131 592 2050
$$ packed form
2796H45J381l470r98L679O78l808k35L728k86l509Q04L204j202k907J687K613
2812B204k155k198K431J903k533j640K579J383k471j229K424R68k259q02K091
2827F96N41j790n05J795K53j707j43J763J03k025l0K226n8k385M0K603j45k695
2845a463L14K725o00k695Q82K538j207k423J670K237k158k000K615J746k967j500
2861b286L304J070l300p58L287L73l168R2K935m93k628Q95K397j340k054J623
2877e1J899j906j636J892J506j771j438J638J416j569j223J298J107j134j027
2892i99J210Q45j225p93J465O06j627o49J976N03k219n80K544M65k676l44K752
2909A254J22k710P5K677o56k389J064K294j694j941K088J839k518j636K723J458
$$ plain form
2925 2050 -791 -1994 784 1631 -877 -1463 813 1046 -1112 -734 1171 445 -1312 -221 1438 194
2941 194 -1438 -209 1464 362 -1306 -346 1283 458 -1010 -383 985 457 -847 -169 928 18 -915
2958 -915 166 1189 -352 -1270 542 1513 -569 -1704 674 1770 -706 -1704 778 1494 -888 -1166
2974 -1166 1081 912 -1345 -606 1514 230 -1791 -54 1906 -112 -2056 101 1906 -271 -1763
2989 -1763 309 1531 -414 -1267 472 824 -702 -698 839 551 -1011 -423 1087 473 -1115 -594 1136
3006 1136 727 -934 -737 854 792 -669 -675 634 622 -637 -369 837 264 -944 -1 1233 -4 -1391
3024 -1391 142 1694 -155 -1684 272 1759 -280 -1584 469 1466 -639 -1169 814 889 -1151 -697
3040 -697 1306 403 -1628 -443 1712 296 -1752 -267 1520 130 -1379 -87 1155 -132 -1022 207
$$ packed form
2925B050k841j203K778Q47k508n86K276K33k158L78J905p26j757J091J659j244
2941A94j632J229J673j102j668R60J629q25j468O27J368n28j304O78J097r10r33
2958i15J081J023j541r18J812R71k082j135K378J096k476r98K482P16k382k78
2974a166K247j69k257P39K120j284k021J737J960k018j944K157J805k177j492
2989a763K072J222j945q53J739L52j526MJ537k88j562N88J510o14j588N21J730
3006A136m09j661J97J591o2j461oJ309j2j259K68J206n73j208R43J234j237j387
3024a391J533J552j849j529J956J487k039j304K053R97k105n30J983P5k040M54
3040f97K003r03k031J185K155j416k048J485J787j390j509J292J242j287q90J229
$$ plain form
3056 207 709 -436 -664 573 614 -704 -661 795 733 -622 -806 647 972 -428 -919 400 849 -344
3074 -344 -720 484 688 -554 -445 806 499 -945 -349 1325 359 -1338 -281 1673 285 -1523 -126
3091 -126 1518 10 -1364 259 1225 -536 -1131 726 935 -1048 -876 1192 758 -1349 -712 1339 475
3108 475 -1297 -480 1089 300 -999 -175 749 -35 -767 80 671 -326 -654 267 734 -392 -760 271
3126 271 807 -231 -854 104 878 -76 -899 156 895 -175 -740 364 811 -530 -714 795 758 -964
3144 -964 -724 1181 704 -1192 -578 1338 502 -1270 -261 1277 96 -1258 212 1151 -420 -1097 602
3161 602 1051 -804 -935 832 821 -913 -762 817 557 -874 -511 768 181 -722 -162 602 94 -702
3179 -702 -43 689 14 -719 -125 589 109 -755 -205 733 184 -728 -127 737 107 -770 11 910 -93 -929
$$ packed form
3056B07N02j145k28J237M1j318M3J456o2j355j84J453L25j400m91J319M49j193
3074c44l76J204K04j242J09J251l07j444N96J674r66j697J057J954j388j808J397
3091a26J644j508j374J623R66j761n95J857K09j983J72K068m34k107O37K051q64
3108D75j772Q17J569p89j299Q24R24p84p32Q47N91r97l28R21M67j126l68J031
3126B71N36j038o23R58P74r54q23J055P39j070n65J104M47j341j84J509l7j722
3144i64K40J905m77j896O14J916q36j772J009J538j181j354J470R39j571o77J699
3161F02M49j855j31J767j1j734J51J579k60j431L63J279n87r03N60P64n08p96
3179g02O59P32o75p33N94P14m80q64N50R38n49r12O01Q64o30q77P81Q99j003q36
$$ plain form
3199 -929 326 984 -390 -917 577 949 -690 -932 859 820 -869 -644 1037 532 -1037 -196 1108
3216 1108 16 -1122 161 1092 -218 -1122 361 1015 -352 -877 449 742 -474 -616 462 400 -581
3233 -581 -402 435 263 -546 -310 497 241 -529 -393 484 291 -494 -421 478 385 -589 -411 520 396 -588 -327
3254 -327 660 157 -724 -65 871 -39 -996 175 1092 -264 -1058 381 1073 -441 -906 659 806 -635
3272 -635 -575 814 458 -845 -215 1046 155 -1015 -18 1021 -15 -971 96 819 -91 -693 122 502
3290 502 -176 -419 185 293 -278 -367 306 288 -309 -390 330 412 -333 -505 353 571 -281 -589 233 608 -357
3311 -357 -630 301 443 -502 -456 565 240 -828 -239 925 65 -980 -17 1051 -34 -1031 220 964
3329 964 -244 -758 399 736 -465 -454 681 456 -696 -263 802 301 -785 -146 817 128 -677 -88
$$ packed form
3199i29J255O58j374n27J494L72j639k42J791l9j689K25J681n05j569Q41J304
3216A108j092j138J283R31j310r04J483O54j367n25J326K93j216j42J078o2r81
3233e81J79Q37j72q09K36Q07k56p70J36Q77j93p85P3Q99r3r74J78R31j24r84K61
3254c27R87n03q81O59R36r10r57J171R17j356p94J439O92j514m65J565J47j441
3272f35O0J389l56j303O30J261q91j170R97J039j036r56J067P23r10o02Q15L80
3290E02o78k43O04J08n71q9O73j8n97q1P20Q2p45j72Q58K18q52l08Q22L75r65
3311c57k73R31J42r45M6J021l25j068N89J164q60j045R63J068j085r97J251P44
3329I64j208n14J157L37j201J1J135k25j152M33J065n01j086O39R63o89q05N89
$$ plain form
3347 -88 669 68 -420 16 429 -56 -362 100 275 -157 -303 138 324 -99 -446 76 524 -164 -559 44
3367 44 596 -89 -687 144 656 -150 -687 281 543 -547 -477 607 429 -788 -252 879 216 -864 -165
3386 -165 1001 99 -945 73 887 -85 -700 268 649 -399 -466 591 376 -586 -286 663 359 -573 -176
3405 -176 568 222 -507 -107 434 175 -344 -94 285 93 -199 -103 222 91 -286 -43 329 77 -471 -121
3425 -121 503 80 -585 -66 682 16 -710 29 656 -158 -711 153 616 -407 -502 485 393 -688 -349 760
3445 760 316 -792 -218 794 121 -716 -59 716 -104 -606 160 567 -213 -374 429 403 -339 -299 443 329
3465 329 -437 -177 440 269 -304 -308 287 191 -126 -162 190 234 -128 -192 126 187 -183 -164 359 185 -388 -205 485
3488 485 192 -636 -174 632 59 -720 -49 608 5 -635 73 600 -270 -536 386 461 -550 -432 712 324
$$ packed form
3347h8P57o01m88M36M13m85l06M62J75m32j46M41J86m23l47N22M48o88l95O03
3367D4N52o85n98Q31N12q06n37R68K62j090P0J084j78j217N36J131o63j080O99
3386a65J166r02j044J018Q14r72o15R68L81j048o7J057k15r62L00R49l04r32L97
3405a76P44l46p29M00N41k59n19K50L79j92k92R6L25j31l77K43L72k52n48L50
3425a21O24m23o65N19P48o66p26P39O27q14n53Q64M63j023r5R87r2j081L39J109
3445G60m44j108N74J012o73q37O57P75q20n02P66M07p80j61Q03k6p42M0P42j14
3465C29p66K60O17j71n73mN95r6l17l6L52M4l62o4L18O1l70J9N23j74n73J83O90
3488D85k93q28M62Q06n73p79O71O57o03o40P08N27q70k66R22P5j011J18J144l88
$$ plain form
3508 324 -656 -268 686 269 -625 -185 584 58 -509 -9 468 -79 -333 255 251 -301 -237 232 279 -299 -213 278
3530 278 308 -169 -330 48 315 -13 -319 7 294 10 -275 127 253 -174 -292 307 295 -422 -313 522 283
3551 283 -573 -335 553 201 -691 -264 611 105 -658 -17 543 -230 -560 313 518 -452 -434 541 284 -539
3571 -539 -294 537 287 -478 -214 434 189 -338 -10 282 11 -181 129 245 -82 -213 157 303 -101 -295
3591 -295 111 265 44 -257 -49 333 169 -255 -126 303 49 -291 61 323 -130 -340 296 448 -409 -424
3611 -424 422 473 -519 -403 536 289 -560 -318 512 122 -561 -28 454 -185 -471 212 413 -341 -477 365
3631 365 406 -375 -333 352 275 -373 -219 279 74 -225 -56 181 -30 -177 112 176 9 -157 -2 255 60
3652 60 -242 -99 227 160 -234 -208 313 237 -200 -144 296 145 -274 25 371 -54 -470 160 412 -303 -442 273
$$ packed form
3508C24r80L88R54m17q94M40P69n26n67N00M77n47k54N88mn52O4M69M7n78Q6M91
3530B78L0m77j61L78K67l28l06L26K87k84k85M02J26m27j18N99j2p17J09Q35k39
3551B83q56K38Q88l52q92M27Q75n06p63O41N60p73l30Q73K05r70J8R75k57q23
3571e39K45Q31k50p65K64O48k45n27L28K92k71j92L10J16l27j31L70J46m04j94
3591b95M06J54k21l01K08L82j64m24J29M29k54l40L52K62m53k10O36J52q57j5
3611d24Q46N1r92J16R39k47q49K42Q30l90o83N33M82o39k86O83K01p54j36Q42
3631C65M1p81M2O85p7o48J54M98k05k99J69K37k11j47K89O4j67j66J55K57j95
3652F0l02J43L26o7l94K6N21p6m37N6M40j51m19K99L46m25m16O30K52p15j39P15
$$ plain form
3674 273 459 -406 -449 419 301 -426 -319 367 116 -458 -36 421 -94 -478 170 409 -267 -491 159 379
3694 379 -189 -286 184 226 -176 -138 191 87 -117 -87 184 56 -172 -42 155 132 -131 -81 157 225 -91 -176 225
3717 225 220 -92 -216 236 273 -216 -265 318 129 -320 -3 446 32 -531 82 474 -97 -480 220 495 -280
3738 -280 -425 323 358 -293 -201 349 128 -421 -96 404 22 -441 49 379 -84 -394 111 285 -86 -206 95
3759 95 164 -124 -85 92 68 -41 -61 63 116 -93 -183 23 197 -56 -169 63 223 30 -196 125 304 -138
3781 -138 -213 209 235 -246 -192 269 151 -364 -123 495 113 -435 18 456 -14 -444 90 359 -173 -347 220
3802 220 257 -290 -178 318 143 -410 -92 341 75 -257 -45 240 0 -230 -38 114 -60 -113 -26 38 -73
3823 -73 -117 17 94 -44 -103 -57 134 89 -241 -109 230 125 -245 -48 294 53 -233 39 239 -124 -244 181
$$ packed form
3674B73J86q65m3Q68j18p27J07O86k51n74M22M57n15l84O48K39o76k24O50K20
3694C79n68r7M70M2m02L8L29j04k04L0K71j28k28J30J97k3k63N0K38O8l16q5M01
3717B25nl12j24M52L7m89m9N83j89m49L17M49m14n63O13L92n71l83P00K75p75
3738b80j45P48L5o51R2N50k21n49L25N00l82m63M90L30m63l10N05J74l71j20L01
3759I5O9k88L9J77k4j09k0J24N3k09r0K06J74k53j13K32J60j93k26L21J79m42
3781a38p5M22K6m81N4M61j18n15K41O18l82n48M53M38m70m30N34K69n32j74N67
3802B20L7n47J12M96j75n53L18M33k66l32K12K85k40k30J92J52j74n3Q7O4j11
3823g3m4J34P7j38n9M6J91m5l30J32L39j05l70J97L42k41k86K72K00l63j20M25
$$ plain form
3845 181 227 -250 -195 325 226 -309 -187 425 117 -357 -35 357 32 -331 69 277 -103 -253 219 257 -219
3866 -219 -200 293 194 -207 -161 245 113 -105 -89 126 44 -95 1 79 -21 4 -18 56 49 -106 -25 130 49 -156 -140
3891 -140 207 152 -211 -181 191 193 -229 -97 289 46 -296 33 269 -77 -277 234 350 -159 -281 260 264 -241
3913 -241 -196 344 228 -264 -86 289 82 -299 83 244 -132 -250 162 215 -171 -204 187 168 -182 -218 106 100
3935 100 -72 -95 20 56 -16 -60 22 33 -18 -40 41 33 -118 -116 54 165 -157 -195 163 216 -114 -205 182 204 -211 -142
3961 -142 254 73 -271 41 315 -34 -256 160 361 -157 -271 220 351 -218 -157 252 173 -199 -45 264 50
3982 50 -263 82 206 -37 -206 140 228 -78 -173 93 177 -65 -184 -4 45 7 -89 -54 61 7 -11 -70 14 42
4006 42 -87 2 166 -18 -176 96 228 -92 -291 154 145 -134 -188 202 218 -233 -108 218 60 -246 -28 296
$$ packed form
3845A81M6m77N5N20r9n35J22O12l08m74L22L92l25l63M00K08l80j50M72L8m76
3866b19J9M93r9m01M6M06j32k18J6K15q2j39R6P8j00K5k2P4pj55Q1J55q1k05J6
3891a40L47n5l63L0L72Km22J32L86k43l42L29K36l46k00N11J16n09j22N41Mn05
3913b41M5N40j16m92J78L75k07l81L82J61l76j18M12N3l86l3L91j9l50l6L24o
3935A00j72k3J15L6p2m4Q2J1n1k2Q1qj51KJ70J11l22l8L58N3l30r1L87K2m15O9
3961a42L96j81l44L12K74l49k22M16K01n18j14M91J31n69O1M09p9l72J54L09k14
3982E0l13L45J24k43j69L46Q8l06r5K66Q4k42j19J80M9l8r6L5J15n4j8n9Q4K8
4006D2j29Q9J64j84j58K72J32l20j99M45rk79n4L90J6m51J25L26j58l06K18L24
$$ plain form
4028 296 -14 -300 67 359 -90 -245 152 281 -110 -183 127 129 -89 -53 167 -59 -122 6 143 -18 -170 91
4050 91 97 17 -180 83 80 53 -125 -3 63 77 -68 -105 80 130 -34 -8 105 9 -124 -21 193 -13 -182 30
4074 30 217 -125 -226 25 280 -100 -203 163 202 -143 -170 224 60 -228 41 273 -1 -263 96 334 -13
4095 -13 -224 83 207 -108 -113 117 126 -116 -80 122 37 -66 -14 116 -7 -107 0 137 37 -127 -20 76 64
4118 64 -12 -129 1 109 -36 -114 4 93 -75 -117 107 91 -123 -50 128 15 -195 -3 231 -27 -294 28
4140 28 257 -25 -256 82 175 -168 -178 206 64 -227 -60 178 20 -153 47 119 -71 -169 14 173 -63 -118
4162 -118 111 43 -17 -3 26 5 -5 -7 55 15 -58 3 24 47 -7 -104 -63 83 67 -77 18 175 -39 -168 30 98 -74
4189 -74 -133 77 107 -106 -100 172 35 -214 -71 136 -15 -289 4 158 -35 -223 94 134 -78 -135 131 96 -111
$$ packed form
4028B96l10k86L67K92m49j55L97J29l91p3L10Kk18L6K20k26o3J28J37j61j52K61
4050I1Oq0j97K63lk7j78J22O6J4j45l7J85N0j64K6J13r6j33J03K14k06j69K12
4074C0J87l42j01K51K55l80j03L66L9l45k7L94j64k88K69K32k74k62L59K38l47
4095a3k11L07J24l15nK30Rk42L6K02q5j03N2J30j23j00J07J37j00j64J07R6j2
4118F4p6j17J30J08j45p8J18Q9j68m2K24j6k14P3J78j13k10J92K34k58k67L22
4140B8K29k82k31L38R3l43j0L84j42k91J67K38j58j73K00P2j90r8J83J59k36n5
4162a18K29o8o0J4K9k1j0kO2m0p3O1K1K3n4r7M1J46j6j44R5J57k14j29J98O8j72
4189g4n9K10L0k13OK72j37k49J43K07j51k74K93J54j93j88L17M0k12n7K66l5k07
$$ plain form
4212 -111 -53 198 25 -158 -16 166 18 -94 27 87 11 -9 76 11 -65 7 77 -16 16 9 7 98 -51 -62 56 75
4238 75 27 -139 19 121 64 -122 -111 117 -73 -127 -25 121 -53 -150 49 103 -155 -176 92 44 -240 -32 216
4261 216 -32 -184 -53 116 -24 -187 72 68 -97 -85 86 75 -116 -13 148 50 -83 -38 109 52 -53 2 28
4284 28 -37 20 -57 -16 -73 9 7 34 28 -49 36 8 48 -60 -99 113 49 -111 -86 83 47 -105 -88 130 2 -121 50
4311 50 161 -5 -166 97 97 -90 -118 131 103 -197 -159 129 23 -129 -44 106 -31 -130 74 25 -92 -96 68 133
4335 133 -127 -18 129 77 -88 -82 52 25 15 0 11 -2 24 -34 46 53 -16 -18 -30 47 7 -48 61 143 -64 -125 69
4362 69 88 -44 -75 95 89 -57 -48 106 35 -139 28 139 -7 -259 61 158 -77 -163 110 110 -85 -56 106 47 -162
4387 -162 -7 122 -19 -131 35 69 -56 -82 50 110 -32 -100 -7 1 -43 -51 2 40 0 14 35 44 32 -2 -13 10 12 -29
$$ packed form
4212a11N8K51j73j83J42J82j48j12J21O0p6k0Q5o5p6P2P0r3L2pkR1j49j1J18J9
4238G5m8j66J58J02n7j86J1K28j90n4J02J46j74r7J99N4k58k1K68m8k84K08K48
4261B16k48j52J31J69j40j63K59mj65J2J71j1j91J03J61r8j33M5J47n7j05N5K6
4284B8o5N7p7M1n7Q2kK7op7Q5k8M0j08l9K12o4j60K5J69l6j52J7K18j28j23J71
4311E0J11j66j61K63%j87k8K49k8l00L8K88j06j52Q5J50j37r9K04m9j17mJ64O5
4335A33k60J09J47n2j65OJ34k7j0j5J1j3K6n8Q0Po9kj2P7m0n5J09Q2k07o1J94
4362F9J9j32l1J70oj46RJ54p1j74J67J11j46k52L20R7k35q6K73%j95K9J62n9k09
4387a62J55J29j41j12J66L4j25k6J32O0j42o8R3Qm4qN3L8m0J4K1Rj2l4j1K3Km1
$$ plain form
4415 -29 -25 124 45 -101 -31 129 -6 -148 28 122 -2 -59 48 50 -59 -32 74 54 -163 -7 75 1 -175 19
4439 19 102 -48 -106 57 71 -43 -90 78 41 -147 7 97 -14 -113 -24 136 14 -33 -25 85 -41 -104 -26 2 21
4464 21 42 -23 -13 -8 15 2 50 36 1 -10 54 -17 -83 4 76 40 -149 -18 144 54 -126 -35 95 -21 -109 57 99
4491 99 -28 -98 134 68 -132 -66 162 43 -172 32 141 -4 -105 15 57 -63 -79 55 -20 -82 -80 68 -61
4514 -61 -69 -5 62 15 -59 16 40 24 -48 -78 -70 49 9 -29 -15 8 -8 -23 35 26 -27 -36 32 99 -108 -50 180 66 -39 -41
4544 -41 100 73 -69 1 73 36 -39 -12 117 -135 -44 127 9 -94 -20 104 71 -128 -40 81 35 -76 -10 52 -81
4569 -81 -32 3 19 -87 -2 45 5 -94 -4 60 -32 -83 11 -2 26 61 -33 -60 109 -11 -47 16 38 51 -31 47 81 24 -42
4598 -42 30 112 -53 -81 142 79 -83 -39 88 42 -62 -20 63 -41 -64 30 23 -42 -81 143 85 -159 -74 98 2 -87
$$ packed form
4415b9MJ49p9j46P0J60j35j42J76R4j24n7J07Kj09K7J06k0k17J56Q2p4j76J94
4439A9Q3j50n8J63J4j14m7J68l7j88J54R0j11r9Q9J60j22m7QJ10j26o3P8K8J9
4464B1K1o5J0NK3j3M8j4l5j1O4p1o6Q7P2l6j89J31J62r0j80R1J30j16q8J66M2
4491I9j27p0K32o6k00O6K28j19k15K04J09j45j01J20M2j20j6J34p5o2KJ48j29
4514f1qO4O7m7p4P5K4j6p2l0QJ19m0l8J4K3j6j5N8rn3rO8O7k07N8K30j14j05k
4544d1J41k7j42P0P2l7p5K7J29k52R1J71j18j03P4J24l3j99Q8J21m6j11O6O2j33
4569h1M9L5J6j06Q5M7m0r9R0O4r2n1R4j3K8L5r4k7J69j20l6O3K2J3q2P8L4n7o6
4598d2P2Q2j65k8K23o3j62M4J27m6j04M2Q3j04k3R4po5l9K24n8k44Q5J72r6q9
$$ plain form
4624 -87 -31 53 29 -64 52 29 -41 27 -4 26 -17 30 30 -50 4 9 -1 -25 14 -53 -54 -38 38 1 -38 38 73 -41 -19 -10 24
4655 24 -12 -37 79 -36 -67 66 60 -40 -125 86 92 -21 -65 102 110 -19 17 107 -2 -77 42 60 -19 -59 57 35
4681 35 -36 -59 63 74 -88 -42 53 -3 -5 4 18 -60 -47 -8 93 -15 -45 -11 70 71 -14 -64 -54 9 -44 -73 -44 20 -50 -16
4711 -16 -11 62 -76 -64 21 3 -84 -31 36 -43 -93 5 69 15 -50 93 25 -64 -58 -15 39 -55 -17 79 -6 -115 58 126 -9
4740 -9 -22 27 31 -28 -76 15 16 -54 44 48 50 -29 -3 32 -36 81 -5 22 8 44 -8 8 -11 46 19 7 68 -35 -79 -35 114
4771 114 -15 -85 2 23 -138 37 107 15 -104 -22 56 -13 -37 47 45 -37 3 34 119 -41 2 58 -5 -50 29 85 65 -115
4799 -115 16 66 -78 -59 44 105 -34 -38 2 20 49 34 -13 3 27 23 28 27 -10 -47 33 -11 -59 -126 -22 11 -78 -69 -14 53
4829 53 43 -50 -4 50 -24 -35 -34 61 -38 -2 74 40 -39 -12 47 17 -68 -1 13 -51 -42 64 80 -34 53 64 29 -46 -15 119
$$ packed form
4624h7N6Q4k4r3J16k3p0O8l1L0m3M7%q0N4Nj0k4L9o7jJ6P6l7l9P6L5j14K2RL4
4655B4l6k5J16j15l1J33oj00q5K11Oj13m4J67Qj29L6R0j09p5J19J8p9m0J16k2
4681C5p1k3J22J1j62M6R5n6kRJ4p8J3L9J01j08l0L4Q1Jq5n0J0O3n3k9K9O4p0L4
4711a6NP3j38J2Q5j8q7N3O7p9n0R8O4n4o5J43o8q9OM3N4r4L8R6q5j09J73O8j35
4740ij3M9Mn9m8R1Jp0R8MKp9K6L5o8J17q6K7j4L6n2J6j9N7k7j2O1j03m4M4J49
4771A14j29p0Q7K1j61J75P0r2j19Q2P8o9k4Q4kq2M0L1Q5j60M3N6o3m5P9N6k0j80
4799a15J31N0j44J9J03O1j39mM0J8K9j5m7J6K4mNjl7l7Q0m4m8o7J04L3q9RN5O7
4829E3j0r3M6N4p4j1JR5r9L6P6l4p9K7N9l0q5O7J4o4RJ06J6j14Q7J1l5p5L1J34
$$ plain form
4859 119 9 -69 -30 41 -17 -25 -36 31 -46 -46 28 4 18 -66 15 21 39 14 -39 16 18 -44 -53 -2 31 -90 3 37 50 -14 -19 40
4891 40 -64 -128 -48 70 8 -91 -29 -19 -80 -2 91 -34 6 66 49 18 -26 47 83 -64 -23 34 87 -20 -45 56 2
4918 2 -1 21 78 -52 -46 -9 -22 18 27 8 -5 -68 9 -17 -18 10 27 6 0 48 18 -84 29 26 40 -57 25 61 -27 -35 55 82 -8
4951 -8 11 63 18 -84 16 67 16 -59 49 41 -42 -69 -12 70 -26 -34 29 -35 -66 -32 39 6 -61 -34 75 -17 19 69 19 -109
4981 -109 -11 56 11 18 12 -18 -19 -7 25 -52 50 -2 -39 8 19 42 -24 27 53 23 13 7 70 17 -36 -22 43 -21 -49 26 100
5012 100 -6 -46 85 8 -85 21 2 -78 -38 -18 55 -51 -29 51 23 -49 -42 30 5 17 37 27 32 -19 53 -35 -11 -16 -1
5041 -1 27 -41 13 40 2 -18 -18 -43 -2 38 10 -23 11 24 4 -66 15 9 33 23 5 36 -74 1 79 -10 -39 31 62 83 -55
5072 -55 38 1 -2 -43 29 -5 -58 22 30 -22 -78 -17 -25 -44 -60 -2 31 5 -13 -10 3 -38 -39 21 -40 -29 41 20 7 39 14 -8 -6
$$ packed form
4859A19j10p8L9P1n8qj1O7p7%P4k4J4q4Q1OJ8k5n3N5Ko2rN1L3j21R3L4J3o4nN9
4891D0j04o4Q0J18o2r9O2J0o1P8R3j25M0O0j7l1m4P3L6j47M1N7N3j07k5J01n4
4918BlK2N7j30OL7j3M0Rj9j3o3P7k6jK8J7k1oM8l0j02J13lJ4r7Q2L6q8qR0K7r0
4951hJ9N2m5j02J00N1n1p5J08qq3k7N7Q2r6qO3o4l1L4P1l3o7K7J09r2L6N0n0j28
4981a09R8O7m5Pol0jJ2L2p7J02n2l7M7J1K3o6N1K6l0j0oO3n3n3J4O5o4k8P5P4
5012A00j06m0J31p7r3J06j9q0M0K0P3j06K2Q0k8p2PP2k5J2K0j0Nn1P2q8K4nJ5
5041aK8o8N4K7l8k0%k5M1M0k8l3L4J3k0p0Q1oK4j0j8L1j10P5P8q9k9P0L1K1j38
5072e5R3l7lm1P2l4n3Q0Qn2n6O1qj9j6N8L3k6j8LJ3m1jO0o1J1P0k1j3L2k5k2K
$$ plain form
5105 -6 -16 41 15 90 48 -5 -45 33 -17 -26 -4 9 -1 16 28 25 33 -82 59 20 -48 -9 75 -39 -76 -60 23 -51 -48 -32 17
5136 17 -42 -25 22 1 -69 -25 6 -71 -41 -5 48 -42 -64 18 39 -10 -16 -7 36 -23 -14 51 -15 -15 17 -13 -33 -4 -10 -4 -4 17 49 -12
5170 -12 -3 75 -39 6 86 4 -3 36 17 20 10 26 22 -20 -24 65 35 -62 -11 13 -17 -118 38 -6 -33 -130 -20 63 12 30 13
5201 13 32 -60 -4 82 -58 -38 28 -12 31 -30 -27 21 -8 -59 1 41 -20 54 -20 3 -96 17 -5 52 8 29 -37 17 -2 -7
5231 -7 -10 6 12 -43 -32 56 32 -57 31 83 -28 -31 18 65 7 45 12 67 -30 7 31 3 19 -44 13 -1 -6 36 29 -88 -34 98
5263 98 -16 -2 -54 24 60 5 -28 37 33 -29 -6 45 8 -28 35 -26 -14 88 51 -30 -23 25 37 38 85 -9 -39 -16 7 -42 -14
5294 -14 54 47 -40 -2 -6 20 -9 -37 72 -86 -14 19 34 -26 26 50 51 -74 -48 0 26 39 54 20 23 4 46 78 -56 67
5324 67 71 -10 -18 -5 68 57 -45 52 -17 17 -2 19 -34 -51 11 -29 9 -63 39 -37 -27 -1 37 -1 5 46 41 -18 -48 3 -46
$$ packed form
5105fj0N7k6P5m2n3m0P8n0rK2J3j0J7J2lQj15J41l9o8L9Q4j14l7J6Q3p4LJ6M9
5136A7n9J7M7k1p0M4L1p7L0L6N3r0k2Q2K1m9oRM3n9RO5o6%L2l0k0K9oO%K1L2o1
5170a2RP8j14M5Q0q2pL9j9Lj0J6mm2mQ9l0r7N1K4l0j01J56m4k7r7J10Q3n1J8j7
5201A3J9r2N6Q6j40K0O6m0M3o1LM8k9n1O0M0o1P4p4K3r9J13k2N7m4K1o6N4j9n
5231glJ6On5J1Q8k4q9Q8N2j11lM9M7n8L8l3N5r7L7K4k8J6o3N7j4nM2pj17N4J32
5263I8j14J4n2P8L6n5l3O5mo2K3N1l7l6O3o1J2J02l7q1PM8J2JM7r4l0K3K3m9K8
5294a4O8pq7L8mK6k9k8J09j58P2L3J5o0N2K4Jj25K6M8K6J3J5l4Lj9M2L2j34J23
5324F7Mq1qJ3P3j1j02R7o9L4j9K1n3j7O2m0L8p2J02p6J0K6L8l8OM1nn9l0N1m9
$$ plain form
5355 -46 -40 9 16 42 5 27 -28 28 45 -1 14 -30 18 58 -14 13 47 55 20 0 9 18 -34 0 49 20 -50 37 23 -36 -1 -11 44
5388 44 24 -30 59 15 62 -13 27 25 21 22 -34 -46 -12 -11 16 6 0 -15 20 16 4 25 11 18 14 -42 63 13 -23 9 29 41 -65
5421 -65 -33 60 -8 -62 45 35 -40 30 18 -28 30 9 31 64 -12 -1 39 12 -36 -21 44 -8 -26 -6 37 -51 -51 -54 26 -40 -26
5452 -26 41 30 41 32 -67 11 72 -13 -8 -54 8 77 6 53 38 -8 -44 -14 27 4 4 -2 -16 12 -12 -16 -12 25 72 47 -22 -67 22
5485 22 50 5 6 24 -10 -20 1 53 32 -15 18 11 -37 -17 -10 2 18 22 -7 15 -65 2 20 5 12 -30 16 27 36 30 1 -72 -22 30
5519 30 32 1 -24 -43 -9 34 -20 -40 15 17 -66 37 -24 -4 8 36 28 15 -14 -68 27 28 1 -21 36 3 -27 9 -12 -27 -12 -39
5551 -39 30 -43 -42 37 6 -11 -10 -58 31 15 18 15 -20 86 -15 -19 37 -9 -9 65 -10 28 28 50 45 25 -19 4 35 36 -43 -31 2 1
5585 1 22 6 -19 -8 36 42 47 -10 8 35 -34 -57 52 11 -80 -21 2 -29 -68 34 54 -56 -13 -2 72 -43 -53 -7 13 -7
$$ packed form
5355d6OM9PK6l7K2n5N6J7m6J5m4M8M0p2K7L4Ql5k0RRn2L4M9k9p0Q7j4n9L5j0N5
5388D4k0n4Q9m4M7p5M0kmJn6j2L4JK7j0oj5L5mj2K1j4Pmn6J05n0l6L2K0J2j06
5421f5L2R3o8n4J07j0p5P0j2m6N8k1K2L3p6J1M0k7m8J5O5n2j8K0M3q8%lQ0o6J4
5452b6O7j1J1rr9P8O1q5Nm6O2O9p1M7j5m6l6L0M1k3%oj4K8k4mML7M7k5o9m5Q9
5485B2K8m5JJ8l4j0K1N2k1m7L3pm8K0PJ2J6Mk9K2q0O7J8j5Pm2M6J1Rok9p3N0N2
5519C0Kl1k5j9L4M3n4k0N5Kq3J03o1K0J2K8qj3k9n4R5Jk7k2N7l3l0L6k1j5J5k7
5551c9O9p3JP9l1j7Jm8Q9j6Lll5J06j01mN6m6%P4p5L8%K2nk0m4K3L1Jp9J2L3j
5585AK1j6k5J1M4ONn7J8K7o9k3J09m1r1N9K3l1l9J02K0j10M3J1P4j15j0M6K0k0
$$ plain form
5615 -7 44 -24 6 75 -19 40 8 -1 92 -29 41 49 20 -31 71 43 -10 -25 43 -3 -5 15 1 -10 -15 39 -3 13 -55 -38 38 -29
5647 -29 -5 -2 19 0 0 47 -6 4 -11 47 -102 3 32 57 39 -17 29 -50 -21 -37 44 -50 -21 22 55 45 -30 21 18 28 -1
5678 -1 71 70 23 -17 34 9 -12 20 19 -49 -8 81 64 -2 6 21 34 83 -63 -45 -41 17 69 -22 -9 -10 -1 -13 52 -27 43 9 26
5711 26 -45 -93 -23 -21 -52 -43 30 28 -22 -57 -15 39 -13 10 37 14 12 29 -15 8 -35 10 -16 -31 41 -38 9 -43 21 50 69 58
5743 58 36 6 33 44 6 8 48 -16 -16 34 -24 18 -25 4 -11 -41 -22 4 13 31 15 21 21 -20 -9 0 -25 -21 2 60 38 -32 -45 22
5777 22 -33 -39 -30 -68 46 -42 50 22 34 -36 5 2 15 27 46 -29 17 25 43 16 -35 1 -68 36 46 14 30 39 -1 -31 20 -36
5809 -36 -55 10 -6 8 -5 -40 10 27 -27 -5 4 33 -100 -20 31 57 -69 6 11 -18 25 27 15 -34 -2 67 10 -26 -25 0 29
5840 29 -13 -26 20 28 23 35 3 -29 58 -5 50 23 43 22 -16 -54 27 56 66 -6 -14 -8 -33 -38 69 -54 -25 26 31 -75 8 -42
$$ packed form
5615gN1o8L0O9r4N9l2rR3j21P0Qk9n1J02k8n3j5O8m6kK0j4j1nN4m2J6o8J7P6o7
5647b9K4LK1j9%M7n3J0j5N8j49J05K9K5j8n6M6p9K9j6Q1r4K9M3L3j0p5N1lJ0k9
5678aP2jm7m0N1k5k1L2jo8M1Q9j7o6QJ5J3M9j46J8MN8N2r1J3jRj2O5p9P0l4J7
5711B6p1m8P0Kl1RP3kn0l5M2N4n2K3K7k3kJ7m4K3m3M5k6j5P2p9M7n2O4K9J9j1
5743E8k2l0K7J1l8KM0o4%N0n8M2m3K9j5l0J9K6RJ8j6O%m1J1Rk5MK3N8k2p0j3O7
5777B2n5oRl8J14q8R2k8J2p0M1lJ3J2J9p5M6QJ8k7n1L6o9J04J0l2J6Rm0l0N1n6
5809c6j9O5j6J4j3l5N0J7n4K2RK9j33Q0N1K6j26P5Nk9M3Kj2m9L2O9n7l6JK5K9
5840B9m2j3M6QnJ2l2l2Q7o3N5k7K0k1l8l8Q1K9J0p2qOk5nJ07j23K9N1Nj06Q3n0
$$ plain form
5872 -42 44 12 60 77 9 15 -8 11 -42 -12 14 34 39 82 64 -27 15 23 -40 26 25 -36 -7 -71 -14 29 -4 -45 21 29 -10 1 20
5905 20 28 -6 36 -2 27 -23 -28 43 -16 -16 -53 11 14 16 40 -32 -11 26 38 39 -83 -4 -15 -13 -65 5 22 24 -5 -79 26 44 -43
5938 -43 -21 28 -5 78 29 37 -44 37 6 -11 -35 -37 -5 70 32 -16 -2 21 74 40 1 38 -7 12 47 66 -7 28 -19 5 -1 -17
5970 -17 -34 4 76 -67 13 -41 1 45 5 -32 -18 3 40 -14 0 32 -26 22 35 11 49 50 -16 18 0 -26 -41 -13 80 -17
6000 -17 22 18 92 13 7 -12 18 -5 -31 58 -8 17 -1 77 7 -56 -54 80 -8 -16 3 -13 -11 -17 -26 5 42 -11 33 -2 -79 39 -7
6033 -7 39 -33 20 32 -21 -40 38 15 7 -9 -69 95 51 43 4 37 63 -8 -67 21 18 -4 29 -24 27 -13 32 66 1 -37 8 23
6065 23 21 10 51 22 25 0 27 -53 -29 3 21 -27 -15 35 19 43 -25 46 -15 -49 -13 -24 -2 -39 14 47 -24 35 -30 -48 -68
6096 -68 30 -6 -96 -47 21 -55 44 6 -8 21 49 6 4 -4 -61 32 -45 6 26 -31 -6 -17 32 -51 -65 -11 -3 -14 -39 1 96 9
$$ packed form
5872d2Q6l2M8J7o8Ok3J9n3L0K6K0NM3j8r1M2Qo3O6jo1K9o4N7M3l3m1O6Ql9J1J9
5905B0Ql4M2l8K9n0nP1n9%l7O4LKK4p2K1L7J2Jj22P9j1Kn2P0J7Kk9p4J05J8q7
5938d3K2M9l3Q3m9Qq1Q1l1j7k4kL2P5l8m8J4K3N3l4l9L7m5J9L5J9p3L5m7K4oj6
5970a7j7L8P2j43Q0n4M2M4m0l7J4K1L7n4J4L2n8M8J3k4L8Jo6L4j8k6j5K8R3r7
6000a7L9mP4p9oj9L0k3k6Q9o6K5j8P8p0o3KJ34q8qJ9j6KorL1L7n3M4l5p7J18m6
6033gM6p2N3J2n3j9P8k3qj6o0J64m4ql9L3K6p1n9Q8lk2L3n3N1m0M5L4o5l8M5J5
6065B3kj1M1k9Lk5K7q0K4L2J8m8J2N0j6K4o8P1o1l4L6j1K2l7N3L3p1N9o5j8k0
6096f8R8l6r0M9O8p6R9l8j4K9K8m3kqn7R3p7N1K0n7K5j1M9q3j4N4Qj1k5M0R5q7
$$ plain form
6128 9 -58 -31 73 -38 -14 8 8 -11 -29 106 1 27 -39 27 -33 -27 -11 14 -4 47 34 10 24 -48 11 -15 39 29 -37 -10
6158 -10 19 -22 -35 40 14 74 -67 -32 56 -26 31 14 14 -30 -19 -24 -13 -29 -6 -42 -40 -46 20 -57 -77 -12 7 -10 30 -51 32 8
6190 8 -44 20 -51 50 -15 70 50 31 27 33 -41 26 25 4 -8 53 15 43 32 3 19 -32 -20 -71 49 -34 -5 36 24 -77 -60
6221 -60 8 -36 33 73 -33 -49 6 -25 -3 -29 91 -25 -21 -5 -1 -28 8 50 -6 44 34 12 46 -51 -5 28 -15 -65 22 12
6251 12 31 -13 72 42 80 -25 42 34 3 64 4 30 27 57 3 24 -48 16 -36 19 -22 -4 -60 61 -13 2 -5 -20 -53 -42 30
6282 30 44 1 -2 -8 -6 10 -14 30 5 -47 -34 4 -23 -24 -39 -12 31 -3 6 33 0 23 24 31 -22 20 25 41 -34 87 64 73 -62 -46
6316 -46 2 -34 -51 32 5 -38 40 22 10 -53 -15 52 -4 54 -27 -10 -18 -8 -37 19 -38 23 30 -70 -1 -30 -25 -43 -46 -61 -23 33
6348 33 74 -70 -18 57 -20 -13 -7 60 -31 -20 -16 -17 24 99 -9 20 109 -3 39 25 16 32 30 73 8 24 70 20 -2 22 -14 -25
$$ packed form
6128Io7K7J04j11K4K2%j9j8J35j05K6o6O6o0OJ6K5j8N1j3k4J4p2N9k6N4j0o6K7
6158a0K9m1j3P5k6O0j41L5Q8q2N7j7%m4J1nJ1j6K3l6KoO6p7k0O5J9j7M0q1Q3k4
6190Hn2O4p1J01o5Q5k0j9mOp4O7jk1j2O1l8K8j1k9J6n1J2n1J20q3K9M1j2j01J7
6221f0O8m4O9M0j06j6N5l1K2k6J20j16MJ6Mk7L6M2n6N0j0k2L4r7M6L3m3n0Q7j0
6251A2J9m4Q5l0L8j05O7ql1O1o0K6lL0n4K1p2O4n2N5m1J8n6J21p4J5pj5l3J1P2
6282C0J4m3loKJ6k4M4k5n2J3L8k7jj5K7M3l4RK7l3K3JPn3M2NJ6p5J21k3Rj35J6
6316d6M8l6j7Q3k7m3P8j8j2o3L8O7n6N8q1J7qJ0k9N6n7O1Pj00O9k9Nj8lj5L8N6
6348C3M1j44N2P5p7POO7r1J1MjM1P5j08K9Q9j12M2j4rJ6kM3o5J6M6n0k2K4l6j1
$$ plain form
6380 -25 -5 -10 -46 -47 5 -5 -50 13 -8 -18 -5 -18 -1 -57 -15 26 -18 -29 -10 59 -37 -11 22 -31 -18 -17 13 46 -2 20 0 -57
6412 -57 -20 51 -27 -21 53 17 48 -47 -47 56 -19 -25 -11 -57 34 14 0 29 -7 -20 -36 35 14 35 51 20 -16 -18 43 -58 -97
6443 -97 22 16 12 -51 10 -8 35 -10 -14 33 9 13 -59 -21 81 35 -21 -38 14 -33 -33 49 14 5 33 1 40 -9 36 80 -45 -19
6475 -19 13 5 -30 41 -12 -40 5 -32 -27 49 -32 0 -36 32 11 -3 28 -18 -64 16 26 -40 -4 38 -45 19 0 10 -44 30 37 20
6507 20 27 15 -26 -31 44 -5 14 9 -5 -1 35 -8 0 -28 5 -10 2 0 19 85 -45 17 39 -12 -35 -14 42 29 -28 21 -51 -38 -75
6540 -75 -23 -30 -34 -55 -52 6 -22 19 53 -15 -1 -9 22 35 -24 -57 12 -39 -38 -61 52 -34 42 -37 0 -20 -12 54 22 66 38 -28 -13
6573 -13 13 11 46 -66 56 -45 -49 26 26 -30 -35 26 36 -24 -12 -18 -25 -7 42 -66 -25 -88 -20 -13 -48 5 -13 6 -66 -2 8 26
6605 26 -73 8 -22 31 -6 8 19 -7 35 -18 -22 -17 27 -32 -15 39 4 47 -21 -42 -53 72 -22 -1 -20 -58 21 13 -33 -40 -3 36
$$ packed form
6380b5K0nl6jN2j0m5O3k1j0J3j3J7n6M2M1m4j1J9O9r6K6L3n3J3JL0L3m8K2k0n7
6412e7L7P1p8OP4l6L1r5%J03p5oJ4m6R1k0j4K9l6j3j6P1k1K1J6l1l6kO1j01l9
6443i7J19omo3O1j8M3m5mM7k4Mp2L8J02m6n6j7N2m7%Q2l5rK8l2L9m9M5M4j25K6
6475a9L2ql5P1n3k8M5l7NP6q1L2l6O8k1j4L1m6m6Q0J0o6L6M2q3O4j9J0n4P4Pj7
6507B0Pj2m1nP5m9J9nj4ML6m3Qk8L3j5J2kJ9O6j30O2K2n1k3K1N6j3n7M9p2J3l7
6540g5N2pmk1LN8k8M1L4o8J4qL1J3n9l3O9n1Jk3J13q6P6p9L7k0QO6l2M4k8o6J5
6573a3K6kL5j12J22j01mP5%n6nO1J0o0J2opJ8M9j08M1o3O8Pl5N3j8J9p2O4J0J8
6605B6r9Q1l0N3l7J4J1k6M2n3mNM4n9J7N4l5M3o8k1j1J25r4K1j9l8P9qm6pL7L9
$$ plain form
6637 36 5 -2 39 13 -44 56 103 -56 -31 10 61 -37 4 7 -17 -23 -26 0 -40 -12 60 -35 25 30 10 40 31 -17 31 -95 24
6668 24 13 33 52 -31 9 2 -47 -7 46 35 -5 -70 -38 37 -48 -53 -34 -11 14 64 -21 -32 -63 4 -25 35 88 17 8 15 14 -22 13
6701 13 5 -20 -78 29 -6 -25 -25 -18 34 44 -45 -6 68 -19 -2 8 17 -21 38 10 -56 -38 14 50 53 36 7 26 -37 -24 24 11
6733 11 34 24 0 61 -21 10 9 -8 26 36 -4 20 -10 -3 -21 -72 3 -3 40 12 22 46 -53 -25 -44 -47 23 49 29 -13 20 6
6765 6 -29 -9 -36 19 -10 -8 5 11 -3 -3 -17 -20 -2 51 29 -5 45 -10 42 -56 -6 12 -3 -3 -23 -1 -42 -28 -36 -44 33 15 -19 -56
6799 -56 -31 33 -33 -48 28 19 -30 -5 49 -18 -8 70 11 11 30 58 43 16 24 -38 -44 -23 14 1 49 -30 58 67 -43 -59 60 -8
6831 -8 32 83 -3 -29 38 27 9 -11 -32 -7 30 -4 -29 -7 -22 -6 18 32 11 3 -15 -23 -29 11 -33 -23 2 9 15 -41 -53 -39 -7
6864 -7 -19 25 -19 -10 8 87 25 -42 -18 16 45 -37 -50 0 -32 26 19 -6 -49 35 15 -44 -52 21 14 -31 -16 24 -1 -32 41 -8 -10
$$ packed form
6637C6l1pM1k6n7J00M7j59K5M1N1r8M1Lk4olK6m0K8P2r5O0Nk0L0rm8M8j26J19
6668B4j1K0J9q3M0pm9M0N3j1m0o5L2P5q5nJ9K3K5N0q5j1l1O7k9O0N3p1rPjl6L5
6701A3qk5n8J07l5j9%PN2J0q9L9P4q7J7J0Rl8N9k8o6J8N2L6Lj7k9J9o3J3M8j3
6733A1K3j0k4O1q2L1jj7L4J0m0K4l0Pj8n1P5oM3k8J0K4r9K8j9lP0K6k0m2L3j4
6765Fl5K0k7N5k9KJ3Oj4%j4lJ8N3k2l4N0n5N2r8N0J8j5%k0K2m1J4qqP7j8l4l7
6799e6K5O4o6j5P6rm9K5N4o7J0P8n9%J9K8j5k7Qo2oK1L7j3M8p9Q8Rj10j6J19o8
6831hM0N1q6k6O7j1j8k0k1K5L7l4k5K2j5J6K4J4k1qj8qoM0m4J0K5POn6j2J4L2
6864gj2M4m4RJ8P9o2o7K4L4K9q2j3N0l2N8pk5m3Q4k0n9qP3pm5J5M0k5l1P3m9k
$$ plain form
6897 -10 23 -12 -3 -36 10 -3 8 -14 43 -31 -85 -15 11 -6 12 21 18 45 -42 19 52 -28 26 -3 22 8 -31 10 -56 75 -38
6928 -38 34 -6 17 -9 7 39 53 7 -29 12 -29 -4 26 -7 98 46 -7 33 23 -49 11 14 32 3 -4 48 -18 -35 33 -40 18
6959 18 -49 -21 -31 19 6 42 -9 4 -35 37 -6 0 -15 -28 21 -23 -16 7 39 15 30 6 25 -11 37 -11 -2 -30 -9 24 -4 33
6991 33 30 54 8 -32 -38 -33 31 6 12 30 -7 -7 32 -14 -67 -38 -9 11 -10 -21 -2 -18 -15 18 -18 49 23 18 16 27 -51 -18 3 -11
7025 -11 28 -35 39 -35 8 -41 4 13 42 9 -62 -10 17 -21 -43 27 36 -16 29 -16 -34 -26 -36 22 20 10 -18 -16 10 39 -64 -19
7057 -19 -35 25 -21 0 26 23 17 -7 -35 -14 12 61 -4 -20 10 -22 -17 -18 -11 48 -19 21 63 21 32 18 58 6 -52 -15 87 -66
7089 -66 16 -8 -20 1 -37 -29 26 -16 1 42 -40 0 -20 20 6 21 67 34 36 -20 59 13 3 -6 20 30 -28 14 24 -85 -50
7120 -50 -45 -1 -58 -36 -19 -5 36 -48 27 1 30 -46 22 -24 50 19 33 22 31 60 6 19 32 43 15 8 4 54 35 -9 35 5
$$ packed form
6897a0L3l5Rl3M6j3J1k2N7p4n4P0K6j7J8RlK7q7O1L3q0N4k9K5j4l9M1o6J31j13
6928c8P2m0K3k6J6L2J4m6l6M1m1K5L0l3J05n2n3M0j0p2O0LJ8k9pN2o6j7O8p3N8
6959A8o7K8j0N0j3L6n1J3l9P2m3Oj5j3M9m4PK3L2k4J5k4J9l6M8m8Rk8K1L3k8L7
6991C3lK4m6m0oNO4k5OJ8l7%L9m6n3K9K9K0k1j1J9j6LL3l6O7k6nkJ1p8L3K1j4
7025a1L9o3P4p4M3m9M5RK9l3p1N2K7l8k2P0Rn2M5m5j8Qj0N8kj0k8KK6K9j03M5
7057a9j6O0m6K1K6lok4k8K1K6M9o5j6L0l2NjPN9o7M0M2m2J1j4M0n2n8L7J02j53
7089f6Q2k4j2K1l8QN5m2J7M1q2M0k0M0j4J5M6l3Kn6P9m6j0rK6J0n8M2J0j09L5
7120e0NM4n7K2J7J4M1q4P5k6K9p6O8m6P4l1J4j1RK9n4J3J3J1k8pmN0j9m4M4l0
$$ plain form
7152 5 -7 5 -72 -54 1 51 10 26 46 9 8 -32 52 17 -15 -6 -32 -5 -4 -30 -4 -9 -32 91 7 26 -23 1 -52 -31 50 22
7184 22 -38 9 -28 -20 -18 2 45 -5 -12 -1 58 49 4 30 40 -10 53 15 -8 30 35 4 8 14 -13 37 24 71 17 7 22 22 -44 -24
7218 -24 10 -23 -25 -40 9 8 7 -24 88 -7 -55 55 17 -24 -21 -47 10 3 27 -35 7 -14 11 19 -3 28 31 -20 7 35 26 24 -19 22
7252 22 3 16 28 -3 26 8 53 19 -20 11 40 18 -47 8 31 15 32 19 -8 -62 -75 0 -17 33 -32 40 -8 -35 -4 -1 4
7283 4 -2 28 -41 47 28 -81 -68 2 67 10 -44 -42 87 83 39 -10 -14 24 -43 8 24 8 -35 32 37 -9 -38 3 47 -36 31 -7
7315 -7 10 -12 -10 -8 16 21 1 22 -32 -69 47 -44 32 24 -32 52 -1 -23 3 -3 -4 -46 9 -7 37 0 -19 26 2 16 -47 -18 -23 -92
7349 -92 -24 61 17 18 62 73 -46 31 22 -7 23 18 0 -83 -23 -27 18 -4 -34 39 -20 -82 -26 27 -34 27 -19 -36 -11 -17 29 -14
7381 -14 2 -24 -19 -10 -40 0 -6 31 5 57 -14 0 10 8 3 -49 -8 61 -15 -51 46 24 2 -20 -7 -22 -58 -54 -23 4 -57 -17 -49
$$ packed form
7152Ej2J2p7J8N5N0m1J6K0l7jm0Q4l5l2Rk6K7Jk6K6nk3J23q4J9m9K4n3K1Q1k8
7184B2o0M7l7QKK0M3n0pJ1N9rm5K6J0n0O3l8k3L8Nl1MOk7N0j3M7n4j0J5%o6K0
7218b4L4l3kj5M9jjl1J12r5m8J10l8m1Lk6N7pK4o2M2k1K5Qk2L1Ln1K7K8rkm3M1
7252B2j9J3J2l1K9j8M5l4l9L1K9k2o5N5K3j6J7j3k7n4j3P5j7N0o5P2m8k7L1LN
7283DoL0o9Q8j9j09J3P0O5n7n4KJ29mm4m9mL8o7N1J6j6m3O7Nm6k9M1M4q3O7l8
7315gJ7k2KKK4Nk0K1n4l7J16r1P6qn6Q4n3k2K6ojm2N5j6M4l7j9M5k4J4o3K9no9
7349i2O8Q5m4JM4J1j19P7rk9L0nj8q3O0mM5k2l0P3n9o2N6N3o1O1m6j7K5oM6m3
7381a4J6k6NRl0M0oL7k6N2p1J4J0knn2M1O9p6l6R7k2k2k2J3j5l6ML1K7o1M0l2
$$ plain form
7414 -49 30 11 -27 1 -29 -2 -25 4 -40 18 -16 -22 -6 -42 -9 37 -44 -19 -45 -64 -20 -20 -10 -44 -19 9 42 5 10 -1 56 69
7446 69 -28 -59 29 -15 24 45 30 34 -8 10 15 -17 -11 54 2 2 -13 23 -63 -39 26 55 -44 -8 31 0 -23 -22 -23 8 -17 31 -25
7479 -25 -17 -51 -44 -35 -60 -25 15 -39 -22 -10 0 -14 -26 53 -27 -2 42 8 24 33 42 -41 21 -13 -25 -25 -24 -4 21 -5 17 -13 4 -21
7513 -21 7 -17 12 -13 30 31 -27 50 -11 -10 -76 -14 3 36 -32 44 70 -87 33 1 14 -26 30 13 -10 11 -96 -13 -2 34
7543 34 1 22 -29 8 -21 -37 23 -61 16 -31 45 -2 8 -17 -22 21 -1 0 -11 -28 8 -10 17 -13 -77 -14 -1 15 35 27 43 -18
7575 -18 -51 -26 -16 -10 -2 -33 -47 49 32 -6 -17 -8 -20 33 40 2 7 -22 -6 13 -1 -10 17 29 -5 -12 23 9 34 -3 12 22 18 -18
7609 -18 26 12 -46 35 22 -37 -5 -21 -37 -24 -19 -37 -3 -1 10 31 -70 -2 12 26 17 -8 -25 -67 19 -10 -2 37 -18 -20 -52 -34
7641 -34 -4 33 -1 15 31 20 23 -11 -34 46 29 -14 -15 -65 -43 39 25 0 45 -3 55 -9 -42 15 -24 25 7 -20 24 -58 -29
$$ packed form
7414d9P9j9l8K8l0K7k3K9m4N8l4oJ6l6L3M6q1K5k6j9M4%J0l4K5K8L3l7Nj1N7J3
7446F9r7l1Q8m4L9K1j5Mm2J8Nl2OO5n2%j5L6q6K4O5K9r9L6L9l1k3JjL1k5M8n6
7479b5Ql4PRk5L5M0n4J7J2J0j4j2P9q0K5M4l4J6RRq3O2l4j2%JK0K5k6K2l0J7k5
7513b1K8k4K9k5M3Jn8P7o1Jo6O2J7L3o8P6K6j57J20l2J3m0N6j7k3K1j07Q3J1L6
7543C4l3K1n1L7k9j6O0q4P7m7P6m7J0k5nM3k2Jj1j7L6j8K7l0o4O3J3J6K0qJ6o1
7575a8l3K5J0OQl1j4R6j7l8j1Rj2N3Pl8Nk9J6J9j4rK7J2l4pL5j4K5l7J5J0ml6
7609a8M4j4n8Q1j3n9L2j6j6J3Nj8L4KJ1K1j01O8J4J4rk5j7m2Q6k9QL9n5kl2J8
7641c4L0L7l4J6J6j1Ll4k3Q0j7m3jn0K2Q2j4k5M5m8N8o4l3N7l9M9j8k7M4q2K9
$$ plain form
7672 -29 9 5 35 -8 -12 -35 -86 51 5 26 24 -9 -24 18 -24 87 4 -9 -15 -51 27 -60 -6 16 32 -45 -76 1 -41 40 -56
7703 -56 39 -2 -39 -21 -12 45 -60 2 -19 27 8 14 35 9 33 -13 -30 50 41 37 -54 -13 33 5 -29 -16 -38 -30 5 -30 1 -55
7735 -55 -43 -80 -5 -15 50 -68 5 -1 56 14 -13 -4 -19 -5 7 18 -18 44 -27 50 -61 -70 6 0 -7 -40 -29 30 24 -29 9 15 -8
7768 -8 -1 21 39 45 33 56 31 -10 52 -7 21 18 3 -13 -28 -11 -76 8 58 -2 -28 -16 18 4 9 -20 17 15 27 43 15 -37 -55
7801 -55 -23 30 -28 58 25 -30 -50 -11 -19 -26 38 -18 -34 1 -57 6 -10 47 -116 10 12 25 -18 -7 -7 -23 60 -3 -4 23 22 11
7833 11 16 -41 42 -44 10 -23 -27 -6 23 72 -12 -11 40 32 -53 26 16 -3 27 -4 9 18 38 32 -5 -8 -11 27 -13 -29 -20 -35 26 8 49
7868 49 -15 0 -7 2 -33 -15 -40 -12 -22 -10 -72 62 17 -10 31 -65 -37 17 15 -12 18 -10 14 17 6 -19 -10 41 12 34 11 26
7900 26 -10 10 -16 -22 28 19 -7 64 -5 -56 37 15 -31 6 45 -7 62 106 52 16 14 69 53 -46 -26 -4 10 31 -31 -31 -54 0
$$ packed form
7672b9L8mL0m3mk3n1J37m6K1kl3j5M2m2J11q3j3ol6P8q7N4K2J6p7l1P7m2Q1r6
7703e6R5m1l7J8RN7j05O2k1M6j9OK1k6K4m6j7Q0rmr1M1M6k8l4J3k2QL5l5L1n6
7735e5J2l7P5j0O5j18P3oN7m2k7Rj5J4J2J1l6O2p1P7j11rP6opl3J1N9on3L8Ok3
7768hPK2J8Oj2K3k5m1O2n9K8lj5j6j5J7o5Q4N0o0k6J2L4j4Nk9L7kJ2J6k8n2j8
7801e5L2N3n8Q6l3n5k0L9qpO4n6j6L5n8O3j6N7j63J26KJ3m3J1%j6Q3o3jK7jj1
7833A1Nn7Q3q6N4l3mK1K9M9q4JN1qq5P9j0j9L0l1J3RK0ol7llL8m0j6Rj5O1j8M1
7868D9o4J5pRl5J8k5K8j0J2o2J34m5k7M1r6K8N4kk7L0k8K4Lj1k5RN1k9K2k3J5
7900B6l6K0k6oN0rk6P1o9n1R3k2m6L7L9n2O9M4n4l6kN5j6r9K0K2J4K1o2%k3N4
$$ plain form
7932 0 -23 -64 -32 -11 31 -16 -1 43 -5 -11 -33 32 -14 -36 -38 7 43 -56 39 20 -50 10 16 15 -55 -20 2 -33 -1 -36 12 -38 66
7965 66 17 2 -20 26 40 -27 -2 31 23 34 -8 20 17 -32 75 -28 -43 -11 78 -10 -40 -72 -10 50 10 38 41 -20 3 -25 44
7996 44 -17 0 41 44 -54 -6 31 -22 -54 20 -11 -39 36 -4 -48 -8 53 9 8 26 -25 32 -8 0 20 4 32 24 56 44 55 13
8028 13 -30 1 -15 3 24 30 24 3 14 -38 40 -37 5 -4 -5 50 -24 28 -27 5 1 -45 -11 26 -16 4 -13 12 13 -33 1 38 11
8061 11 -43 27 10 39 37 22 30 43 12 -34 3 -1 -82 -33 2 0 -29 -12 6 -23 -13 46 -34 39 1 -11 -20 -8 -13 8 -13 -18 38 -19
8095 -19 -76 -64 -16 -18 -10 -8 20 -8 43 15 -69 -2 1 37 24 -7 -20 19 -11 22 17 -31 16 -63 -6 -25 -11 -13 -63 -10 22 60 -49
8128 -49 -37 31 -7 18 70 50 57 -28 -57 -6 14 -49 24 43 -32 -6 -29 24 -17 -64 1 -5 13 44 -67 15 -4 39 -10 -33 5
8159 5 -41 -43 23 55 27 -57 47 2 33 -47 4 -18 -16 33 -18 -5 -6 18 12 4 6 15 29 44 16 38 8 7 35 42 64 -4
$$ packed form
7932@k3m1L2K1M2m7J5M4m8ok2O5m6k2kM5L6r9R5j9p0O0Ojp0L5K2l5L2l5M8n0J04
7965F6m9j5k2M6J4o7K5L3qJ1m2K8lm9J07j03j5L2Q9q8l0l2O2O0m0K8Lo1K3k8O9
7996D4o1J7M1Lr8M8L7n3l2P4l1k8P5m0m4M0O1m4jJ8n1N7m0QK0j6K8qL2j2J1m2
8028A3m3L1j6J8K1Ook1J1n2P8p7M2rjN5p4N2n5L2mm6L4L7m2K0j7K5Jm6L4L7k7
8061A1n4P0j7K9kj5QJ3l1m6L7mq1M9L5kk9J7J8k9J0N9q0P3l8j2rJ2nK1k1nN6n7
8095a9n7J2M8kQKK8k8N1k8q4O7LL6j3l1j3L9l0L3nm8M7p9N7j9J4kn0N3L2L8j09
8128d9J2O8l8K5N2k0Pq5k9N1K0o3P3J9p5K6k3N3m1m7O5oJ8L1j11Q2j9M3m9k3L8
8159Em6kO6L2k8q4J04m5L1q0N1k2KM9n1J3jK4oqKRJ4J5k8K2l0jK8PK2o8
8191d
$$ Imaginary data points
##PAGE= N=2
##DATA TABLE= (X++(I..I)), XYDATA
$$ plain form
0 0 0 0 0 0 0 0 16 -16 0 -16 32 -32 32 -48 64 -80 96 -112 144 -176 192 -229 280 -336 384 -448 520 -608
28 -608 688 -787 905 -1033 1169 -1320 1493 -1682 1881 -2104 2352 -2625 2919 -3236 3589 -3979
44 -3979 4397 -4851 5351 -5907 6506 -7161 7890 -8699 9590 -10585 11701 -12969 14413
57 14413 -16074 18015 -20321 23106 -26539 30913 -36695 44710 -56573 75962 -113023 208608
69 208608 -952046 -1547830 1781611 1253741 -1682710 -1197507 1739691 912493 -1643508
78 -1643508 -712030 1653228 422695 -1596875 -218185 1616443 2134 -1590053 118024
87 118024 1594275 -221558 -1539436 261885 1488320 -300098 -1377499 328417 1272361
96 1272361 -385376 -1139385 463729 1032537 -579162 -935073 710254 876960 -853027
$$ packed form
0@%%%%%%J6l2J6j6M8o4O4q0J12j44J76k08K56l20L68m21N09o16P20q32R68j128
28f08J296j475J692j938K202k489K813l175L563l985M456m977N544o155O825p568
44c979Q376r248J0202j1258J2413j3667J5051j6589J8289k0175K2286k4670K7382
57A4413l0487L4089l8336M3427m9645N7452o7608Q1405j01283J32535j88985L21631
69B08608j160654n95784L329441n27870k936451M85203K937198q27198k556001
78a643508R31478K365258j230533k019570J378690J834628j614309j592187J708077
87A18024J476251j815833j317878J801321J226435j788418j077401J705916R43944
96A272361j657737p54009J603114N68808j611699l55911J645327J66706j729987
$$ plain form
105 -853027 -834915 987749 818924 -1102198 -796292 1188558 760545 -1250980 -693475
114 -693475 1287396 585148 -1317942 -442103 1340883 266455 -1371227 -78214 1403154
123 1403154 -109753 -1437687 274859 1454821 -417031 -1455951 519239 1416798 -598052
132 -598052 -1344319 651334 1231437 -696269 -1091457 738864 935120 -787554 -782092 838297
142 838297 641887 -891029 -528056 936006 443199 -964130 -380264 974916 337080
151 337080 -959139 -292854 929986 245278 -887401 -179098 847790 97777 -814341
160 -814341 3067 800645 -108497 -798478 219527 813786 -318746 -829238 407785
169 407785 840121 -481234 -833604 541921 802352 -595047 -743849 646091 660297
$$ packed form
105h53027J8112J822664j68825j921122L05906J984850m28013k011525N57505
114f93475J980871p02248j903090Q75839J782986j074428j637682J293013J481368
123A403154j512907j327934J712546J179962j871852j038920J975190Q97559k014850
132e98052p46267J995653N80103j927706l95188J830321J96256j722674N462J620389
142H38297j96410j532916L62973J464062m92807j407329N83866J355180o37836
151C37080j296219O66285J222840o84708j132679P08303J026888p50013r12118
160h14341Q17408P97578r09142o89981J018005N94259j132532n10492J237023
169D07785M32336j321355l52370J375525K60431j397399j48802J389940J4206
$$ plain form
178 660297 -699671 -558482 756165 445531 -816959 -335886 870591 229798 -918617
187 -918617 -141396 943947 62322 -949687 2262 926588 -63630 -882986 120294
196 120294 818279 -182362 -747363 244283 672310 -311029 -606446 373832 550860 -430372
206 -430372 -507269 476645 474593 -508170 -445350 528048 416433 -536153 -379467 540620 335081
217 335081 -542308 -277283 551937 214875 -564515 -143354 587813 74881 -611754 -6245
227 -6245 637490 -54857 -654396 113014 661999 -165097 -652636 217437 629094 -268813
237 -268813 -589921 322569 539165 -378658 -482505 433119 421302 -486250 -362707 530026
247 530026 304322 -565777 -251425 586257 198173 -595759 -148735 589408 95152 -576814
$$ packed form
178F60297j359968J41189J314647l10634j262490M81073J206477o40793j148415
187i18617P77221J085343q81625j012009R51949R24326r90218q19356J003280
196A20294O97985j000641n65001R91646M28027r83339k95417R80278J77028r81232
206d30372p6897R83914k052r82763O2820R73398j11615r52586J56686R20087k05539
217C35081q77389K65025Q29220l37062p79390M21161P31167n12932o86635O05509
227f245O43735o92347n99539P67410N48985q27096m87539Q70073M11657q97907
237b68813l21108R12490K16596r17823j03847R15624j1817r07552J23543Q92733
247E30026k25704q70099L14352Q37682l88084p93932M47024P38143m94256o71966
$$ plain form
257 -576814 -43811 554363 -11819 -531908 64800 507526 -117740 -486577 165419 466930
267 466930 -208649 -449722 244797 431396 -275664 -411201 302032 387666 -324583 -357736
277 -357736 348208 325020 -370034 -285560 395390 245483 -418942 -201084 444406 158497
287 158497 -464887 -112928 483651 70199 -493244 -24372 498170 -19903 -493351 66543
297 66543 482693 -112702 -464731 159419 441582 -204917 -414555 247626 383998 -287177
307 -287177 -351914 320522 316278 -349979 -280870 371227 241475 -389432 -203652 399518 162007
318 162007 -408129 -122722 410564 80966 -412420 -42401 409435 2888 -406250 33086
328 33086 398910 -68999 -390517 102265 378843 -134443 -364928 165475 348833 -194837
$$ packed form
257e76814N33003N98174n66182n20089N96708M42726o25266l68837O51996L01511
267D66930o75579k41073O94519J86599p07060j35537P13233Q5634p12249l3153
277c57736P05944k3188o95054Q4474O80950j49907o64425K17858O45490k85909
287A58497o23384L51959N96579m13452n63443M68872N22542n18073m73448N59894
297F6543M16150n95395l52029O24150K82163o46499k09638O62181J36372o71175
307b87177o4737O72436m244o66257O9109O52097j29752o30907J85780O03170k37511
318A62007n70136K85407N33286l29598m93386L70019M51836m06547m09138M39336
328C3086L65824m67909l21518M92782K76578n13286k30485N30403J83358n43670
$$ plain form
338 -194837 -329398 224041 308687 -250506 -284064 277157 258976 -299724 -229171 322379 199655
349 199655 -339712 -165350 356554 131673 -367462 -94079 376978 57506 -380609 -18606
359 -18606 381951 -18825 -377938 56680 370606 -92873 -358827 127628 343379 -160647
369 -160647 -324798 190578 302107 -219165 -278245 243286 250609 -266366 -223218 284204 192655
380 192655 -301022 -163456 312424 131478 -323052 -101664 328363 69712 -332835 -39840
390 -39840 332861 8834 -331618 20499 326756 -50277 -320245 78879 311166 -106853
400 -106853 -299649 134477 286532 -160393 -270461 186374 253906 -209212 -233680 232160
410 232160 213687 -250830 -189439 269088 165503 -282440 -137437 294853 109437 -302514
$$ packed form
338a94837j34561N53439Q4646n59193l3558N61221j8181n58700P0553N51550j22724
349A99655n39367J74362N21904k24881m99135K73383M71057l19472m38115L62003
359a8606M00557m00776l59113M34618L13926m63479k65954M86455K15751n04026
369a60647j64151N15376J11529n21272n9080N21531P323n16975M3148N07422r1549
380A92655m93677J37566M75880j80946m54530K21388M30027k58651m02547K92995
390c9840L72701l24027l40452L52117L06257l77033k69968L99124K32287m18019
400a06853j92796M34126J52055m46925j10068M56835O7532m63118k4468M65840
410B32160j8473m64517O1391M58527j03585m47943J45003M32290j85416m11951
$$ plain form
420 -302514 -77950 309145 47066 -311483 -14170 312628 -17232 -310388 48288 305716
430 305716 -77413 -298014 104074 286820 -129026 -273015 150748 254822 -172009 -235247
440 -235247 190140 211698 -209032 -188932 224877 163700 -241493 -140970 254283 117042
450 117042 -266824 -95918 274434 73704 -280140 -52893 280973 29764 -279571 -5952
460 -5952 275202 -20128 -269269 47812 262911 -75869 -255461 104657 248767 -130685
470 -130685 -240112 155251 231231 -174877 -217786 192679 202417 -205353 -180697 217765 156717
481 156717 -226933 -127484 237462 98096 -246295 -67173 256093 39150 -263322 -13106
491 -13106 268664 -8965 -269538 28143 265505 -45529 -256498 61825 242279 -79966
$$ packed form
420c02514K24564L87095k62079l58549K97313L26798l29860k93156L58676K57428
430C05716l83129k20601M02088J82746m15846j43989M23763J04074m26831o3238
440b35247M25387K1558m20730K0100M13809o1177m05193J00523L95253j37241
450A17042l83866J70906L70352k00730l53844K27247L33866k51209l09335K73619
460e952K81154k95330k49141L17081K15099l38780j79592L60118J44110l79452
470a30685j09427L95363P5980m06108m2909M10465R738m07770K4656L98462o1048
481A56717l83650R9449L64946j39366l44391J79122L23266k16943l02472K50216
491a3106K81770k77629k60573K97681K37362l11034k10969L18323J80454l22245
$$ plain form
501 -79966 -225847 98657 206744 -120612 -189755 142141 172992 -165051 -160698 183972 148826
512 148826 -201159 -139672 211984 127915 -219591 -114780 221841 96012 -222723 -73405
522 -73405 222195 45775 -223094 -15795 225526 -14790 -229393 43914 234248 -68636
532 -68636 -236744 89765 236464 -104881 -229165 118246 216735 -128315 -196188 140458
542 140458 172220 -152523 -144068 168569 117878 -184478 -92947 201589 73774 -215015 -58195
553 -58195 224697 47264 -227357 -37613 223833 27145 -214755 -13873 201945 -4185
563 -4185 -189195 25854 177429 -51610 -170611 76987 166755 -102023 -167921 121236 168359
574 168359 -137006 -168765 145756 162992 -152257 -152293 155345 133094 -160429 -108845 167068
$$ packed form
501g9966j45881L24504J08087l27356o9143L31896L0851l38043M353L44670l5146
512A48826l49985O1487L51656q4069l47506J04811L36621j25829l18735J49318
522g3405K95600j76420k68869K07299K41321k40316k14603K73307J90334l02884
532f8636j68108L26509J46699l41345j24284L47411R8489l45050o7873L36646
542A40458L1762l24743Q455L12637n0691l02356R1531K94536j27815k88789J56820
553e8195K82892j77433k74621J89744K61446j96688k41900K00882K15818k06130
563d185j85010K15049J51575k29039j19001K47598Q9768k68778o5898K89157M7123
574A68359l05365l1759L14521J7236l15249l6L07638k2251k93523N1584K75913
$$ plain form
585 167068 79731 -177905 -50262 191223 22727 -205635 662 218423 -18371 -226078
595 -226078 31830 227373 -41311 -219428 51422 205173 -61811 -183871 77054 161605
605 161605 -94386 -138437 115900 120684 -136060 -106615 155175 99271 -167768 -94433 174879
616 174879 91585 -174276 -86421 168700 77099 -160131 -62077 151887 41318 -147335 -17222
627 -17222 147051 -8862 -152921 32123 161327 -52581 -172117 66457 178914 -77170
637 -77170 -181840 83273 175605 -90334 -163127 97738 142712 -110373 -119456 125972 94268
648 94268 -145783 -72020 165704 53395 -183769 -39720 196552 30018 -201698 -21985
658 -21985 199233 13978 -188716 -2525 174334 -11784 -156745 31210 142063 -51615
$$ packed form
585A67068q7337k57636J27643K41485j68496k28362K06297K17761k36794k07707
595b26078K57908J95543k68684j78117K70850J53751k66984j22060K60925Q4551
605A61605k55991m4051K54337M784k56744K9445K61790n5904k67039P3335K69312
616A74879q3294k65861Q7855K55121r1601k37230R8054K13964j10569j88653J30113
627a7222J64273j55913j44059J85044J29204k13908j19536K38574J12457k56084
637g7170j04670K65113R2332k65939p2793K60865M4974k53085r083K45428l1704
648I4268k40051P3763K37724j12309k37164J44049K36272j66534k31716J79713
658b1985K21218j85255k02694J86191J76859j86118j44961J87955J10853j93678
$$ plain form
668 -51615 -129554 73528 123518 -91401 -120744 105858 122081 -113022 -122390 115701 121161
679 121161 -113241 -114720 110057 103373 -107762 -86620 109391 66621 -116197 -45929 127275
690 127275 26263 -141987 -10473 156130 -2381 -168762 11064 174848 -19537 -175496
700 -175496 27243 167781 -39134 -155679 53394 138860 -72775 -122384 93560 106180
710 106180 -115621 -93792 134461 83795 -149130 -76499 157067 69561 -158346 -61333 154123
721 154123 50959 -145715 -36659 136667 20045 -127958 -980 123247 -16765 -121074
731 -121074 33571 123138 -45382 -125577 54274 129156 -57897 -129271 60330 126833 -61386
742 -61386 -119358 64879 109143 -70813 -95883 81037 82107 -94466 -69077 109778 57601
$$ packed form
668e1615p7939K03082M9990k14919k9343K26602J6223k35103r368K38091N460
679A21161k34402j479K24777o684k11135K1142J96011m2770j82818P0268J73204
690A27275j01012j68250J31514J66603j58511j66381J79826J63784j94385j55959
700a75496K02739J40538k06915j16545K09073Q5466k11635m9609K15944J2620
710A06180k21801K1829K28253n0666k32925P2631K33566q7506k27907R7013K15456
721A54123j03164j96674J09056J73326j16622j48003J26978J24227j40012j04309
731a21074J54645Q9567j68520q0195J79851P4882j87053p1374J89601O6503j88219
742f1386n7972J84237M4264j79956k5070J76920J070j76573K5389J78855n2177
$$ plain form
753 57601 -125379 -48535 138114 40007 -147739 -32570 151400 22731 -151095 -11474
763 -11474 145476 -4004 -138290 21168 128942 -41191 -121203 59871 113404 -77907
773 -77907 -107853 91428 102133 -101212 -96713 105985 89476 -107230 -80481 105978 69135
784 69135 -103845 -55895 102645 42248 -102552 -28291 105305 16814 -108595 -6442 113567
795 113567 -476 -117010 6703 120202 -10840 -119922 16433 118386 -22440 -113625
805 -113625 31599 108301 -42200 -101605 55402 95240 -69206 -89009 83125 82961 -95621
816 -95621 -76818 105448 69285 -112894 -60808 116740 49586 -118936 -37259 118314 22132
827 22132 -117599 -7305 115193 -8431 -113592 21940 110537 -34644 -108070 43931
$$ packed form
753E7601j82980P6844J86649r8107j87746J15169J83970j28669j73826J39621
763a1474J56950j49480j34286J59458J07774j70133q0012J81074N3533j91311
773g7907k9946J99281J0705k03345M499K02698j6509j96706K6749J86459l6843
784F9135j72980M7950J58540o0397j44800P4261J33596q8491j25409J02153J20009
795A13567j14043j16534J23713J13499j31042j09082J36355J01953j40826r1185
805a13625J45224P6702j50501n9405J57007L9838j64446j9803J72134j64j78582
816i5621J8803J82266l6163j82179N2086J77548o7154j68522Q1677J55573r6182
827B2132j39731J10294J22498j23624j05161J35532Q8597j45181p3426J52001
$$ plain form
837 43931 103694 -51853 -99061 57010 92475 -61408 -85137 64945 77037 -68560 -68476 72782
849 72782 60640 -77107 -52890 82333 46543 -86974 -40055 92079 34819 -95520 -28411
860 -28411 99201 22404 -100779 -14228 102565 5905 -102449 4469 102524 -14941 -101075
871 -101075 26589 99458 -37671 -96381 48600 92310 -58576 -86884 67214 79841 -75172
882 -75172 -71992 81151 62278 -86732 -52439 90301 41485 -93539 -31394 94672 20605
893 20605 -95765 -11556 94571 2018 -93637 5756 90824 -13796 -88240 20484 84689
904 84689 -27296 -81365 33293 77608 -39193 -74126 44707 70549 -49933 -66488 55310
915 55310 62575 -60005 -57450 65435 52605 -69907 -45964 75243 39679 -79289 -31883
$$ packed form
837D3931N9763j55547m7208J56071L5465j53883k3729J50082J2092j45597Q4J41258
849G2782j2142j37747K4217J35223l5790j33517M6919J32134n7260j30339O7109
860b8411J27612p6797j23183Q6551J16793r6660j08354J06918R8055j17465q6134
871a01075J27664P2869j37129n8710J44981M3710j50886k8308J54098J2627j55013
882g5172L180J53143j8873j49010L4293J42740m8816j35024O2145J26066p4067
893B0605j16370Q4209J06127r2553r5655R9393Q5068j04620p4444J08724O4205
904H4689j11985n4069J14658M4315j16801l4933J18833K5842j20482j6555J21798
915E5310P265j22580K555J22885j2830j22512K3943J21207l5564j18968M7406
$$ plain form
926 -31883 83904 24449 -86690 -15627 89520 7534 -90283 1714 90417 -10428 -88643
937 -88643 19606 85934 -28404 -81920 37068 76921 -45325 -71425 52426 65050 -59079
948 -59079 -58969 63898 51808 -68363 -45389 70720 37808 -72981 -31186 73486 23504
959 23504 -74286 -16843 73776 9444 -74100 -3022 73449 -3718 -73201 9549 72394 -15292
971 -15292 -71472 20827 70167 -26088 -68013 31534 65572 -36706 -62026 42700 58483 -47911
983 -47911 -53417 54004 48785 -58894 -42748 64370 37006 -68202 -30059 72123 23489
994 23489 -74143 -15797 75897 8658 -75883 -631 75384 -6883 -73569 14522 70997 -21837
1006 -21837 -67888 28539 63868 -35049 -59827 40420 55005 -45673 -50595 49362 45335 -53185
$$ packed form
926c1883J15787n9455j11139P1063J05147q1986r7817R1997Q8703j00845p8215
937h8643J08249O6328j14338n3516J18988L9853j22246k6100J23851J2624j24129
948e9079J10J22867j2090j20171K2974J16109l2912j10789M1795J04672m9982
959B3504r7790N7443R0619o4332q3544P1078P6471p7167o9483Q2750O2845q7686
971a5292n6180R2299M9340r6255m1925R9547L4038j02278k5320J04726J5783j06394
983d7911n506J07421n219j07679J6146J07118k7364j05208L8143J02182m8634
994B3489r7632N8346R1694o7239q4541P5252P6015q2267o6686Q8091N6475r2834
1006b1837m6051R6427L5329r8917k4778J00247J4585j00678m922R9957m027r8520
$$ plain form
1018 -53185 -40759 55353 35271 -57841 -30571 58886 24773 -60279 -19669 60779 13696 -61843
1030 -61843 -8239 62251 2244 -63047 3337 63382 -8992 -63529 14421 63325 -19487 -62043
1042 -62043 24750 60260 -29425 -56928 34721 53381 -39498 -48220 44999 43247 -49747 -37096
1054 -37096 55102 31866 -58921 -25832 62696 20618 -64449 -14758 65510 9500 -64746 -3555
1066 -3555 63223 -2423 -60756 8908 57771 -15564 -54964 21829 52070 -28035 -50004 32746
1078 32746 47644 -37054 -45885 39480 43059 -41717 -40360 42465 36049 -43743 -31573 44436 25638
1091 25638 -46606 -20128 48646 14130 -51930 -9004 54837 4258 -57681 -410 59510 -2968
1103 -2968 -59957 6387 58960 -10016 -56117 14870 52653 -20102 -47892 26896 43852 -33426
$$ packed form
1018e3185J2426R6112k0082r3112K7270Q9457l4113q5052M0610Q0448m7083p5539
1030f1843N3604P0490o0007o5291O6384O0045p2374n4537P7950M8904q2812m2556
1042f2043Q6793L5510q9685k7503R1649J8660r2879q722R3219j752r2994J2651
1054c7096R2198k3236r0787L3089Q8528m2078q5067M9691Q0268n6010p4246O1191
1066c555O6778o5646n8333O9664M8863p3335l9400P6793L0241q0105k1969Q2750
1078C2746J4898q4698q831Q5365L579q4776J357Q2825o416p9792J2170P6009j8798
1091B5638p2244K6478O8774l4516o6060M2926O3841n0579o1939N7271N9920o2478
1103b968n6989O6344N2573o8976m6101P0987L7783p2755k7790P4788J6956p7278
$$ plain form
1115 -33426 -39468 40603 36407 -45985 -33130 50663 30810 -52770 -27355 53693 23792 -52485
1127 -52485 -18613 50918 12545 -48734 -5499 47185 -1843 -46426 8671 46541 -14695 -47511
1139 -47511 18770 48049 -21733 -48659 22682 47269 -23549 -45239 23624 40899 -25189 -36260
1151 -36260 27316 30403 -31498 -25556 36234 20892 -42088 -17964 47098 15570 -51300 -14243
1163 -14243 53563 12590 -53809 -10056 52352 6153 -49361 -315 46198 -6672 -42976 15092
1175 15092 41090 -22938 -39505 30432 39375 -35505 -38725 39078 38202 -39821 -35727 39506 32089
1188 32089 -37790 -26255 36673 19524 -36008 -12131 36975 5251 -39089 276 41832 -4130
1200 -4130 -44858 5778 46683 -6428 -47496 5938 45994 -6252 -43320 7154 39014 -10555
$$ packed form
1115c3426o042Q0071m196q2392J2855Q3793j9853q3580K5415Q1048k9901p6277
1127e2485L3872O9531l8373o1279M3235N2684m9028m4583N5097L7870o1236l2816
1139d7511O6281K9279o9782k6926P1341K4587p0818k1690O8863J7275o6088j1071
1151c6260O3576L087o1901N942O1790j5342o2980K4124O5062l1528o6870L7057
1163a4243O7806m0973o6399M3753O2408m6199n5514M9046M6513n2870l6304N8068
1175A5092K5998o4028j6567O9937Q943p4880l220P7803q76p8023M094P5233p417
1188C2089o9879J1535O2928j7149n5532K3877M9106l1724m4340L9365M1556m5962
1200d130m0728N0636M0905n3111m1068N3434M0056n2246l7068N0474L1860m9569
$$ plain form
1212 -10555 -34987 14855 30660 -21483 -28125 28062 26355 -34763 -26108 39822 25966 -43350
1224 -43350 -25874 44579 24202 -44119 -20810 42483 15437 -40548 -8067 39310 27 -38575
1236 -38575 8503 39472 -15445 -40539 21193 42122 -24140 -42209 25668 41564 -25114 -38297
1248 -38297 24646 33949 -23843 -27675 24647 21616 -26343 -15652 29613 11213 -33505 -8482
1260 -8482 37288 7541 -40326 -7909 41696 8331 -41791 -8656 39890 7061 -37715 -4304
1272 -4304 34746 -955 -33047 7001 31595 -14281 -31978 20632 32480 -26471 -33919 30093
1284 30093 34128 -32543 -33422 33207 30460 -33210 -25780 32979 19412 -33190 -12165 34231 5044
1297 5044 -35944 1505 38351 -6215 -40095 9500 41460 -10723 -40854 11356 39200 -11157
$$ packed form
1212a0555k4432M9842J5805n2143o642N6187j707o1118Q655O5930j3856o9316
1224d3350J7476P0453k0377o8321K3309O3293k7046n5985L2481M7377l9283l8602
1236c8575M7078L0969n4917k5094O1732K0929o6262j8069O7877J5896o6678j3183
1248c8297O2943R303n7792l832N2322l031m7959J0691M5265j8400m4718K5023
1260h482M5770k9747m7867L2417M9605l3365n0122L3135M8546l2829m4776L3411
1272d304L9050l5701l2092M0048K4594m5876j7697N2610J1848n8951p448O4012
1284C0093M035o6671q79O6629k747o3670P430N8759j3567n2602K1025M6396k9187
1297E044m0988L7449L6846m4566l3880M9595L1960n2183l0131N2210K7844n0357
$$ plain form
1309 -11157 -35433 11815 31334 -12894 -26549 15620 22708 -18714 -19569 22861 18195 -26564 -17844
1322 -17844 29808 18380 -31799 -19127 32727 19066 -32700 -17993 31881 15034 -31543 -10894
1334 -10894 31044 5236 -32052 540 33079 -6637 -35143 11430 36402 -15773 -37608 18440
1346 18440 36943 -20640 -35068 21854 31249 -23476 -26558 24985 21013 -27145 -15532 29498
1358 29498 10619 -31865 -6659 34001 4089 -35060 -2138 35443 1323 -34247 -223 32582
1370 32582 -703 -29821 2752 27666 -4848 -25259 8202 24176 -11155 -23494 14541 23952
1382 23952 -17254 -24481 19597 25134 -21213 -25062 22518 24176 -23589 -22100 24759 18840 -26436
1395 -26436 -15057 28220 10525 -30606 -6329 32520 1956 -34606 1538 35341 -5093 -35637
$$ packed form
1309a1157k4276M7248J9519m4228j3655M2169P088m1422q55M2430m666m4759Q720
1322a7844M7652j1428n0179J2672N1854j3661n1766J4707M9874j6847m6577K0649
1334a0894M1938k5808l7288L2592L2539l9716k8506M6573K4972n2175k1835N6048
1346A8440J8503n7583j4428N6922R395n4725l082N1543l972m8158J1613M5030
1358B9498j8879m2484K5206M0660k9912l9149L2922L7581l4120l5570L4024L2805
1370C2582l3285k9118L2573K4914l2514k0411L3461J5974l5331j2339L8035R411
1382B3952m1206p227M4078N537m6347l849M7580J658m7765J489M6859n919m5276
1395b6436J1379M3277j7695m1131K4277L8849l0564l6562L6144L3803m0434l0544
$$ plain form
1407 -35637 7675 34197 -10658 -32248 12936 29124 -15722 -25881 18192 22254 -20818 -19095
1419 -19095 23012 16286 -24754 -13994 26007 12241 -26452 -10442 26580 9262 -25930 -7490
1431 -7490 25479 5950 -24652 -3601 24695 1773 -24460 900 25084 -2886 -25472 5288
1443 5288 26354 -7271 -26618 9660 26774 -11792 -26198 14150 25128 -16635 -23431 19180
1455 19180 21099 -21945 -18612 24362 15654 -26786 -12714 28357 9312 -29770 -6312 30070
1467 30070 2812 -30160 138 29168 -3554 -28302 6285 26502 -9189 -25012 11314 23060
1479 23060 -13415 -21422 14892 19578 -16067 -17862 17007 16315 -17616 -14654 18481 13389 -18909
1492 -18909 -11714 19952 10625 -20522 -9017 21827 7908 -22470 -6107 23612 4706 -24215
$$ packed form
1407c5637M3312K6522m4855k1590M5184J6188m4846j0159M4073M062m3072J723
1419a9095M2107o726m1040J0760M0001j3766l8693J6010L7022j7318l5192J8440
1431g490L2969j9529l0602K1051K8296k2922k6233K5360K4184k7970k2586L0760
1443E288K1066l3625j9347L6278J7114l8566j4406M0348J0978m1763o796M2611
1455A9180J919m3044L333M2974q708m2440J4072M1071j9045l9082K3458L6382
1467C0070k7258l2972L0298K9030l2722k4748L4587K0217l5691j5823L6326J1746
1479B3060l6475q007L6314M686l5645j795L4869o92l3931K962L3135n092l2298
1492a8909P195L1666r327l1147J1505L0844j3919l0378J6363K9719j8906k8921
$$ plain form
1504 -24215 -2520 25045 500 -25212 2193 25423 -4904 -25143 8022 24797 -10864 -23832
1516 -23832 13791 22620 -16510 -21114 18632 18961 -20740 -16716 21895 13710 -23324 -11043 23747
1529 23747 7764 -24352 -5029 24215 1964 -24353 267 23605 -2621 -23212 4203 22177
1541 22177 -5836 -21348 7098 20082 -8285 -19031 9401 17818 -10587 -16683 11916 15869
1553 15869 -13153 -14861 14761 14302 -15889 -13275 17530 12580 -18628 -11097 20054 9855 -20851
1566 -20851 -7778 21961 5824 -22426 -3110 23120 553 -23310 2394 23419 -5118 -23086
1578 -23086 7714 22380 -10145 -21362 12279 19848 -14292 -18218 15643 15995 -17148 -13934 17901
1591 17901 11439 -18908 -9293 19105 6894 -19682 -5085 19606 3061 -19816 -1635 19540
$$ packed form
1504b4215K1695K7565k4545k5712K7405K3230l0327k0239L3165J6775l5661j2968
1516b3832L7623Q829l9130m604L9746L29l9701M024L8611q185l7034J2281L4790
1529B3747j5983l2116J9323K9244k2251k6317K4620K3338k6226k0591K7415J7974
1541B2177k8013j5512K8446J2984k8367j0746K8432Q417k8405o096K8599L953
1553A5869k9022j708K9622m59l0191K614L0805m950l1208P531L1151j0199l0706
1566b0851J3073K9739j6137k8250J9316K6230k2567k3863K5704K1025k8537j7968
1578b3086L0800J4666l2525j1217L3641P569l4140l926L3861L52l3143L214L1835
1591A7901o462l0347R615K8398j2211k6576J4597K4691j6545k2877J8181K1175
$$ plain form
1603 19540 102 -19420 960 18935 -2237 -18628 3304 18048 -4524 -17584 5804 17074
1615 17074 -7238 -16458 8923 16085 -10536 -15291 12472 14740 -13997 -13738 15815 12884 -17003
1628 -17003 -11414 18351 9964 -19070 -7758 19902 5675 -20158 -2932 20443 482 -20278
1640 -20278 2268 20240 -4677 -19901 6878 19275 -8804 -18537 10124 17167 -11387 -15940
1652 -15940 11978 13913 -12902 -12199 13345 9986 -14230 -8319 14706 6428 -15629 -5250 16239
1665 16239 4019 -16999 -3444 17199 2677 -17378 -2052 17080 1147 -16722 52 16172
1677 16172 -1600 -15693 3645 15398 -5738 -15059 8107 15196 -9993 -14939 11955 15007 -13105
1690 -13105 -14142 14346 13283 -14700 -11362 15354 9367 -15524 -6480 16217 3860 -16635 -1057
$$ packed form
1603A9540j9438j9522K0380J7975k1172j6391K1932J4744k2572j3060K3388J1270
1615A7074k4312r220K5381P162k6621m755K7763K268k8737K59K9553k931k9887
1628a7003N589K9765q387k9034J1312K7660j4227k5833J7226K3375j9961k0760
1640b0278K2546J7972k4917j5224K6779J2397k8079r733K8661P043k8554m553
1652a5940K7918J935k6815P03K5544l359k4216N911K3025q278k2057J0379K1489
1665A6239j2220k1018J3555K0643j4522k0055J5326J9132j5933j7869J6774J6120
1677A6172j7772j4093J9338J1753k1136r321K3166P089k5189m946K6894L052k8112
1690a3105j037K8488j063k7983L338K6716n987k4891R044K2697j2357k0495J5578
$$ plain form
1703 -1057 17463 -1199 -17932 3110 18292 -4416 -18171 5195 17469 -5840 -16274 6142
1715 6142 14386 -6945 -12557 7721 10522 -9220 -9066 10479 7694 -12220 -7306 13322 6956 -14466
1729 -14466 -7228 14749 7092 -14845 -6966 14296 5997 -13820 -4596 13383 2470 -13260 -68
1742 -68 13705 -2431 -14269 4850 15442 -6589 -16075 8102 16593 -8635 -15994 9352 15080
1755 15080 -9533 -12941 10349 10656 -10943 -7626 12420 5199 -13669 -2906 15282 1434 -16327
1768 -16327 -472 17059 29 -16936 178 15966 -472 -14476 977 12586 -2187 -11022
1780 -11022 3570 9479 -5639 -8969 7395 8591 -9293 -9333 10245 9840 -11033 -10686 10820 10727
1794 10727 -10638 -10266 10081 8941 -10009 -7060 10228 4640 -11141 -2167 12513 -6 -14005
$$ packed form
1703a057J8520j8662j6733K1042J5182k2708j3755K3366J2274k3309j0434K2416
1715F142Q244k1331n612K0278K801j9742J54J9545k785j9914M914K0628o366k1422
1729a4466P238K1977p657k1937P879K1262q299j9817R224J7979j0913j5730J3192
1742f8J3773j6136j1838J9119J0592k2031r486K4177Q491k5228p359K5346N728
1755A5080k4613l408K3290L07k1599L317K0046p221j8868J0763J8188j3848j7761
1768a6327J5855J7531j7030j6965J7114J5788j6438j4004J5453J1609j4773q835
1780a1022J4592N909j5118l330J6364J196j7884m0J9578m05k0873L47K1506r3
1794A0727k1365L72K0347j140j8950K949J7288n588j5781Q974J4680j2519j3999
$$ plain form
1807 -14005 1823 15572 -2831 -16357 3659 16768 -3911 -15914 4552 14551 -5013 -12149
1819 -12149 6420 10033 -7775 -7555 9944 5940 -11672 -4575 13358 4190 -14203 -3915 14444
1832 14444 4019 -13755 -3888 12707 3387 -11254 -2325 9879 701 -9041 1024 8698 -3018
1845 -3018 -9210 4523 9934 -5723 -11147 6203 11977 -6335 -12618 6025 12189 -6135 -11529
1858 -11529 6126 9778 -6973 -7921 8115 5827 -9901 -4079 11827 2671 -13547 -1737 14934
1871 14934 1208 -15318 -588 15142 164 -14057 847 12621 -2032 -10692 3984 9217
1883 9217 -5751 -7767 7856 7137 -9266 -6679 10409 6846 -10600 -6784 10354 6643 -9602
1896 -9602 -6196 8747 5297 -7916 -4076 7508 2580 -7769 -1217 8354 -179 -9554 937 10540
$$ packed form
1807a4005J5828J3749j8403j3526K0016J3109k0679j2003K0466R999j9564p136
1819a2149J8569L613j7808K20J7499m004j7612P097J7933r168j8393J0288J8359
1832A4444j0425j7774R867J6595r320j4641Q929J2204r178r742J0065P674j1716
1845c018o192J3733N411j5657n424J7350N774j8312o283J8643O164j8324n394
1858a1529J7655L652j6751r48J6036k288j5728N822J5906r156j6218J1810J6671
1871A4934j3726j6526J4730J5730j4978j4221J4904J1774j4653q660J4676N233
1883I217j4968k016J5623p19j6403K587J7088l563j7446L816J7138l711j6245
1896i602L406J4943l450j3213L840J1584m928j0349O552R571q533r375J0491R603
$$ plain form
1910 10540 -1558 -11756 1608 12304 -1887 -12564 1936 11928 -2675 -11043 3584 9621
1922 9621 -5173 -8499 6856 7175 -8864 -6225 10527 5405 -11865 -4831 12638 4192 -12744
1935 -12744 -3416 12280 2459 -11321 -1017 10402 -426 -9285 2316 8720 -3727 -8151 5254
1948 5254 8128 -5915 -7926 6486 8075 -6259 -7814 6085 7637 -5631 -6861 5499 6133 -5496
1962 -5496 -5197 6044 4268 -6872 -3679 7803 2956 -8957 -2710 9835 2239 -10676 -2070 10890
1976 10890 1359 -11134 -592 10722 -768 -10451 2065 9669 -3903 -9264 5445 8530 -7136
1989 -7136 -8112 8171 7355 -9010 -6684 9423 5776 -9474 -4656 9368 3498 -9008 -2114 8751
2003 8751 948 -8421 347 8349 -1009 -8054 1851 8092 -2093 -7809 2455 7864 -2354 -7463
$$ packed form
1910A0540j2098j0198J3364J0696j4191j0677J4500R992j4603q368J4627O037
1922I621j4794l326J5355L19j6039K639J6752n122j7270P034J7469q446j6936
1935a2744R328J5696r821j3780J0304J1419j0828q859J1601O404j2447m424J3405
1948E254K874j4043k011J4412J589j4334j555J3899J552j3268j230J2360O34j1629
1962e496K99J1241j776j1140L193J1482m847j1913O247J2545p596j2915Q606J2960
1976A0890r531j2493J0542J1314j1490r683J2516P604j3572n361J4709L085j5666
1989g136r76J6283q16j6365K326J6107l647j5250M818J4024n870j2506O894J0865
2003H751p803r369Q768Q002r358p045R905O241j0185n716J0264N409j0218n109
$$ plain form
2017 -7463 2681 7335 -2743 -6872 3269 6687 -3702 -6374 4561 6203 -5410 -6079 6285
2030 6285 5692 -7122 -5468 7833 4819 -8650 -4249 9003 3098 -9544 -2213 9628 610 -9942
2044 -9942 418 9670 -1996 -9619 2975 9112 -4258 -8686 5008 7795 -5758 -7017 6234
2057 6234 5979 -6633 -5017 6965 4183 -7040 -3332 7199 2697 -7040 -2101 7063 1831 -6789
2071 -6789 -1253 6807 1086 -6532 -588 6677 270 -6545 210 6829 -609 -6951 1310 7250 -1844
2086 -1844 -7389 2474 7466 -3270 -7407 3976 7104 -4855 -6672 5651 5955 -6524 -5170 7190
2100 7190 4154 -8016 -3276 8447 2167 -8968 -1354 8884 202 -8912 572 8340 -1621 -7925
2114 -7925 2324 7215 -3137 -6579 3751 5812 -4297 -5252 4654 4743 -5003 -4394 5141 4084 -5032
$$ packed form
2017g463J0144M654j0078m129J0141L418j0389k672J0935J642j1613o69J2364
2030F285n93j2814J654J3301l014j3469M401J3252n905j2642P331J1841r018j0552
2044i942J0360R252j1666p623J2594O137j3370m428J3694K787j3553j259J3251
2057F234k55j2612J616J1982k782j1223L708J0531m502r737M939R164n232q620
2071f789N536Q060n721p618N944P265o407o815O755O619p438o342Q261N940r094
2086a844n545R863M992j0736m137J1383L128j1959j817J2323L04j2479J354J2360
2100G190l036j2170M740J1723o280j1135P614J0238q682r114R484P768r961o304
2114g925J0249M891j0352l442J0330K061j0109r55R906Q9r746O09R535j057r116
$$ plain form
2129 -5032 -3775 5090 3610 -4940 -3176 5072 2933 -5101 -2475 5500 2114 -5717 -1575 6265 1189
2144 1189 -6684 -576 7174 110 -7407 535 7639 -1230 -7554 1990 7331 -2892 -6925 3730
2158 3730 6287 -4787 -5794 5598 4865 -6382 -4255 6910 3345 -7333 -2722 7376 1821 -7391
2172 -7391 -1141 7078 242 -6833 349 6263 -1132 -5942 1654 5446 -2158 -5188 2526 4886 -2787
2187 -2787 -4760 2957 4632 -3033 -4546 3243 4510 -3301 -4261 3623 4135 -3757 -3733 4364 3490 -4684
2203 -4684 -3028 5340 2721 -5756 -2037 6328 1584 -6687 -895 7092 292 -7199 527 7116 -1290
2218 -1290 -6842 2048 6431 -2971 -5968 3657 5330 -4422 -4750 4954 3994 -5497 -3483 5640 2745
2233 2745 -5953 -2324 5675 1678 -5629 -1381 5277 717 -5135 -396 4750 -235 -4600 546 4467
$$ packed form
2129e032J257Q865j480q550J764Q248k139q034K626P975l386p831M142P840n076
2144A189p873O108P750p064p517P942P104q869o324R544N341j0223m033J0655
2158C730K557j1074j007J1392p33j1247K127J1165l565j0678M611J0098n555r212
2172g391O250Q219o836p075P182N914p395m810P596L792p604l030P714K360p673
2187b787j973P717J675p665j513P789J267p811r60P884N12p892K4Q097q74q174
2203d684J656Q368k619q477L719Q365m744q271N792P987o800p491P726O589q406
2218a290n552Q890M383r402k997R625J673r752l28R704r60r491K014R123k895
2233B745q698L629P999l997p307M248O658m560n852M739N146m985m365N146L921
$$ plain form
2248 4467 -919 -4585 1269 4631 -1440 -4732 1763 5018 -1843 -5020 2144 4997 -2253 -4730 2770
2263 2770 4531 -3140 -3940 3845 3634 -4443 -2909 5272 2554 -5786 -1962 6405 1550 -6527 -967
2278 -967 6638 451 -6414 270 6018 -963 -5515 1682 4935 -2525 -4507 3232 4000 -4022 -3785 4242
2294 4242 3321 -4585 -3290 4410 2917 -4340 -2716 3874 2237 -3758 -1874 3442 1173 -3503 -719
2309 -719 3660 220 -4027 131 4462 -278 -4865 317 5172 -304 -5247 451 5297 -525 -4913
2324 -4913 1004 4661 -1551 -4033 2491 3741 -3301 -3260 4359 3141 -4946 -2812 5592 2671 -5645
2339 -5645 -2332 5666 1984 -5293 -1316 4894 492 -4495 384 4117 -1385 -3892 2178 3820 -2824
2354 -2824 -3970 2981 3848 -3158 -4054 2826 3716 -2605 -3484 2220 2861 -2184 -2381 2106 1700 -2496 -1297
$$ packed form
2248D467n386l666N854L362o071l292O495L255o861l177P164K853p250k477P500
2263B770J761p671q00P785k11q077J534Q181k718q340L824Q367m855q077N560
2278i67P605o187o865O684N748o981m552P197L253p460j982P739P68q022K37Q027
2294D242r21p906J295P700j493p257J624O590j637n995J884N316k269m676K784
2309g19M379l440m247M158M331m740m587N182M855n476m943N698M846n822m388
2324d913N917L657o212k482O524J250p042M1P619j218q087K134Q404k921q316
2339e645L313P998l682p277L977O210m402m987M879L733n502k507O070J642o644
2354b824j146O951Q67p006q96O880Q90o321q79N704O41n045j97M487m06m196J199
$$ plain form
2371 -1297 3014 952 -3652 -927 4234 1078 -4651 -1169 4959 1318 -4886 -1225 4741 958 -4404
2386 -4404 -234 4129 -475 -3826 1637 3680 -2534 -3583 3468 3728 -4033 -3732 4374 3657 -4364 -3277
2402 -3277 4198 2819 -3898 -2043 3593 1056 -3454 -174 3439 -759 -3650 1253 3747 -1645 -4103
2417 -4103 1618 4067 -1494 -4138 1009 3700 -952 -3479 791 2750 -998 -2386 1260 1912 -1933
2432 -1933 -1836 2567 1727 -3216 -2017 3650 2235 -4015 -2407 4011 2419 -3993 -2149 3808 1642 -3672
2448 -3672 -791 3664 -120 -3589 1159 3851 -1813 -3942 2585 4213 -2777 -4124 3027 4002 -2842
2463 -2842 -3403 2743 2861 -2642 -1923 2681 1201 -2815 -495 3029 -16 -3320 143 3585 -336 -3703
2479 -3703 100 3659 42 -3515 -347 3048 212 -2879 -184 2485 -331 -2366 668 2212 -1497
$$ packed form
2371a297M311k062m604K725N161l156n729L482O128l641o204L661N966l783n362
2386d404M170M363m604l351N463K043o214j049P051K60p761L01Q106p17q021J087
2402c277P475j379o717J855N636k537m510L280L613m198k891M903K494n392k458
2417d103N721K449n561k644N147K691m652k527M270J959l748j388L646O52l845
2432a933R7M403q40m943J199N667j415o250J608O418j592o412J844N957k166n314
2448c672K881M455l784l469M748K692n664k129O527J628o990j347P151R75o844
2463b842n61O146J18n503P19M604j480m016K320L524l045l304L463L442l921l367
2479c703L803L559l617l557L168L395k836l091K695K669k816k035L034J544l709
$$ plain form
2494 -1497 -2565 1858 2711 -2432 -3062 2658 3106 -2951 -3220 2876 2989 -3025 -2486 3035 1844 -3145
2510 -3145 -1030 3468 285 -3691 393 3984 -910 -4052 1307 4189 -1463 -3959 1615 3608 -1620
2525 -1620 -3049 1769 2528 -1857 -1890 2139 1439 -2359 -975 2572 885 -2710 -787 2836 1011 -2803
2541 -2803 -1067 2689 1102 -2622 -1196 2422 873 -2407 -662 2339 205 -2647 41 2684 -617
2556 -617 -3160 856 3217 -1321 -3467 1493 3373 -1747 -3302 1952 2922 -2298 -2442 2603 1957 -2962
2572 -2962 -1425 3317 944 -3515 -442 3681 220 -3629 230 3561 -329 -3234 736 3076 -846
2587 -846 -2481 1165 2242 -1317 -1922 1558 1832 -1553 -1661 1706 1626 -1679 -1654 1696 1699 -1730 -1635 1700
2605 1700 1587 -1865 -1563 1889 1317 -2206 -1160 2411 811 -2781 -789 2941 322 -3270 -145 3183
$$ packed form
2494a497j068M423Q53n143o30N720M48o057k69O096J13o014N39N521j191m989
2510c145K115M498l183l976M084L591m894l142N359K882n652k496N574J993n228
2525a620j429M818P59m385l3M029p00l798J384L547j687l595J923L623j825l814
2541b803J736L756j587l724J426L618j549l280J745L001k134k852K688K643l301
2556f17k543M016K361m538k146M960J880n120j555N254R70n220j44N045o46m919
2572b962J537M742k373m459L073M123l461l849L859L331l890k905L970K340l922
2587h46j635L646J077l559o05L480K74l385j08L367q0l305K5L350Ll429R5L335
2605A700j13l452L02L452n72l523J046L571j600l592J992L730k619l592L125L328
$$ plain form
2621 3183 -309 -3369 595 3145 -1059 -3048 1449 2739 -1846 -2529 2213 2219 -2609 -1883 2785 1535
2637 1535 -2843 -1126 2885 856 -2725 -415 2700 241 -2381 179 2344 -323 -2129 606 2169
2652 2169 -612 -2033 689 2044 -656 -1929 713 1924 -641 -1905 663 1863 -835 -1872 1014
2667 1014 1763 -1266 -1833 1612 1702 -2008 -1792 2210 1587 -2581 -1475 2633 1098 -2871 -882 2802
2683 2802 306 -2934 45 2808 -616 -2861 970 2647 -1430 -2556 1751 2349 -1899 -2056 2027
2698 2027 1870 -2048 -1537 1991 1152 -1883 -765 1867 502 -1837 -203 1875 159 -1853 -61 1933
2714 1933 147 -1846 -123 1919 264 -1856 -214 1802 210 -1840 46 1917 -206 -1874 612
2729 612 2001 -921 -2103 1279 2163 -1596 -2242 1811 1994 -2111 -1961 2144 1575 -2324 -1177 2413
$$ packed form
2621C183l492l060L964K550m204j989M497J290m585o83M742Om828P26M668j250
2637A535m378J717M011k029l581K310L115k459k622K560K165k667j806K735J563
2652B169k781j421K722J355k700j273K642J211k565j264K568J200k698j037K886
2667A014P49l029n67L445R0l710K16M002o23m168J106M108j535l969J989L684
2683B802k496l240K979K763l424k245L831J677m077j126M307N98m248j57M083
2698B027j57l918N11L528q39l035J118K632j365k339J634K078j716k012J792J994
2714A933j786j993J723K042j655k120J642K016j592k050J886J871k123j668K486
2729F12J389k922j182L382Q84l759o46M053J83m105J50M105n69l899J147L590
$$ plain form
2745 2413 664 -2546 -314 2487 -191 -2632 516 2451 -928 -2455 1066 2223 -1244 -2083 1198
2760 1198 1745 -1259 -1523 1235 1178 -1242 -973 1192 796 -1330 -633 1468 756 -1440 -647 1575 812
2777 812 -1526 -819 1655 914 -1569 -759 1680 765 -1758 -485 1894 249 -1998 17 2124 -449
2793 -449 -2197 723 2196 -1091 -2311 1280 2170 -1623 -2022 1713 1713 -1911 -1389 1970 946 -2113 -630
2810 -630 2062 195 -2174 21 2121 -449 -2188 460 1986 -554 -1842 562 1559 -630 -1473 640
2826 640 1264 -622 -1148 679 1011 -705 -876 808 1002 -940 -1022 1114 1093 -1141 -1192 1334 1280 -1377
2844 -1377 -1148 1494 1176 -1544 -953 1744 697 -1878 -348 1964 19 -2100 281 2183 -618 -2264
2860 -2264 889 2189 -1192 -2092 1180 1840 -1436 -1615 1465 1201 -1623 -886 1551 457 -1711 -332
$$ packed form
2745B413j749l210K232K801k678k441L148J935l379j527L521J157l467q39L281
2760A198N47l004k64K758n7k420K69K165l96k126O97K101p12k196P93K222p63
2777H12k338P07K474p41k483Q10K439r15k523J273K379j645k247K015K107k573
2793d49j748K920J473l287j220L591Q90l793l99L735%l624N22L359j024l059J483
2810f30K692j867k369K195K100k570j739K648J526k540j288K404R97k189q43K113
2826F40O24j886n26J827L32j716j71J684J94j942q2K136k1k234n1K526n4k657
2844a377K29K642l18k720N91K697j047k575J530K312j945k119K381J902k801j646
2860b264L153J300l381r00L272O60l276j79L080k64k824P37K437j094k168J379
$$ plain form
2876 -332 1696 -51 -1724 2 1720 -178 -1713 38 1464 -113 -1386 -13 1240 -44 -1030
2891 -1030 154 1055 -149 -982 384 1075 -535 -1136 758 1289 -849 -1377 1074 1591 -1093 -1546 1233
2908 1233 1498 -1225 -1253 1448 1023 -1469 -647 1664 239 -1864 46 1878 -408 -2143 536 2056
2924 2056 -746 -2108 768 1770 -890 -1629 848 1199 -1068 -975 1082 598 -1254 -408 1334 147
2940 147 -1541 -183 1399 245 -1462 -375 1310 377 -1144 -486 1050 441 -856 -278 896 130
2956 130 -832 166 1061 -242 -1235 473 1460 -606 -1630 720 1851 -658 -1765 764 1651 -836 -1319
2973 -1319 996 1079 -1173 -686 1432 415 -1614 -144 1851 -48 -2035 141 2026 -259 -1869 262
2989 262 1704 -306 -1356 384 1035 -606 -805 748 559 -935 -531 1072 417 -1154 -532 1062 646
$$ packed form
2876c32K028j747j673J726J718j898j535J751J426j577j273J373J253j284r86
2891a030J184R01j204q33J366O91j610o01J894N31k138n28K451N17k684m53K779
2908A233K65k723k8K701m25k492Q22K311j425k103J910J832k286j735K679J520
2924B056k802j362K876J002k660p39K477L51k267R3K057m84j852Q46J742j187
2940A47j688J358J582j154j707J087J685r33j521O58J536o09j297N78J174p66
2956A30r62R98Q95j303r93J708R87k066j024K350J131k509j107K529Q87k487m83
2973a319K315Q3k252M87K118j017k029J470J995j899j987K176J885k285j610K131
2989B62J442k010j050J740O51j641j99J553j89j494M04J603o55j571O22J594m16
$$ plain form
3006 646 -1037 -727 858 773 -784 -827 612 658 -586 -551 649 331 -858 -183 1056 74 -1325 101
3024 101 1575 -108 -1726 223 1738 -224 -1725 352 1625 -477 -1240 772 1031 -976 -718 1344
3040 1344 576 -1480 -378 1663 421 -1730 -264 1650 187 -1548 -108 1270 -15 -1047 242
3055 242 752 -358 -726 554 549 -716 -640 668 665 -758 -857 579 851 -596 -968 395 863 -400 -815
3074 -815 368 726 -517 -610 647 521 -935 -403 1095 367 -1317 -408 1541 346 -1555 -143 1541
3091 1541 115 -1443 148 1382 -343 -1176 633 1083 -870 -822 1137 785 -1231 -618 1327 677 -1300
3108 -1300 -503 1250 389 -1007 -222 842 51 -806 12 674 -207 -716 302 678 -401 -752 242 765
3126 765 -242 -849 113 752 -166 -931 58 767 -190 -837 238 752 -495 -745 609 668 -872 -702 1006
$$ packed form
3006F46j683L10J585q5j557m3J439M6j244L5J200l18j189O75J239r82j399J426
3024A01J474j683j618J949J515j962j501K077J273k102p63K012K59k007K58K062
3040A344p68k056J102K041j242k151J466J914j463j735J440J378j285j032J289
3055B42N10j110l68J280nj265P6J308lj423r9J436K72j447l72J363M68j263m15
3074h15J183L58j243r3J257j26j456N32J498p28j684R09J949j195j901J412J684
3091A541j426j558J591J234j725q33J809M50j953M8J959l52k016O13J945o50j977
3108a300P97J753q61j396P85J064p91q57Q18O62q81n09J018L76j079l51R94N23
3126G65j007o07R62O39r18p65R89P09r57o47J075N14j247k50J354N9j540J70J708
$$ plain form
3145 1006 712 -1121 -640 1274 576 -1207 -347 1306 142 -1209 82 1184 -305 -1081 596 1096
3161 1096 -726 -940 865 858 -831 -761 893 687 -826 -501 782 342 -690 -262 616 63 -714 -85
3179 -85 592 18 -653 -122 608 67 -720 -203 644 155 -733 -206 684 135 -781 -70 808 -112 -925 197
3199 197 900 -428 -1021 518 958 -703 -905 800 899 -878 -757 994 554 -1006 -365 1111 180 -1033
3217 -1033 72 1122 -202 -1045 365 1113 -372 -931 444 892 -465 -717 519 502 -474 -344 525
3234 525 316 -557 -259 460 221 -549 -266 511 325 -474 -481 475 391 -507 -478 475 348 -546 -369 626 254
3255 254 -788 -168 830 1 -963 57 1029 -276 -1124 298 1048 -348 -1047 568 862 -635 -716 734
3273 734 483 -825 -298 915 168 -966 -41 1019 -54 -1009 148 856 -104 -777 152 681 -148 -540
$$ packed form
3145A006k94j833M81J914o98j783Q60J653j164j351J291J102j489p76J677N00
3161A096j822k14J805pj689P0J654k06j513L25J283m40j032M28Q78n53p77O29
3179h5O77n74o71N31P30n41p87N17Q47m89q88N27Q90n49r16P11Q78r20q13J122
3199A97P03j328n93J539M40j661k02J705R9j777J21J751m40j560O41J476r31j213
3217a033J105J050j324q43J410P48j485n59J375M48j357k52J236j7r76J30Q69
3234E25k09q73K98P19k39p70K83P77j86p99pR56q4q98K9R53j27q94J77R95l72
3255B54j042O20R98q29r64J020R72j305q48J422P50j396o99J615K94j497q1J450
3273G34k51j308N27J213p47j134R25J060j073r55J157P08r60o73R29N29q29l92
$$ plain form
3291 -540 260 427 -302 -334 270 328 -299 -354 311 365 -317 -493 310 564 -273 -593 259 631 -324 -649 363
3312 363 473 -479 -483 547 260 -802 -272 837 98 -1057 -74 1005 -132 -1034 79 1005 -257 -937
3330 -937 278 728 -450 -588 593 470 -751 -412 767 212 -848 -237 882 144 -754 -104 683 30
3348 30 -508 -12 426 -4 -340 125 268 -38 -262 161 354 -131 -364 159 519 -194 -599 98 599 -44
3368 -44 -653 70 644 -206 -675 264 576 -441 -523 461 402 -738 -321 797 307 -915 -181 949 54
3387 54 -971 -43 783 -201 -857 187 626 -434 -621 442 425 -543 -324 644 260 -549 -223 560 210
3406 210 -516 -199 433 285 -365 -101 336 211 -166 -82 253 146 -259 10 304 69 -398 -33 499 59
3426 59 -576 -42 665 52 -717 -30 712 -90 -666 164 620 -310 -595 436 478 -612 -442 634 347 -838
$$ packed form
3291e40Q00J67p29l2O04N8o27n5O65N4o82j76Q03K54q37l20Q52L72r55l25J012
3312C63J10r52mJ030k87j062N30J109p39j155R83J079j137r02J113R26j262o80
3330i37J215M50j178j38J181j23j221L39J179n55j060O11J119p38q98O50P87o53
3348C0n38M96M38m30l36M65J43l06k24M23J93m85k33N23L60p13m05O97N01o43
3368d4o09P23N74q50m69R39L12j017q2R84n9j140M17J118m90j222P34J130q95
3387E4j025R28Q26r84o56J044M39j060j87J063j7r68K19R68l84q09L26P83l50
3406B10p26L17O32j48o50K64M37j25l77Q4L35j07m05K69K94k35m67L65N32m40
3426E9o35N34P07o13p69O87P42q02n76Q30M56r30k85J031M2j090J70J076k87j185
$$ plain form
3446 -838 -271 784 65 -858 -123 714 -29 -707 71 531 -257 -516 307 402 -420 -336 428 298 -335 -271 405
3467 405 231 -385 -212 271 285 -185 -202 129 256 -115 -192 169 194 -120 -182 234 215 -388 -191 499 231 -613
3489 -613 -173 669 197 -690 -167 702 30 -713 41 619 -160 -550 267 511 -539 -503 564 370 -718
3508 -718 -343 637 227 -700 -182 650 98 -565 -22 407 -80 -365 162 274 -288 -215 264 251 -245 -239 284
3529 284 271 -141 -322 116 360 -72 -305 101 340 11 -277 23 296 -45 -303 177 277 -344 -327 449 298
3550 298 -566 -314 641 270 -610 -227 622 71 -622 -19 546 -105 -536 242 470 -407 -439 496 342 -541
3570 -541 -395 560 331 -502 -209 417 148 -426 -88 287 -20 -271 91 236 -191 -244 152 301 -125 -269
3590 -269 21 299 -34 -362 -36 373 164 -354 -83 348 96 -308 -35 296 14 -321 203 329 -275 -398
$$ packed form
3446h38N67J055p19r23P35Q37p43o78P78M60p88k59Q23R5q22Q4P64j30o33O4O76
3467D05j74o16J73M83J4m70j7L31J27l71p7L61K5l14o2M16j9o03J97O90k68q44
3489f13M40Q42m72q87N23Q69o72p43P54N78p79l90Q17K44j050L6J067j94j088
3508g18L75R80m10r27N18Q32n52o63N43M29m87k85N27J12n62P3M79j3m96ON23
3529B84j3m12j81M38K44m32k33M06K39l29k88L00K73l41k58M80J00o21J7P76j51
3550B98q64K52R55l71q80L83Q49n51o93O03N65o51m31P78K28q77l2R35j54q83
3570e41J46R55k29q33K93O26k69n74L38L75l07k51L62J45m27n3L96J49m26j44
3590b69K90K78l33l28L26M09k09n18K71M31k52m04K73L31k82l35N24J26o04j23
$$ plain form
3610 -398 385 469 -470 -440 531 446 -522 -292 499 204 -482 -22 460 -103 -464 188 454 -282 -448 342 364
3631 364 -383 -415 373 322 -374 -248 207 178 -275 -156 156 -84 -274 23 162 -61 -217 7 154 -7 -253
3652 -253 -187 234 180 -283 -237 304 207 -302 -181 260 192 -238 9 320 8 -403 147 457 -174 -448 311 546
3674 546 -327 -454 411 402 -397 -229 481 248 -369 -18 457 -34 -488 142 479 -145 -421 243 318 -279 -318
3695 -318 139 287 -187 -242 142 83 -245 -49 99 21 -190 -108 105 29 -230 -169 161 151 -118 -211 170 268 -149
3718 -149 -243 161 286 -229 -194 254 167 -361 -65 407 -35 -469 78 517 -85 -439 179 557 -187 -348 267
3739 267 314 -312 -267 367 227 -379 -61 431 -9 -387 -22 339 -66 -362 23 326 -162 -244 88 156 -96
3760 -96 -176 78 16 -108 -133 95 89 -79 -207 0 141 5 -214 44 260 4 -207 17 269 -43 -256 102
$$ packed form
3610c98P83Q4r39L0R71q5r68K30P91k95o86M60M82n63l61O52K66p36j66P90K2
3631C64p47l2P88n1o96J26M55k9m53J19L12k40j90K97J39k23j56K24J47j61k46
3652b53O6M21n4m63M6N41r7n09J21M41o8m30K47L11l12m11N50L10o31k74P59K35
3674E46q73j27Q65rp99J68P10k33o17L51M75m91m54O30L37o24k76O64P5n97l9
3695c18M57J48m74n5L84n9l28J96J48p8k11Q2K13p6k59O1L30j0k69r3L81R8m17
3718a49r4M04J25n15L5M48q7n28K96M72m42m34N47M39o02l54O18L78p44j61O15
3739B67M7o26M5O34j40o06L18M92m40l78L65L61m05k96L85L03m88q2L32O8k52
3760i6q0K54o2j24k5K28oj68j28K07J41j36k19K58K16k56k11K24K52l12k13L58
$$ plain form
3782 102 269 -200 -231 278 168 -316 -51 433 110 -455 -45 503 0 -440 85 374 -87 -352 168 204 -250
3803 -250 -184 333 171 -298 -109 332 133 -318 -74 287 -19 -221 19 112 -39 -92 20 61 -90 -110 -36 14
3825 14 -96 -64 3 165 -6 -180 -58 216 23 -275 -67 238 33 -239 45 246 -105 -270 177 227 -201
3846 -201 -210 285 204 -361 -265 356 136 -376 -163 369 69 -397 1 256 -65 -252 141 251 -232 -208 293 217
3868 217 -285 -145 318 92 -246 -120 138 91 -98 -40 15 54 -27 25 24 -57 -98 -3 133 61 -191 -147 154 111 -262
3893 -262 -145 240 173 -245 -133 218 46 -246 -50 200 -56 -324 109 255 -248 -298 231 219 -309 -322 323
3914 323 211 -325 -177 235 80 -284 62 218 -56 -259 194 280 -192 -135 213 247 -165 -151 174 138 -79 -107
3936 -107 103 95 -8 -14 -88 58 63 -9 18 73 -16 -91 70 105 -130 -182 133 158 -187 -239 144 198 -227 -194 240 82
$$ packed form
3782A02J67m69l1N09j10m84K65M84l23n65M10N48n03m40N25K89m61k65N20L6m54
3803b50O6N17j62m69J89M41j99m51K44L61l06k02K40R3j51n3J12M1j51k0P4N0
3825A4j10L2O7J62j71j74J22K74j93k98K08L05k05k72K84K01l51j65M47N0m28
3846b01rM95q1n65R6O21k20n12K13N32l00m66L98K55l21j87L93J10m83K4N01p6
3868B17n02J40M63k26l38J26K58m7j89N8N5L9q1N2jq1m1R5J36p2k52M4L01m3l73
3893b62J17L85o7m18J12L51j72k92J96K50k56k68M33J46n03n0N29j2n28j3O45
3914C23j12n36J48M12j55l64L46J56k74k03M53Q6m72N7L48L4m12J4L25l6k17k8
3936a07K10qj03op4J46Np2K7N5q9p5J61L5k35n2L15K5l45n2L83N4m25L3M34j58
$$ plain form
3962 82 -251 10 250 -61 -260 54 283 -223 -293 226 255 -220 -277 175 193 -210 -141 238 119 -185 -21 209
3984 209 1 -131 123 252 -84 -191 88 183 -95 -144 60 95 -47 -64 -43 40 12 -62 -65 82 15 -71 18 67 -8
4009 -8 -150 33 179 -136 -215 41 173 -76 -224 120 181 -218 -193 226 71 -261 -61 283 -33 -308 55 311
4031 311 -172 -288 167 255 -144 -252 162 182 -112 -88 169 57 -126 -50 174 18 -142 59 168 -101 -152 28
4053 28 159 2 -93 -91 48 17 -33 -37 46 61 -33 -97 54 14 -112 -48 137 38 -187 -18 165 -63 -266 30 252
4078 252 -52 -246 106 184 -219 -197 213 34 -237 -36 183 -42 -276 41 298 -116 -299 64 187 -84 -177
4099 -177 113 111 -155 -57 102 -29 -92 -36 101 38 -91 -1 45 -2 -120 -52 62 36 -5 -88 35 111 -31 -31 30 54
$$ packed form
3962H2l33K61K40l11j99L14K29n06p0N19K9m75n7M52J8m03O9L79j19l04J64K30
3984B09k08j32K54J29l36j07K79R5k78m9K04L5j42j7K1Q3k8p4lJ47o7q6Q9M9p5
4009hj42J83J46l15p9K56J32k49j48L44O1l99K5M19j55l32K00L44l16k75L63K56
4031C11m83j16M55Q8l99j08M14K0k94K4K57j12j83P6K24j56j60K01J09k69n1J80
4053B8J31j57r5KJ39l1n0mQ3J5r4o4J51m0j26O4J85r9k25J69J83k28k03K96K22
4078B52l04j94L52P8m03K2M10j79k71K01K19k25k34L17K57m14j83L63J23k71r3
4099a77K90kk66R8J59j31o3N6J37o3j29R0M6m7j18O8J14k6m1q3J23P6j42%O1K4
$$ [...]
8191B1
##END NTUPLES=NMR FID
##END=
