##TITLE=1H ikalashn
ES-amide-sub(nlock)
18.10.2024
##JCAMPDX= 6.0         $$ Bruker NMR JCAMP-DX V2.0
##DATA TYPE= NMR FID
##DATA CLASS= NTUPLES
##ORIGIN= UXNMR, Bruker Analytische Messtechnik GmbH
##OWNER= root
$$ TOPSPIN		Version 1.3
$$ 2024-10-18 14:54:20.390 +0400  Irina@DPX200
$$ Compression mode = diff/dup
##.OBSERVE FREQUENCY= 200.13100065
##.OBSERVE NUCLEUS= ^1H
##.DELAY= (6, 6)
##.ACQUISITION MODE= SIMULTANEOUS
##.ACQUISITION SCHEME= undefined
##.AVERAGES= 8
##.DIGITISER RES= 18
##SPECTROMETER/DATA SYSTEM= spect
##.PULSE SEQUENCE= zg
##.SOLVENT NAME= D2O
##.SHIFT REFERENCE= INTERNAL, D2O, 1, 15.99637
##AUDIT TRAIL= $$ (NUMBER, WHEN, WHO, WHERE, WHAT)
$$ ##TITLE= Audit trail, TOPSPIN		Version 1.3
$$ ##JCAMPDX= 5.01
$$ ##ORIGIN= Bruker BioSpin GmbH
$$ ##OWNER= Irina
$$ $$ F:/spectra/data/iren/nmr/1H/4/audita.txt
$$ ##AUDIT TRAIL=  $$ (NUMBER, WHEN, WHO, WHERE, VERSION, WHAT)
(   1,<2024-10-18 14:53:56.828 +0400>,<Irina>,<DPX200>,<TOPSPIN 1.3>,
      <created by zg
	started at 2024-10-18 14:53:19.468 +0400,
	POWCHK disabled, PULCHK disabled
       configuration hash MD5:
       BE 6D 3F 07 2A EA 11 49 91 17 2B D3 AF B3 58 0D
       data hash MD5: 16K
       4F EC 35 22 12 75 5B FE C1 82 30 7A AD 87 35 51>)
$$ ##END=
$$ 
$$ $$ hash MD5
$$ $$ DD D0 77 8C 4B 37 0F F7 C7 7C 81 B1 4C 46 71 BE
##$RELAX= 
##$RELAX= 
##$RELAX= 
##$RELAX= 
##$RELAX= 
##$RELAX= 
##$RELAX= 
##$RELAX= 
##$RELAX= 
$$ Bruker specific parameters
$$ --------------------------
##$DU= <F:/spectra>
##$EXPNO= 4
##$NAME= <1H>
##$PROCNO= 1
##$TYPE= <nmr>
##$USER= <iren>
##$AMP= (0..31)
100 100 100 100 100 100 100 100 100 100 100 100 100 100 100 100 100 100 
100 100 100 100 100 100 100 100 100 100 100 100 100 100 
##$ANAVPT= -1
##$AQSEQ= 0
##$AQ_mod= 1
##$AUNM= <au_zg>
##$AUTOPOS= <>
##$BF1= 200.13
##$BF2= 200.13
##$BF3= 200.13
##$BF4= 200.13
##$BF5= 200.13
##$BF6= 200.13
##$BF7= 200.13
##$BF8= 200.13
##$BYTORDA= 1
##$CFDGTYP= 0
##$CFRGTYP= 5
##$CHEMSTR= <none>
##$CNST= (0..63)
1 1 145 1 1 1 1 1 1 1 1 1 1 1 1 1 1 1 1 1 1 1 1 1 1 1 1 1 1 1 1 1 1 1 
1 1 1 1 1 1 1 1 1 1 1 1 1 1 1 1 1 1 1 1 1 1 1 1 1 1 1 1 1 1 
##$CPDPRG= <>
##$CPDPRG1= <>
##$CPDPRG2= <>
##$CPDPRG3= <>
##$CPDPRG4= <mlev>
##$CPDPRG5= <mlev>
##$CPDPRG6= <mlev>
##$CPDPRG7= <mlev>
##$CPDPRG8= <mlev>
##$CPDPRGB= <>
##$CPDPRGT= <>
##$D= (0..63)
0 2 0 0 0 0 0 0 0 0.06 0 0.03 0 0 0 0 0.0002 0 0 0 0 0 0 0 0 0 0 0 0 0 
0 0 0 0 0 0 0 0 0 0 0 0 0 0 0 0 0 0 0 0 0 0 0 0 0 0 0 0 0 0 0 0 0 0 
##$DATE= 1729248833
##$DBL= (0..7)
120 120 120 120 120 120 120 120 
##$DBP= (0..7)
150 150 150 150 150 150 150 150 
##$DBP07= 0
##$DBPNAM0= <>
##$DBPNAM1= <>
##$DBPNAM2= <>
##$DBPNAM3= <>
##$DBPNAM4= <>
##$DBPNAM5= <>
##$DBPNAM6= <>
##$DBPNAM7= <>
##$DBPOAL= (0..7)
0.5 0.5 0.5 0.5 0.5 0.5 0.5 0.5 
##$DBPOFFS= (0..7)
0 0 0 0 0 0 0 0 
##$DE= 6
##$DECBNUC= <off>
##$DECIM= 32
##$DECNUC= <off>
##$DECSTAT= 4
##$DIGMOD= 1
##$DIGTYP= 9
##$DL= (0..7)
0 120 120 120 120 120 120 120 
##$DP= (0..7)
150 150 150 150 150 150 150 150 
##$DP07= 0
##$DPNAME0= <>
$$ [...]
##$SW= 21.9926370048069
##$SWIBOX= (0..15)
0 0 2 0 0 0 0 0 0 0 0 0 0 0 0 0 
##$SW_h= 4401.40845070422
##$TD= 16384
##$TD0= 1
##$TE= 300
##$TE2= 300
##$TE3= 300
##$TEG= 300
##$TL= (0..7)
0 120 120 120 120 120 120 120 
##$TP= (0..7)
150 150 150 150 150 150 150 150 
##$TP07= 0
##$TPNAME0= <>
##$TPNAME1= <>
##$TPNAME2= <>
##$TPNAME3= <>
##$TPNAME4= <>
##$TPNAME5= <>
##$TPNAME6= <>
##$TPNAME7= <>
##$TPOAL= (0..7)
0.5 0.5 0.5 0.5 0.5 0.5 0.5 0.5 
##$TPOFFS= (0..7)
0 0 0 0 0 0 0 0 
##$TUNHIN= 0
##$TUNHOUT= 0
##$TUNXOUT= 0
##$USERA1= <user>
##$USERA2= <user>
##$USERA3= <user>
##$USERA4= <user>
##$USERA5= <user>
##$V9= 5
##$VALIST= <valist>
##$VCLIST= <CCCCCCCCCCCCCCC>
##$VD= 0
##$VDLIST= <DDDDDDDDDDDDDDD>
##$VPLIST= <PPPPPPPPPPPPPPP>
##$VTLIST= <TTTTTTTTTTTTTTT>
##$WBST= 1024
##$WBSW= 25
##$XGAIN= (0..3)
0 0 0 0 
##$XL= 0
##$YL= 0
##$YMAX_a= 600601
##$YMIN_a= -578778
##$ZGOPTNS= <>
##$ZL1= 120
##$ZL2= 120
##$ZL3= 120
##$ZL4= 120
##$ABSF1= 10
##$ABSF2= 0
##$ABSG= 5
##$ABSL= 3
##$ALPHA= 0
##$AQORDER= 0
##$ASSFAC= 0
##$ASSFACI= 0
##$ASSFACX= 0
##$ASSWID= 0
##$AUNMP= <proc_1d>
##$AXLEFT= 0
##$AXRIGHT= 0
##$AXTYPE= 0
##$AXUNIT= <>
##$AZFE= 0.1
##$AZFW= 0.1
##$BCFW= 1
##$BC_mod= 2
##$BYTORDP= 1
##$COROFFS= 0
##$CY= 7568.61572265625
##$DATMOD= 1
##$DC= 2
##$DFILT= <>
##$DTYPP= 0
##$F1P= 17.9538593292236
##$F2P= -4.03888763876832
##$FCOR= 0.5
##$FTSIZE= 32768
##$FT_mod= 4
##$GAMMA= 1
##$GB= 1
##$INTBC= 1
##$INTSCL= 1
##$ISEN= 128
##$LB= -0.5
##$LEV0= 0
##$LPBIN= 0
##$MAXI= 945.577
##$MC2= 0
##$MEAN= 0
##$ME_mod= 0
##$MI= -402.1523
##$NCOEF= 0
##$NC_proc= 0
##$NLEV= 6
##$NOISF1= 8.587773
##$NOISF2= 6.764455
##$NSP= 1
##$NTH_PI= 0
##$NZP= 0
##$OFFSET= 15.99637
##$PC= 1
##$PHC0= 64.74585
##$PHC1= -34.68161
##$PH_mod= 0
##$PKNL= yes
##$PPARMOD= 0
##$PPDIAG= 0
##$PPIPTYP= 0
##$PPMPNUM= 100
##$PPRESOL= 1
##$PSCAL= 0
##$PSIGN= 0
##$REVERSE= no
##$SF= 200.13
##$SI= 32768
##$SIGF1= 18.5376
##$SIGF2= -6.396296
##$SINO= 400
##$SIOLD= 32768
##$SREGLST= <1H.CDCl3>
##$SSB= 3
##$STSI= 0
##$STSR= 0
##$SW_p= 4401.40845070422
##$SYMM= 0
##$S_DEV= 0
##$TDeff= 0
##$TDoff= 0
##$TI= <>
##$TILT= no
##$TM1= 0
##$TM2= 0
##$TOPLEV= 0
##$USERP1= <user>
##$USERP2= <user>
##$USERP3= <user>
##$USERP4= <user>
##$USERP5= <user>
##$WDW= 1
##$XDIM= 8192
##$YMAX_p= 0
##$YMIN_p= 0
$$ End of Bruker specific parameters
$$ ---------------------------------
##NTUPLES= NMR FID
##VAR_NAME=  TIME,          FID/REAL,        FID/IMAG
##SYMBOL=    X,             R,               I
##VAR_TYPE=  INDEPENDENT,   DEPENDENT,       DEPENDENT
##VAR_FORM=  AFFN,          ASDF,            ASDF
##VAR_DIM=   8192,          8192,            8192
##UNITS=     SECONDS,       ARBITRARY UNITS, ARBITRARY UNITS
##FACTOR=    0.0002272,     1,               1
##FIRST=     0,             0,               0
##LAST=      1.8609952,     104,             24
##MIN=       0,             -578778,         -578778
##MAX=       1.8609952,     600601,          600601
$$ Real data points
##PAGE= N=1
##DATA TABLE= (X++(R..R)), XYDATA
$$ plain form
0 0 0 0 0 0 0 0 0 0 0 8 -8 8 -8 16 -16 24 -24 32 -40 48 -56 64 -73 88 -104 120 -142 164 -186 216 -249 281
32 281 -318 361 -405 456 -514 572 -639 713 -792 881 -977 1081 -1195 1321 -1455 1604 -1770
49 -1770 1947 -2148 2366 -2608 2878 -3182 3527 -3920 4372 -4900 5527 -6286 7222 -8413
63 -8413 9991 -12177 15427 -20764 31042 -58027 276364 600601 -171338 -436285 -146569
74 -146569 106566 121770 202173 80231 -201471 -275881 -10790 202688 182783 876 -113460
85 -113460 -130932 -107005 5328 257689 252488 -165095 -388665 -37004 269208 147594 3606
96 3606 -15469 -173171 -218811 107253 332839 86639 -215241 -206058 -26416 123082 157048
107 157048 38375 -91521 -108942 -75235 4963 148044 149732 -52675 -171550 -87339 24826
$$ packed form
0@%%%%%%%%%Qj6J6j6K4l2M0m8N6p2Q8j04J20j37J61j92K24k62L06l50M02m65N30
32B81n99O79p66Q61r70J086j211J352j505J673j858K058k276K516k776L059l374
49a770L717m095M514m974N486o060O709p447Q292r272J0427j1813J3508j5635
63h413J8404k2168K7604l6191N1806q9069L34391L24237p71939k64947K89716
74a46569K53135J5204Q0403j21942k81702p4410K65091K13478j9905j81907j14336
85a13460j7472K3927J12333K52361n201m17583k23570L51661L06212j21614j43988
96C606j9075j57702m5640L26064K25586k46200l01880R183J79642J49498L3966
107A57048j18673j29896j7421L3707Q0198J43081J688k02407j18875Q4211J12165
$$ plain form
118 24826 118302 169246 17704 -213675 -174448 77506 194989 108947 -49982 -173451 -124216
129 -124216 67859 148303 69133 -7332 -94888 -175358 -29878 226024 174533 -113953 -194719
140 -194719 -42469 71786 105022 86411 -30034 -132757 -73666 53993 97609 55529 -18146
151 -18146 -72246 -68699 -24978 52996 136268 65975 -159250 -197675 64210 219539 55397
162 55397 -114925 -97156 -34455 30190 117075 79732 -85256 -128899 59 88011 56037
173 56037 282 -34545 -48035 -24201 21620 52546 38626 -24312 -66751 -27251 26618 31639
185 31639 36641 27648 -60701 -109435 12887 137130 65678 -77483 -100019 -24585 58422 94635
197 94635 28396 -82222 -81389 20770 63935 22886 -4807 -7409 -27207 -40230 -6116 52093
$$ packed form
118B4826R3476N0944j51542k31379L9227K51954J17483q6042j58929j23469M9235
129a24216J92075Q0444p9170p6465q7556q0470J45480K55902n1491k88486q0766
140a94719J52250J14255L3236j8611j16445j02723N9091J27659M3616m2080p3675
151a8146n4100L547M3721P7974Q3272p0293k25225l8425K61885J55329j64142
162E5397j70322J7769O2701O4645Q6885l7343j64988m3643J28958Q7952l1974
173E6037n5755l4827j3490K3834M5821L0926j3920o2938m2439L9500N3869N021
185C1639N002q993q8349m8734J22322J24243p1452j43161k2536P5434Q3007L6213
197I4635o6239j10618Q33J02159M3165m1049k7693k602j9798j3023L4114N8209
$$ plain form
209 52093 64992 -2972 -82495 -68874 23191 84430 63233 -15976 -94827 -81984 37775 119800
221 119800 56898 -54673 -90854 -53206 25751 105377 84770 -50720 -135345 -55977 76212
232 76212 108451 35219 -56682 -93816 -48364 43560 97463 56791 -42970 -101256 -57555 39755
244 39755 95645 66885 -23824 -106281 -88590 35958 130549 77494 -55154 -117193 -63828 41298
256 41298 110583 76869 -42341 -122937 -69686 54223 110806 53873 -45678 -94493 -55052 33155
268 33155 87015 56115 -24557 -74910 -55748 6274 62104 72079 17211 -68032 -95673 -19729
280 -19729 85489 102361 11303 -90863 -100866 -9256 93172 100410 2251 -95784 -89590 4435
292 4435 81841 75818 6980 -63461 -80356 -23444 61311 88655 28206 -57983 -88518 -38319
$$ packed form
209E2093J2899o7964p9523J3621R2065O1239k1197p9209p8851J2843J19759Q2025
221A19800o2902j11571l6181L7648P8957P9626k0607j35490q4625P9368J32189
232G6212L2239p3232r1901l7134M5452R1924N3903m0672r9761n8286M3701R7310
244C9755N5890k8760r0709q2457J7691J24548R4591n3055j32648o2039N3365J05126
256D1298O9285l3714j19210q0596N3251J23909N6583n6933r9551m8815L9441Q8207
268C3155N3860l0900q0672n0353J9162O2022N5830R975n4868q5243k7641P5944
280a9729J05218J6872r1058j02166j0003R1610J02428P238r8159r8035O194R4025
292D435P7406o023o8838p0441j6895N6912Q4755K7344o0449q6189l0535N0199
$$ plain form
304 -38319 51182 99952 50509 -58449 -112269 -48078 67446 112980 42721 -70735 -112047
315 -112047 -38989 73512 109216 31525 -76374 -100310 -20839 70689 83719 19520 -54460
326 -54460 -75994 -27949 47008 75410 29524 -40518 -68750 -35592 29957 71788 44608 -31169
338 -31169 -76933 -43281 33434 74962 41061 -33696 -73409 -37739 34717 69084 32710 -34308
350 -34308 -62414 -25870 31170 50498 22579 -19570 -41762 -27846 11296 39725 30541 -4925
362 -4925 -35196 -36810 -4422 38311 46421 4240 -45532 -48639 -938 48878 48905 -3004 -52594
375 -52594 -45996 8985 52818 40396 -13049 -50342 -33542 15647 44139 27456 -12471 -37713
387 -37713 -27072 8879 35498 27025 -6669 -33036 -28845 2971 34593 33206 -4134 -39594 -33836
$$ packed form
304c8319Q9501M8770m9443j08958n3820O4191J15524M5534p0259j13456m1312
315a12047P3058J12501L5704p7691j07899k3936P9471R1528J3030o4199p3980
326e4460k1534M8045P4957K8402m5886p0042k8232L3158O5549M1831k7180p5777
338c1169m5764L3652P6715M1528l3901p4757l9713L5670P2456L4367l6374o7018
350c4308k8106L6544N7040J9328k7919m2149k2192J3916L9142K8429r184l5466
362d925l0271j614L2388M2733Q110m2181m9772l107M7701M9816K7n1909m9590
375e2594O598N4981M3833j2422n3445l7293J6800M9189K8492j6683l9927k5242
387c7713J0641L5951K6619q473l3694k6367M191L1816L1622j387l7340l5460N758
$$ plain form
400 -33836 8525 42979 32451 -13470 -46137 -28994 20226 47342 22621 -26118 -45273 -15084
412 -15084 29768 40306 7882 -29734 -33539 -3814 26165 27850 3377 -21536 -24688 -5852 16907
425 16907 24577 10547 -14476 -28202 -14530 16025 32271 15484 -18273 -34652 -15867 20641
437 20641 37233 14717 -23757 -37271 -12441 24414 36323 11298 -25004 -34582 -8909 22922
449 22922 30174 9969 -17357 -28520 -14146 12676 28506 20043 -7370 -32408 -28549 7215 40020
462 40020 32300 -10400 -44662 -34258 13233 49577 33785 -18087 -50142 -30995 17763 49317
474 49317 32638 -18264 -51443 -31351 19677 49524 30904 -17802 -49473 -31094 18114 46773
486 46773 29749 -12824 -43547 -35151 8379 46238 38943 -7001 -47613 -43693 5716 54024 46362
$$ packed form
400c3836M2361L4454j0528m5921l2667J7143M9220K7116k4721m8739j9155L0189
412a5084M4852J0538l2424l7616l805K9725K9979J685k4473k4913l152J8836K2759
425A6907P670j4030k5023j3726J3672L0555J6246j6787l3757j6379J8785L6508
437B0641J6592k2516l8474j3514K4830L6855J1909k5025l6302r578K5673L1831
449B2922P252k0205k7326j1163J4374K6822J5830q463k7413k5038L859L5764L2805
462D0020p720m2700l4262J0404M7491L6344j5792n1872l2055J9147M8758L1554
474D9317j6679n0902l3179K0092N1028K9847j8620m8706l1671J8379M9208K8659
486D6773j7024m2573l0723Q396M3530L7859p295m5944m0612L920M9409M8308p662
$$ plain form
499 46362 -12467 -56878 -40270 15464 53075 36723 -16091 -49428 -30429 14250 39353 29097
511 29097 -4809 -35659 -33510 1889 33931 32815 3251 -29729 -37361 -7855 31192 38552 8822
524 8822 -27970 -40231 -14485 29205 44929 13260 -31014 -43335 -14055 30194 45652 11955
536 11955 -33647 -39201 -6525 24341 31628 15038 -16050 -35746 -21371 14498 38040 26997
548 26997 -13074 -45105 -30077 19299 47550 25957 -20430 -46484 -25418 23384 45783 18447
560 18447 -22016 -36122 -20432 12572 39452 27471 -17874 -43723 -20766 20810 37898 17489
572 17489 -19121 -34434 -13784 16511 26850 14467 -9095 -26372 -18226 8910 25254 17637
584 17637 -3953 -25098 -24693 6433 33508 19037 -15648 -26194 -9889 9759 19250 12286 -6814
$$ packed form
499D6362n8829m4411J6608N5734L7611j6352n2814l3337J8999M4679K5103j0256
511B9097l3906l0850K149L5399L2042j116k9564l2980p632K9506L9047P360k9730
524H822l6792j2261K5746M3690J5724l1669m4274j2321K9280M4249J5458l3697
536A1955m5602n554L2676L0866P287j6590l1088j9696J4375L5869K3542j1043
548B6997m0071l2031J5028M9376K8251k1593m6387k6054K1066M8802K2399k7336
560A8447m0463j4106J5690L3004K6880j1981m5345k5849K2957M1576J7088k0409
572A7489l6610j5313K0650L0295J0339j2383k3562j7277Q146K7136J6344p617
584A7637k1590k1145M05L1126K7075j4471l4685j0546J6305J9648R491o964j9100
$$ plain form
597 -6814 -18379 -11508 4264 16153 13963 -4054 -18277 -10537 6044 11912 8618 614 -10686
610 -10686 -12664 -133 10540 10407 5002 -6709 -18937 -9726 16938 24325 753 -22815 -19578
623 -19578 4970 23860 14604 -11634 -20474 -4953 9467 10749 6223 -2322 -11509 -9629 2138
636 2138 10966 11616 2165 -14649 -18520 2407 22553 15048 -8657 -21253 -12194 9635 22118 9791
650 9791 -12608 -19267 -7596 9173 19577 11680 -12264 -24304 -7454 16589 20830 4862 -15055
663 -15055 -20515 -3905 16830 17457 1199 -12132 -14452 -6121 9344 18091 8525 -10339 -20056 -10694
677 -10694 11703 24295 9057 -17088 -21983 -3739 13804 16975 6719 -9719 -18233 -9051 8564
690 8564 18325 12314 -6516 -22217 -14910 10504 24320 11092 -11905 -20458 -8983 8764 16190
$$ packed form
597f814j1565O871J5772J1889k190j8017j4223P740J6581N868l294q004j1300
610a0686j978J2531J0673j33n405j1711j2228R211K6664P387k3572k3568L237
623a9578K4548J8890r256k6238q840J5521J4420J282m526q545r187J880J1767
636B138Q828O50r451j6814l871K0927K0146p505k3705j2596R059K1829J2483j2327
650I791k2399o659J1671J6769J0404p897k3944j2040J6850K4043M241j5968j9917
663a5055n460J6610K0735O27j6258j3331k320Q331J5465Q747r566j8864r717R362
677a0694K2397J2592j5238k6145m895J8244J7543L171j0256j6438q514R182J7615
690H564R761o011j8830j5701P307K5414J3816j3228k2997q553J1475J7747P426
$$ plain form
703 16190 9649 -2548 -13325 -16355 -3710 17953 23678 2301 -23748 -25217 291 26854 25719
716 25719 -3644 -29098 -22370 6776 26066 18990 -4229 -22347 -20174 682 21840 22778 771
729 771 -23304 -24148 -251 23337 23291 1108 -21848 -24318 -3012 22153 25713 3441 -22485 -26320
743 -26320 -3714 23375 27107 2693 -24583 -25805 -57 24322 21778 -2004 -19986 -16986 -797
756 -797 13751 16937 5638 -11667 -18782 -8231 10348 20271 10933 -10902 -22703 -10187 12777
769 12777 21246 8436 -11015 -18861 -8722 8660 16968 10252 -5048 -17270 -14107 4732 19875
782 19875 13648 -6160 -18570 -13269 4463 18582 13720 -5370 -17260 -11655 2721 14331 14609
795 14609 373 -16312 -16646 493 17334 17331 -697 -19362 -17175 3918 19014 13530 -3504 -16483
$$ packed form
703A6190o541j2197j0777l030J2645K1663N725k1377k6049j469K5508K6563j135
716B5719k9363k5454O728K9146J9290p076k3219j8118K173K0856K1158R38k2007
729G71k4075q44K3897K3588m6k2183k2956k470K1306K5165L560k2272k5926l835
743b6320K2606K7089L732k4414k7276j222K5748K4379k544k3782j7982L000J6189
756g97J4548L186j1299j7305p115J0551J8579R923r338k1835j1801J2516K2964
769A2777Q469j2810j9451p846J0139J7382Q308o716j5300j2222L163J8839J5143
782A9875o227j9808j2410N301J7732J4119m862j9090j1890N605J4376J1610K78
795A4609j4236j6685l34J7139J6841lj8028j8665K187K1093J5096n484j7034j2979
$$ plain form
809 -16483 -14368 2993 17803 12526 -5101 -14985 -10473 2746 14246 11606 -4128 -14225 -8197
822 -8197 4000 10687 8276 -1860 -10548 -8070 1710 8548 8579 870 -10434 -11244 2363 12602 7135
837 7135 -4365 -9684 -6095 3765 10121 4091 -5924 -6579 -847 2706 3913 2961 -1348 -4129 -2458
852 -2458 73 2694 5002 1427 -5852 -5793 1309 5232 4111 551 -5247 -7025 530 8018 5413 -2075
868 -2075 -6429 -5751 910 8542 6549 -3352 -8352 -4621 2238 7789 6588 -2797 -9579 -5306 3202
883 3202 7605 6527 -1032 -10228 -8778 3453 11424 7344 -3025 -11403 -9503 3909 14346 8507
897 8507 -5974 -13325 -8111 5227 14924 8851 -7704 -15175 -6523 7195 13816 7694 -7182 -15276
911 -15276 -6546 8167 13088 6071 -5749 -13163 -7902 6097 13528 7257 -4836 -12471 -9259 3914
$$ packed form
809a6483K115J7361J4810n277j7627r884M512J3219J1500k640j5734j0097O028
822h197J2197O687k411j0136q688K478R780O838L1p709j1304q10J3607J0239n467
837G135j1500n319L589R860O356o030j0015o55N732L553J207r52m309k781J671
852b458K531K621K308l575p279N9P102L923j121l560n798j778P555P488k605p488
868b075m354O78O661P632j993r901n000L731O859N551j201r385o782M273Q508
883C202M403j078p559r196J450J2231P971m080j0369q378J900J3412J0437n839
897H507j4481p351N214J3338R697o073j6555p471Q652J3718O621o122j4876q094
911a5276Q730J4713M921p017j1820p414N261J3999P431o271j2093p635L212J3173
$$ plain form
925 3914 14341 9601 -4855 -13585 -9403 3421 13804 10504 -4183 -13964 -9132 3351 11921 9877
939 9877 -1739 -12081 -10091 1362 10363 10134 1401 -9564 -12300 -2492 10071 12832 3696 -9294
953 -9294 -14480 -5193 10453 15729 4908 -10596 -15836 -5766 10599 16866 5696 -11217 -16499
966 -16499 -5657 10414 16616 6388 -10554 -16721 -6025 9971 15950 6935 -8834 -16459 -7752
979 -7752 8848 16570 7954 -8287 -16689 -8788 8311 17317 8495 -8924 -16885 -7800 8658 16097
993 16097 7350 -8408 -15103 -6557 7639 13575 6419 -6334 -12476 -6374 5286 11119 6539 -3423
1007 -3423 -10165 -7632 2339 10125 7910 -1600 -9243 -8534 242 9515 9455 -560 -9696 -8637 388
1022 388 8511 8627 427 -8185 -8423 -574 7108 8105 1855 -6462 -8795 -2298 6273 8651 3071 -5771
$$ packed form
925C914J0427m740j4456q730M182J2824J0383l300j4687r781M832J2483Q570k044
939I877j1616j0342J990J1453R001k29q733j0965k736R808J2563K761r136j2990
953i294n186R287J5646N276j0821j5504n240J0070J6365O267j1170j6913n282
966a6499J0842J6071O202j0228j6942o167J0696J5996N979r015j5769p625Q707
979g752J6600P722q616j6241q402P901J7099R006q822j7419p961R085J6458P439
993A6097q747j5758o695Q546J4196N936p156j2753o142O102J1660N833m580r962
1007c423o742K533R971P786k215r510p643P09Q776R273o0j0015r136J059R025
1022C88Q123J16q200q612k38P849P682R97o250q317k333O497Q571K378n580q842
$$ plain form
1038 -5771 -9736 -3575 6834 9739 2618 -6366 -9249 -3504 6541 10422 2685 -7879 -9415 -1520
1052 -1520 7328 9055 1384 -8107 -8465 355 7673 6651 -315 -6724 -6487 632 6635 5316 -637
1067 -637 -5467 -5623 37 6465 5601 -1635 -6167 -4123 1230 5612 4742 -1896 -6557 -3276 2914 5081
1083 5081 2803 -1965 -5650 -3239 3409 5818 1543 -3622 -4806 -1398 3678 4631 254 -3464 -2937
1098 -2937 -731 1644 3534 2015 -2117 -3702 -1879 959 3866 4044 -1282 -6228 -3487 2992 5290
1113 5290 2869 -1622 -5385 -4237 1848 6042 4165 -1287 -6072 -5707 1238 7692 5700 -2076 -7358
1128 -7358 -5941 1307 8276 6665 -2321 -8126 -5769 850 7197 8222 245 -9686 -9334 1212 10300
1143 10300 9281 -1107 -11421 -10013 2712 12166 8387 -3095 -10913 -8435 2449 11111 8269
$$ packed form
1038e771l965O161J0409K905p121q984k883N745J0045L881p737j0564j536P895
1052a520Q848J727p671r491l58Q820P318j022o966o409K37P119O003j319n953
1067f37m830j56N660O428q64p236m532K044N353M382q70o638m661L281O190K167
1083E081k278m768l685K411O648K409m275n165j184L408N076R53m377l718N27
1098b937K206K375J890j519m132j585J823K838K907J78n326m946K741O479K298
1113E290k421m491l763J148O085M194j877n452m785L65O945O454j992p776n282
1128g358J417P248O969j611q986n805K357O619O347J025p977r931L52J0546R088
1143A0300j019j0388j0314J408J2725R454l779j1482p818K478J0884Q662k842
$$ plain form
1156 8269 -2470 -10168 -8472 1214 10683 9456 -2086 -10844 -8072 1618 9239 8707 -396 -9560 -8826
1171 -8826 396 8428 8980 1498 -8664 -10830 -954 9955 9768 -32 -8782 -8742 -416 7698 7694 1014
1187 1014 -5354 -7291 -3589 4035 8769 5039 -3850 -9611 -6566 3850 11597 6768 -5816 -11328
1201 -11328 -4886 4814 9391 6091 -3021 -10132 -7278 3086 10395 7669 -2523 -10803 -8458 2835
1215 2835 11389 8260 -3154 -11316 -7882 3500 10662 6904 -2597 -9132 -7885 968 10231 9224
1229 9224 -2304 -11186 -7709 3070 9814 6931 -2404 -9241 -6715 2383 8502 6044 -1825 -7520
1243 -7520 -6060 1052 7187 6416 -913 -7586 -6163 2012 7216 4087 -2213 -4689 -2991 157 3051
1258 3051 3870 1364 -2755 -4641 -2239 2834 5660 2570 -3823 -6166 -1448 4636 5002 115 -3801
$$ packed form
1156H269j0739p698J696R686R469j227j1542q758K772R690P621n32r103r164P34
1171h826R222Q032N52p482j0162k166R876J0909j87r800q750M0Q326Q114mo680
1187A014o368j937L702P624M734l730q889n761L045J0416P747m829j2584n512
1201a1328O442R700M577l300r112p111K854J0364P309k726j0192q280K345J1293
1215B835Q554l129j1414q162L434J1382P162l758r501o535J247Q853R263j007
1229I224j1528q882L477J0779O744k883r335o837K526R098O119k458p869n695
1243g520J460P112O135p71p329o673J423Q175N204l129o300k476J698L148K894
1258C051Q19k506m119j886K402N073K826l090o393k343M718O084L66m887l916
$$ plain form
1273 -3801 -3210 -303 1988 2697 1628 -1012 -3183 -2607 755 3936 3378 -1226 -5076 -3242 2498 5317
1289 5317 2119 -3094 -4677 -1499 2926 4335 1528 -3014 -4779 -1325 4008 4794 -45 -4474 -3711
1304 -3711 622 4042 3455 -845 -4367 -2867 1585 3672 2164 -677 -3122 -3317 191 4452 4118 -1256
1320 -1256 -5800 -3786 2951 6381 2196 -4149 -5244 -977 3610 4474 1071 -3462 -4169 -727 2704
1335 2704 3536 1922 -1894 -4945 -2720 3266 5633 1674 -3754 -5082 -1282 3755 4543 686 -3004
1350 -3004 -3398 -1513 1511 3859 2722 -1429 -4199 -3164 830 4680 4232 -1142 -5505 -3872 1329
1365 1329 4881 4299 -392 -5387 -4993 738 5421 4832 74 -5238 -6002 -228 6181 5856 -139 -5437
1381 -5437 -5856 -1072 5375 6979 1453 -5778 -7612 -1975 6438 8811 1436 -7770 -8370 -427 7407
$$ packed form
1273c801N91K907K291P09j069k640k171N76L362L181n58m604l850J834N740K819
1289E317l198n213j583L178M425J409k807m542j765L454N333P86m839m429P63
1304c711M333L420n87m300l522J500M452K087j508k841k445j95L508M261l34n374
1320a256m544K014O737L430m185o345j095M267M587Q64l403m533p07L442L431
1335B704Q32j614l816l051K225N986K367l959n428j328L800N037P88l857l690
1350c004l94J885L024K348j137m151k770J035L994L850m48n374m363J633N201
1365A329L552n82m691m995L94N731M683n89m758n312p64N774O409l25n995n298
1381e437m19M784O447J604n526p231j834N637Q413K373p375r206o00P943P834
$$ plain form
1396 7407 7908 564 -7608 -7626 341 6866 6142 566 -5191 -6874 -1934 5581 7530 1799 -5551 -7523
1412 -7523 -2100 5783 7723 1528 -5729 -6796 -1556 4926 6701 1762 -4753 -5944 -1668 3434 5563
1427 5563 2917 -3054 -6171 -2742 3085 5259 2924 -1820 -5219 -3795 1610 5291 3869 -941 -5018
1442 -5018 -4670 528 5460 4802 -551 -5160 -4997 0 5330 5315 -174 -5160 -5040 -446 4771 5757 723
1459 723 -5413 -5762 -231 5158 5434 507 -5092 -5540 -182 5101 4970 219 -4510 -4917 -455 4549
1475 4549 4844 330 -4342 -4704 -393 4494 4670 -200 -4569 -3865 533 4005 3391 -547 -3791 -2876
1491 -2876 817 3158 2200 -535 -2524 -2088 289 2225 1833 -175 -1825 -1737 -30 1690 1629 -36 -1458
1508 -1458 -1383 -110 1221 1364 115 -1204 -1173 3 954 933 163 -715 -940 -252 716 944 286 -603 -940
$$ packed form
1396G407N01p344q172j8P967O525p24n576n757j683M940P515J949n731p350j972
1412g523N423P883J940o195p257j067N240O482J775m939o515j191M276N102K129
1427E563k646n971l117L429N827K174k335m744l399J424N405L681j422m810m077
1442e018L48N198M932o58n353m609J63M997N330j5n489m986J20M594N217R86n034
1459G23o136l49N531N389K76m927n599m48N358N283j31m751m729m07M462N004
1475D549K95m514m672l62M311M887J76m870m369P04M398L472o14l938l244R15
1491b876L693K341r58k735j989M36K377J936l92k008j650Q8J707J720o1j665j422
1508a458P5J273J331J43j249j319L1J176R51k1p70q78k25O88R68K28o58q89l37
$$ plain form
1527 -940 -422 625 1170 489 -797 -1342 -521 1003 1650 462 -1443 -1856 -186 1753 1930 83 -2139
1544 -2139 -2254 301 2693 2096 -783 -2785 -2016 820 3028 2114 -1234 -3294 -1928 1320 3281 2096
1560 2096 -1418 -3683 -2071 1708 3666 2055 -1630 -3952 -2275 2031 4209 2003 -2090 -4079 -2178
1575 -2178 2162 4503 2015 -2586 -4213 -1673 2331 4113 1844 -2434 -4048 -1476 2178 3495 1771
1590 1771 -1613 -3663 -2037 1617 3452 2060 -1081 -3398 -2559 1034 3523 2379 -772 -3053 -2775
1605 -2775 183 3293 3058 -281 -3041 -2992 -439 2845 3693 598 -3202 -3617 -697 2761 3871 1301
1621 1301 -2916 -4227 -1278 2811 4237 1829 -2715 -4828 -1856 3090 4685 1851 -2675 -4911 -2342
1636 -2342 3007 5219 1947 -3039 -4839 -2191 2746 5175 2180 -3140 -4906 -1822 2773 4636 2006
$$ packed form
1527i40N18J047N45o81j286n45Q21J524O47j188j905m13J670J939J77j847k222
1544b139j15K555K392n97k879k002P69K836K208r14l348k060J366L248J961j185
1560B096l514k265J612L779J958j611l685k322J677M306K178k206m093j989J901
1575b178M340K341k488m601j627K540M004J782k269m278j614K572L654J317j724
1590A771l384k050J626L654J835j392l141k317Q39L593K489j144l151k281K78
1605b775K958L110k35l339k760M9K553L284Q48l095l800m15K920L458J110k570
1621A301m217j311K949M089J426k408m544k113K972M946J595k834m526k236K569
1636b342N349K212l272m986j800K648M937K429k995n320j766L084M595J863k630
$$ plain form
1651 2006 -2763 -4511 -1684 2397 3938 2031 -1900 -4213 -2168 2118 3917 1894 -1661 -3705 -2222
1666 -2222 1711 3762 1747 -1645 -2997 -1726 1006 2861 1877 -887 -2453 -1752 276 2199 2221 -93
1682 -93 -2302 -2027 -28 1780 2189 600 -1842 -2455 -565 1676 2349 1021 -1556 -2849 -1024 1939
1698 1939 2659 789 -1641 -2555 -1041 1663 2580 803 -1538 -2290 -1072 1265 2575 1154 -1593 -2559
1714 -2559 -928 1560 2526 836 -1847 -2397 -288 1783 1858 330 -1444 -1913 -326 1682 1760 21 -1555
1731 -1555 -1563 13 1712 1521 -450 -1754 -984 684 1457 705 -742 -1254 -374 659 850 410 -329 -963
1749 -963 -648 568 1157 392 -733 -1036 -297 770 1017 64 -911 -754 102 638 561 78 -455 -626 -238
1768 -238 377 754 463 -446 -968 -381 612 867 330 -389 -749 -515 212 824 806 30 -961 -1210 -85 1404
$$ packed form
1651B006m769j748K827M081J541j907l931k313K045M286J799k023l555k044J483
1666b222L933K051k015l392j352J271K732J855r84k764j566P01K028J923K2k314
1682i3k209K75J999J808M09j589k442o13J890K241O73j328k577j293J825K963
1698A939P20j870k430r14J514K704R17j777k341p52J218K337J310j421k747r66
1714b559J631K488R66j690k683n50K109K071P5j528j774m69J587K008P8j739j576
1731a555qJ576J699j91j971j304P70J668P73p52j447n12Q80J033J91m40p39o34
1749i63L15J216N89p65j125l03P39J067K47r53r75J57Q56N36p7m83n33j71L88
1768b38O15L77k91r09n22N87R93K55n37p19l60K34P27O12j8p76r91k49J125J489
$$ plain form
1788 1404 1484 -170 -1686 -1446 327 1757 1419 -307 -1729 -1514 168 1786 1752 -42 -1964 -2017 42
1805 42 2256 2207 -236 -2511 -2140 459 2482 1926 -461 -2273 -1922 178 2145 2171 30 -2333 -2415 61
1823 61 2545 2412 -205 -2614 -2303 395 2549 1970 -455 -2118 -1686 119 1724 1835 267 -1597 -1992
1840 -1992 -498 1605 2177 527 -1655 -2081 -465 1444 1890 639 -1168 -1860 -843 880 1810 1215
1856 1215 -656 -2091 -1471 759 2166 1367 -669 -2012 -1521 421 1986 1650 -239 -1902 -1922 -86
1872 -86 2093 2290 42 -2329 -2321 82 2435 2295 -233 -2401 -1994 221 2016 1995 188 -1950 -2261 -189
1890 -189 2077 2249 226 -2042 -2324 -123 2245 2124 -173 -2018 -1737 120 1685 1563 7 -1410
1906 -1410 -1499 -318 1226 1694 386 -1417 -1622 -165 1255 1369 203 -1153 -1285 -110 953 913 224
$$ packed form
1788A404Q0j654j516K40J773J430l38j726j422K15J682J618l4j794j922n3K059
1805D2K214m9k443k275L71K599K023n56k387j812L51K100J967K6k141k363q2K476
1823F1K484j33k617k409L11K698K154n79k425j663M32J805J605J11j568j864l95
1840a992J494K103N72j650k182m26J616J909M46j251j807o92J017J723R30n95
1856A215j871j435O20K230J407p99k036j343M91J942J565l36j889j663k0J836
1872h6K179J97k248k371QK403K353j40k528k168M07K215J795k1j807k138l11K072
1890a89K266J72k023k268k82K201K368j21k297j845K81J857J565j22j556j417
1906a410q9J181J544M68j308j803k05J457J420J14j166j356j32J175J063m0o89
$$ plain form
1923 224 -496 -906 -548 436 1008 585 -352 -952 -666 306 954 614 -213 -745 -713 -48 838 935 19 -926 -931
1944 -931 -61 961 1072 -49 -1173 -881 314 958 641 -151 -808 -745 62 824 788 -24 -890 -949 110
1963 110 1162 857 -430 -1227 -680 600 1242 477 -855 -1132 -142 819 865 168 -685 -951 -208 863 1011
1982 1011 98 -927 -998 -9 1067 1010 -179 -1149 -866 282 1105 799 -323 -1063 -712 298 992 774
2000 774 -213 -1075 -842 290 1100 729 -327 -1002 -728 233 949 726 -170 -859 -759 9 787 878 115 -817
2020 -817 -996 -190 839 1031 217 -779 -1025 -372 639 1096 585 -546 -1271 -795 589 1501 941 -641
2038 -641 -1655 -1034 699 1809 1077 -798 -1872 -1039 789 1824 1161 -672 -1927 -1311 681 2017
2054 2017 1386 -661 -2127 -1500 706 2208 1452 -741 -2176 -1511 684 2237 1501 -749 -2154 -1428
$$ packed form
1923B24p20m10L58R84N72m23r37o00K86R72O48l40q27n32L2O65Q86R7r16r45n
1944i31Q70J022J11j121j124K92J195O44l17p92o57O3Q07P62l6q12q66n9J059
1963A10J052l05j287p97N47J280O42p65j332k77R90R61M6o97q53k66P43J071J48
1982A011r13j025p1R89J076n7j189r70K83J148Q23l06j122p40L51J010O94k18
2000G74r87q62K33J132Q10l71j056o75K74R61P16k23q96o89J00P68P78R1p63r32
2020h17j79Q06J029J92q14r96k46O53J011M57n11j131p25M76J384R12n60j582
2038f41j014O21J733J110p32j875j074Q33J828J035o63j833j255O16J992J336
2054B017o31k047j466O27K206J502p56k193j435O65K195J553p36k250j405P26
$$ plain form
2070 -1428 633 2074 1502 -602 -2077 -1427 563 1891 1424 -404 -1834 -1424 362 1663 1363 -115
2086 -115 -1521 -1515 33 1552 1449 23 -1302 -1444 -276 1246 1538 305 -1143 -1457 -497 957 1583
2103 1583 646 -953 -1564 -748 724 1626 998 -790 -1798 -963 710 1632 1126 -528 -1854 -1299 654
2120 654 1853 1218 -524 -1828 -1401 556 1971 1319 -598 -1851 -1372 502 1979 1365 -679 -1846
2136 -1846 -1148 545 1744 1303 -553 -1820 -1078 654 1561 1045 -442 -1584 -1067 610 1511 815 -529
2153 -529 -1302 -877 498 1359 673 -579 -1049 -585 341 1021 639 -462 -938 -428 290 694 535 -239 -794
2172 -794 -419 289 502 350 -12 -529 -543 91 540 365 18 -341 -557 -150 544 604 -1 -470 -551 -136 550
2193 550 719 18 -622 -573 -53 568 773 79 -839 -766 169 773 666 1 -862 -911 183 1098 771 -299
$$ packed form
2070a428K061J441n72k104j475O50J990J328m67j828j430M10J786J301l00j478
2086a15j406OJ548J519j03j426j325j42J168J522K92j233j448l14R60J454O26
2103A583r37j599o11Q16J472R02o28j788j008Q35J673R22n06j654j326N55J953
2120F54J199o35j742j304M27J957J415o52j917j253M79J874J477o14k044j167
2136a846O98J693J199m41j856j267P42J732R07n16j487j142N17J677R01o96j344
2153e29p73M25J375Q61o86j252m70M64R26O80l82j101m76N10P18M04j59p74n55
2172g94L75P08K13j52l62n17j4O34M49j75l47l59k16M07O94O0o05m69q1M15O86
2193E50J69p01o40M9N20O21K05o94r18P3R35O04j07o65q63m9J094R15l27j070
$$ plain form
2213 -299 -1059 -885 261 1306 915 -566 -1391 -811 566 1485 886 -813 -1628 -635 909 1466 679 -823
2231 -823 -1637 -708 1029 1616 586 -931 -1596 -729 1013 1743 616 -1101 -1618 -612 996 1690 660
2248 660 -1061 -1616 -571 899 1525 765 -844 -1647 -714 853 1467 754 -625 -1482 -902 581 1412 916
2266 916 -363 -1358 -1186 225 1485 1244 -194 -1406 -1371 -19 1481 1537 14 -1500 -1540 -186 1388
2283 1388 1778 391 -1528 -1976 -429 1596 2112 505 -1726 -2217 -439 1767 2196 512 -1690 -2269
2299 -2269 -590 1737 2331 638 -1646 -2363 -774 1714 2543 738 -1834 -2471 -641 1777 2390 639
2315 639 -1705 -2292 -652 1572 2217 715 -1486 -2204 -732 1414 2098 724 -1338 -2019 -716 1226
2331 1226 1850 702 -993 -1670 -846 792 1681 999 -678 -1664 -1030 610 1621 1062 -527 -1548 -1040
$$ packed form
2213b99p60J74J146J045l91j481q25N80J377R19n99j699q15R93J544N57p87j502
2231h23q14R29J737N87j030j517o65Q67J742P30j127j717n17J006J608O94j030
2248F60j721n55J045J470O26p60j609q03R33J567O14p13j379q57N80J483Q31m96
2266I16j279r95J72J411J260k41j438j212L5J352J500N6j523j514m0J354J574
2283A388L90j387j919m48J547K025N16j607k231m91J778K206M29j684k202n79
2299b269J679K327N94j693k284p17J589K488Q29j805k572o37J830K418O13j751
2315F39k344n87J640K224O45j502k201p18J472K146O84j374k062o81J303J942
2331A226O24j148j695o77Q24J638Q89o82j677r86O34J640J011n59j589j021N08
$$ plain form
2348 -1040 429 1413 1082 -185 -1263 -1236 -36 1295 1451 128 -1408 -1552 -94 1481 1560 74 -1447
2365 -1447 -1517 -119 1375 1546 199 -1366 -1583 -257 1366 1679 273 -1516 -1772 -109 1636 1581 -80
2382 -80 -1554 -1416 106 1456 1321 -111 -1366 -1260 71 1367 1293 -133 -1447 -1202 296 1471 1066
2399 1066 -451 -1433 -813 613 1252 607 -493 -1061 -617 446 1067 574 -491 -1016 -539 497 1045 458
2417 458 -641 -953 -250 603 741 240 -448 -680 -292 308 640 447 -225 -792 -573 325 862 493 -345 -843
2437 -843 -531 321 858 522 -251 -739 -650 11 874 982 -20 -1147 -1077 185 1334 1141 -284 -1418 -1066
2456 -1066 375 1401 1112 -236 -1456 -1285 250 1599 1409 -219 -1778 -1615 347 2099 1601 -655
2472 -655 -2165 -1425 693 2084 1393 -683 -2062 -1401 596 2036 1540 -577 -2188 -1573 673 2182
$$ packed form
2348a040J469R84l31j267j078K7J200J331J56j323j536j44J458J575P9j486j521
2365a447p0J398J494J71j347j565k17J326J623L13j406j789k56J663J745n5j661
2382h0j474J38J522J350j35j432j255J06J331J296p4j426j314K45J498J175m05
2399A066j517r82O20J426O39o45j100n68M44J063O21m93j065n25M77J036N48n87
2417D58j099l12P03Q53J38n01o88k32L88O00L32j93o72n67K19Q98N37l69q38m98
2437h43L12Q52N37l36p73m88Q9O61Q63J08j002j127P0J262J149j93j425j134L52
2456a066J441J026k89j348j220J71J535J349j90j628j559J63J962J752m98k256
2472f55j510P40K118J391o91k076j379O61J997J440m96k117j611O15K246J509
$$ plain form
2488 2182 1512 -639 -2170 -1490 690 2087 1381 -562 -1873 -1456 348 1879 1580 -304 -1863 -1587
2504 -1587 260 1838 1596 -225 -1698 -1433 94 1429 1491 233 -1296 -1647 -442 1237 1806 640
2520 640 -1278 -2015 -703 1346 2008 688 -1278 -1991 -805 1155 1975 947 -993 -2076 -1231 935
2536 935 2316 1354 -1063 -2433 -1348 1141 2487 1343 -1166 -2454 -1282 1145 2408 1340 -1034
2551 -1034 -2392 -1390 1023 2439 1428 -1027 -2432 -1370 1099 2390 1261 -1040 -2198 -1196 943
2566 943 2108 1193 -863 -2023 -1169 808 1926 1129 -756 -1820 -1046 736 1667 948 -604 -1441 -904
2583 -904 385 1270 981 -226 -1237 -1086 142 1232 1100 -130 -1187 -1037 84 1081 1017 18 -961 -991
2601 -991 -105 844 1028 310 -773 -1203 -405 902 1326 376 -971 -1317 -328 1027 1327 283 -1028 -1298
$$ packed form
2488B182o70k151j531O80K180J397p06j943j311M17J804J531k99j884j559K76
2504a587J847J578k42j821j473K65J527J335O2j258j529l51J205J679N69j166
2520F40j918p37J312K049O62j320j966p13J186J960Q20j028j940j083Q45K166
2536I35J381r62k417j370J085K489J346j144k509j288J172K427J263j068k374
2551a034j358J002K413J416j011k455j405J062K469J291j129k301j158J002K139
2566I43J165r15k056j160Q54J977J118p97j885j064P74J782R31p19j552q37N37
2583i04J289Q85k89j207j011J51J228J090j32j230j057J50J121R97o4r99r79l0
2601i91Q86R49J84p18j083m30P98J307M24r50j347l46R89J355L00j044j311k70
$$ plain form
2619 -1298 -270 1055 1327 207 -1126 -1278 -156 1102 1283 142 -1223 -1299 15 1282 1159 -127
2635 -127 -1256 -1145 143 1300 1095 -280 -1344 -1030 360 1406 961 -531 -1396 -779 591 1325 742
2652 742 -619 -1342 -613 737 1247 526 -625 -1166 -576 675 1239 524 -690 -1156 -486 686 1191 473
2670 473 -678 -1057 -448 526 1029 571 -510 -1065 -569 409 971 717 -256 -1088 -857 265 1110 889 -164
2689 -164 -1140 -1063 118 1206 1087 -64 -1174 -1257 -49 1323 1381 12 -1352 -1424 -132 1419 1654 151
2707 151 -1570 -1679 -104 1602 1795 167 -1728 -1863 -68 1775 1854 126 -1788 -1953 -63 1903 1905
2724 1905 25 -1823 -1915 -108 1870 1946 25 -1861 -1870 -104 1762 1898 125 -1767 -1842 -124 1621
2741 1621 1815 249 -1605 -1824 -212 1477 1664 330 -1287 -1691 -439 1245 1630 490 -1036 -1586
$$ packed form
2619a298J028J325K72j120j333j52J122J258J81j141j365p6J314J267j23j286
2635a27j129J11J288J157k05j375j064L14J390J046m45j492q65O17J370P34n83
2652G42j361p23P29J350N10p21j151n41N90J251N64p15j214m66O70J172N05p18
2670D73j151l79O09R74N03m58j081n55M96R78N62k54r73q32K31J122Q45k21j053
2689a64r76P7J181J088j19j151j110q3J208J372N8j369j364p2J292J551K35j503
2707A51j721j09J575J706J93j628j895j35J795J843P9j728j914j65J890J966K
2724A905j880j848r2J807J978P6j921j886rJ766J866J36j773j892p5J718J745
2741A621J94j566j854k19J612J689J87j334j617m04J252J684L85j140j526n50
$$ plain form
2757 -1586 -660 955 1646 737 -822 -1568 -863 704 1645 981 -651 -1595 -1045 487 1623 1245 -440
2774 -440 -1710 -1280 422 1691 1358 -339 -1761 -1448 337 1741 1449 -270 -1767 -1555 247 1814
2790 1814 1533 -261 -1808 -1582 230 1860 1587 -325 -1851 -1506 319 1785 1470 -320 -1753 -1396
2806 -1396 340 1676 1359 -312 -1631 -1273 346 1542 1180 -317 -1429 -1110 310 1373 1026 -281
2822 -281 -1235 -954 239 1142 909 -214 -1039 -838 169 958 768 -137 -850 -741 41 736 725 40 -691
2841 -691 -741 -86 639 749 124 -628 -770 -146 592 749 192 -560 -793 -238 577 847 290 -575 -926 -310
2861 -310 680 1011 288 -732 -1022 -255 834 1081 174 -904 -1048 -129 914 1088 139 -1016 -1128 -30
2879 -30 1089 1106 -9 -1167 -1121 105 1221 1053 -182 -1252 -1053 222 1309 1034 -338 -1318 -979 331
$$ packed form
2757a586R26J615O91r09j559p46P05J567R41o64j632r44N50J532J136l78j685
2774d40j270M30J702J269l33j697j422L13J785J404k92j719j497K12J802J567
2790A814k81j794j547K26J812J630k73j912j526L45J825J466l15j790j433L57
2806a396J736J336l17j671j319L58J619J196l62j497j112L19J420J063l47j307
2822b81r54K81J193R03k33j123q25K01J007P89j90r05p13J09P82O95j1o85p31
2841f91n0O55P25J10o25p52j42O24P38J57n57p52k33N55Q15K70n57q65l51O16
2861c10R90L31p23j020k90P67J089K47r07j078j44R19J043J74r49j155j12J098
2879c0J119J7j115j158M6J226J116j68j235j070J99J275J087k75j372r80L39J310
$$ plain form
2897 331 1350 1015 -438 -1428 -889 509 1320 818 -486 -1305 -808 486 1226 799 -384 -1200 -868 381
2915 381 1246 849 -343 -1144 -871 252 1173 893 -248 -1054 -853 78 954 1003 72 -979 -1070 -164 927
2934 927 1190 271 -1003 -1278 -286 965 1261 413 -909 -1421 -510 949 1478 585 -908 -1608 -709 1013
2952 1013 1748 684 -1050 -1731 -726 1059 1832 746 -1092 -1794 -752 1032 1888 882 -1084 -1964
2968 -1964 -807 1157 1926 797 -1126 -1924 -763 1158 1833 723 -1016 -1762 -807 984 1777 797 -916
2985 -916 -1690 -851 862 1720 805 -905 -1576 -725 720 1422 798 -586 -1388 -835 454 1276 926 -306
3003 -306 -1293 -999 302 1257 985 -182 -1164 -1049 107 1126 1059 35 -991 -1145 -192 1063 1302 214
3021 214 -1083 -1278 -233 1093 1354 239 -1102 -1307 -236 1035 1338 351 -1041 -1409 -349 1080 1426
$$ packed form
2897C31J019l35j453r90N39J398Q11n02j304q19M97J294P40m27j183q16L32J249
2915C81Q65l97j192q01K73J123R21k80j141q06K01R31Q76M9r31j051r1R06J091
2934I27K63r19j274k75R92J251K96q48j322n12R11J459N29q93j493p00Q99J722
2952A013P35j064j734o81J005J785P73j086j838p02J042J784Q56j006j966q80
2968a964J157J964P69j129j923p98J161J921O75j110j739p46R55J791P93r80j713
2985i16p74Q39J713Q58r15j710o71Q51J445P02o24j384q02N53J289Q22l50j232
3003c06r87K94J301R55k72j167r82J15J156J019o7j024j026j54R53J255K39j088
3021B14j297j95J045J326K61j115j341k05J071J271L03r87j392l68J060J429L46
$$ plain form
3038 1426 358 -1105 -1467 -299 1197 1395 187 -1151 -1326 -195 1126 1279 158 -1088 -1222 -166
3054 -166 1065 1250 119 -1130 -1165 -3 1078 1022 -24 -1011 -936 66 930 851 -24 -818 -800 1 810
3073 810 802 -6 -773 -742 46 767 678 -97 -689 -548 61 541 515 35 -495 -568 -91 473 585 151 -460 -649
3095 -649 -151 513 659 153 -512 -664 -180 473 689 237 -464 -779 -320 516 918 349 -612 -973 -304 698
3115 698 1017 326 -726 -1073 -289 813 1119 305 -817 -1150 -295 924 1261 290 -1008 -1270 -195 1104
3133 1104 1287 157 -1119 -1251 -105 1129 1246 135 -1140 -1282 -110 1185 1274 76 -1205 -1286 -55
3150 -55 1245 1220 -19 -1188 -1149 -14 1105 1120 74 -1029 -1116 -149 951 1162 242 -930 -1172 -260 888
3169 888 1160 338 -797 -1157 -389 737 1158 517 -594 -1162 -642 543 1247 752 -487 -1272 -853 437
$$ packed form
3038A426j068j463l62J168J496J98j208j338j75J131J321J53j121j246j34J056
3054a66J231J85j131j249l5J162J081n6j046r87P5J002Q64p9q75p94J8Q01Q09
3073H10qq08p67L1P88P21q9p75n92J41O09M80k6m80n30p3M77N64J12m34o11j89
3095f49M98O64J46n06o65j52M84O53K16m52p01l15M59Q36M02n69r61l61O69J002
3115F98L19o91j052l47P84J102L06q14j122l33Q55J219L37r71j298k62J075J299
3133A104J83j130j276j32J146J234J17j111j275j42J172J295Q9j198j281q1J231
3150e5J300k5j239j169L9J135J119J5j046j103q7R67J100K11r20j172k42R12J148
3169H88K72q22j135l60P68J126M21o41j111n68N20J185P04m95j239p85M19J290
$$ plain form
3187 437 1348 938 -429 -1381 -994 355 1412 1117 -336 -1485 -1167 324 1519 1224 -317 -1600 -1274
3204 -1274 346 1593 1261 -334 -1592 -1298 326 1635 1304 -306 -1618 -1322 309 1656 1338 -347
3220 -347 -1627 -1243 340 1560 1229 -324 -1525 -1164 316 1414 1130 -217 -1351 -1127 204 1299
3236 1299 1114 -143 -1222 -1085 113 1151 1022 -60 -1013 -996 -51 944 1003 86 -855 -971 -212 726 1006
3255 1006 304 -730 -1039 -356 652 1039 421 -615 -1056 -475 582 1085 542 -554 -1109 -560 587 1130
3273 1130 581 -526 -1127 -625 571 1225 615 -594 -1165 -588 601 1223 617 -651 -1231 -553 691 1226
3291 1226 512 -732 -1226 -431 778 1175 395 -784 -1147 -344 816 1098 256 -802 -1043 -235 792 1010
3309 1010 171 -826 -960 -117 801 901 96 -797 -821 -19 761 773 30 -706 -729 -10 692 684 23 -630 -652 -47
$$ packed form
3187D37R11m10j367r52L87J349J057k95j453j149L18J491J195k95j541j283L26
3204a274J620J247l32j595j258K94J624J309l31j610j312K96J631J347l18j685
3220c47j280L84J583J220l31j553j201L61J480J098k84j347j134K24J331J095
3236A299j85j257j079J37J198J038j29j082r53J7R45R95N9r17r41j16P59R38K80
3255A006p02j034l09O83J008L87o18j036m41N81J057N03n43j096n55N49J147N43
3273A130n49j107o01N02J196O54o10j209n71N77J189O22o06j268n80O78J244N35
3291A226p14j244m94P95J209L97p80j179l63Q03J160K82q42j058k41Q08J027K18
3309A010q39r97j34Q43R18J00q05q93k4Q02P80J2p43p36k3P19P02qo61o53k2O05
$$ plain form
3331 -47 620 666 81 -558 -626 -79 545 656 134 -516 -671 -186 466 707 263 -478 -786 -320 477 830 368
3352 368 -479 -909 -439 501 977 502 -533 -1064 -544 549 1130 593 -589 -1223 -620 651 1304 645 -689
3371 -689 -1333 -626 749 1395 665 -769 -1434 -642 824 1473 655 -848 -1473 -630 883 1516 614 -897
3389 -897 -1496 -577 914 1460 554 -881 -1444 -568 864 1411 565 -836 -1382 -587 778 1349 581 -717
3407 -717 -1285 -625 640 1251 636 -566 -1201 -714 430 1168 787 -361 -1159 -831 289 1132 914 -172
3425 -172 -1106 -964 112 1079 1049 16 -1069 -1154 -65 1098 1215 126 -1093 -1287 -191 1138 1349 198
3443 198 -1140 -1382 -253 1164 1420 260 -1187 -1442 -284 1168 1482 282 -1232 -1467 -247 1210
3459 1210 1418 253 -1192 -1446 -244 1182 1394 212 -1162 -1367 -221 1155 1317 168 -1093 -1238
$$ packed form
3331d7O67M6n85o39o8N47O24J11n22o50j55M85O52K41m44p41l08M66P97L53m62
3352C68q47m30M70R40M76m75j035n31N20J093N81n37j182o34O03J271O53o59j334
3371f89o44P07J375O46p30j434o65P92J466O49q18j503o25Q43J513O33r02j511
3389h97n99R19J491N46r06j435n63Q76J432N47q46j401n46P95J365N71p68j298
3407g17n68O60J265O11o15j202o35M87J144P38l81j148p98L28J120Q43k18j086
3425a72r34J42J076R67l0j033j085q5J089J163J17j089j219j94J096J329K11j151
3443A98j338k42J129J417K56j160j447k55J158J452L14j200j514k35J220J457
3459A210K08j165j445k54J202J426K12j182j374k05J146J376J62j149j261j45
$$ plain form
3475 -1238 -178 1036 1198 153 -991 -1086 -153 874 1048 245 -810 -1036 -210 772 960 249 -671 -913
3493 -913 -276 615 870 292 -508 -839 -373 442 811 387 -379 -800 -504 307 853 507 -349 -829 -506 275
3513 275 806 579 -250 -860 -610 267 875 628 -252 -919 -638 320 941 625 -322 -973 -643 395 1020 599
3533 599 -401 -988 -591 432 1071 602 -526 -1099 -509 592 1087 486 -631 -1091 -396 698 1024 354
3551 354 -676 -1035 -332 705 996 268 -723 -999 -284 736 994 190 -785 -923 -145 730 864 142 -711
3570 -711 -823 -127 655 792 179 -642 -817 -184 623 786 197 -576 -775 -231 546 773 269 -465 -770 -363
3590 -363 413 816 444 -400 -862 -513 367 933 582 -374 -957 -614 347 995 706 -318 -1082 -803 297
3609 297 1133 856 -317 -1229 -924 349 1288 922 -377 -1331 -949 394 1354 959 -401 -1366 -1001 397
$$ packed form
3475a238J060J214J62j045j144r5R33J027J74q03j055k26Q26R82J88p11r20k42
3493i13O37Q91K55n78q00l31M66Q15L69m24p66m21K96Q11N46l46q56m80L23P81
3513B75N31k27q29o10K50Q77O08k47q80o67K81R58O21l16r47o51L30J038O25m21
3533E99j000n87L97J023O39m69j128n73N90J101M95o01j117m60O95J094L26o70
3551C54j030l59P03J037K91p28r91k76P15J020K58q04r75j38P78Q75J34p22q53
3570g11j12O96P82J37o13q21j75O33Q07J63n89p73j99N44P77K27n04p34l05M07
3590c63P76M03l72q44m62L49Q80N66l51r56n83L43R61O48k89j024p64K79J100
3609B97Q36k77j173r12L05J273R39l66j299r54L82J343R60l95j360r65L65J398
$$ plain form
3627 397 1411 1019 -423 -1442 -999 460 1464 988 -460 -1416 -917 468 1375 926 -419 -1318 -913
3644 -913 385 1293 916 -354 -1258 -907 330 1207 873 -298 -1140 -855 224 1044 848 -140 -980 -889 18
3663 18 919 925 22 -895 -962 -117 837 982 168 -802 -1010 -269 732 1048 350 -716 -1112 -418 699 1164
3683 1164 488 -693 -1207 -504 737 1231 529 -695 -1237 -540 708 1280 572 -704 -1293 -598 725 1323
3701 1323 556 -761 -1286 -527 756 1258 493 -777 -1227 -449 754 1169 428 -739 -1176 -432 732 1116
3719 1116 379 -727 -1095 -333 741 1014 268 -690 -925 -267 614 873 255 -571 -809 -260 511 778 296
3738 296 -479 -747 -257 449 683 305 -364 -659 -292 339 631 326 -264 -606 -390 234 631 402 -234 -633
3758 -633 -440 198 644 434 -231 -680 -474 178 677 500 -222 -761 -537 231 767 536 -275 -847 -546 347
$$ packed form
3627C97J014l92j442j019M43J459J004m76j448r56M99J385R07m49j345q99M05
3644i13J298R08l77j270r04L51J237Q77l34j171q42K85J079Q20j96r88q40R1R07
3663A8R01Or03r17o7Q45R54J45q14r70k08P41J001L16o98j066l96O94J117M65
3683A164o76j181n14P03J241M94p02j224n42O97J248N72p08j276n89O95J323N98
3701A323p67j317n25P59J283N02p65j270m50P78J203M15p41j167m37P44J164L84
3719A116p37j106l68P62J074K73p46r58k35O58Q81K59o18q26k38N49P71K67m82
3738B96p75k68M90P06K34l78o69k95L67O31K92l05n90l42K16O24L97k29o36l99
3758f33J93O38M46k10o65m49K06O52M99j77p22n39K24P68N36k31q11n72L01Q93
$$ plain form
3778 347 883 522 -374 -902 -535 399 948 527 -443 -967 -523 488 1032 496 -570 -1035 -423 617 1033
3797 1033 417 -641 -1044 -367 671 1015 337 -659 -1001 -324 684 987 300 -669 -983 -303 663 946 279
3816 279 -658 -909 -278 602 876 292 -607 -865 -297 524 810 337 -490 -835 -381 434 799 412 -372 -826
3836 -826 -487 319 846 552 -269 -849 -633 234 893 688 -182 -893 -746 153 941 815 -144 -977 -848 104
3856 104 987 937 -83 -1049 -987 94 1088 1004 -90 -1130 -1044 95 1151 1030 -125 -1164 -1061 120
3874 120 1156 1027 -130 -1157 -1031 109 1148 1009 -141 -1131 -982 141 1114 949 -116 -1059 -922
3891 -922 143 1015 895 -99 -951 -845 81 898 831 -17 -826 -809 -12 774 778 60 -706 -783 -115 643 786
3912 786 178 -596 -780 -229 537 790 288 -499 -823 -346 462 822 374 -458 -857 -440 413 862 467 -415
$$ packed form
3778C47N36l61q96n28L67R34N49m21r70n24M44J011N44n36j066m65O12J040M16
3797A033o16j058m03O77J038L44o78r96l42O77J008L03o87r69l14O80R66K83o67
3816B79r37k51O31Q80K74n84q99k58N68Q21K86m73q27l45M54Q15L65l87p84m54
3836h26L39Q06N27k94q21n80K16Q67O59k05q70p11J47Q99P88j26r59q33J29R52
3856A04Q83n0j020r66O2J081R94q4j094j040Q6J139J056j21j155j039J03J181
3874A20J036j29j157j027J26J140J039j39j150r90J49J123R73j65j065r43J37
3891i22J065Q72j20r94q52J06R26Q17o7q48q09J7P97P86Mp18p66p7O68P58J43
3912G86o08p74j84N51P66K53n02p87l24M77Q08L60m48q32l99M17Q53M49l95q82
$$ plain form
3932 -415 -915 -506 408 935 512 -421 -940 -521 426 960 524 -435 -956 -499 474 955 485 -456 -939 -453
3952 -453 491 929 442 -497 -914 -403 530 885 353 -544 -859 -311 518 821 268 -555 -802 -241 532 737
3972 737 208 -529 -709 -182 515 662 138 -486 -619 -147 457 577 134 -410 -536 -154 388 543 157 -362
3992 -362 -504 -161 331 499 191 -297 -496 -202 288 501 246 -237 -501 -255 233 532 306 -232 -564 -340
4012 -340 240 595 355 -263 -617 -390 245 662 419 -296 -721 -436 303 740 442 -340 -812 -454 370 823
4032 823 436 -413 -876 -439 445 884 437 -452 -896 -440 506 934 419 -523 -933 -401 544 930 378 -539
4052 -539 -909 -344 551 898 357 -518 -875 -346 512 849 351 -483 -834 -354 466 791 348 -423 -758 -370
4072 -370 382 735 387 -328 -710 -411 274 690 450 -232 -692 -496 176 672 545 -131 -680 -564 85 686
$$ packed form
3932d15n00M09R14N27m23r33n19M19R47N34m36r59n21M57R73M81m70r41m83M86
3952d53R44M38m87r39m17N11R33L55n32q97l15N48Q29L03n53q23k47N61P73K05
3972G37n29p37j80N27O97J47n24o24j33M72O04J20m43n44j26L82N42J55l86n19
3992c62j42L43M92J68l08m88j99K94M90K13k55m83k64K46M88K99k26n38l32K24
4012c40N80L55k40o18l54K27O35M17k43p15m25K85P39M37k98p82m72L58Q24M53
4032H23l87q49m63M37Q84M39m47q89m44M56R46M28n15r42m10N32R45L86n52r17
4052e39l70N65Q95L47n41q75l57N29Q58L37m98q34l51M80Q20L25m43p71l35L88
4072c70P52L53l48p15l82K99O85M16k40o82m60J96O72M96j27o76n49J16O49O01
$$ plain form
4092 686 623 -31 -689 -682 11 722 731 14 -719 -751 -40 744 787 54 -752 -829 -71 778 863 75 -784 -864 -80
4115 -80 801 875 58 -827 -864 -40 812 850 25 -795 -828 -35 777 798 19 -764 -781 -31 723 742 13 -705 -711
4138 -711 -20 667 672 9 -635 -624 -30 583 603 57 -537 -586 -73 507 579 96 -449 -525 -115 402 531 162
4160 162 -352 -502 -178 328 538 228 -286 -528 -252 268 537 258 -254 -553 -310 251 559 311 -231 -567
4180 -567 -349 222 582 355 -236 -614 -352 267 613 339 -283 -630 -326 292 613 310 -302 -635 -285 348
4200 348 623 271 -343 -615 -252 382 615 213 -411 -585 -167 411 569 147 -409 -541 -119 424 532 112
4220 112 -430 -520 -93 404 474 63 -416 -476 -52 393 429 52 -379 -423 -84 337 403 71 -340 -404 -97 304
4242 304 390 89 -296 -390 -111 268 395 154 -239 -398 -164 238 408 205 -216 -449 -228 221 473 249 -225
$$ packed form
4092F86o3o54o58PO93P11Rp17p33l2P11P84M3p33q06p7P58Q49Q5p88q59q0P84
4115h0Q81P4q17q85l7Q24Q52L8q25q20l3P93Q12K1p79p83j7P50P54J9p29p18o
4138g11O91O87No63o44J1N94O13K0n46n94m9N13N80P2m83n45p6M10N17J29l69
4160A62n14j50L24N06K10l10n14k42K76N20K69k79n12k99K43N61L08k48n42l36
4180e67K18N71L60k27n91l78K62O19L46k74o22l47L04O18L21l03o12l33L50O33
4200C48K75l52o14k72L63O34K33m02o24j74M18N78J58m22n56j32M22N43J08m20
4220A12n42r0M27M97P0m11m79o0M24M45L6l77m31m4L39M21O6l32m11o4L07M01
4242C04Q6l01l85r4K79L79J27k41l93j59K34M02J70k03m21k33K21M49K52k24m74
$$ plain form
4263 -225 -501 -282 219 531 306 -219 -545 -347 223 576 356 -261 -627 -375 258 641 362 -295 -678 -380
4283 -380 292 665 377 -294 -697 -391 314 703 374 -325 -704 -380 334 709 365 -353 -689 -351 332 679
4303 679 351 -311 -653 -330 309 637 347 -286 -625 -319 259 579 331 -229 -557 -336 198 505 332 -147
4323 -147 -477 -353 104 483 361 -82 -457 -398 35 434 413 -12 -421 -426 -30 393 457 60 -416 -495 -83 402
4345 402 518 113 -429 -550 -119 420 556 143 -428 -563 -139 451 601 148 -427 -575 -145 447 589 144
4365 144 -453 -592 -136 455 559 116 -463 -554 -101 421 531 93 -431 -511 -77 398 466 63 -406 -460 -76
4386 -76 359 410 43 -353 -392 -60 311 374 46 -307 -355 -64 264 320 66 -245 -309 -71 225 299 90 -165 -283
4409 -283 -105 180 283 130 -139 -281 -135 139 295 163 -125 -288 -166 124 301 186 -115 -314 -195 121
$$ packed form
4263b25k76K19N01L12k25n25l26J98N70L53k20o17l66K52O33L83k79o57l83K98
4283c80O72L73k88o71m03L06P05L89l29o99l79L24P14L75l44p18l36L38O83L47
4303F79l28o62l42L23O39L28k90o33l39L06N78L20k48n60l28K21N34L07j73m79
4323a47l30J24M57L79j22m43l75N9M33L99k1m25m09nL96M23O4l97m76p9M12M85
4345D02J16m05n42j21M31N39J36m13n71j35M24N90J50m53n75j48M30N92J42m45
4365A44n97j39M56N91J04m43n79r1M53N22J10m38n24q0M34M75O8m03m69n4L84
4386g6M35N1l67l96l9L32L71O3l28l53m8K91L28N6k54l11o4K38K96P4k09k55j18
4409b83J78K85J03j53k69j42J46K74J56j32k88j63J22K90J77j15l01j99J19L16
$$ plain form
4429 121 321 209 -133 -351 -216 118 353 209 -170 -382 -216 164 376 205 -192 -396 -195 202 412 172
4449 172 -221 -397 -176 244 407 157 -264 -415 -137 270 415 120 -288 -404 -113 287 392 99 -290 -382
4469 -382 -81 287 361 68 -301 -356 -75 283 347 76 -277 -342 -85 243 323 79 -249 -332 -107 205 315 107
4491 107 -200 -330 -144 155 300 150 -158 -323 -160 145 326 206 -118 -317 -215 104 340 245 -82 -343
4511 -343 -271 83 380 301 -65 -375 -316 75 417 344 -57 -419 -355 65 425 373 -63 -454 -376 65 477 382 -75
4534 -75 -463 -393 73 466 386 -76 -474 -396 85 454 378 -95 -476 -381 76 441 364 -72 -430 -344 62 408 333
4557 333 -58 -378 -329 37 361 333 -12 -318 -303 7 310 315 22 -276 -293 -29 255 289 70 -228 -305 -94 210
4580 210 307 106 -185 -325 -129 187 336 163 -166 -343 -188 162 348 186 -173 -357 -205 162 371 229
$$ packed form
4429A21K00j12l42k18J35L34K35j44l79k12J66L80K12j71l97k04K01L97K10k40
4449A72l93j76K21M20J63k50m21j51K78M07J45k95m08j16K91M00J05k93l89r2
4469c82L01L68P4k93l69n5K81L58O4k71l53o5K57L28Q0k44l28q3K25L12J10k08
4491A07l07j30J86K99J45j50l08j65J63L05J81j20l24j99J02L19K36r5l27k61
4511c43P2L54K97p9l66l10N9L91L42p3m01l62O4M20L60n2m36l91P8M41M12r5m57
4534g5l88P0M66L93q0m62l98P8M81L69p6m73l81R5M57L65p7m36l58Q6M06L46p5
4557C33l91l20M9L66L24k8l45l06J5L10L03Nk93k98j7K64K84L4k19k98p7K11L04
4580B10R7k01k91j40J96L16J49j73l29j77J55L50J86j62l59j84J52L67K09j42
$$ plain form
4600 229 -162 -390 -224 176 398 228 -170 -392 -224 174 396 211 -172 -390 -207 191 403 200 -178 -369
4620 -369 -182 214 380 166 -203 -355 -146 199 340 142 -197 -326 -121 193 309 111 -182 -310 -98 178
4640 178 261 77 -171 -258 -87 148 218 74 -156 -224 -87 124 206 84 -119 -205 -90 103 206 105 -94 -196
4662 -196 -103 82 191 124 -61 -200 -135 70 231 163 -58 -224 -169 64 246 185 -62 -251 -187 65 265 214 -64
4685 -64 -282 -220 81 318 229 -92 -330 -228 103 334 223 -112 -360 -236 121 362 218 -145 -379 -225 151
4706 151 380 222 -157 -391 -220 187 397 206 -174 -379 -185 179 391 198 -175 -367 -189 187 373 207
4726 207 -158 -357 -180 162 344 189 -127 -326 -194 119 311 192 -95 -304 -223 76 283 229 -53 -293 -256
4747 -256 32 274 260 -15 -269 -286 -23 266 310 33 -275 -329 -53 281 345 70 -294 -356 -62 299 392 98
$$ packed form
4600B29l91k28J66M00K22j70l98k22J68L98K22j85l83k18J83L98K12k03l78j91
4620c69J87L96J66k14l69j52K09L45J41j98l39j29K05L14J16j98k93j28K12K76
4640A78Q3j84k48q7J71K35P0j44k30o8J37K11Q2j22k03q6J15J93J03j01j99j02
4662a96R3J85J09o7j85j39O5K05J61o8k21j66N5K33J82o1k47j89O4K52K00n1k78
4685f4k18O2L01K37q9l21k38J02L31K31j11l35k48J24L57K41j44l63k34J54L76
4706A51K29j58l79k34J71M07K10j91l80k05J94L64K12j93l73j92J78L76J86j66
4726B07l65j99J77L42J82j55l16j99J32L13J92j19k87k09Q1K99K07n4k82k40L7
4747b56K88K42j4k75k54j7K63K89M4k77l08n4K76L34O4k75l64o2K94L61R3k94
$$ plain form
4769 98 -295 -391 -81 322 418 111 -314 -404 -79 334 439 101 -333 -420 -91 341 425 82 -350 -431 -84 334
4791 334 412 73 -327 -401 -75 315 375 64 -320 -369 -67 293 348 51 -267 -336 -67 252 312 68 -226 -299 -71
4814 -71 216 293 86 -189 -269 -92 172 262 107 -138 -247 -114 133 263 146 -102 -253 -154 93 265 164 -93
4836 -93 -266 -194 77 274 184 -83 -279 -214 74 286 214 -85 -315 -220 97 304 215 -106 -321 -208 106 315
4858 315 216 -124 -340 -197 131 319 184 -135 -332 -169 169 336 154 -160 -313 -139 189 323 132 -176
4878 -176 -306 -106 193 303 118 -178 -275 -92 194 279 78 -191 -260 -72 185 248 64 -175 -239 -70 163 224
4900 224 64 -162 -238 -77 145 217 73 -133 -214 -92 121 219 99 -112 -230 -126 102 245 159 -85 -246 -149
4922 -149 94 265 185 -74 -260 -194 93 290 213 -84 -296 -231 87 324 235 -81 -342 -248 104 356 262 -106
$$ packed form
4769I8l93r6L10M03R6l07m25r0L25M13J05l38m34q7L29M32Q4l43m32q1L47M18
4791C34P8l39m00p4L26L90O0l11l84m9L02L60N5k97l18o9K69L19O0k44k94p3K28
4814g1K87P7k07k75q0J77K64R0j55k45j09J33K47J30j17k48j51R9K47J72j01k57
4836i3j73P2K71J97r0k67j96O5K88K12p2k99k30R5L17K07q9l21k15J13L14K09
4858C15r9l40k16J43L28J88j35l19j97J63L38J67j82l14j53J74L28J34j91l08
4878a76j30K00K99J10j85k96r7J83K86Q5k01k69o9J88K57O3j84k39o4J69K33O1
4900B24j60k26p6J61K22P2j44k06q1J22K13R8j20k11j18J04K28J43q6k44j61R7
4922a49K43J71q0k59j86O6K87J97p7k97k12O5L18K37q9l16k61R4L52K52r4l68
$$ plain form
4944 -106 -369 -265 116 380 261 -123 -388 -248 135 396 257 -138 -409 -263 152 415 256 -153 -402 -234
4964 -234 143 400 240 -138 -388 -232 152 375 242 -127 -360 -226 139 344 233 -97 -319 -213 90 298
4984 298 223 -74 -306 -227 47 299 246 -28 -267 -265 8 250 264 8 -247 -278 -38 240 290 55 -230 -304 -81
5007 -81 244 321 94 -231 -329 -103 237 346 101 -247 -357 -111 249 371 123 -243 -379 -116 268 388 118
5028 118 -257 -376 -102 292 380 107 -259 -370 -87 278 359 90 -259 -342 -68 268 333 63 -263 -321 -51 243
5050 243 287 49 -243 -283 -45 213 254 40 -198 -241 -47 179 216 45 -176 -211 -48 147 203 65 -120 -188 -66
5073 -66 131 179 76 -94 -182 -69 107 184 94 -83 -190 -94 94 203 113 -89 -211 -129 99 210 130 -99 -234
5096 -234 -139 101 240 130 -114 -253 -136 107 269 113 -151 -285 -138 142 270 117 -172 -292 -111 177
$$ packed form
4944a06k63J04L81K64j19l84k65J40L83K61j39l95k71J46M15K63j59m09k49J68
4964b34L77K57j60l78k50J56L84K23j33l69k33J34L65K05j11l30k22J06L03K08
4984B98p5k97k32P9K74K52n3k74k39KK73K42J4k56k55l1K40K78N0k35k85p4K23
5007h1L25P7k27l25r8K26L40J09k45l48j10K46L60J22k48l66j36K63L84J20k70
5028A18l75j19K74L94Q8k73l66j11K83L65Q1k69l49q3K74L36O5k70l26n8K70K94
5050B43M4k38k92m0K38K58M1k14k38m3J94K26L7j71k21l5J63J95N6j38j85o8J22
5073f6J97M8j03j70q8J13J76P7r0j77j07R6J88J09r0k02j22Q2K28J11q0k29j35
5096b34R5K40J39j10k44j39J17K43J62j56k64j34J47K80J28j53k89j20J81K88
$$ plain form
5116 177 279 115 -200 -285 -76 202 281 82 -195 -270 -56 221 278 54 -211 -248 -29 237 265 53 -222 -241
5138 -241 -23 209 246 32 -204 -238 -21 201 238 35 -181 -220 -42 176 220 50 -153 -213 -67 146 227 63
5160 63 -145 -232 -89 128 235 114 -117 -233 -127 112 241 147 -93 -254 -163 96 269 192 -85 -272 -187 99
5182 99 287 215 -82 -287 -211 91 322 223 -91 -318 -206 99 329 216 -108 -335 -224 101 335 221 -124
5203 -124 -339 -227 121 326 213 -119 -338 -211 121 324 195 -115 -315 -191 120 301 185 -101 -287 -177
5223 -177 104 282 181 -99 -261 -168 86 241 168 -52 -212 -155 68 217 174 -18 -180 -160 9 181 176 11
5245 11 -167 -186 -11 162 191 17 -153 -201 -47 154 214 42 -156 -217 -73 162 226 60 -170 -242 -87 165 234
5268 234 57 -186 -239 -69 167 237 55 -178 -241 -39 190 228 34 -201 -229 -30 198 213 24 -190 -208 -3
$$ packed form
5116A77J02j64l15q5K09K78P9j99k77p5K14K77N7k24k65l7K19K66K8k12k75j9
5138b41K18K32L7k14k36l4K17K22L7k03k16l9J78K18M4j70k03o0J46K13Q1j64
5160F3k08q7J43K17J07j21k31j16J06K39J29r4k40j61R1K59J73p7k77j87Q5K86
5182I9J88p2k97k05P6L02K31r9l14k27J12L05K30j13l24k27J11L25K34j14l45
5203a24k15J12L48K05j13l32k19J27L32K03j29l10k00J24L11J81j16k86j86J10
5223a77K81J78j01k80j62R3K54J55p3k20j60N7K23J49m3j92j62K0J69J72nj65
5245A1j78j9J75J73K9j74j70m8J54K01O0j72j98o1J44K35O4j66k30p2J55K52O9
5268B34j77k43n3J70K36P0j82k33o3K02K29L8j94k35k8J99K28J5j89k14j8K05
$$ plain form
5290 -3 191 205 5 -178 -186 -10 195 179 -4 -186 -165 18 161 148 -18 -168 -134 21 156 130 -24 -148 -108 12
5314 12 124 112 -26 -130 -111 9 117 102 -3 -104 -105 -2 101 98 9 -92 -106 -14 97 120 31 -94 -124 -26 107
5339 107 134 37 -92 -146 -32 113 152 57 -118 -167 -55 127 179 35 -135 -200 -57 151 196 47 -159 -212 -53
5362 -53 151 199 32 -175 -219 -38 166 197 33 -182 -207 -25 176 203 12 -186 -189 -7 184 196 15 -172 -192
5385 -192 -20 170 185 21 -161 -177 -1 173 174 18 -141 -157 -14 144 169 25 -128 -154 -45 124 168 48 -114
5408 -114 -169 -70 102 168 63 -95 -168 -79 73 173 90 -69 -177 -109 65 170 116 -58 -194 -121 53 195 140
5431 140 -52 -178 -140 63 201 161 -45 -197 -153 57 214 167 -47 -209 -151 60 214 161 -54 -210 -137 66
5453 66 207 147 -59 -198 -149 57 193 133 -65 -200 -129 51 182 122 -56 -178 -113 46 164 106 -49 -152 -111
$$ packed form
5290cJ94J4k00j83qJ76K05j6j83j82K1J83J43j3j66j50L4J55J35k6j54j24M0J20
5314A2J12j2j38j04J9J20J08j5j05j01jJ03J03lq9j01j4R2J11K3q9j25l0R8J33
5339A07K7r7j29n4J14J45L9r5j75m9J12J82N2j44j70o5J43K08M5j49k06n3J59
5362e3K04M8j67k07m4J81K04L1j64k15k5J82K01K7j91j98lJ82J91J2j81j87k0
5385a92J72J90J5j64j82j6J76J74Jj56j59j6J43J58K5j44j53k6J09J69M4j20j62
5408a14n5R9J72O6j05j58p3Q9J52J00q3j59j08O8J74J05n4j74j36P3J74J42n5
5431A40j92j26L8K03J38m0k06j52M4K10J57m7k14j62N8K11J54n3k15j56P3K03
5453F6J41o0k06j39M9K06J36o0j98j35P1J80J31o0j78j22O5J59J18n8j55j03M1
$$ plain form
5476 -111 44 145 110 -25 -114 -91 26 121 111 -7 -107 -97 1 113 91 19 -77 -83 -3 99 116 35 -73 -98 -16 90
5502 90 122 48 -66 -103 -34 79 120 46 -86 -133 -43 73 131 39 -94 -136 -43 94 136 32 -94 -139 -32 100 138
5527 138 31 -110 -141 -37 115 143 28 -106 -123 -5 116 140 9 -119 -112 4 129 115 -8 -114 -104 19 129
5550 129 111 -18 -102 -88 23 113 89 -12 -108 -84 16 109 80 -15 -93 -85 18 96 84 -9 -83 -70 2 80 86 -3 -76 -87
5578 -87 -21 75 87 23 -77 -89 -27 77 111 42 -61 -100 -28 75 134 69 -76 -126 -45 85 149 77 -70 -140 -59 89
5604 89 161 77 -71 -161 -72 98 169 72 -82 -165 -70 98 172 74 -98 -169 -73 89 177 57 -99 -161 -66 103 156 73
5630 73 -103 -170 -79 88 150 58 -97 -157 -59 89 157 80 -78 -129 -63 74 143 88 -52 -112 -66 58 135 81 -22 -113
5656 -113 -72 38 126 100 -12 -98 -106 17 112 97 -1 -116 -113 -6 104 121 9 -107 -122 -23 102 134 27 -106 -133
$$ packed form
5476a11J55J01l5j35q9K3J17R5j0j18j00J0R8J12k2p2r6oQ0J02J7q1j08k5Q2J06
5502I0L2p4j14l7O9J13M1p4j32m7R0J16N8r2j33m2R3J37M2j04j26m5J07J32L8
5527A38j07j41l1J04J52K8j15j34j7J18J21K4j31j28PJ16J25j4j23j06J0J23J10
5550A29j8j29q4J4J11R0k4j01r6K4J00R3k9r5p8QJ03P8j2r3p4J3P2P8Oq9p3j1
5578h7O6R6J2o4j00j2O2J04L4o9j03l9P2J03N9o5j45n0Q1J30O4p2j47p0Q1J48
5604H9P2q4j48r0Q9J70P1r7j54q3R5J68P4r8j72p1R6J62Q8j20j56o2R5J69N3q3
5630G3j76o7R1J67O2r2j55o0R8J48O8p7j58n1O6J37O9n5j40o0M6J24P7n4j03r1
5656a13M1J10Q8k6j12q6qJ23R5j5r8j15LJ07J10J7j12j16j5R9J25L2j07j33k7
$$ plain form
5681 -133 -31 108 136 29 -113 -145 -19 110 148 47 -116 -147 -11 138 154 30 -112 -133 -23 128 145 29
5703 29 -105 -125 -20 122 137 19 -105 -113 -4 101 123 18 -109 -112 -10 87 98 1 -98 -97 -7 79 72 13 -80 -82 -15 68
5731 68 82 10 -67 -76 -18 60 83 16 -39 -80 -17 47 90 51 -33 -74 -29 51 91 53 -25 -76 -45 36 93 49 -31 -75 -57 46
5761 46 101 61 -39 -95 -51 53 117 58 -64 -106 -66 61 113 59 -76 -120 -62 57 117 53 -78 -127 -45 72 125 38
5787 38 -76 -116 -41 88 124 37 -85 -121 -32 91 128 41 -75 -113 -29 88 127 41 -76 -98 -16 76 119 37 -69 -99
5813 -99 -30 67 104 50 -56 -97 -39 63 89 46 -46 -98 -66 32 93 54 -31 -107 -75 26 97 94 -22 -99 -84 15 125 100
5841 100 -14 -120 -115 17 124 114 -14 -119 -116 18 137 134 12 -134 -124 9 147 140 3 -133 -120 9 137 135
5865 135 7 -146 -124 8 145 130 -8 -136 -130 3 134 135 -15 -126 -122 -5 121 116 1 -123 -122 10 127 124 6
$$ packed form
5681a33J02J39K8j07j42l2J26J29L8j01j63l1J36J49J6j24j42k1J10J51J7j16
5703B9j34k0J05J42J5j18j24qJ09J05K2j05j27lJ02R7J1r7r9JR0Q6pn9r3kO7Q3
5731F8J4p2p7rN8P8K3o7n5m1O3O4M3l9q4m1M5Q0M0l8p8n1L1Q1N7m4q0m4J8J03
5761D6N5m0j00n6M4J04O4n9j22m2M0J27N2n4j35m4N8J19O0o4j31m9Q2J17N3q7
5787C8j14m0P5J29L6q7j22l6Q9J23L7q7j16l8Q4J17L9q6j17k2Q2R2M3q2j06l0
5813i9O9R7L7n4j06m1N8J02K6m3r2n2L2R8O1l9q5p6L2J01P1lj16p7J5R9J10k5
5841A00j14j06NJ32J07j0j28j05LJ34J19lj22j46J0J33J38pj37j36J3J29J28k
5865A35j28j53K2J32J37j5j38j28OJ33J31Jj50j11MJ17J26nj15j24JJ32J17lj18
$$ plain form
5890 6 -103 -110 -4 104 117 16 -89 -108 -24 93 113 34 -66 -105 -25 87 110 53 -57 -105 -33 71 112 58 -52 -113
5916 -113 -59 48 123 85 -39 -116 -80 44 131 82 -42 -127 -101 42 118 87 -50 -142 -97 34 127 85 -49 -129 -81 56
5942 56 134 82 -47 -139 -76 63 134 81 -54 -127 -69 62 121 81 -56 -118 -56 71 132 65 -57 -118 -57 72 117 53
5968 53 -57 -107 -46 45 99 42 -62 -95 -38 47 104 42 -40 -91 -43 26 76 37 -35 -84 -45 25 69 58 -30 -80 -54 21 78
5997 78 72 -2 -81 -65 22 95 84 -2 -90 -69 24 101 92 -6 -103 -81 28 107 108 -8 -118 -113 21 117 106 -26 -131 -116 16
6026 16 146 110 -28 -138 -105 38 141 105 -44 -163 -109 33 138 106 -43 -160 -119 37 149 111 -33 -157 -100
6049 -100 29 144 104 -46 -139 -95 30 134 101 -21 -126 -96 39 132 112 -19 -120 -105 11 114 105 -6 -115
6072 -115 -126 -11 104 110 2 -105 -134 -18 104 133 19 -98 -142 -48 98 152 38 -113 -155 -54 97 165 61
$$ packed form
5890Fj09pJ06J08J3j01j05j9Q4J17K0p9j00l9Q0J12K3n7j10m8P2J04M1n4j10o1
5916a13N4J07P5l8j24p7L6J24Q7m9j24q5K6J43P6l1j37r2M5J31R3m2j34q0M8J37
5942E6P8n2j29r2O3J39P1n3j35p3N8J31N9m0j37o2O2J27O1o7j22o1O1J29M5o4
5968E3j10n0O1R1N4n7j04l3N7Q5N7o2q2n1M8O9N0l9p2m9L9P0M4j1q8n0K6P5N7
5997G8op4p9J6Q7P3j1q6q8K1R3P7rr8r7K2J09P9Jj16j10NJ34R6j1j32j05J5J32
6026A6J30l6j38j10L3J43J03l6j49j19N4J42J05l2j49j17M1J56J12l8j44j24N7
6049a00J29J15m0j50r3M4J25J04l3j22j05L0J35R3k0j31j01J5J16J03rj11j09
6072a15j1J15J15Oj08j07k9J16J22K9j14j17m4R4J46N4j14j51m2J01J51O8j04
$$ plain form
6095 61 -93 -156 -55 120 180 83 -98 -164 -58 113 181 70 -109 -182 -64 117 184 76 -108 -169 -57 124 186
6118 186 83 -100 -167 -69 115 169 75 -111 -172 -73 90 152 46 -103 -152 -63 82 149 48 -91 -150 -71 71 130
6142 130 51 -75 -129 -69 57 124 70 -57 -108 -80 53 114 80 -32 -116 -84 33 124 94 -15 -113 -92 20 121 104
6167 104 -6 -105 -101 26 117 130 -2 -115 -110 10 126 117 -8 -133 -116 20 129 115 -21 -142 -124 11 140 122
6191 122 -30 -149 -128 31 144 102 -42 -150 -112 41 146 107 -40 -144 -88 57 156 102 -42 -141 -80 55 148
6214 148 85 -47 -128 -77 58 123 94 -44 -109 -75 54 115 69 -47 -119 -72 32 112 63 -47 -109 -84 25 115 81 -17
6240 -17 -111 -98 10 101 88 -4 -116 -120 -5 112 107 -5 -108 -124 -11 114 133 13 -113 -135 -3 139 158 17 -125
6265 -125 -148 3 147 172 32 -144 -176 -5 157 180 15 -159 -167 -15 152 166 -2 -173 -186 -17 165 168 0
$$ packed form
6095F1j54o3J01J75O0r7j81o6J06J71O8j11j79p3J18J81O7j08j84o1J12J81O2
6118A86j03j83o7R8J84N4r4j86o1R9J63O2j06j49m9Q9J45O7j01j39n9P9J42N9
6142A30p9j26n4O0J26O7n4j27n1K8J33O1l4j12q4L2J17R1l0j09r8K1J12J01j7
6167A04j10r9MJ27R1J3j32j13NJ20J16rj25j25J7J36J09j4j36j21J8J35J29j8
6191A22j52j19K1J59J13m2j44j08L8J53J05l9j47j04N6J45R9n4j44r9O1J35R3
6214A48o3j32q1N1J35O5k9j38o5L4J29O1m6j16p2M7J04Q0m9j10o2K5J09R0l4r8
6240a7r4J3J08R1j3r2j12mJ15J17nj12j03j6J13J25J9j20j26k2J32J42J9j41j42
6265a25k3J51J44K5j40j76l2J71J62K3j65j74qJ52J67J4j68j71j3J69J82Lj68
$$ plain form
6288 0 -179 -190 -14 160 178 11 -167 -178 -9 157 166 1 -160 -175 -16 145 162 15 -143 -156 -29 128 159 37
6312 37 -120 -152 -37 114 157 51 -108 -160 -69 103 155 64 -88 -155 -80 91 170 77 -81 -170 -96 73 174 96 -70
6337 -70 -184 -131 68 181 125 -70 -202 -138 65 201 125 -57 -208 -140 66 194 135 -67 -206 -142 62 218 143
6360 143 -62 -208 -136 69 217 148 -63 -199 -136 79 201 140 -65 -191 -130 70 191 122 -61 -172 -112 68
6382 68 171 110 -60 -157 -108 47 141 98 -41 -161 -115 34 124 97 -38 -140 -110 19 134 100 -21 -131 -111 7
6406 7 118 106 0 -121 -112 -8 128 132 20 -108 -132 -11 120 146 25 -117 -142 -25 122 147 4 -136 -154 -17
6430 -17 136 147 14 -152 -157 -13 148 156 11 -162 -173 -12 164 155 -21 -160 -162 17 171 153 -20 -180 -163 21
6454 21 177 141 -38 -192 -161 33 186 143 -26 -172 -134 36 179 150 -37 -151 -128 36 163 149 -10 -145 -131
$$ packed form
6288@j79j1J76J74J8j67j78j1J69J66Rj65j61j5J59J61J7j47j58j3J27J57L1j22
6312C7j57l2J15J51M3j06j59n2R1J72N2r1j52o7P5J71P9r3j58q9P4J69J01p8j66
6337g0j14N3J99J13n6j95j32O4K03J36p6j82j51O8K06J28n9k02j39O4K04J56p5
6360A43k05j46P2K05J48o9k11j36O3K15J22o1k05j26O1K00J21o9j83j11O0J80
6382F8J03o1j70r7M9J55R4m3j39j20M6J49R0k7j35j02L0J29J15l4j21j10K0J18
6406GJ11j2j06j21RJ04J36Mj12j28k4J21J31K6j21j42k5J17J47K5j43j40j8J37
6430a7J53J1j33j66nJ44J61Qj45j73j1J61J76rj76j39kJ79J54j8j73j60J7J84
6454B1J56l6j79j54L1J94J53m3j69j46L8J70J43k9j87j14K3J64J27j4j59j35J4
$$ plain form
6477 -131 26 151 130 -8 -136 -143 2 139 139 18 -135 -143 -22 127 145 22 -131 -159 -38 123 160 38 -138
6500 -138 -191 -60 123 206 66 -134 -210 -76 132 215 81 -147 -231 -95 146 225 88 -151 -244 -75 160 252 101
6523 101 -150 -243 -83 175 271 92 -154 -242 -91 168 254 99 -155 -245 -79 168 256 77 -155 -249 -97 146
6545 146 231 75 -148 -229 -95 140 207 88 -122 -219 -89 122 223 108 -119 -204 -108 99 204 101 -81 -188
6567 -188 -117 87 193 127 -64 -173 -123 71 211 154 -36 -194 -149 43 192 156 -28 -199 -170 34 203 186 -19
6590 -19 -208 -180 19 210 185 -29 -228 -205 25 212 186 -42 -228 -210 13 213 185 -40 -225 -198 40 227 193
6613 193 -35 -221 -177 44 223 181 -33 -210 -157 58 217 171 -34 -211 -143 67 206 145 -50 -186 -125 45
6635 45 179 134 -38 -168 -128 33 168 124 -37 -156 -133 22 143 132 -23 -148 -144 -10 144 134 -14 -151 -148 -23
$$ packed form
6477a31J57J25k1j38j28pJ45J37%j21j53qJ21J49J8j23j53k8J21J61L7j22j76
6500a38n3J31J83Q3j40k00p6J34K08Q3j34k28q4J36K41P9j37k39r3J69K35R2j51
6523A01k51r3J60K58R6j79k46q8J51K59Q6j55k54r0J66K47Q8j79k32r4J52K43
6545A46Q5j56k23q1J34K35O7j19k10r7J30K11J01j15k27q5R6K07J05j03j82j07
6567a88P1K04J06o6j91j09N0J94J40n7j90j58M5J92J49l6j84j71K9K04J69j7k05
6590a9j89K8J99J91k5k14j99K3K30J87k6k28j86J8K23K00k8k25j85K7K38J87l4
6613A93k28j86M4K21J79m2k14j77N3K15J59m6k05j77O8K10J39o1j95j36O1J70
6635D5J34m5j72j30M0J61J35m4j61j19K3J55J21j1j55j25MJ34J54j0j48j37LJ25
$$ plain form
6659 -23 138 149 12 -138 -158 -18 141 164 15 -147 -177 -29 155 179 26 -157 -183 -30 160 207 32 -172 -197
6682 -197 -17 184 206 21 -198 -224 -11 193 208 1 -213 -213 5 218 208 -8 -218 -214 7 212 206 -23 -221
6705 -221 -223 6 216 190 -16 -211 -202 11 216 192 -14 -190 -199 -2 198 187 1 -190 -186 1 178 189 23 -169
6729 -169 -182 -16 176 203 41 -148 -209 -42 161 211 62 -134 -206 -71 124 221 88 -138 -230 -108 134 230 101
6752 101 -143 -263 -120 130 252 118 -140 -274 -137 123 269 139 -147 -285 -152 144 285 143 -146 -297
6772 -297 -152 153 292 139 -152 -284 -147 148 282 143 -143 -281 -137 149 287 147 -134 -274 -118 126
6792 126 263 126 -131 -267 -143 119 248 131 -117 -237 -138 103 221 133 -93 -229 -140 70 194 139 -76
6813 -76 -217 -156 50 189 144 -35 -188 -159 29 197 160 -21 -193 -168 15 195 187 4 -190 -192 3 200 198 4
$$ packed form
6659b3J61J1j37j50k0J40J59K3j49j62l0J48J84K4j53j83k6J53J90M7j75k04k5
6682a97J80K01K2j85k19k6K13K04J5k07k14%K18K13j0k16k10MK21K05ok29j98
6705b21kK29K10k6k06j95RK13K05k4k06j76rJ97K00j1j86j91MJ87J77J1j66j92
6729a69j3J66J92K7j62j89o1J67K03N0j49j96p2J35J95R7j33k26r2J22K42R6j29
6752A01k44j20J43K50J22j34k58j34J37K60J46j30k86j38J33K96J41j42k89j51
6772b97J45L05J39j53k91j32J37K95J34j39k86j38J44K86J38j40k81j40J56K44
6792A26J37j37k57j36J24K62J29j17k48j20R9K41J18q8k26j36Q9K10J24n5k15
6813g6j41O1K06J39m5j79j53K9J88J68l7j81j72K5J83J80qj83j94kJ95J97kj94
$$ plain form
6837 4 -186 -190 -5 206 208 3 -201 -203 -1 207 208 1 -217 -206 -8 211 202 -7 -211 -208 15 212 199 -25 -226
6862 -226 -205 28 220 181 -38 -229 -183 28 205 174 -35 -206 -164 38 211 169 -32 -187 -150 39 200 145 -36
6885 -36 -179 -136 45 190 155 -15 -162 -135 40 162 151 -24 -156 -143 13 139 140 -13 -160 -161 -10 145 149 2
6909 2 -143 -177 -37 138 166 27 -163 -196 -38 148 183 37 -173 -212 -49 175 224 38 -179 -230 -54 191 249
6932 249 42 -187 -235 -41 212 255 35 -202 -249 -39 229 259 29 -213 -263 -29 226 248 25 -232 -260 -29
6954 -29 213 234 15 -230 -251 -35 207 230 26 -196 -235 -27 199 231 35 -192 -236 -41 177 226 50 -164 -219
6977 -219 -62 155 220 85 -142 -221 -93 142 233 114 -124 -218 -103 117 241 129 -108 -238 -122 100 252
6998 252 154 -98 -245 -156 90 265 162 -95 -262 -170 92 271 179 -111 -291 -183 93 289 165 -109 -288
$$ packed form
6837Dj90mJ85K11Kk05k04kK02K08Jk07k18J1J98K19rk09k04LK23J97j3k24k01
6862b26K1K33J92l9k19j91M6K11J77l1k09j71M2K02J73m2k01j55L7J89J61n5j81
6885c6j43M3J81J45l5j70j47K7J75J22j1j75j32J3J56J26Jj53j47jJ51J55Mj47
6909Bj45l4J40J75K8j39j90l3J58J86L5j46k10l9J63K24M9j86k17n1J76K45N8
6932B49k07k29m8J94K53M3k20k37m7K10K68L0k30k42n0K34K55K2k23k57k8K31
6954b9K42K1k19k45k1K16K42K3k04k22l9K08K26L2j96k27m4J95K18M9j76k14n5
6977b19J57K17O5j35k27p9J28K35R1j19k38r4J15K20J24j12k37j30J16K22J52
6998B52r8k52j47Q9K46J75j03k57j67R2K62J79r2k90j80J08K76J96j24k74j79
$$ plain form
7019 -288 -185 101 281 178 -106 -290 -173 108 279 182 -96 -290 -174 113 276 167 -100 -271 -157 104
7039 104 266 158 -100 -250 -160 93 242 145 -89 -231 -147 66 205 133 -61 -211 -143 55 185 137 -56 -196
7061 -196 -145 33 169 144 -36 -183 -150 14 167 155 -12 -176 -171 -6 165 150 -11 -167 -179 -14 171 183 14
7084 14 -176 -184 -16 183 187 13 -187 -198 -15 181 200 10 -189 -212 -10 204 209 -3 -206 -198 7 201 197 -18 -224
7109 -224 -194 17 206 172 -52 -224 -192 36 203 160 -56 -222 -166 52 207 157 -42 -221 -169 38 196 144 -58
7132 -58 -190 -139 34 193 151 -45 -178 -142 35 183 149 -32 -167 -157 21 166 146 -11 -166 -158 6 160 165 11
7156 11 -151 -168 -11 155 183 30 -162 -205 -48 153 206 35 -173 -226 -58 170 219 56 -171 -238 -57 183 240
7179 240 56 -188 -258 -66 189 254 51 -200 -254 -56 205 267 55 -195 -264 -31 211 245 58 -208 -263 -45
$$ packed form
7019b88J03K86J80j03k84j84J17K81J71r7k78j94J16K87J63j09k67j71J14K61
7039A04J62j08k58j50R0K53J49r7k34j42Q4K13J39p2j94j50O8J98J30m8j93j40
7061a96N1J78J36k5j80j47L3J64J53j2j67j64NJ65J71j5j61j56j2J65J85J2j69
7084A4j90qJ68J99Mj74k00j1J83J96J9j90j99k3K02K14Nk12k03QK05J94mk15k06
7109b24L0K11J89l4k24j72L2K28J67m3k16j66N6K18J55n0j99j79N2K07J58n2k02
7132e8j32N1J73J59m2j96j33L6J77J48l4j81j35J0J78J45k0j57j55QJ64J54Nj54
7156A1j62j7J57J66K8j53j92m3J57K01N3j71k08n3J68K28M9j63k27o7J81K40N7
7179B40j84k44p0J92K55O5k03k51n4J98K61O2k12k50o9K33K42L4j87k66n5K18
$$ plain form
7201 -45 207 242 39 -201 -244 -42 186 234 47 -182 -239 -51 166 218 40 -168 -228 -69 149 201 63 -140 -223
7224 -223 -81 129 202 87 -118 -208 -103 109 200 102 -102 -214 -116 81 204 127 -76 -202 -122 75 213 144 -67
7247 -67 -218 -147 71 224 159 -66 -232 -163 64 230 170 -52 -233 -176 66 243 159 -68 -240 -180 62 229 160
7270 160 -64 -239 -171 64 232 163 -78 -232 -149 73 224 147 -74 -222 -143 66 206 138 -77 -203 -124 64
7292 64 196 138 -58 -174 -127 66 170 134 -47 -173 -102 60 158 99 -42 -146 -117 33 124 100 -31 -143 -121 -3
7316 -3 125 118 -19 -128 -120 -9 121 131 10 -138 -147 -5 135 138 9 -134 -153 -18 144 148 9 -153 -158 -20 152
7341 152 171 19 -149 -162 -4 177 183 8 -162 -169 10 181 181 2 -176 -160 20 195 153 -28 -184 -164 8 192
7365 192 157 -37 -184 -157 28 179 148 -40 -179 -145 28 164 124 -35 -177 -147 24 152 134 -27 -152 -133 16
$$ packed form
7201d5K52L5k03k40m3K02K28M8j87k29n7J88K17N2j78k08o0J59K18N2j38k03q3
7224b23J42K10P3j15k05r0J05K12R1r8k04j12R8J97J23p7k03j26Q0J97J38o9k11
7247f7j51P1K18J53o5k25j66O9K27J66o0k22j81N7K42J77q4k27j72O0K42J67o9
7270A60k24j75O8K35J68o9k41j54Q3K22J51p7k21j48P9K09J40o8k15j26P9J88
7292F4J32n8j96j16M7J93J04l6j81j26P1J62R8n9j41j04K9J50R1k4j31j12K2J18
7316cJ28pj37j09QJ11J30J0j21j48rJ42J40Lj29j43j9J35J62Mj39j62nJ38J72
7341A52J9j52j68j3J58J81Oj75j70pJ79J71%j79j78J6J80J75m2j81j56K0J72J84
7365A92l5j94j47K7J85J51l1j88j39L4J73J36m0j59j42L0J71J28j8j61j25J9J49
$$ plain form
7388 16 151 140 -8 -143 -130 8 131 142 17 -131 -137 -19 128 150 40 -107 -153 -39 125 175 50 -109 -167
7411 -167 -60 122 189 74 -115 -193 -73 117 193 74 -118 -203 -90 114 207 81 -127 -209 -99 125 206 84
7433 84 -131 -208 -83 134 221 85 -128 -222 -71 142 216 87 -126 -202 -74 141 208 74 -136 -206 -61 121 206
7456 206 88 -118 -182 -70 108 185 75 -100 -171 -86 77 162 75 -83 -163 -89 63 156 96 -55 -157 -91 46 140
7480 140 93 -50 -155 -126 5 134 113 -18 -149 -127 15 142 145 -9 -135 -128 11 152 136 -1 -147 -145 3 163
7504 163 151 10 -149 -148 11 161 151 -9 -152 -159 9 153 152 -16 -166 -143 17 149 136 -24 -162 -132 23 157
7528 157 125 -33 -153 -125 31 146 116 -37 -152 -117 21 134 100 -26 -131 -96 29 132 94 -23 -111 -101 24
7551 24 106 90 -10 -103 -88 4 107 91 0 -89 -83 4 92 101 16 -88 -104 -25 88 109 4 -99 -115 -26 85 102 12 -98
$$ packed form
7388A6J35j1j48j35J3J38J23J1j25j48oJ18J47K2j10j47m6J14J64N0j25j59n8
7411a67J07J82O7j15j89p8J20J90P6j19j92q5J13K04R3j26k08q2J10K24Q1j22
7433H4k15p7J25K17Q7j36k13r4J51K13P4j29k13p6J28K15O7j34k10p0J45J82Q5
7456B06j18k06o4J12J78P7j10j75p1Q5J63Q5q7j58q0P4J52R3o0j51j02O6J37R4
7480A40m7j43j05K9J31J29k1j31j31K2J42J27Lj54j26PJ39J41j6j37j46KJ48J60
7504A63j2j41j59JJ59J50j0j60j43pJ68J44jj68j50K3J60J32j3j60j38L0J55J34
7528A57l2j58j20K8J56J15l0j53j15L5J38J13l4j26j05L5J25J03l8j17q8J0J25
7551B4Q2j6j00r3J5R2J03j6r1q9OQ7Q8Rq5j04j6P9J13K1j05j03j6Q9J11J7r0j10
$$ plain form
7579 -98 -130 -33 93 133 21 -104 -138 -33 90 133 31 -112 -132 -29 129 158 36 -127 -135 -23 131 170 25 -139
7603 -139 -148 -16 131 157 18 -137 -147 3 139 153 12 -124 -144 0 142 148 14 -131 -135 -11 129 131 -10 -141
7627 -141 -139 -14 111 133 8 -123 -129 -29 95 121 19 -105 -129 -27 97 119 46 -83 -133 -47 72 140 73 -59
7651 -59 -137 -67 76 144 77 -69 -140 -87 73 148 93 -63 -156 -84 59 164 108 -51 -159 -102 57 165 115 -74 -173
7676 -173 -114 54 172 105 -71 -182 -112 66 172 110 -68 -180 -119 63 169 95 -73 -176 -111 68 160 87 -77
7699 -77 -165 -84 70 150 91 -59 -142 -88 57 146 92 -46 -135 -83 47 133 77 -30 -125 -86 23 112 96 -22 -118 -86
7725 -86 6 105 86 -4 -96 -100 -20 86 102 8 -95 -113 -23 86 110 17 -92 -122 -25 95 101 13 -95 -123 -31 91 133 33
7753 33 -96 -117 -20 109 135 40 -97 -119 -7 120 134 17 -112 -108 2 127 131 13 -117 -107 6 122 126 -2 -131
$$ packed form
7579i8l2R7J26M0j12j25l4J05J23M3j02j43k0J03J58K9j22j63qJ12J54L9j45j64
7603a39rJ32J47K6j39j55j0J50J36J4j41j36k0J44J42Oj34j45mJ24J40Kj41j31
7627a41KJ25J25K2j25j31oJ00J24K6j02j24k4J02J24K2p3j29n0Q6J19O8o7j32
7651e9p8P0J43O8o7j46p1N3J60P5n5j56r3P2J43J05n6j59j08N7J59J08n0j89r9
7676a73N9J68J18o7j76j11P0J78J06o2j78j12O1J82J06p4j68j03O5J79R2p3j64
7699g7q8Q1J54Q0n9j50q3N4J45Q9n4j38q9N2J30Q6n6j07r5L9J09Q9j6j18r6L2
7725h6R2R9j9r0r2mQ0J06J6r4j03j8R0J09K4r3j09l0R7J20Oq8j08k8R2J22M2j00
7753C3j29k1R7J29K6r5j37k2J12J27J4j17j29MJ10J25Mj18j30J0J13J16Mj28j29
$$ plain form
7778 -131 -104 4 106 98 -21 -120 -115 13 99 88 -20 -108 -86 9 96 77 -17 -103 -91 7 84 68 -6 -91 -87 7 83 71 4
7807 4 -80 -79 2 77 82 13 -63 -88 -4 77 87 23 -69 -105 -19 80 120 29 -63 -115 -34 71 122 49 -82 -132 -65 75 126 40
7837 40 -95 -145 -49 78 139 42 -104 -140 -55 97 145 43 -108 -145 -40 109 158 45 -108 -147 -38 115 144 40
7861 40 -105 -135 -37 108 143 25 -106 -136 -31 103 133 29 -104 -127 -27 84 117 45 -82 -127 -41 72 115 32
7885 32 -80 -127 -55 62 105 47 -64 -118 -63 44 111 55 -39 -128 -87 21 121 83 -35 -122 -96 29 115 90 -20 -119
7911 -119 -94 28 138 113 -16 -126 -105 28 137 107 -42 -137 -117 26 143 116 -24 -137 -123 24 132 100 -23
7934 -23 -151 -107 32 129 98 -34 -141 -105 23 122 83 -52 -129 -100 26 127 84 -42 -118 -92 27 110 78 -27 -105
7959 -105 -76 23 99 74 -28 -90 -81 16 87 83 -7 -81 -81 -1 70 68 5 -75 -77 -20 55 75 6 -72 -78 -34 64 63 9 -78 -114 -21 60
$$ packed form
7778a31K7J08J02qj19r9NJ28Q6j1j08q8K2R5Q7j9r4q6J2R8P7j6p4q5MR4P6j2o7
7807Dq4JQ1P5No9p6k5Q4Q1J0o4r2l6Q6R9M0r1r2n2Q1J05N1p3j31n0O7J40N1q6
7837D0j35n0R6J27O1r7j46l6Q5J52M8j02j51l7J05J49M9j13j53l9J09J53K9j04
7861D0j45l0R8J45L5j18j31l0J05J34L0j04j33k3J00J11L3p2j27m5Q6J13M3q3
7885C2j12m7P2J17M3n8j11n4N5J07O7n6r4q9M1J08J00l8j18q7K6J25Q6k5j10r9
7911a19K5J22J10k5j29j10K1J33J09l0j49r5K0J43J17k7j40j13J4J47J08l2j23
7934b3j28M4J39R7l1j32j07L6J28R9l9j35p7K9J26J01m3j26p6K6J19Q3l2j05p8
7959a05K9R9P6k5j02o2RR7P1mr0p4%Q0P1ko3q0kN7P5K0o9p8oM4R8jn4q7l6R3Q1
$$ plain form
7992 60 89 20 -85 -95 -29 70 94 19 -78 -110 -27 86 104 14 -74 -109 -17 92 102 3 -109 -105 -6 104 103 4 -94 -98 -1
8021 -1 111 103 -7 -105 -91 2 112 89 -13 -93 -86 10 105 87 -16 -92 -90 6 85 64 -23 -95 -90 5 68 68 -17 -85 -74 6 67
8052 67 69 -7 -72 -64 -9 65 65 7 -66 -75 -24 61 80 24 -68 -84 -35 62 86 26 -75 -101 -43 59 105 34 -73 -112 -53 56
8082 56 111 45 -74 -125 -56 66 118 48 -78 -136 -62 71 130 50 -93 -149 -61 70 121 42 -100 -134 -56 85 118 34
8108 34 -86 -127 -45 96 129 41 -79 -122 -38 80 123 44 -68 -114 -39 72 111 41 -61 -103 -56 60 96 26 -64 -93
8134 -93 -49 37 67 42 -45 -88 -57 25 77 42 -31 -89 -64 15 70 68 -15 -94 -95 0 78 74 -23 -91 -94 0 90 95 -9 -90 -97 10
8166 10 103 90 3 -94 -93 7 105 89 1 -93 -73 19 108 87 -22 -108 -93 18 105 72 -30 -102 -76 16 104
$$ packed form
7992F0K9o9j05j0O6R9K4p5r7l2Q3J13J8r0q8l5R2J09J0r9j12MR9J10jr9r8mR7
8021aJ12qj10r8J4R3J10k3j02q0PR6R5j8j03p6KR6P9k1q7p2NR5O3%q5o8J1Q0O1
8052F7Kp6o5QN5P4%n8p3rN1Q5J9n6r2j6M9R7K4o0j01k6N8J02M6p1j07l9N9J09
8082E6N5o6j19n1O9J22N2p0j26n8P4J33N9q0j43n6Q8J31N1p9j42l4P8J41L3q4
8108C4j20m1Q2J41L3q8j20m3Q4J18M3p9j12m6P5J11L9p0j02m2M7J16L6p0r0k9
8134i3M4Q6L0k5q7m3L1Q2N2l5p3n8K5P9N5kq3p9jR5P8mr7o8lR4R0Nj04q1pJ07
8166A0R3j3q7r7JJ00R8j6q8r4K0R2Q9k1j09q6J5J11Q7l3j02p2K6R2Q8
8191A04
$$ Imaginary data points
##PAGE= N=2
##DATA TABLE= (X++(I..I)), XYDATA
$$ plain form
0 0 0 0 0 0 0 0 0 0 0 0 -8 8 -8 8 -16 16 -24 24 -32 40 -48 56 -64 80 -91 107 -123 144 -168 192 -219 251
32 251 -283 323 -366 411 -463 519 -579 647 -722 802 -890 986 -1091 1205 -1331 1468 -1620
49 -1620 1781 -1963 2164 -2383 2629 -2903 3211 -3561 3964 -4426 4970 -5618 6408 -7392 8660
64 8660 -10359 12772 -16484 22963 -37433 135665 -271126 -578778 5523 277454 186950
75 186950 70480 -23925 -245500 -194647 103025 273509 113636 -105472 -185914 -93486 2502
86 2502 96426 201295 121062 -243195 -349639 63647 362034 118878 -132838 -106282 -110537
97 -110537 -99912 172595 306084 -9916 -299045 -166193 95584 187063 114898 -42267 -149586
108 -149586 -97451 4713 71631 129276 75683 -120021 -186266 -24017 114434 124607 80808
$$ packed form
0@%%%%%%%%%%qJ6j6J6k4L2m0M8n6P2q8J04j20J44j71J98k30K67l12L60m11M70
32B51n34O06o89P77q74R82j098J226j369J524j692J876k077K296k536K799l088
49a620L401l744M127m547N012n532O114o772P525q390R396j0588J2026j3800J6052
64H660j9019K3131k9256L9447o0396J73098m06791l07652N84301K71931r0504
75A86950j16470r4405k21575N0853K97672J70484j59873k19108q0442R2428R5988
86B502R3924J04869q0233l64257j06444M13286K98387k43156k51716K6556m255
97a10537J0625K72507J33489l16000k89129J32852K61777R1479p2165j57165j07319
108a49586N2135J02164O6918N7645n3593j95704o6245J62249J38451J0173m3799
$$ plain form
119 80808 -63779 -214854 -102483 165938 210996 24430 -135028 -161721 -44627 137328
129 137328 161065 7122 -94210 -103794 -92897 43681 221037 107940 -187841 -207378 29521
140 29521 145320 90880 13081 -80044 -127390 -25246 106577 101925 7753 -64711 -78154 -30827
152 -30827 34966 77910 87161 -2205 -163637 -139534 121637 225123 -1599 -181404 -92077
163 -92077 36636 73578 88343 25470 -114155 -116188 44000 119182 37244 -43062 -52950 -31845
175 -31845 6748 44412 46608 9546 -44004 -60053 -2937 53796 37690 5545 -9611 -58180
187 -58180 -71759 43591 132729 26277 -117958 -92658 26638 88149 68323 -15589 -97910
198 -97910 -62357 54363 82165 8264 -34458 -21614 -17791 -15991 18256 54060 36623 -34527
$$ packed form
119H0808j44587j51075J12371K68421M5058j86566j59458k6693J17094J81955
129A37328K3737j53943j01332r584J0897J36578J77356j13097k95781j9537K36899
140B9521J15799n4440p7799r3125m7346J02144J31823m652r4172p2464j3443M7327
152c0827O5793M2944R251q9366j61432K4103K61171J03486k26722j79805Q9327
163i2077J28713L6942J4765o2873j39625k033J60188P5182q1938q0306r888K1105
175c1845L8593L7664K196l7062n3550j6049N7116N6733j6106l2145j5156m8569
187e8180j3579J15350Q9138j06452j44235K5300J19296O1511j9826q3912q2321
198i7910L5553J16720K7802p3901m2722J2844L823J800L4247L5804j7437p1150
$$ plain form
210 -34527 -83232 -35692 60437 86625 21131 -59869 -90709 -35712 75636 112912 10932 -98494
222 -98494 -85951 136 69928 92279 31080 -89641 -122378 -2181 118777 94912 -20116
233 -20116 -94612 -77014 3821 80778 84990 6605 -82467 -92238 -9050 81823 89520 14779 -71844
246 -71844 -100527 -34625 83119 124276 23345 -104970 -111579 -6115 91932 102173 20540
257 20540 -88379 -114182 -15761 100486 104058 2067 -89428 -87812 -7821 73533 83598 14623
269 14623 -64915 -78379 -20304 48152 71563 38630 -29116 -82993 -63118 30716 104611 68969
281 68969 -43069 -110568 -63940 47168 111493 63022 -51623 -112373 -54169 55703 99252
292 99252 43644 -42729 -83042 -52431 23929 83503 65186 -19885 -86048 -68228 12450 82732
$$ packed form
210c4527m8705M7540R6129K6188o5494q1000l0840N4997J11348L7276j01980j09426
222i8494J2543Q6087O9792K2351o1199j20721l2737J20197J20958k3865j15028
233b0116p4496J7598Q0835P6957M212p8385q9072r771Q3188R0873P697p4741q6623
246g1844k8683O5902J17744M1157j00931j28315o609J05464R8047J0241q1633
257B0540j08919k5803R8421J16247L572j01991r1495J616P9991Q1354J0065o8975
269A4623p9538j3464N8075O8456K3411l2933o7746n3877J9875R3834P3895l5642
281F8969j12038o7499M6628J11108O4325m8471j14645o0750N8204J09872M3549
292I9252n5608q6373m0313L0611P6360N9574j8317q5071o6163J7820Q0678P0282
$$ plain form
304 82732 80019 -2155 -92133 -92512 7266 103364 92138 -14180 -105294 -88879 17916 106115
316 106115 85077 -23307 -105843 -76619 29721 97594 62111 -27539 -80416 -57250 14472
327 14472 71876 61026 -9311 -67480 -58136 2587 58378 63000 7992 -59978 -69940 -6775 63448
340 63448 68122 4714 -62331 -66134 -3031 61591 61586 -260 -58816 -55399 3156 53140 45371 -3160
354 -3160 -40573 -38829 -5697 31356 40413 11798 -26456 -39273 -18495 19123 44234 28541 -20641
367 -20641 -52870 -29737 25899 55661 28138 -29794 -57843 -24596 34747 56179 18331 -36955
379 -36955 -51834 -12558 37017 44913 7938 -32029 -38112 -9109 26852 36644 10923 -24420 -35147
392 -35147 -12900 21220 36777 16886 -22756 -41603 -16513 27611 43493 13239 -32152 -44370
$$ packed form
304H2732k713q2174q9978l79R9778R6098j1226j06318r1114J6415J06795Q8199
316A06115k1038j08384q2536K9224J06340O7873l5483q9650n2877K3166P1722
327A4472N7404j0850p0337n8169R344O0723N5791M622n5008o7970r962O3165P0223
340F3448M674o3408o7045l803O3103O4622no1846n8556L417N8555M9984p769m8531
354c160l7413J744L3132L7053R057k8615l8254j2817K0778L7618K5111j5693m9182
367b0641l2229K3133N5636K9762k7523n7932k8049L3247N9343K1432l7848n5286
379c6955j4879L9276M9575P896l6975l9967o083K9003L5961R792k5721l5343j0727
392c5147K2247L4120J5557j9891l9642j8847K5090M4124J5882l0254m5391j2218
$$ plain form
404 -44370 -8642 37415 42984 1489 -41172 -38349 5791 42072 31669 -11619 -39446 -24156
416 -24156 13918 34064 18940 -12404 -28684 -16967 8747 24579 18118 -3972 -23281 -22452 601
429 601 25936 26725 -853 -29303 -28528 1842 31904 30198 -3650 -34919 -29670 6474 35354 28045
443 28045 -7377 -35156 -26660 8769 33121 23181 -7034 -27957 -23105 1728 24645 25451 3883
456 3883 -21955 -30763 -11222 23935 39368 13434 -29634 -43932 -12927 33621 47773 11357
468 11357 -38845 -48074 -7416 39117 46341 8436 -39075 -48400 -7536 40930 46753 6625 -38885
481 -38885 -46569 -7872 38981 45425 7191 -34775 -43131 -12886 30761 47499 17324 -31454 -50246
494 -50246 -20553 31392 56013 22705 -38143 -58887 -16178 40964 53615 12900 -39143 -49910
$$ packed form
404d4370L5728M6057N569m1495m2661K823M4140L6281j0403m3288k7827J5290
416b4156L8074K0146j5124l1344j6280J1717K5714J5832o461k2090j9309Q29K3053
429F01K5335P89k7578k8450P75L0370L0062j706l3848l1269N249L6144K8880p309
443B8045l5422k7779Q496L5429K4352r940l0215k0923M852K4833K2917Q06k1568
456C883k5838q808J9541L5157J5433k5934m3068j4298L1005M6548J4152l6416
468A1357n0202r229M0658M6533P224l7905m7511r325M0864M8466N823m0128m5510
481c8885p684L8697M6853O444l8234m1966q356L0245M3647J6738l0175m8778j8792
494e0246K9693N1945K4621l3308o0848k0744M2709N7142J2651m0715n2043j0767
$$ plain form
506 -49910 -9468 36103 41270 9757 -25721 -38478 -17082 21993 39712 18415 -18009 -37003
518 -37003 -23713 13108 40110 26974 -13176 -39044 -28534 8316 40494 34054 -9477 -43867
530 -43867 -32656 9820 42405 34317 -10187 -45234 -30050 14536 37037 23529 -5075 -28751
542 -28751 -30140 -2536 30008 34589 6459 -30277 -41313 -9052 37103 44217 3704 -38937 -41573
555 -41573 -3064 39727 40978 -2018 -38752 -32392 373 28818 34974 8076 -33063 -40476 -1839
568 -1839 36478 33860 -1091 -32342 -30353 2133 29126 24299 -474 -21122 -24293 -5460 20572
581 20572 25527 5179 -17356 -24937 -11359 18286 32723 7279 -27140 -25847 2160 20251 17581
594 17581 2157 -15101 -18151 -3020 13142 16231 5643 -11603 -18564 -4166 13537 13328 2062
$$ packed form
506d9910M0442M5571N167l1513l5478j2757K1396L9075J7719k1297l6424j8994
518c7003J3290L6821K7002j3136m0150k5868J0510L6850L2178o440m3531l4390
530d3867J1211M2476L2585q088m4504l5047J5184M4586K2501j3508k8604k3676
542b8751j389K7604L2544M581k8130l6736j1036L2261M6155P114m0513m2641k636
555d1573L8509M2791J251m2996l6734O360L2765K8445O156k6898m1139p413L8637
568a839L8317k618l4951l1251J989L2486K6993m827k4773k0648l171J8833K6032
581B0572M955k0348k2535p581J3578K9645J4437k5444l4419J293K8007J8091k670
594A7581j5424j7258l050J5131J6162L089j0588j7246o961J4398J7703k09j1266
$$ plain form
607 2062 -6740 -11730 -7812 6221 13748 6393 -3685 -10625 -13270 -599 20375 18414 -9324 -25978
621 -25978 -11156 15272 24088 5736 -19315 -19871 2776 16563 9756 -1189 -7930 -10853 -4228
634 -4228 8258 12222 5204 -5792 -15134 -10969 10142 22838 6794 -17468 -20291 -1997 17455
647 17455 19482 244 -19638 -16747 2678 16495 15638 991 -18385 -20204 2813 22978 16035
660 16035 -6509 -20476 -14657 6169 21260 12541 -8524 -17263 -9597 3580 14385 14156 -886
673 -886 -16753 -16286 323 18419 19683 -1705 -23381 -17779 7102 20478 12503 -3850 -15909
686 -15909 -14885 469 15919 16079 1832 -14829 -19800 -4335 18836 22316 536 -20447 -18364
699 -18364 1082 16841 15337 1068 -11446 -14328 -7820 6661 20189 14899 -9849 -27162 -15210
$$ packed form
607B062q802m990L918J4033P527p355j0078o940k645J2671K0974j961k7738j6654
621b5978J4822K6428Q816j8352k5051n56K2647J3787o807j0945o741k923O625
634d228J2486L964p018j0996r342M165K1111J2696j6044k4262k823J8294J9452
647A7455K027j9238j9882K891J9425J3817q57j4647j9376j819K3017K0165o943
660A6035k2544j3967N819K0826J5091q719k1065q739P666J3177J0805k29j5042
673h86j5867M67J6609J8096J264k1388k1676N602K4881J3376p975j6353j2059
686a5909J024J5354J5450J60j4247j6661m971J5465K3171L480k1780k0983K083
699a8364J9446J5759j504j4269j2514k882O508J4481J3528n290k4748j7313J1952
$$ plain form
712 -15210 14012 29546 14185 -17430 -31166 -10856 20188 27944 7603 -17286 -24333 -9485
724 -9485 13638 24736 12732 -12461 -26716 -14243 13363 27467 13684 -12899 -26361 -14802
736 -14802 11034 27001 16497 -11003 -27945 -17115 10937 28643 17656 -11853 -29531 -16382
748 -16382 13762 28660 13071 -14407 -24171 -9500 10679 18414 10949 -4813 -17194 -14470 2176
761 2176 17220 16498 -41 -18266 -19343 444 20298 18163 -2199 -18534 -16095 1000 16101
774 16101 15409 1118 -13080 -16185 -4955 13034 19613 5091 -14982 -18685 -4248 13281 18450
787 18450 5404 -13772 -18131 -4026 11563 15451 6912 -8474 -18049 -9562 9934 19595 9540
800 9540 -10391 -20860 -9326 13188 20715 5819 -12725 -17394 -6391 11111 18397 5588 -12940
$$ packed form
712a5210K9222J5534j5361l1615j3736K0310L1044P756k0341k4889p047J4848
724i485K3123J1098j2004k5193j4255J2473K7606J4104j3783k6583j3462J1559
736a4802K5836J5967j0504k7500j6942J0830K8052J7706j0987k9509j7678J3149
748a6382L0144J4898j5589k7478r764J4671K0179P735p465j5762j2381K724J6646
761B176J5044p22j6539j8225j077J9787J9854k135k0362j6335K439J7095J5101
774A6101o92j4291j4198l105J1230J7989O579j4522k0073l703J4437J7529N169
787A8450j3046j9176m359J4105J5589L888q539j5386r575Q487J9496R661j0055
800I540j9931j0469J1534K2514P527j4896j8544m669J1003J7502P286j2809j8528
$$ plain form
813 -12940 -15981 -3480 10061 14307 5153 -10450 -14859 -2667 10233 11138 2814 -7164 -10997 -3700
827 -3700 7145 9880 4066 -4603 -10892 -6655 7248 13347 2812 -9378 -9639 -1285 7437 9190
841 9190 394 -8855 -6309 2390 5218 3137 380 -3141 -4243 -700 2663 3280 2816 -952 -6126 -3917
857 -3917 4094 6279 1651 -2857 -5473 -4187 3376 8395 2644 -5793 -6856 -2121 4291 8098 3077
872 3077 -6783 -8467 -751 6160 7252 2438 -6127 -9198 -1394 7418 7615 1870 -5276 -9656 -4160
887 -4160 7960 11458 2090 -8452 -10825 -3511 8908 13465 2443 -11623 -12471 -1156 10759 13194
901 13194 1975 -12905 -13663 628 12865 11820 285 -12114 -13192 288 13396 11427 -1082
914 -1082 -11039 -11324 -1257 11180 12411 667 -10765 -11613 -2489 9666 13644 3207 -11085 -13423
$$ packed form
813a2940l041J2501J3541M246r154j5603m409J2192J2900R05q324r978l833P297
827c700J0845K735n814q669o289M237J3903O099j0535j2190k61Q354Q722J753
841I190q796r249K546Q699K828k081k757l521j102L543L363O17m64l768n174K209
857c917Q011K185m628m508k616J286P563N019n751q437j063M735O412L807n021
872C077r860j684P716O911J092m814q565l071P804Q812J97n745p146m380N496
887d160J2120L498r368j0542k373P314J2419M557j1022j4066q48J1315J1915K435
901A3194j1219j4880p58J4291J2237j045j1535j2399j078J3480J3108j969j2509
914a082r957k85J0067J2437J231j1744j1432q48R124J2155L978j0437j4292k338
$$ plain form
928 -13423 -2627 9925 13521 4088 -10350 -14152 -2999 9972 12383 3917 -7976 -12889 -4981
941 -4981 7775 12074 5248 -5377 -11739 -7935 4313 13142 8882 -3860 -13008 -10440 2636 14545
955 14545 12008 -3293 -15254 -11952 2892 15341 13004 -2923 -16237 -12859 3170 15578 12895
968 12895 -2392 -15776 -13425 2522 15445 12827 -1738 -14460 -13593 674 14720 14117 -532
981 -532 -14427 -14279 -211 14492 15041 98 -15074 -14642 538 14636 13833 -593 -14071 -13075
995 -13075 828 13044 11819 -476 -11493 -11129 -239 10277 10384 938 -8486 -9922 -2515 7334
1009 7334 10445 3310 -6837 -10108 -4081 5593 10506 5279 -5839 -11101 -4788 5723 9985 4861
1023 4861 -4673 -9819 -5232 4330 9084 5172 -3054 -8576 -6222 2443 8833 6413 -1909 -8433 -7357
$$ packed form
928a3423J0796J2552L596r433j4438l802J1153J2971K411q466j1893m913P908
941d981J2756M299o826j0625o362L804J2248Q829m260j2742r148K568J3076J1909
955A4545k537j5301j1961L302J4844J2449k337j5927j3314L378J6029J2408k683
968A2895j5287j3384K351J5947J2923k618j4565j2722Q67J4267J4046o03j4649
981e32j3895J48J4068J4703N49j4943j5172M32J5180J4098q03j4426j3478R96
995a3075J3903J2216j225j2295j1017L64J0890J0516J07r446r424j436P407R849
1009G334L111p135j0147l271O027R674M913n227j1118n262O313J0511M262n124
1023D861r534n146M587R562M754l912q226n522K354Q665O390k420q322o524J076
$$ plain form
1038 -7357 1362 9543 7641 -2374 -9296 -6872 1700 9109 7919 -2237 -10408 -6926 3542 9542
1052 9542 6073 -3354 -9740 -5656 4687 9188 3758 -4419 -7686 -3652 4128 7539 2806 -4119 -6256
1067 -6256 -2912 3175 6873 3140 -4555 -6714 -1523 4159 5574 1995 -4274 -6390 -843 5273 4811
1082 4811 13 -4060 -4808 -682 5124 5105 -992 -5276 -3639 1208 4792 3506 -1817 -4603 -2000 1478
1098 1478 2780 2574 149 -3344 -3345 168 2860 3384 1600 -3116 -5751 -1135 5241 5050 -15 -4077
1114 -4077 -4836 -1456 4297 5939 1255 -4388 -5958 -2416 4359 7664 2461 -5696 -7563 -2191 5086
1129 5086 8177 3001 -6133 -8588 -2055 5324 7680 4109 -4314 -10311 -5252 6386 11228 4504 -6636
1144 -6636 -11832 -4969 8096 12647 3304 -8683 -11166 -3167 7706 11350 3421 -7849 -10760 -3509
$$ packed form
1038g357Q719Q181j902j0015o922K424Q572P409j190j0156q171L482J0468O000
1052I542l469r427o386M084J0343M501n430q177l267M034P780L411m733o925k137
1067f256L344O087L698l733p695k159N191N682J415l579o269k116N547O116m62
1082D811m798m073p48M126N806j9o097m284J637M847L584j286n323k786K603L478
1098A478J302k06k425l493jL513K692N24j784m716k635M616O376j91n065m062
1114d077p59L380N753J642m684n643j570L542O775L305n203q157j867N372P277
1129E086L091n176r134k455O533P379K356l571q423n997N059J1638M842o724j1140
1144f636n196O863J3065M551r343j1987k483P999J0873L644p929j1270k911P251
$$ plain form
1158 -3509 6659 11107 4710 -7340 -11707 -3577 7133 10153 4200 -5635 -10686 -4959 5768 10130
1172 10130 5029 -4162 -10320 -7020 4494 11890 6184 -5604 -10702 -5233 4666 9595 4972 -3739
1186 -3739 -7805 -5127 1120 6901 7267 390 -7533 -8484 -1332 7931 10360 1560 -9944 -10384 370
1201 370 9293 8488 834 -7352 -9519 -2377 7768 10259 2594 -7555 -10702 -3351 7936 11422 3097
1216 3097 -8350 -11273 -2801 8439 10744 2130 -7661 -9492 -3107 5984 10478 4613 -7231 -11642
1230 -11642 -3182 8027 10103 2379 -6984 -9414 -2623 6604 8847 2272 -5886 -7938 -2566 4974
1244 4974 7724 3119 -4650 -8026 -3052 5350 7643 1463 -5172 -5208 -813 2820 3802 2342 -1122 -4008
1260 -4008 -3506 428 4431 4497 -268 -5416 -4895 1310 6048 3735 -2386 -4988 -2161 1817 3117 1962
$$ packed form
1158c509J0168M448o397j2050m367Q130J0710L020n953r835n051N727J0727M362
1172A0130n101r191o158L300J1514P396n706j1788n098N469R899M929m623q711
1186c739m066K678O247N781L66o877p923r51P152R263K429q800j1504m40J0754
1201C70Q923q05p654q186k167P142J0145K491p665j0149l147P351J1287L486q325
1216C097j1447k923Q472J1240K305q614r791j831O385R091M494n865j1844m411
1230a1642Q460J1209K076p724r363k430O791R227K243o575q158k052N372P540
1244D974K750m605p769l376M974Q402K293o180o635l6M395L633R82j460l464k886
1260d008N02L934M003O6m765n148N21O205M738k313o121k602K827L978J300j155
$$ plain form
1276 1962 -210 -2337 -2904 -831 2398 3753 1367 -3042 -4744 -1062 4263 4775 -187 -4701 -3895 852
1292 852 4326 3371 -802 -4200 -3541 1002 4938 3400 -2237 -5185 -2114 2830 4395 1640 -2751 -4418
1308 -4418 -1207 3328 3778 421 -2544 -3152 -1457 2058 4414 2059 -3329 -5500 -1293 4883 5629 -414
1324 -414 -5851 -4252 1702 4986 3185 -1401 -4567 -3095 1491 4035 2565 -537 -3301 -3927 -320
1339 -320 4721 4682 -927 -5299 -3870 1351 5025 3451 -1638 -4362 -2522 800 3016 3227 638 -3175
1355 -3175 -4045 -949 3060 4549 1860 -3445 -5576 -1553 3966 5110 1748 -3176 -5632 -2619 3615
1370 3615 6056 2380 -3189 -5900 -3452 2986 7016 3498 -3654 -6601 -3369 2629 6599 4590 -2429
1385 -2429 -7460 -5151 2351 8110 6051 -2963 -9465 -5582 4163 9040 4835 -3879 -8893 -4770 4443
$$ packed form
1276A962k172k127n67K073L229J355k386m409j702L682N325N12m962m514Q06M747
1292H52L474r55m173l398O59M543L936j538n637k948L071M944J565k755m391j667
1308d418L211M535M50l357k965o08J695L515K356k355n388k171M207O176P46o043
1324d14n437J599N954L284j801m586l166J472M586K544j470l102k764o26L607
1339c20N041l9n609m372J429N221L674j574n089k724J840L322K216K11k589l813
1355c175q70L096M009J489k689n305k131M023N519J144l362m924k456L013O234
1370C615K441l676n569k711K448O438M030l518p152k947L232N998L970k009p019
1385b429n031K309P502N759k059r014o502L883R745M877m205q714n014M123R213
$$ plain form
1400 4443 8381 3567 -3579 -6705 -4407 1993 7295 5450 -2233 -7574 -5389 2021 7663 5651 -2401
1415 -2401 -7727 -4902 2317 6776 4871 -1763 -6627 -4588 1672 5500 4331 -306 -5081 -5302 146
1430 146 5331 4726 -22 -4201 -4816 -1177 4020 5308 1330 -3691 -5221 -2147 3299 5876 2475 -3502
1446 -3502 -5798 -2591 3043 6007 3086 -3179 -6066 -2861 2777 5725 3578 -2397 -6427 -3715 2972
1461 2972 6278 3315 -2675 -6064 -3502 2811 6121 3043 -2771 -5487 -3019 2336 5469 3091 -2425
1476 -2425 -5294 -2933 2251 5271 2903 -2645 -5267 -2189 2828 4500 1719 -2548 -4136 -1433 2544
1491 2544 3485 905 -2069 -2771 -982 1592 2513 953 -1346 -2130 -964 1030 1998 1009 -948 -1784 -825
1508 -825 758 1523 876 -610 -1470 -766 652 1208 579 -439 -968 -661 259 963 699 -255 -912 -717 130
$$ packed form
1400D443L938m814p146l126K298O400N302j845p683n341K185P410N642k012q052
1415b401n326K825P219M459j905o634m864K039O260L828j169m637m775k21N448
1430A46N185o05m748m179o15L639N197J288l978n021j530L074N446K577l401n977
1446c502k296L207N634K964k921o265k887L205N638K948k147n975m030K712O687
1461B972L306k963n990l389K562O313L310l078n814k716K468N355L133k378n516
1476b425k869K361N184L020k368n548k622L078N017J672k781m267j588K703L977
1491B544R41k580k974p02J789K574R21j560k299p84J166J994R68r89j957q36R59
1508h25J583P65o47j486q60P04J418N56o29j018n29L07R20P04k64r54o57J95Q47
$$ plain form
1527 130 908 894 -108 -1146 -1036 207 1339 1171 -362 -1776 -1287 739 2036 1141 -1017 -2309 -1260
1544 -1260 1404 2771 973 -1995 -2768 -673 2095 2889 708 -2455 -3079 -359 2691 3002 419 -2720
1560 -2720 -3290 -330 3109 3299 173 -3083 -3460 -344 3456 3687 -53 -3629 -3495 -27 3609 3807
1576 3807 -110 -4066 -3585 496 3786 3347 -260 -3765 -3420 486 3596 2932 -203 -3017 -3201 -261
1592 -261 3065 3195 267 -2685 -3214 -859 2591 3545 813 -2514 -3196 -1168 1951 3561 1664 -2080
1608 -2080 -3568 -1604 1583 3461 2381 -1363 -3992 -2446 1488 3752 2685 -907 -3962 -3211 992
1623 992 4120 3208 -627 -4076 -3820 545 4583 3783 -744 -4293 -3910 227 4573 4343 -638 -4767
1639 -4767 -3947 467 4402 4239 -342 -4780 -4115 701 4411 3757 -406 -4267 -3788 558 4009 3308
$$ packed form
1527A30P78j4j002j038J10J243J132j68j533j414M89K026J297q95k158j292J049
1544a260K664J367j798k968p73K095K768P94k181l163o24K720L050L11k583l139
1560b720n70K960L439J90l126l256l77L116L800K31l740l576J34L468L636J98
1576C807l917l956M81M081L290m39l607l505L45L906L110o64l135k814j84K940
1592b61L326J30k928k952n29K355L450R54k732l327o82K028L119J610j897l744
1608b080j488J964L187J878j080l744k629J546L934K264j067l592l055P51M203
1623I92L128r12l835l449K56M365M038q00m527l549L83M137M346k30m981m129
1639d767Q20M414L935j63m581m438O65M816L710o54m163l861M79M346L451p01
$$ plain form
1655 3308 -177 -3398 -3617 -156 3657 3526 -71 -3217 -3277 -344 3131 3454 77 -3075 -2805 -129
1671 -129 2333 2720 552 -2171 -2560 -564 1609 2349 1145 -1362 -2651 -1162 1306 2248 1321 -740
1687 -740 -2385 -1788 747 2400 1702 -420 -2307 -2228 314 2729 2110 -644 -2469 -1960 345 2446 2088
1704 2088 -468 -2367 -1820 261 2095 2108 -89 -2376 -2114 381 2350 1979 -410 -2471 -1851 852
1720 852 2354 1267 -790 -1899 -1295 634 2042 1198 -918 -1894 -921 884 1837 854 -1194 -1838 -340
1737 -340 1324 1391 44 -1226 -1146 153 1069 720 -133 -710 -794 -161 876 991 -116 -1064 -796 264 1016
1756 1016 746 -389 -1076 -475 561 819 300 -314 -617 -421 145 618 582 26 -700 -804 40 893 742
1775 742 -145 -753 -658 -67 596 796 315 -529 -1042 -670 577 1490 833 -945 -1815 -725 1152 1824 616
$$ packed form
1655C308l485l221k19L461L813j31l597l146o0K933L475L23l377l152K70K676
1671a29K462L87k168k723l89J996K173P40j204k507j289J489K468R42r27k061
1687g40j645N97K535J653o98k122j887P9K542K415o19k754j825N09K305K101l58
1704B088k556j899N47K081J834J3k197k287K62K495J969l71k389k061O20K703
1720H52J502j087k057j109O04J929J408q44k116r76R73J805R53r83k048o44J498
1737c40J664O7j347j270Q0J299R16l49q53n77q4O33J037J15j107r48K68J060P52
1756A016k70j135o87O01J036K58n19o14l03J96N66M73l6n56p26j04Q44Q53j51
1775G42q87o08R5N91O63K00m81q44n13L72J247R13o57j778q70J090J877O72j208
$$ plain form
1794 616 -1211 -1844 -715 1115 1907 881 -1107 -2156 -1114 1192 2446 1193 -1461 -2686 -1077 1695
1810 1695 2650 864 -1674 -2442 -872 1445 2389 1156 -1255 -2603 -1380 1421 2846 1342 -1583 -2867
1826 -2867 -1193 1693 2779 963 -1699 -2386 -797 1279 2025 1037 -881 -2017 -1339 656 2087 1525
1842 1525 -636 -2223 -1531 655 2029 1394 -472 -1824 -1498 162 1621 1568 175 -1476 -1916 -455
1858 -455 1667 2109 362 -1668 -1992 -518 1440 2067 718 -1324 -2088 -967 1111 2334 1336 -1207
1874 -1207 -2646 -1335 1402 2738 1278 -1518 -2711 -1052 1502 2354 1073 -1089 -2323 -1411 1041
1889 1041 2509 1407 -1092 -2489 -1490 1095 2593 1302 -1353 -2393 -960 1196 1988 885 -956
1904 -956 -1748 -908 643 1589 1170 -495 -1781 -1157 694 1657 920 -569 -1432 -882 545 1290 656 -390
$$ packed form
1794F16j827o33J129J830P92j026j988j049J042K306J254j253k654j225J609K772
1810A695R55j786k538p68J570K317R44j233k411j348J223K801J425j504k925j284
1826b867J674K886J086j816k662o87J589K076P46r88j918j136O78J995J431n62
1842A525k161j587O92K186J374o35j866j352L26J660J459n3j393j651m40J461
1858d55K122M42j747k030l24J474J958O27j349k042p64J121K078J223r98k543
1874a207j439J311K737J336j460k796j193J659K554Q52j281k162j234R12K452
1889A041J468j102k499j397R99K585J498j291k655j040J433K156P92j103j841
1904i56p92Q40J551R46m19j665j286O24J851R63p37j489q63N50J427P45o34j046
$$ plain form
1922 -390 -838 -685 -14 798 910 103 -805 -894 -173 745 950 182 -683 -811 -297 436 904 550 -495 -1080
1942 -1080 -537 500 1063 622 -583 -1261 -493 804 1048 208 -633 -862 -356 502 902 403 -497 -964 -508
1961 -508 599 1176 407 -894 -1163 -136 1022 1080 -51 -1150 -891 400 1101 611 -353 -891 -635 298
1979 298 1055 688 -441 -1094 -606 544 1184 574 -706 -1223 -384 816 1124 309 -818 -1071 -243 781
$$ packed form
1922c90m48J53O71Q12J12q07r08q9P21R18K05p68q65j28N14P33M68l54j045n85
1942a080N43J037N63m41j205o78P68J297K44q40q41k29N06Q58M00m99r00m67M56
1961e08J107N77p69j301k69J027J158N8j131j099K59J291P01m90r64n38K56R33
1979B98P57l67j129o53M88J150O40o10j280n17Q39J200L08q15j127k53Q28J024
$$ [...]
8191B4
##END NTUPLES=NMR FID
##END=
