##TITLE=1H ikalashn
CG-1218
14.11.2024
##JCAMPDX= 6.0         $$ Bruker NMR JCAMP-DX V2.0
##DATA TYPE= NMR SPECTRUM
##DATA CLASS= NTUPLES
##ORIGIN= UXNMR, Bruker Analytische Messtechnik GmbH
##OWNER= root
$$ TOPSPIN		Version 1.3
$$ 2024-11-14 13:59:25.468 +0400  Irina@DPX200
$$ Compression mode = diff/dup
##.OBSERVE FREQUENCY= 200.131300845
##.OBSERVE NUCLEUS= ^1H
##.ACQUISITION MODE= SIMULTANEOUS
##.ACQUISITION SCHEME= undefined
##.AVERAGES= 32
##.DIGITISER RES= 18
##SPECTROMETER/DATA SYSTEM= spect
##.PULSE SEQUENCE= zg
##.SOLVENT NAME= CDCl3
##.SHIFT REFERENCE= INTERNAL, CDCl3, 1, 17.49637
##AUDIT TRAIL= $$ (NUMBER, WHEN, WHO, WHERE, WHAT)
$$ ##TITLE= Audit trail, TOPSPIN		Version 1.3
$$ ##JCAMPDX= 5.01
$$ ##ORIGIN= Bruker BioSpin GmbH
$$ ##OWNER= Irina
$$ $$ F:/spectra/data/iren/nmr/1H/4/pdata/1/auditp.txt
$$ ##AUDIT TRAIL=  $$ (NUMBER, WHEN, WHO, WHERE, VERSION, WHAT)
(   1,<2024-11-14 13:57:00.156 +0400>,<Irina>,<DPX200>,<TOPSPIN 1.3>,
      <acquisition in progress>)
(   2,<2024-11-14 13:59:10.500 +0400>,<Irina>,<DPX200>,<TOPSPIN 1.3>,
      <Start of raw data processing
       efp BC_mod = 2 LB = 0.02 FT_mod = 6 PKNL = 1 PHC0 = 121.4716 PHC1 = 2.52035 SI = 32K 
       data hash MD5: 32K
       1B 4C 4C 05 B6 CD 71 9F 6C BF 4D 73 59 A9 7D 40>)
(   3,<2024-11-14 13:59:13.250 +0400>,<Irina>,<DPX200>,<TOPSPIN 1.3>,
      <apk 
       data hash MD5: 32K
       45 EC E0 7B 9F 97 09 8B 19 9B 08 91 58 40 EB 78>)
(   4,<2024-11-14 13:59:15.578 +0400>,<Irina>,<DPX200>,<TOPSPIN 1.3>,
      <abs n ABSG = 5 
       data hash MD5: 32K
       7C 8E D9 45 90 4D 7C 55 F8 B7 8D FE BD 5D F3 E3>)
$$ ##END=
$$ 
$$ $$ hash MD5
$$ $$ B3 5E E1 56 5D 36 50 69 16 F2 35 D3 14 C3 4C 59
##$RELAX= 
##$RELAX= 
##$RELAX= 
##$RELAX= 
##$RELAX= 
##$RELAX= 
##$RELAX= 
##$RELAX= 
##$RELAX= 
$$ Bruker specific parameters
$$ --------------------------
##$DU= <F:/spectra>
##$EXPNO= 4
##$NAME= <1H>
##$PROCNO= 1
##$TYPE= <nmr>
##$USER= <iren>
##$AMP= (0..31)
100 100 100 100 100 100 100 100 100 100 100 100 100 100 100 100 100 100 
100 100 100 100 100 100 100 100 100 100 100 100 100 100 
##$ANAVPT= -1
##$AQSEQ= 0
##$AQ_mod= 1
##$AUNM= <au_zg>
##$AUTOPOS= <>
##$BF1= 200.13
##$BF2= 200.13
##$BF3= 200.13
##$BF4= 200.13
##$BF5= 200.13
##$BF6= 200.13
##$BF7= 200.13
##$BF8= 200.13
##$BYTORDA= 1
##$CFDGTYP= 0
##$CFRGTYP= 5
##$CHEMSTR= <none>
##$CNST= (0..63)
1 1 145 1 1 1 1 1 1 1 1 1 1 1 1 1 1 1 1 1 1 1 1 1 1 1 1 1 1 1 1 1 1 1 
1 1 1 1 1 1 1 1 1 1 1 1 1 1 1 1 1 1 1 1 1 1 1 1 1 1 1 1 1 1 
##$CPDPRG= <>
##$CPDPRG1= <>
##$CPDPRG2= <>
##$CPDPRG3= <>
##$CPDPRG4= <mlev>
##$CPDPRG5= <mlev>
##$CPDPRG6= <mlev>
##$CPDPRG7= <mlev>
##$CPDPRG8= <mlev>
##$CPDPRGB= <>
##$CPDPRGT= <>
##$D= (0..63)
0 2 0 0 0 0 0 0 0 0.06 0 0.03 0 0 0 0 0.0002 0 0 0 0 0 0 0 0 0 0 0 0 0 
0 0 0 0 0 0 0 0 0 0 0 0 0 0 0 0 0 0 0 0 0 0 0 0 0 0 0 0 0 0 0 0 0 0 
##$DATE= 1731578347
##$DBL= (0..7)
120 120 120 120 120 120 120 120 
##$DBP= (0..7)
150 150 150 150 150 150 150 150 
##$DBP07= 0
##$DBPNAM0= <>
##$DBPNAM1= <>
$$ [...]
##$SW_h= 4401.40845070422
##$TD= 16384
##$TD0= 1
##$TE= 300
##$TE2= 300
##$TE3= 300
##$TEG= 300
##$TL= (0..7)
0 120 120 120 120 120 120 120 
##$TP= (0..7)
150 150 150 150 150 150 150 150 
##$TP07= 0
##$TPNAME0= <>
##$TPNAME1= <>
##$TPNAME2= <>
##$TPNAME3= <>
##$TPNAME4= <>
##$TPNAME5= <>
##$TPNAME6= <>
##$TPNAME7= <>
##$TPOAL= (0..7)
0.5 0.5 0.5 0.5 0.5 0.5 0.5 0.5 
##$TPOFFS= (0..7)
0 0 0 0 0 0 0 0 
##$TUNHIN= 0
##$TUNHOUT= 0
##$TUNXOUT= 0
##$USERA1= <user>
##$USERA2= <user>
##$USERA3= <user>
##$USERA4= <user>
##$USERA5= <user>
##$V9= 5
##$VALIST= <valist>
##$VCLIST= <CCCCCCCCCCCCCCC>
##$VD= 0
##$VDLIST= <DDDDDDDDDDDDDDD>
##$VPLIST= <PPPPPPPPPPPPPPP>
##$VTLIST= <TTTTTTTTTTTTTTT>
##$WBST= 1024
##$WBSW= 25
##$XGAIN= (0..3)
0 0 0 0 
##$XL= 0
##$YL= 0
##$YMAX_a= 1052522
##$YMIN_a= -655297
##$ZGOPTNS= <>
##$ZL1= 120
##$ZL2= 120
##$ZL3= 120
##$ZL4= 120
##$ABSF1= 17.49637
##$ABSF2= -4.496376
##$ABSG= 5
##$ABSL= 3
##$ALPHA= 0
##$AQORDER= 0
##$ASSFAC= 0
##$ASSFACI= 0
##$ASSFACX= 0
##$ASSWID= 0
##$AUNMP= <proc_1d>
##$AXLEFT= 0
##$AXRIGHT= 0
##$AXTYPE= 0
##$AXUNIT= <>
##$AZFE= 0.1
##$AZFW= 0.1
##$BCFW= 0
##$BC_mod= 2
##$BYTORDP= 0
##$COROFFS= 0
##$CY= 7568.61572265625
##$DATMOD= 1
##$DC= 0
##$DFILT= <>
##$DTYPP= 0
##$F1P= 17.9538593292236
##$F2P= -4.03888763876832
##$FCOR= 0.5
##$FTSIZE= 32768
##$FT_mod= 6
##$GAMMA= 0
##$GB= 0
##$INTBC= 0
##$INTSCL= 1.367314e-010
##$ISEN= 128
##$LB= 0.02
##$LEV0= 0
##$LPBIN= 0
##$MAXI= 945.577
##$MC2= 0
##$MEAN= 0
##$ME_mod= 0
##$MI= -402.1523
##$NCOEF= 0
##$NC_proc= -6
##$NLEV= 6
##$NOISF1= 8.587773
##$NOISF2= 6.764455
##$NSP= 0
##$NTH_PI= 0
##$NZP= 0
##$OFFSET= 17.49637
##$PC= 1
##$PHC0= 121.9416
##$PHC1= 6.134896
##$PH_mod= 1
##$PKNL= yes
##$PPARMOD= 0
##$PPDIAG= 0
##$PPIPTYP= 0
##$PPMPNUM= 100
##$PPRESOL= 1
##$PSCAL= 0
##$PSIGN= 0
##$REVERSE= no
##$SF= 200.13
##$SI= 32768
##$SIGF1= 16.12182
##$SIGF2= -4.496377
##$SINO= 3.521527
##$SIOLD= 32768
##$SREGLST= <1H.CDCl3>
##$SSB= 0
##$STSI= 32768
##$STSR= 0
##$SW_p= 4401.40845070422
##$SYMM= 0
##$S_DEV= 0
##$TDeff= 16384
##$TDoff= 0
##$TI= <>
##$TILT= no
##$TM1= 0
##$TM2= 0
##$TOPLEV= 0
##$USERP1= <user>
##$USERP2= <user>
##$USERP3= <user>
##$USERP4= <user>
##$USERP5= <user>
##$WDW= 1
##$XDIM= 32768
##$YMAX_p= 456012101
##$YMIN_p= -1169150
$$ End of Bruker specific parameters
$$ ---------------------------------
##NTUPLES= NMR SPECTRUM
##VAR_NAME=  FREQUENCY,     SPECTRUM/REAL,   SPECTRUM/IMAG
##SYMBOL=    X,             R,               I
##VAR_TYPE=  INDEPENDENT,   DEPENDENT,       DEPENDENT
##VAR_FORM=  AFFN,          ASDF,            ASDF
##VAR_DIM=   32768,         32768,           32768
##UNITS=     HZ,            ARBITRARY UNITS, ARBITRARY UNITS
##FACTOR=    0.134324425510551, 1,           1
##FIRST=     4401.40845070422, -123193,      -1814457
##LAST=      0,             258552,          -2223130
##MIN=       0,             -1169150,        0
##MAX=       4401.40845070422, 456012101,    0
$$ Real data points
##PAGE= N=1
##DATA TABLE= (X++(R..R)), XYDATA
$$ [...]
11331C802641J31488K94381L1172l72332m35684j14148K43871L50751J94283m5298
$$ 3802641 3934129 4228510 4259682 3887350 3451666 3337518 3581389 3932140 4126423 4081125
11321D081125j52885o1395O7992N8630k0582J1935J12745P4138r0829j33153J2569
$$ 4081125 3928240 3866845 3934837 3993467 3972885 3984820 4097565 4171703 4080874 3947721 3960290
11310C960290J08052J9122n7051O1049K25829K07314N8556N805R6990J72721J25086
$$ 3960290 4068342 4087464 4030413 4091462 4317291 4524605 4583161 4588966 4685956 4858677 4983763
11299D983763J2259n9611m4206M1775J35931J57734P3886o2124j49503j17096
$$ 4983763 4996022 4936411 4892205 4933980 5069911 5227645 5301531 5239407 5089904 4972808
11289D972808J3527J27771J36243J03644J46716J86810K0945k60484k27711K59011
$$ 4972808 4986335 5114106 5250349 5353993 5500709 5687519 5708464 5447980 5220269 5479280
11279E479280O70347M74194m0742j49572K10231L72991L7714k69922j01951J89741
$$ 5479280 6149627 6623821 6583079 6433507 6643738 7016729 7054443 6784521 6682570 6872311
11269F872311J00668j62602n7174L71924N62442L01689l7216j18146k3192N5663
$$ 6872311 6972979 6810377 6753203 7125127 7687569 7989258 7952042 7833896 7810704 7866367
11259G866367J11185J84365K20007J85647J50715J68337K03480K00728J34185
$$ 7866367 7977552 8161917 8381924 8567571 8718286 8886623 9090103 9290831 9425016
11250I425016L3173K5898K20189M46360L55849l5330j95905K01682O91453O07616
$$ 9425016 9458189 9484087 9704276 10150636 10506485 10471155 10275250 10476932 11168385 11776001
11240A1776001O9624j94934O5638L53560L02971J82070K70725L39033J52373J3757
$$ 11776001 11845625 11650691 11716329 12069889 12372860 12554930 12825655 13164688 13317061 13330818
11230A3330818K86668P02259P03572L16751J26297L97429P27017O89282M24626
$$ 13330818 13617486 14319745 15023317 15340068 15466365 15863794 16590811 17280093 17704719
11221A7704719L67536O48647J001917J132840R90010P40610O23484P87471J148872
$$ 17704719 18072255 18720902 19722819 20855659 21845669 22586279 23209763 23997234 25146106
11212B5146106J420810J395840J208530J202541J494644J804682J841603J739621
$$ 25146106 26566916 27962756 29171286 30373827 31868471 33673153 35514756 37254377
11204C7254377J876390K282813K542562K398304K146208K157796K254602J947592
$$ 37254377 39130767 41413580 43956142 46354446 48500654 50658450 52913052 54860644
11196E4860644J174678L58855k58537q74979j602203k143703k259210k191320
$$ 54860644 56035322 56394177 56135640 55260661 53658458 51514755 49255545 47064225
11188D7064225k294131k491900k461986k179913j915947j784673j649591j446985
$$ 47064225 44770094 42278194 39816208 37636295 35720348 33935675 32286084 30839099
11180C0839099j282427j184220j046937q72806q12896q87662q95597p13585m99078
$$ 30839099 29556672 28372452 27325515 26452709 25639813 24752151 23856554 23142969 22643891
11171B2643891m54730n32036n21021l50425j52936o6974j02269k06949l52964
$$ 22643891 22189161 21657125 21136104 20785679 20632743 20565769 20463500 20256551 19903587
11162A9903587m99091n50938m62797l55399m01951n63447n89966l92823k51959
$$ 19903587 19404496 18853558 18390761 18035362 17633411 17069964 16479998 16087175 15835216
11153A5835216m39617p54727p37585l29880J7006l0762k82000l83166k77060j03630
$$ 15835216 15395599 14640872 13903287 13573407 13590413 13559651 13277651 12894485 12617425 12513795
11143A2513795O4012J45322r632l31497m44233j75696J08225L3286k01183k12622
$$ 12513795 12577807 12723129 12713497 12382000 11937767 11762071 11870296 11903582 11702399 11489777
11133A1489777j31051l25602o23964m97704L247K23024p8069l73755k65480m5372
$$ 11489777 11358726 11033124 10409160 9911456 9914703 10137727 10059658 9685903 9420423 9375051
11123I375051m2609o5558O9665P0114k35559l92573n5265K77906K6233m00317
$$ 9375051 9332442 9266884 9336549 9406663 9171104 8778531 8723266 9001172 9027405 8627088
11113H627088k01774M08504M47950k15592n84044j19905M20019K47600k52630
$$ 8627088 8425314 8833818 9281768 9066176 8482132 8362227 8782246 9029846 8777216
11104H777216k88021O1375J52837q5098j85095n7104m9752j89857j23866J60298
$$ 8777216 8489195 8550570 8703407 8618309 8433214 8376110 8326358 8136501 8012635 8172933
11094H172933K48426L1282j15222j3678O4130P19O0893K70440K05287k37107m68632
$$ 8172933 8421359 8452641 8337419 8323741 8387871 8388590 8449483 8719923 8925210 8688103 8219471
11083H219471r4183L88998L60036M9225M1443K18490N4551k80123r0351N72064
$$ 8219471 8125288 8514286 8874322 8923547 8964990 9183480 9238031 8957908 8867557 9439621
11073I439621Q07187K83159j83341P9890N62825M84447O1322L2025L57983L28440
$$ 9439621 10246808 10529967 10346626 10426516 10989341 11473788 11535110 11567135 11925118 12253558
11063A2253558j99175n66157m01391j47216k31957l75304j38285K91846L60814
$$ 12253558 12054383 11488226 11086835 10939619 10707662 10332358 10194073 10485919 10846733
11054A0846733k7897l89232l17539N0535K87835J89827o5111j87903j04085L0928
$$ 10846733 10818836 10429604 10112065 10162600 10450435 10640262 10575151 10387248 10283163 10314091
11044A0314091P9639O4314N1950N3614R7990K21482K91525Q2304l05115l90357
$$ 10314091 10393730 10458044 10509994 10563608 10661598 10883080 11174605 11256909 10951794 10561437
11034A0561437K9872M61258L60225m1777r6591K35247L63413O8616j65797L109
$$ 10561437 10591309 11052567 11412792 11371015 11274424 11509671 11873084 11941700 11775903 11779012
11024A1779012K48770J94320N01m2850k8032j07862q4872K08027M61256L14373
$$ 11779012 12027782 12222102 12222603 12179753 12151721 12043859 11958987 12167014 12628270 12942643
11014A2942643l8716j49796j739P8531J0495q350O7570J06912J01607J09339M0007
$$ 12942643 12903927 12754131 12752392 12830923 12841418 12833068 12900638 13007550 13109157 13218496 13258503
11003A3258503j24171j01068K58797N38377K84067k23720l34594j9693J73842
$$ 13258503 13134332 13033264 13292061 13830438 14114505 13890785 13556191 13536498 13710340
10994A3710340Q0665P6328K42358J75690j73211k55941J40505M30605J51995k73155
$$ 13710340 13791005 13867333 14109691 14285381 14112170 13856229 13996734 14427339 14579334 14306179
10984A4306179k35498J17111K27545L4070q5978k1362N389o7658q2715j8137J605
$$ 14306179 14070681 14187792 14415337 14449407 14363429 14342067 14347456 14279798 14197083 14178946 14180551
10973A4180551k5554k8266n9692j52178j46321L3274J44554O34j64476p4022J06448
$$ 14180551 14154997 14126731 14067039 13914861 13768540 13801814 13946368 13947002 13782526 13708504 13814952
10962A3814952Q6721j5559M3658Q8527j46582l67999j07069L82020L99877l3569
$$ 13814952 13901673 13886114 13929772 14018299 13871717 13503718 13396649 13778669 14178546 14144977
10952A4144977j51687K67841M79630J3508m94217l05640K49303L35580j12149
$$ 14144977 13993290 14261131 14740761 14754269 14260052 13954412 14203715 14539295 14427146
10943A4427146m45316l67759j98712j68171j29896p481M2971q181k0519m9286
$$ 14427146 13981830 13614071 13415359 13247188 13117292 13109811 13152782 13144601 13124082 13074796
10933A3074796k73269m98677k78676L04614N32808M4431n50121m96639K8479K29720
$$ 13074796 12801527 12302850 12024174 12328788 12861596 12906027 12355906 11859267 11887746 12117466
10923A2117466j19890m19016j90185K71675M18193J93003n6712j44228j70488
$$ 12117466 11997576 11578560 11388375 11660050 12078243 12271246 12214534 12070306 11899818
10914A1899818k12863k07081j28179n4956l8250p0981j69389l14478l55461j86658
$$ 11899818 11686955 11479874 11351695 11296739 11258489 11187508 11018119 10703641 10348180 10161522
10904A0161522N004o6640l23382l56897k9900K71147J81856j25242k50833j63578
$$ 10161522 10166526 10099886 9776504 9419607 9389707 9660854 9842710 9717468 9466635 9303057
10894I303057j32124k07745j77278o561O3391n3755j04842R2307L12301K14979
$$ 9303057 9170933 8963188 8785910 8779349 8842740 8788985 8684143 8776450 9088751 9303730
10884I303730j67182m41858l22367N4022K91035J63327j55099l20095k36509j15712
$$ 9303730 9136548 8694690 8372323 8426345 8717380 8880707 8725608 8405513 8169004 8053292
10874H053292j00392o2445Q7695J48888m2639k50054j64330O5771O7804r7864
$$ 8053292 7952900 7890455 7978150 8127038 8084399 7834345 7670015 7735786 7803590 7705726
10864G705726l8293K28632K29026j33291l09868K5898L97123K40285k37842m28584
$$ 7705726 7667433 7896065 8125091 7991800 7681932 7707830 8104953 8345238 8107396 7678812
10854G678812k26639k7808k2451k4176P7466J57835J36139N3613q3649k29595
$$ 7678812 7452173 7424365 7401914 7377738 7455204 7613039 7749178 7802791 7719142 7489547
10844G489547j80153J21146L04392K5303m20174m24630L6690L68806K44698j3939
$$ 7489547 7309394 7430540 7734932 7760235 7340061 6915431 6952121 7320927 7565625 7551686
10834G551686o4893j9772o7704j00603o709N4575k1948l2327J46305K31823k9547
$$ 7551686 7486793 7467021 7399317 7298714 7292005 7346580 7324632 7292305 7438610 7670433 7640886
10823G640886l70442l46797P148K69275K52339J36627M8420p9573k03292j18204
$$ 7640886 7270444 6923647 6930795 7200070 7452409 7589036 7637456 7557883 7354591 7236387
10813G236387J58887K83072N1858k54737k41249M6851K05951O7529q5277J0009
$$ 7236387 7395274 7678346 7730204 7475467 7234218 7281069 7487020 7554549 7469272 7479281
10803G479281J71022P4912j64236j02261L14254N42931J94448l56105m78208j59953
$$ 7479281 7650303 7725215 7560979 7458718 7772972 8315903 8510351 8154246 7676038 7516085
10793G516085R3150Q6001J02963K49277K20128r5644l21994j98393j4749q9742
$$ 7516085 7609235 7695236 7798199 8047476 8267604 8171960 7849966 7651573 7636824 7547082
10783G547082k22669r0043J49160J28757q8224j53174n0829o2952j98430j73817
$$ 7547082 7324413 7234370 7383530 7512287 7424063 7270889 7220060 7157108 6958678 6784861
10773F784861L5003J13108l9786j22195N3331K40127J54624j00517k23958j21032
$$ 6784861 6819864 6932972 6893186 6770991 6824322 7064449 7219073 7118556 6894598 6773566
10763F773566O2335J66112J36321K4148m7995o537O3962L8235m4682m3574M6813
$$ 6773566 6835901 7002013 7138334 7162482 7114487 7107950 7171912 7210147 7165465 7121891 7168704
10752G168704R7933O2489J270o3851j16410k9990K50944M68894L07875j20583
$$ 7168704 7266637 7329126 7330396 7266545 7150135 7120145 7371089 7839983 8147858 8027275
10742H027275l77478k94413j18904l5918N0372J70665J57371J6167J0884J76893
$$ 8027275 7649797 7355384 7236480 7200562 7250934 7421599 7578970 7595137 7606021 7782914
10732G782914J80944p7249j80716J23458L95565J49235l19181l36737J16958M14090
$$ 7782914 7963858 7886609 7705893 7829351 8224916 8374151 8054970 7718233 7835191 8249281
10722H249281K53311J2487L8413J43789M5505j22530n0230K40140M13630K53862
$$ 8249281 8502592 8515079 8553492 8697281 8742786 8620256 8570026 8810166 9223796 9477658
10712I477658j02398l17963j74248K01623M25018K64541o8503j80573L439J98288
$$ 9477658 9375260 9057297 8883049 9084672 9509690 9774231 9705728 9525155 9528594 9726882
10702I726882J96630J07540J03782J52830J18980o259r0722j7956J88408L55445
$$ 9726882 9923512 10031052 10134834 10287664 10406644 10400385 10309663 10291707 10480115 10835560
10692A0835560L01815N6034j30609q6120O2664J05460O0831Q2795J72208K14836
$$ 10835560 11137375 11193409 11062800 10976680 11039344 11144804 11205635 11288430 11460638 11675474
10682A1675474K09721K10787J50369K427j8387K15437L62683N0483l86811k26384
$$ 11675474 11885195 12095982 12246351 12248778 12230391 12445828 12808511 12858994 12472183 12245799
10672A2245799N08100R08393M51962k29114k89723J65225M31401L02904J52414
$$ 12245799 12753899 13662292 14114254 13885140 13595417 13760642 14192043 14494947 14647361
10663A4647361J53321J06527j6803K5222K51048L73587K95942K41291L00302K82481
$$ 14647361 14800682 14907209 14890406 14915628 15166676 15540263 15836205 16077496 16377798 16660279
10653A6660279J39927J20474L22386M72135L65022K06866K68448M56703M93710
$$ 16660279 16800206 16920680 17243066 17715201 18080223 18287089 18555537 19012240 19505950
10644A9505950L40718J96168J88191K74962L75021M39712M48513M29629M29232
$$ 19505950 19846668 20042836 20231027 20505989 20881010 21320722 21769235 22198864 22628096
10635B2628096M25242L72653L39414M36517N99493O45227N81108O13521P79106
$$ 22628096 23053338 23425991 23765405 24201922 24801415 25446642 26027750 26641271 27420377
10626B7420377Q44173O94949N40588N48226N63193M36496L61482N63548Q59484
$$ 27420377 28264550 28959499 29500087 30048313 30611506 31048002 31409484 31973032 32832516
10617C2832516Q89832O64750N11155N43182N55701M44257L73981M58025N69645
$$ 32832516 33722348 34387098 34898253 35441435 35997136 36441393 36815374 37273399 37843044
10608C7843044N82480N55400N65275N54025M52859L09482K15315K31040M01666
$$ 37843044 38425524 38980924 39546199 40100224 40553083 40862565 41077880 41308920 41710586
10599D1710586O85106Q67286P54309M62324K88852K91026K83004K79521N43822
$$ 41710586 42395692 43262978 44017287 44479611 44768463 45059489 45342493 45622014 46165836
10590D6165836J033174J221371Q04963K45910J76742N07449O34052M02194K76714
$$ 46165836 47199010 48420381 49225344 49471254 49647996 50155445 50789497 51191691 51468405
10581E1468405N14179P55374O60255M42457M33592N25477M67638M00057N85259
$$ 51468405 51982584 52737958 53398213 53840670 54274262 54799739 55267377 55667434 56252693
10572E6252693Q16438O62639K35739J10719M03699N42818K01698j27821P1020
$$ 56252693 57069131 57731770 57967509 58078228 58481927 59024745 59226443 59098622 59169642
10563E9169642M64117L89562n9415j89893J53302L52508M2666l20470k28704J15108
$$ 59169642 59633759 60023321 59963906 59774013 59927315 60279823 60322489 60002019 59773315 59888423
10553E9888423K30548J14779P3216J17481N0728o3506l0799L3659q5725j78873
$$ 59888423 60118971 60233750 60306966 60424447 60475175 60411669 60380870 60414529 60328804 60149931
10543F0149931J27699O25616O77516K02991j29407Q9655M35219M29782L12731
$$ 60149931 60277630 60903246 61580762 61783753 61654346 61744001 62179220 62609002 62921733
10534F2921733N12088Q08093O67733J54478j53057o3361J1084k36492o23740r10008
$$ 62921733 63433821 64241914 64909647 65064125 64911068 64847707 64858791 64622299 63998559 63088551
10524F3088551j126526j307188j311437j137195j060790j220054j349329j187396
$$ 63088551 61962025 60654837 59343400 58206205 57145415 55925361 54576032 53388636
10516E3388636q97794p99242q80103q91710p84761p24355p35651o65467n17606
$$ 53388636 52490842 51691600 50811497 49919787 49135026 48410671 47675020 47009553 46491947
10507D6491947n18793p40397r04425p52177m47565l86617o57569r18340q61380
$$ 46491947 45973154 45232757 44328332 43576155 43128590 42741973 42084404 41166064 40304684
10498D0304684o03762m73076n44799o15105n86946o08332p44928p77488n29839
$$ 40304684 39700922 39227846 38683047 38067942 37480996 36872664 36127736 35350248 34820409
10489C4820409k18556k11262n18744p85317p58314n28519l07136k00953k33108
$$ 34820409 34601853 34390591 33871847 33086530 32328216 31799697 31492561 31291608 31058500
10480C1058500l58662m17195k83531r8960j23491l27057l99144k28501o7780j02670
$$ 31058500 30699838 30282643 29999112 29900152 29776661 29449604 29050460 28821959 28754179 28651509
10470B8651509j78140j36572j10804k25747k94323j28284P9109L7874j39627j01429
$$ 28651509 28473369 28336797 28225993 28000246 27705923 27577639 27656748 27694622 27554995 27453566
10460B7453566J78924L66035K58377M000j61713j24705J12596L80618L76104M6195
$$ 27453566 27632490 27998525 28256902 28260902 28099189 27974484 28087080 28467698 28843802 28889997
10450B8889997j76613J06301O14166P18660L65672J28030K99521N29686N27529
$$ 28889997 28713384 28819685 29433851 30152511 30518183 30646213 30945734 31475420 32002949
10441C2002949N19353O92528P54286M97866L27564O56910J134203J088223N33179
$$ 32002949 32522302 33214830 33969116 34466982 34794546 35451456 36585659 37673882 38207061
10432C8207061J02353Q0925J30905o405j41541j14511j16767l03116m85765m56191
$$ 38207061 38309414 38390339 38521244 38514839 38373298 38258787 38142020 37838904 37353139 36896948
10422C6896948k93163j42915P633J40825J00582r6508j41737J07323L35138K54018
$$ 36896948 36603785 36460870 36468503 36609328 36709910 36613402 36471665 36578988 36914126 37168144
10412C7168144J16830L41556Q12169J020894Q34436O35268O63727P07682O13441
$$ 37168144 37284974 37626530 38438699 39459593 40294029 40929297 41593024 42300706 42914147
10403D2914147O42153R84553J261316R56777K05319l01011j95232J66026K81338
$$ 42914147 43556300 44540853 45802169 46758946 46964265 46663254 46468022 46634048 46915386
10394D6915386J19778m9903j52234l10253n09041n88604n43250n35737n90901
$$ 46915386 47035164 46985261 46833027 46522774 46013733 45425129 44881879 44346142 43755241
10385D3755241n52526m10374l84925n48220o29310m15764j26168r5118k41797
$$ 43755241 43202715 42792341 42407416 41859196 41229886 40814122 40687954 40592836 40351039
10376D0351039j97292R5527K81038J55755l601J45323N11265P15874O07623M06832
$$ 40351039 40153747 40249274 40530312 40686067 40682466 40827789 41339054 42054928 42662551 43069383
10366D3069383L81404N53796P37157P43167N32732K35800M4451M7236J52967J83463
$$ 43069383 43450787 44004583 44741740 45484907 46017639 46253439 46297890 46345126 46498093 46681556
10356D6681556L7891k19017m04156l73181j71832q72J5166l5056j4929M9612N7544
$$ 46681556 46719447 46500430 46096274 45723093 45551261 45550389 45565555 45530499 45515570 45565182 45622726
10345D5622726M3276J09895K11855K30942K25849L30768M30697K97247Q8187K59944
$$ 45622726 45666002 45775897 45987752 46218694 46444543 46775311 47206008 47503255 47591442 47851386
10335D7851386Q00218J038889N97633R0852L21110J070119J383846R74630N92459
$$ 47851386 48651604 49690493 50288126 50378978 50700088 51770207 53154053 54128683 54721142
10326E4721142Q47006J361684J484414J291034J336540J732839K065524K128614
$$ 54721142 55568148 56929832 58414246 59705280 61041820 62774659 64840183 66968797
10318F6968797K206319K547934K977521L203201L242321L334646L586074L897010
$$ 66968797 69175116 71723050 74700571 77903772 81146093 84480739 88066813 91963823
10310I1963823M197544M587040N179344N886782O487474O965875P669868Q942191
$$ 91963823 96161367 100748407 105927751 111814533 118302007 125267882 132937750 141879941
10302A41879941J0620853J2153494J3279356J4304044J5466195J6254645J5692272
$$ 141879941 152500794 164654288 177933644 192237688 207703883 223958528 239650800
10295B39650800J3220600R022271L598557k505305q473228j3207819j5952097
$$ 239650800 252871400 261893671 265492228 262986923 254513695 241305876 225353779
10288B25353779j6819127j6494247j5525024j4087153j2302821j0482407q984118
$$ 225353779 208534652 192040405 176515381 162428228 150125407 139643000 130658882
10281A30658882p964553p301487o711005n988234n206930m623857m329773m114647
$$ 130658882 122694329 115392842 108681837 102693603 97486673 92862816 88533043 84418396
10273H4418396l777650l410562l191421l047465k791153k496707k409605k489232
$$ 84418396 80640746 77230184 74038763 70991298 68200145 65703438 63293833 60804601
10265F0804601k401194k051652j770706j781561j820930j571524j205164j127544
$$ 60804601 58403407 56351755 54581049 52799488 50978558 49407034 48201870 47074326
10257D7074326j339197j445593j255980r97112r00960r21454r45151r74908r80597
$$ 47074326 45735129 44289536 43033556 42036444 41135484 40214030 39268879 38293971 37313374
10248C7313374q47187o30521o10973q90672j146050j014457n82474k63519k88330
$$ 37313374 36466187 35835666 35224693 34334021 33187971 32173514 31591040 31327521 31039191
10239C1039191n16829o73684n91197l01403n4222j43466n39392q19116o73323
$$ 31039191 30522362 29848678 29257481 28956078 28901856 28758390 28218998 27399882 26726559
10230B6726559l40926k63355m36263m73696k64131j27604k44467l60009k57106
$$ 26726559 26385633 26122278 25686015 25212319 24948188 24820584 24576117 24216108 23959002
10221B3959002j42852k64124m34145l21261l3355r80l16006n76173m75186k25493
$$ 23959002 23816150 23552026 23117881 22796620 22763265 22762285 22446279 21870106 21394920 21169427
10211B1169427k04015l92095m29984j70180Q1019k2299l71707n31327l34869j12567
$$ 21169427 20965412 20573317 20143333 19973153 20054172 20031873 19660166 19128839 18793970 18681403
10201A8681403j97245m23028l88266j02338l153k84275n65821m24626J9083K94743
$$ 18681403 18484158 18061130 17672864 17570526 17567373 17283098 16717277 16292651 16311734 16606477
10191A6606477J84276j20604l51836m12462l38456k11220j05390k2720P2676J12358
$$ 16606477 16790753 16670149 16318313 15905851 15567395 15356175 15250785 15228065 15300741 15413099
10181A5413099k6239k54726k91440q7435L6308j04336k14577j0940K38970J15043
$$ 15413099 15386860 15132134 14840694 14753259 14789567 14685231 14470654 14459714 14698684 14813727
10171A4813727k38172l27891j20040l9216j86989j90840O5361J88462j9058j79094
$$ 14813727 14575555 14247664 14127624 14088408 13901419 13710579 13775940 13964402 13945344 13766250
10161A3766250J2779K58585J62608j48787l07834k53541j17505R9308L41496L22703
$$ 13766250 13779029 14037614 14200222 14051435 13743601 13490060 13372555 13471863 13813359 14136062
10151A4136062l9346l16798j41145K17614K94489J31344K9135n4145k48216k50695
$$ 14136062 14096716 13779918 13638773 13856387 14150876 14282220 14311355 14257210 14008994 13758299
10141A3758299J96713N88108K81411l26589k57740M30434O13653q2672o13298
$$ 13758299 13955012 14543120 14824531 14497942 14240202 14670636 15284289 15201617 14588319
10132A4588319j95467M35847K74718l60132n01050j47642o7283l57527l67057
$$ 14588319 14392852 14828699 15103417 14743285 14242235 14094593 14027310 13669783 13302726
10123A3302726N4308L00436R1910j21252k4890J12262Q4469R2007J82848O5885
$$ 13302726 13357034 13657470 13749380 13628128 13603238 13715500 13799969 13891976 14074824 14140709
10113A4140709k28094k06638K11201L89945j929l52009o5662M45044M40830L2535
$$ 14140709 13912615 13705977 13917178 14307123 14305194 13953185 13887523 14332567 14773397 14805932
10103A4805932j20604N2895O0637j67245j86078P0815J38529j00461j56427J85874
$$ 14805932 14685328 14738223 14798860 14631615 14445537 14516352 14654881 14554420 14397993 14583867
10093A4583867M28209J81523j77404j43019J20656J59312K4893Q9235K99416K52849
$$ 14583867 15012076 15193599 15016195 14873176 14993832 15153144 15178037 15267272 15566688 15819537
10083A5819537n5759j65742R7545L31841K02408o3563r3592O1102J04466J8791
$$ 15819537 15763778 15598036 15695581 16027422 16229830 16166267 16072675 16133777 16238243 16257034
10073A6257034M2394K12381K78888J12547q1468o6454J10509K45556K70475K51446
$$ 16257034 16299428 16511809 16790697 16903244 16821776 16755322 16865831 17111387 17381862 17633308
10063A7633308K03000J08820P9498K49350M87327M71778J79243L9908L58212P81657
$$ 17633308 17836308 17945128 18024626 18273976 18761303 19233081 19412324 19452232 19810444 20592101
10053B0592101P14911J83650j50509Q7974M95687N52828L74581L95389N82047
$$ 20592101 21307012 21490662 21340153 21428127 21923814 22476642 22851223 23246612 23828659
10044B3828659N02159J11079q8965J78861N07285M08904L5186q3310J82179M38826
$$ 23828659 24330818 24441897 24352932 24531793 25039078 25447982 25483168 25399858 25582037 26020863
10034B6020863L82488J64105Q4178K04720L83090M89633M67719L30999K16924
$$ 26020863 26403351 26567456 26651634 26856354 27239444 27729077 28196796 28527795 28744719
10025B8744719L04000N51385O58803M48887J70834K02135N04675O42993L92060
$$ 28744719 29048719 29600104 30258907 30707794 30878628 31080763 31585438 32228431 32620491
10016C2620491P0311J05042M44182O34810M29609Q4946M995K52289N17153N02754
$$ 32620491 32690802 32795844 33240026 33874836 34304445 34389391 34394386 34646675 35163828 35666582
10006C5666582K48490O9623K01482N18627O57764M55561J76950J89712M79025
$$ 35666582 35915072 35984695 36186177 36704804 37362568 37818129 37995079 38184791 38663816
9997C8663816O77415N77270L85699L84403N55203P01403P56256P61455O85603
$$ 38663816 39341231 39918501 40304200 40688603 41243806 41945209 42701465 43462920 44148523
9988D4148523N19045M53926O81598J042916J176090J029793R25791J049718J206710
$$ 44148523 44667568 45121494 45803092 46846008 48022098 49051891 49977682 51027400 52234110
9979E2234110J220558J242964J426185J577909J473866J309320J451432J846161
$$ 52234110 53454668 54697632 56123817 57701726 59175592 60484912 61936344 63782505
9971F3782505K077728K009155J960347K167518K447569K570898K631677K796705
$$ 63782505 65860233 67869388 69829735 71997253 74444822 77015720 79647397 82444102
9963H2444102K948550K884046K702467K685150K872273L037396L031124K889784
$$ 82444102 85392652 88276698 90979165 93664315 96536588 99573984 102605108 105494892
9955A05494892K649804K338109K122130K137345K122396J590284N14710m91762
$$ 105494892 108144696 110482805 112604935 114742280 116864676 118454960 118969670 118477908
9947A18477908r22517j006920j288873j833845k275217k498299k769536l157482
$$ 118477908 117555391 116548471 115259598 113425753 111150536 108652237 105882701 102725219
9939A02725219l322450l077584k758523k746587k916812k886969k610641k372697
$$ 102725219 99402769 96325185 93566662 90820075 87903263 85016294 82405653 80032956
9931H0032956k310854k287614k198928k091043j957889j715641j434652j334395
$$ 80032956 77722102 75434488 73235560 71144517 69186628 67470987 66036335 64701940
9923F4701940j456043j558239j440196j188535j014421j014329j168852j395601
$$ 64701940 63245897 61687658 60247462 59058927 58044506 57030177 55861325 54465724
9915E4465724j511771j336143r52952p02632p75281r73544j018004r15193q44282
$$ 54465724 52953953 51617810 50664858 49962226 49186945 48213401 47195397 46280204 45435922
9906D5435922q36978p94435p18624o95672p02217o40421n41691n44129o68855
$$ 45435922 44598944 43804509 43085885 42390213 41687996 41047575 40505884 39961755 39292900
9897C9292900p80352p71738o57111m97465l66767l60447m88356n79872m53165
$$ 39292900 38512548 37740810 37083699 36586234 36219467 35859020 35370664 34790792 34337627
9888C4337627j80534l8404j74273m42411n83064m67241j76825N3682k151l44394
$$ 34337627 34157093 34118689 33944416 33502005 32918941 32451700 32274875 32328557 32326406 31982012
9878C1982012p01115p97785o41872m50360l64313l61847l86576m09392m02611
$$ 31982012 31280897 30483112 29841240 29390880 29026567 28664720 28278144 27868752 27466141
9869B7466141l86208m50257o09855p15735o39354m49243k75704j46587j05237
$$ 27466141 27079933 26629676 26019821 25304086 24664732 24215489 23939785 23793198 23687961
9860B3687961k72442n61578n89844k13133J00217j21606n81574o07736j88892
$$ 23687961 23415519 22853941 22264097 22050964 22151181 22029575 21448001 20840265 20651373
9851B0651373L4148j93861m09455k67710l4363j473m3642n3759k10888m69784
$$ 20651373 20685521 20491660 20082205 19814495 19780132 19778659 19735017 19681258 19470370 19000586
9841A9000586l98027O4057K95210n9779m40771k63099J25881R4831j87893j54162
$$ 19000586 18602559 18666616 18961826 18902047 18461276 18198177 18324058 18418889 18230996 18076834
9831A8076834Q8360M753l06190k60404J20270K16261r1467k52983o7091K9233
$$ 18076834 18165194 18169947 17863757 17603353 17723623 17939884 17848417 17595434 17528343 17557576
9821A7557576j40944j77367O4723J58177n6271j09318K20674M17789Q9295l48315
$$ 17557576 17416632 17239265 17303988 17462165 17405894 17296576 17517250 17935039 18024334 17676019
9811A7676019l62229j07509j2908o2870j0148J17995J84862K26714K13232j3184
$$ 17676019 17313790 17206281 17193373 17130503 17120355 17238350 17423212 17649926 17863158 17849974
9801A7849974k50815J594O22363P35663L5124n48366k27645L73262K78990k05287
$$ 17849974 17599159 17600753 18223116 18958779 18993903 18445537 18217892 18591154 18870144 18664857
9791A8664857j01248M89485N73817J1087k83554N4976L13754N1685j92880K2669
$$ 18664857 18563609 19053094 19626911 19637998 19354444 19409420 19723174 19774859 19581979 19604648
9781A9604648K86307J79425J0074J27993K60673J16663j2196J60654L24457J64258
$$ 19604648 19890955 20070380 20080454 20208447 20469120 20585783 20573587 20734241 21058698 21222956
9771B1222956k375J97746M74672L86185J35270J71562L58952K69715M3615J87190
$$ 21222956 21220581 21418327 21892999 22279184 22414454 22586016 22944968 23214683 23258298 23445488
9761B3445488O38930P84752M36009J26166K87798O79463Q42712P14684N53592
$$ 23445488 24084418 24869170 25305179 25431345 25719143 26398606 27241318 27956002 28509594
9752B8509594N42429O80211Q90179J072308J140033J097917J046335J095115J287301
$$ 28509594 29052023 29732234 30622413 31694721 32834754 33932671 34979006 36074121 37361422
9743C7361422J555169J741234J763977J760370J914755K177380K381717K592772
$$ 37361422 38916591 40657825 42421802 44182172 46096927 48274307 50656024 53248796
9735E3248796K989500L414176L515084L421621L701350M408038M777668M261256
$$ 53248796 56238296 59652472 63167556 66589177 70290527 74698565 79476233 83737489
9727H3737489L279556K444324J599501L09961j173296k246463k937598l713715
$$ 83737489 87017045 89461369 91060870 91370831 90197535 87951072 85013474 81299759
9719H1299759m489361m692160m271533l818003l632864l444383l118762k887524
$$ 81299759 76810398 72118238 67846705 64028702 60395838 56951455 53832693 50945169
9711E0945169k748087k397302j923638j803119k004599j895666j323902r74375
$$ 50945169 48197082 45799780 43876142 42073023 40068424 38172758 36848856 35874481
9703C5874481j246403j568333j359377r49132r07239j079545r94682p35349o88171
$$ 35874481 34628078 33059745 31700368 30751236 29843997 28764452 27769770 27034421 26346250
9694B6346250q07346q03869p37925p80322p14584l40684n5671l14215p78615p64273
$$ 26346250 25538904 24735035 23997110 23216788 22502204 22161520 22105849 21791634 21013019 20248746
9684B0248746l25327j08390k72992l87826l32912m31698o39450m85387j48J49231
$$ 20248746 19923419 19815029 19542037 19154211 18821299 18389601 17750151 17264764 17264616 17413847
9674A7413847k62544n96933l78233q650m546j85039j57563m1215j19208k39669
$$ 17413847 17151303 16554370 16176137 16167487 16162941 15977902 15820339 15779124 15659916 15420247
9664A5420247j62764j06580l31690n26887k67519J77908J91859k03102l96868
$$ 15420247 15257483 15150903 14819213 14292326 14024807 14202715 14394574 14191472 13794604
9655A3794604j73019M9056o385j05461n5188k4098j08046j05526L3483K1975k29296
$$ 13794604 13621585 13670641 13664256 13558795 13503607 13479509 13371463 13265937 13299420 13321395 13092099
9644A3092099l55826j37693Q7430r609j85634r2635N9790j16035m10385k90742
$$ 13092099 12736273 12598580 12686010 12676401 12490767 12398132 12457922 12341887 11931502 11640760
9634A1640760J55034K60784j60096m88578k72709R8750Q9487j37685r6424J58558
$$ 11640760 11795794 12056578 11896482 11407904 11135195 11233945 11323432 11185747 11089323 11247881
9624A1247881J48468k04724m51716l20133n5522L3323k7081o1748k3971M2629
$$ 11247881 11396349 11191625 10739909 10419776 10364254 10397577 10370496 10308748 10284777 10327406
9614A0327406Q7914L3717j18373j67808K5211K10327N0477k77155k72772M6911
$$ 10327406 10415320 10449037 10330664 10162856 10188067 10398394 10448871 10171716 9898944 9945855
9604I945855R9233k81217m73860q6382L05192N0403m61563l73775K74724O29214
$$ 9945855 10045088 9763871 9290011 9203629 9508821 9559224 9097661 8723886 8998610 9627824
9594I627824L47484k8319q8086r1352k56423k89636j0637J95296J4555k16998
$$ 9627824 9975308 9946989 9858903 9767551 9511128 9221492 9210855 9406151 9420706 9203708
9584I203708o5121K79597L32723O5479j62769j98157j67663j27687m5207M74m8264
$$ 9203708 9138587 9418184 9750907 9816386 9653617 9455460 9287797 9160110 9114903 9115377 9067113
9573I067113k8379J81114L56534K27285q2286k49109k22468j49613k6109J74741
$$ 9067113 9038734 9219848 9576382 9803667 9721381 9472272 9249804 9100191 9074082 9248823
9563I248823K14346r5273m32031l35223O0721K14241M2331j5348J71816J97767
$$ 9248823 9463169 9367896 8935865 8600642 8661363 8875604 8917935 8902587 9074403 9272170
9553I272170j00174k82655m7878K35006J42206j20961j21687P6660R8137p9782
$$ 9272170 9171996 8889341 8841463 9076469 9218675 9097714 8976027 9052687 9150824 9071042
9543I071042j42066Q396J51544J52098R5793N3225R812o58N0056N2449p8924j91798
$$ 9071042 8928976 8937372 9088916 9241014 9336807 9390032 9399844 9399186 9449242 9501691 9422767 9230969
9531I230969r2882J29087K32265J78076R0646k6197k15639l11049j21593J69427
$$ 9230969 9138087 9267174 9499439 9677515 9768161 9741964 9526325 9215276 9093683 9263110
9521I263110J80040q5892k19595l1872J91457J74294K4110m5569m4338o4284q1398
$$ 9263110 9443150 9357258 9137663 9105791 9297248 9471542 9495652 9450083 9405745 9341461 9260063
9510I260063p8176j16553j37480L4310L26709L83419J02338j30303k1121J63938
$$ 9260063 9181887 9065334 8927854 8962164 9288873 9672292 9774630 9644327 9623206 9787144
9500I787144P8362r3479J9215K75803K37659o1299j64780J0769N7566j51779k01057
$$ 9787144 9865506 9772027 9791242 10067045 10304704 10243405 10078625 10089394 10146960 9995181 9794124
9489I794124J22613L93132K23532r5109q5791J45874J47097j07292k04256K4934
$$ 9794124 9916737 10309869 10533401 10438292 10352501 10498375 10645472 10538180 10333924 10358858
9479A0358858K83373K91475J19790j2290J3336J88938L63773K74425j46511n29428
$$ 10358858 10642231 10933706 11053496 11041206 11054542 11243480 11607253 11881678 11735167 11205739
9469A1205739m33322O0470M30611L95663J79134O2892L9887J5878J4826L0171
$$ 11205739 10772417 10832887 11263498 11659161 11838295 11901187 11941074 11956952 11971778 12001949
9459A2001949l4074j24744k8185K54129M17751L08777J48970J15172M3775j81860
$$ 12001949 11967875 11843131 11814946 12069075 12486826 12795603 12944573 13059745 13103520 12921660
9449A2921660l05322j14078J29897R7624l1797J10421L86946L33851m5132k41224
$$ 12921660 12616338 12502260 12632157 12729781 12697984 12808405 13195351 13529202 13484070 13242846
9439A3242846m1373J81792J26301O219R7764K55920J98679j6433j15273k4513
$$ 13242846 13201473 13383265 13509566 13515785 13613549 13869469 14068148 14051715 13936442 13911929
9429A3911929R9401J39742J13367Q2616J10439K10864K68622J49475n2924q0044
$$ 13911929 14011330 14151072 14264439 14347055 14457494 14668358 14936980 15086455 15033531 14953487
9419A4953487J01773K13319R1934m2974N6140K70096L08828J37957k7088l8450
$$ 14953487 15055260 15268579 15360513 15317539 15373679 15643775 15952603 16090560 16063472 16025022
9409A6025022P6249K20057K67418J19821j13329j39693J20308L32442J85823j22962
$$ 16025022 16101271 16321328 16588746 16708567 16595238 16455545 16575853 16908295 17094118 16971156
9399A6971156j43977J80830M54682L97369J67494M6381O0836N5634j9544m7648
$$ 16971156 16827179 17008009 17462691 17860060 18027554 18073935 18134771 18190405 18170861 18123213
9389A8123213P0201K54752L15379J92107P0715J43890L04137K78445O8443k3456
$$ 18123213 18193414 18448166 18763545 18955652 19026367 19170257 19474394 19752839 19821282 19797826
9379A9797826J21001K52558K05404J68751K68906K65718J6293j34846J05672L88946
$$ 19797826 19918827 20171385 20376789 20545540 20814446 21080164 21096457 20961611 21067283 21456229
9369B1456229K47188o8045L5353M46961M93545J07655j4228L89391O50175K70788
$$ 21456229 21703417 21635372 21670725 22117686 22611231 22718886 22704658 23094049 23744224 24015012
9359B4015012k48817k41240J06533K16630J08544J95915M35549M31577K03412
$$ 24015012 23766195 23524955 23631488 23848118 23956662 24152577 24588126 25019703 25223115
9350B5223115J30387K18005J21007j04518J5470N07181P45307L90867n3911j5961
$$ 25223115 25353502 25571507 25692514 25587996 25603466 26110647 26855954 27246821 27192910 27176949
9340B7176949K97495L04700j4607j42449J31558M14629L43382R5792N5557K35559
$$ 27176949 27474444 27779144 27764537 27622088 27753646 28168275 28511657 28607449 28663006 28898565
9330B8898565L26739K11771J22685K38106L84954L14583J02714L1751J58504K70494
$$ 28898565 29225304 29437075 29559760 29797866 30182820 30497403 30600117 30631868 30790372 31060866
9320C1060866K58534K42637K80038K52592J52516J67883L17317L19939O4448j13197
$$ 31060866 31319400 31562037 31842075 32094667 32247183 32415066 32732383 33052322 33116770 33003573
9310C3003573O0556L08267K32518r385L7948L42902M18659J30400q4699P3823
$$ 33003573 33064129 33372396 33604914 33595529 33633477 33976379 34395038 34525438 34440739 34514562
9300C4514562L30011L08545O0385j21840j09431N2283K78899M08258K70984l5366
$$ 34514562 34844573 35153118 35213503 35091663 34982232 35034515 35313414 35721672 35992656 35957290
9290C5957290j78578l4951J60251K28585K89309M05450L52693K9978k18682o2218
$$ 35957290 35778712 35743761 35904012 36132597 36421906 36827356 37180049 37210027 36991345 36929127
9280C6929127K65882K67852j02844m02099l09807L8999L10579K95942J3246k83090
$$ 36929127 37195009 37462861 37360017 36957918 36648111 36687110 36997689 37293631 37306877 37023787
9270C7023787k57081J17005M03592K04050k77068m62110j57772K28355K51979
$$ 37023787 36766706 36883711 37287303 37491353 37214285 36752175 36594403 36822758 37074737
9261C7074737o3483l48430l04255M0492L28905J65137m02427p77442m79658J63592
$$ 37074737 37011254 36662824 36358569 36399061 36727966 36893103 36490676 35713234 35233576 35397168
9251C5397168L73102l4700m18706k74474N9886Q99l59619m39401j07209J11687
$$ 35397168 35770270 35735570 35316864 35042390 35102276 35103175 34743556 34304155 34196946 34308633
9241C4308633j49827n43361n23148j22608J41840K3038j83843j78556j08529k44392
$$ 34308633 34158806 33615445 33092297 32969689 33111529 33134567 32950724 32772168 32663639 32419247
9231C2419247m51929l60562J8661K44446P8018k12803l31715l60406m37564l96844
$$ 32419247 31967318 31606756 31625417 31869863 31947881 31735078 31403363 31042957 30605393 30208549
9221C0208549j06652J17277q3127m69881m98091j60299J3550j82363l46583j92286
$$ 30208549 30101897 30219174 30136047 29666166 29168075 29007776 29021326 28838963 28492380 28300094
9211B8300094K486o9334k40174k42231j85121k69207l42064j65442J01205J04230
$$ 28300094 28302580 28233246 27993072 27750841 27565720 27296513 26954449 26789007 26890212 26994442
9201B6994442j58912l72084l72472k55082j06896L7434O3766q0424j97685j04950
$$ 26994442 26835530 26463446 26090974 25835892 25728996 25766430 25830196 25749772 25552087 25447137
9191B5447137J5929j17716l67430l32648j4192J27596j28173m14728l18632M3405
$$ 25447137 25463066 25345350 24977920 24645272 24631080 24758676 24630503 24215775 23897143 23940548
9181B3940548K20919J0896l55967n07627k90724R2165K69259R4567j91611l03224
$$ 23940548 24161467 24172363 23816396 23308769 23018045 23110210 23379469 23474036 23282425 22979201
9171B2979201k69606k44563j40116J75416M35019K26183l01849n17467k15264
$$ 22979201 22709595 22465032 22324916 22500332 22935351 23161534 22859685 22342218 22126954
9162B2126954J01758O5382j6743J61348K53794j27571n80618m15066K25406N01824
$$ 22126954 22228712 22294094 22277351 22438699 22692493 22564922 21984304 21569238 21794644 22296468
9152B2296468J25741k67666j53927J49114J25882j08979j12289J15043K01019
$$ 22296468 22422209 22154543 22000616 22149730 22275612 22166633 22054344 22169387 22370406
9143B2370406Q4967Q4716K64800K42768j66648n13159k90557K62218M08056m5471
$$ 22370406 22455373 22540089 22804889 23047657 22881009 22367850 22077293 22339511 22747567 22702096
9133B2702096m44677k51358J47214M7840m53640o03206j81465J63661l0270l42278
$$ 22702096 22257419 22006061 22153275 22201115 21747475 21144269 20962804 21126465 21096195 20753917
9123B0753917k33466Q0305R9396p3813j5688J61986J0730l47211l19469J30776
$$ 20753917 20520451 20600756 20700152 20626339 20610651 20772637 20783367 20436156 20116687 20247463
9113B0247463L51434M9660k74125k04026j7880n2129j00457Q5504K40419N6789
$$ 20247463 20598897 20648557 20374432 20170406 20152526 20100397 19999940 20085444 20325863 20382652
9103B0382652k24938k24750m9021Q116L2861K13725L26146R4257k06484j39801
$$ 20382652 20157714 19932964 19883943 19892059 19924920 20138645 20464791 20559048 20352564 20212763
9093B0212763J21036P7074k14536k51916J6061J49120N9046J26990L88518L74185
$$ 20212763 20333799 20410873 20196337 19944421 19960482 20109602 20168648 20295638 20684156 21058341
9083B1058341l1519l10346j79902l6403j58943j69585K07195M80774J45738l84034
$$ 21058341 21026822 20716476 20536574 20500171 20341228 20171643 20378838 20859612 21005350 20621316
9073B0621316l35598K19581M78200J14897l34959l67473j60794j10237j81904
$$ 20621316 20285718 20505299 20983499 21098396 20763437 20395964 20235170 20124933 19943029
9064A9943029p0529K32753L71202J21570k54907l12754j8640J86981L7108j42420
$$ 19943029 19872500 20105253 20476455 20598025 20343118 20030364 20011724 20198705 20235813 20093393
9054B0093393J7238K39325K9671l66167k16312M22486N94935m5923n63015j94439
$$ 20093393 20110631 20349956 20379627 20013460 19797148 20219634 20814569 20768646 20205631 20011192
9044B0011192L96876K41704l08934k42706L23053L55272k60270m95052N4154N02496
$$ 20011192 20408068 20649772 20340838 20098132 20421185 20776457 20516187 20021135 20075289 20577785
9034B0577785K12609j99982m1497K93378J33106k81467k95750L2435J61504L0021
$$ 20577785 20790394 20590412 20548915 20842293 20975399 20693932 20398182 20430617 20592121 20622142
9024B0622142p638O5925j1939j56409n1788K07546K08151r5153l11048k10545
$$ 20622142 20614504 20680429 20668490 20512081 20460293 20667839 20875990 20780837 20469789 20259244
9014B0259244M2534K20462K27211N5180j36670p1173K12161K47910j52782m51524
$$ 20259244 20301778 20522240 20749451 20804631 20667961 20596788 20808949 21056859 20904077 20452553
9004B0452553j50577L54128L52827m5735j53465J11040J64052j32802k20206J31013
$$ 20452553 20301976 20656104 21008931 20963196 20809731 20920771 21084823 20952021 20731815 20862828
8994B0862828L92009J79422j56394k05008r8948o5216J4469J92524J79428r5065
$$ 20862828 21254837 21434259 21277865 21072857 20973909 20908693 20923162 21115686 21295114 21200049
8984B1200049j92368J14235L69532J79333j14863o7969Q5836n2894k26934N858
$$ 21200049 21007681 21121916 21491448 21670781 21555918 21487949 21573785 21520891 21293957 21299815
8974B1299815L51703K04607k46213k67457J46346K34629j95290l89304P0191N21240
$$ 21299815 21651518 21856125 21609912 21342455 21488801 21723430 21528140 21138836 21209027 21730267
8964B1730267L08115j56556j28801K35904K21473k02465l49407K3642L42478J77623
$$ 21730267 22038382 21881826 21753025 21988929 22210402 22007937 21658530 21682172 22024650 22202273
8954B2202273j10818l8043K22773J89845j24447k66672n8901K05177K68861K06274
$$ 22202273 22091455 22053412 22276185 22466030 22341583 22074911 22016010 22221187 22490048 22696322
8944B2696322J42205N0139m1449J8062J82653J52208j26734k35877R7123M63508
$$ 22696322 22838527 22888666 22847217 22865279 23047932 23200140 23073406 22837529 22934652 23398160
8934B3398160L25342j23051k27885R0223K43525j4907j97735L8320K92385J46310
$$ 23398160 23723502 23600451 23372566 23462789 23706314 23691407 23493672 23531992 23824377 23970687
8924B3970687q4348P3249L58967J83540l25891m45892K3625M77095M45099J76037
$$ 23970687 23886339 23959588 24318555 24502095 24176204 23730312 23753937 24231032 24676131 24852168
8914B4852168O3877O2057j4840o0477P1598K10068J39421J380N9491K31213K21813
$$ 24852168 24916045 24978102 24963262 24902785 24974383 25184451 25323872 25325252 25384743 25615956 25837769
8903B5837769K8569n5249P2412J77866J06407L0154J21554K34142J57287J9737
$$ 25837769 25866338 25811089 25883501 26061367 26167774 26197928 26319482 26553624 26710911 26730648
8893B6730648J09257L37610K78195j38776l65299R459N55145N38244K292k81181
$$ 26730648 26839905 27177515 27455710 27316934 26951635 26961094 27516239 28054483 28056775 27775594
8883B7775594M3123M54380M35488J88967J11183J18799K088k7939K52936N07949
$$ 27775594 27818717 28273097 28708585 28897552 29008735 29127534 29129622 29101683 29354619 29862568
8873B9862568L32332J5194R3544L91251L04929j01406j69822J99683L91344J88422
$$ 29862568 30194900 30210094 30303638 30694889 30999818 30898412 30728590 30928273 31319617 31508039
8863C1508039J09837L72679M52938R5751j30983J51250L96949J02856k37273L3811
$$ 31508039 31617876 31990555 32443493 32539244 32408261 32559511 32956460 33059316 32822043 32855854
8853C2855854N63424N70322J44292l224K17847K72793Q2328J11574L84782L77240
$$ 32855854 33419278 33989600 34133892 34130668 34348515 34621308 34703636 34815210 35199992 35577232
8843C5577232L1539l0976M08574P09217M02555l8587J4703L63843L87603N4053
$$ 35577232 35608771 35577795 35986369 36695586 37098141 37059554 37074257 37438100 37825703 37879756
8833C7879756r5601J81668N19995N28108K89262J52079K46067L72386L29871K06130
$$ 37879756 37784155 37965823 38485818 39013926 39303188 39455267 39701334 40073720 40403591 40609721
8823D0609721K28044L78157L93418K13286J31451L05115M38997K86643J42771
$$ 40609721 40837765 41215922 41609340 41822626 41954077 42259192 42698189 42984832 43127603
8814D3127603L63841O71393N41479J19613M2790L86029N47234K92359J34209L92340
$$ 43127603 43491444 44162837 44704316 44823929 44866719 45252748 45799982 46092341 46226550 46618890
8804D6618890O16424L84467M8888J48319N53651P56775O53376N09020M26661L46167
$$ 46618890 47235314 47619781 47668669 47816988 48370639 49127414 49780790 50289810 50716471 51062638
8794E1062638L48236N00964O00012M76102L54161M98280P20925O85525M93584
$$ 51062638 51410874 51911838 52511850 52987952 53342113 53840393 54561318 55246843 55740427
8785E5740427M94709O66012O72664M64017L43347M63279O48549P16261O52017
$$ 55740427 56235136 56901148 57573812 58037829 58381176 58844455 59493004 60209265 60861282
8776F0861282N10747M17313N53098Q68319R93609P49225M90783N65704P35234
$$ 60861282 61372029 61789342 62342440 63210759 64204368 64953593 65444376 66010080 66745314
8767F6745314O44055N39447Q43988J259215J125847N87439M79772R66679J231739
$$ 66745314 67389369 67928816 68772804 70032019 71157866 71745305 72225077 73191756 74423495
8758G4423495Q24443L99607O16232J103816J183612R70381R94025J199172J136653
$$ 74423495 75247938 75647545 76263777 77367593 78551205 79521586 80515611 81714783 82851436
8749H2851436Q60502Q30145J054548J091287Q78597Q56113J166412J386065J237844
$$ 82851436 83711938 84542083 85596631 86687918 87566515 88422628 89589040 90975105 92212949
8740I2212949J003700R83226J044053J015966J083699J394799J628501J423605
$$ 92212949 93216649 94199875 95243928 96259894 97343593 98738392 100366893 101790498
8732A01790498J024155J005308J423494J718708J532216J187588J158108J403282
$$ 101790498 102814653 103819961 105243455 106962163 108494379 109681967 110840075 112243357
8724A12243357J539216J442290J325242J314921J321719J329974J462615J673860
$$ 112243357 113782573 115224863 116550105 117865026 119186745 120516719 121979334 123653194
8716A23653194J715562J558862J522468J763159J956875J792864J499520J482607
$$ 123653194 125368756 126927618 128450086 130213245 132170120 133962984 135462504 136945111
8708A36945111J667724J683624J560254J690755K101459K319564K099541J787990
$$ 136945111 138612835 140296459 141856713 143547468 145648927 147968491 150068032 151856022
8700A51856022J769052J977783K179499K323342K378116K219942J965947K028509
$$ 151856022 153625074 155602857 157782356 160105698 162483814 164703756 166669703 168698212
8692A68698212K504353K878295K722488K356290K365488K745536L022716L030685
$$ 168698212 171202565 174080860 176803348 179159638 181525126 184270662 187293378 190324063
8684A90324063L036450L181142L303155L333506L442916L732305M092078M396828
$$ 190324063 193360513 196541655 199844810 203178316 206621232 210353537 214445615 218842443
8676B18842443M591431M637717M631210M852602N400786N929088O109844O180322
$$ 218842443 223433874 228071591 232702801 237555403 242956189 248885277 254995121 261175443
8668B61175443O564851P119650P341116P260455P463882Q136857Q751228Q918976
$$ 261175443 267740294 274859944 282201060 289461515 296925397 305062254 313813482 322732458
8660C22732458Q944457R218677R612530R849028J0003555J0214059J0293517J0062572
$$ 322732458 331676915 340895592 350508122 360357150 370360705 380574764 390868281 400930853
8652D00930853R721869R459732R010144Q058736O794298N556659M188108K291702
$$ 400930853 410652722 420112454 429122598 437181334 443975632 449532291 453720399 456012101
8644D56012101k5616k230357m095809n808553p385061q559645r308311r920678
$$ 456012101 455986485 453756128 449660319 443851766 436466705 427907060 418598749 408678071
8636D08678071j0404947j0353367r643585q813072q414814q351397q175963p758366
$$ 408678071 398273124 387919757 378276172 369463100 361048286 352696889 344520926 336762560
8628C36762560p290684o855457o391593n986722n819869n805166n611522n119629
$$ 336762560 329471876 322616419 316224826 310238104 304418235 298613069 293001547 287881918
8620B87881918m620134m430073m470876m383541m000430l550653l358262l435487
$$ 287881918 283261784 278831711 274360835 269977294 265976864 262426211 259067949 255632462
8612B55632462l486139l294254k966671k723699k593002k464003k340880k324222
$$ 255632462 252146323 248852069 245885398 243161699 240568697 238104694 235763814 233439592
8604B33439592k377090k340215k192426k068900j996132j870630j758193j893240
$$ 233439592 231062502 228722287 226529861 224460961 222464829 220594199 218836006 216942766
8596B16942766k226932k313732j928627j512893j621724k118803k370954k164422
$$ 216942766 214715834 212402102 210473475 208960582 207338858 205220055 202849101 200684679
8588B00684679j935995k036063k246697k235717k084103k060996k168078k236480
$$ 200684679 198748684 196712621 194465924 192230207 190146104 188085108 185917030 183680550
8580A83680550k264118k322680k295681k070742j880350k053371k454851k579410
$$ 183680550 181416432 179093752 176798071 174727329 172846979 170793608 168338757 165759347
8572A65759347k262937j913155j896647k060827k079193j951896j875788j861689
$$ 165759347 163496410 161583255 159686608 157625781 155546588 153594692 151718904 149857215
8564A49857215j806937j778561j885841j981441j832731j528881j371788j391370
$$ 149857215 148050278 146271717 144385876 142404435 140571704 139042823 137671035 136279665
8556A36279665j342968j205699j261673j554308j693859j451504j171194j238846
$$ 136279665 134936697 133730998 132469325 130915017 129221158 127769654 126598460 125359614
8548A25359614j448237j346847j011673r40636j213184j332831j049035p98132
$$ 125359614 123911377 122564530 121552857 120612221 119399037 118066206 117017171 116219039
8540A16219039j004581j379171j373269j038145q78350r85948r43469o48095n91478
$$ 116219039 115214458 113835287 112462018 111423873 110545523 109559575 108616106 107968011 107376533
8531A07376533j026986j415464j186981o49739n29703q50331r77990p22638o17251
$$ 107376533 106349547 104934083 103747102 103097363 102567660 101717329 100739339 100016701 99399450
8522I9399450r23237j115735p81051l85597n41079r71784r46864m78448l01740
$$ 99399450 98476213 97360478 96579427 96193830 95652751 94680967 93734103 93255655 92953915
8513I2953915o99639j093994r61594n33733l24005m38352o35286p15968o19668
$$ 92953915 92254276 91160282 90198688 89664955 89340950 88902598 88267312 87551344 86931676
8504H6931676m16610l50354n86915q55421p34322l53583k90921o34908p78899
$$ 86931676 86515066 86164712 85577797 84722376 83988054 83634471 83343550 82708642 81929743
8495H1929743m31551j58639m41968q29434o82302k61805k79353o96065q18677
$$ 81929743 81498192 81339553 80897585 80068151 79385849 79124044 78844691 78148626 77329949
8486G7329949m48984j19292j76204l66669m28983m48369m93953m63107m00906
$$ 77329949 76880965 76761673 76585469 76218800 75789817 75341448 74847495 74384388 73983482
8477G3983482m68935n48556m05891k45494m67581q57773p64896k01646N2781l01833
$$ 73983482 73514547 72965991 72560100 72314606 71847025 70989252 70224356 70022710 70075491 69773658
8467F9773658n94176l40036m4218k57029n99964m82650j65902k60501o26147o52698
$$ 69773658 69179482 68839446 68795228 68538199 67938235 67455585 67289683 67029182 66403035 65750337
8457F5750337l28489j60460k36520k20559j50269l72332p16235o09456j04961
$$ 65750337 65421848 65261388 65024868 64804309 64654040 64281708 63565473 62956017 62851056
8448F2851056O0057l58877o84345l97095P6615J00222k43738m63301m43996m06865
$$ 62851056 62911113 62552236 61867891 61470796 61547411 61647633 61403895 60940594 60496598 60089733
8438F0089733l93308k82222j34256j14109j90450k19912k09423k45229k92634
$$ 60089733 59696425 59414203 59279947 59165838 58975388 58755476 58546053 58300824 58008190
8429E8008190k83599k66020k85147k78884k44779k96976l93406k80230O4383K29668
$$ 58008190 57724591 57458571 57173424 56894540 56649761 56352785 55959379 55679149 55743532 55973200
8419E5973200o0580m40292l68992O4388K59033l3965m12965m47945k09404k8611
$$ 55973200 55912620 55472328 55103336 55167724 55426757 55392792 54979827 54531882 54322478 54293867
8409E4293867l0224j05187j64528k18149k70632k78587k08791q5904J6819L4651
$$ 54293867 54263643 54158456 53993928 53775779 53505147 53226560 53017769 52931865 52948684 52983335
8399E2983335k6257j04620j65758k08918j96554r6547k0321j42607l94511m40579
$$ 52983335 52957078 52852458 52686700 52477782 52281228 52184681 52164360 52021753 51627242 51186663
8389E1186663j34695J91848J47737j62090l14089k12091j68154l09103l23575
$$ 51186663 51051968 51243816 51391553 51229463 50915374 50703283 50535129 50226026 49902451
8380D9902451l359L09921J61078l24730n69762l33002m760r917k32614k70320
$$ 49902451 49899092 50209013 50370091 50045361 49475599 49142597 49137837 49127920 48895306 48624986
8370D8624986n9354P0361q1652l18281l74607k61288j38402n5002M10l9602j86028
$$ 48624986 48565632 48635993 48554341 48236060 47861453 47600165 47461763 47406761 47407171 47367569 47181541
8359D7181541k50294r0137R8859J8637k69981m32708l75619l20784l50781k76534
$$ 47181541 46931247 46841110 46939969 46958606 46688625 46255917 45880298 45559514 45208733 44932199
8349D4932199o8022j0865k26508m01834k68935l6592k8424j67153j77341p9146
$$ 44932199 44864177 44853312 44626804 44224970 43956035 43919443 43891019 43723866 43546525 43467379
8339D3467379r0565j94757j97427j14159j23937k05831j85141r0314j04462j98742
$$ 43467379 43376814 43182057 42984630 42870471 42746534 42540703 42355562 42265248 42160786 41962044
8329D1962044j78591p2326r4976k25557k17146n9432j7935j42305j68071l2913
$$ 41962044 41783453 41711127 41616151 41390594 41173448 41114016 41096081 40953776 40785705 40752792
8319D0752792m0926l02546m44607j87078J55322J22322k10139l95742k88037j44060
$$ 40752792 40711866 40409320 39964713 39777635 39932957 40055279 39845140 39449398 39161361 39017301
8309C9017301j42881j79734j53503j47569k39354l34143k86162r2222Q0461L8379
$$ 39017301 38874420 38694686 38541183 38393614 38154260 37820117 37533955 37441733 37522194 37560573
8299C7560573k23052m39197l37723k0460J04456j29492l92088l28368o1058M6212
$$ 37560573 37337521 36898324 36560601 36540141 36644597 36515105 36123017 35794649 35733591 35779803
8289C5779803n2304j03606l6005l9064j56808j74604j9108N6567j27143l46750
$$ 35779803 35727499 35623893 35587888 35548824 35392016 35217412 35198304 35254871 35127728 34780978
8279C4780978k82291J5339K14146J66103L2540l3860q7829k04233k84355j83373
$$ 34780978 34498687 34514026 34728172 34894275 34926815 34892955 34805126 34600893 34316538 34133165
8269C4133165O7618K86869L32638J81657r8845l35050k95913M4510L40013K15047
$$ 34133165 34200783 34487652 34820290 35001947 34903102 34568052 34272139 34316649 34656662 34871709
8259C4871709k08571m07876j60003J71359K13530R6038R6308J19227l6179j64329
$$ 34871709 34663138 34255262 34095259 34266618 34480148 34576186 34672494 34791721 34755542 34591213
8249C4591213L8756L21111J72460k61708k78374K44012N47557J58671l43761k29402
$$ 34591213 34629969 34951080 35123540 34861832 34583458 34827470 35375027 35533698 35189937 34960535
8239C4960535K82533M52159J45726j39681j32373j3633Q2320J96825K37951Q3565
$$ 34960535 35243068 35695227 35840953 35701272 35568899 35555266 35637586 35834411 36072362 36155927
8229C6155927n6571J00774L51052K52764r0208j06867L17563O17507M19133N9501
$$ 36155927 36099356 36200130 36551182 36803946 36713738 36606871 36924434 37541941 37961074 38020575
8219C8020575k2313R8510J41228J14790J56038K04744J67722J47125K33801L14709
$$ 38020575 37998262 38096772 38238000 38352790 38508828 38713572 38881294 39028419 39262220 39576929
8209C9576929L06699L17349L75826L15696J40250J42147L82668M41865O5769k99923
$$ 39576929 39883628 40200977 40576803 40892499 41032749 41174896 41557564 41999429 42065198 41765275
8199D1765275j06935M35736O45352L55582N9941R8857K52763K46966J87166K77933
$$ 41765275 41658340 42094076 42739428 43095010 43154951 43253808 43506571 43753537 43940703 44218636
8189D4218636M40409M57015L14882K10677K92165M95682O04144M64839J95788
$$ 44218636 44659045 45116060 45430942 45641619 45933784 46429466 47033610 47498449 47694237
8180D7694237R8151K76816M86182N04589M77096O21799P66979N79276J95722J60451
$$ 47694237 47792388 48069204 48555386 49059975 49537071 50158870 50925849 51505125 51700847 51861298
8170E1861298O22709J035375R02364M79752L82913P14494R88543Q63466N63557
$$ 51861298 52484007 53519382 54421746 54901498 55284411 55998905 56987448 57850914 58414471
8161E8414471M83436O77073R19235J065747J118751J048965Q22486N96021O24451
$$ 58414471 58897907 59574980 60494215 61559962 62678713 63727678 64550164 65146185 65770636
8152F5770636R00842J122249J125057J104579J225428J291866J105106R01407
$$ 65770636 66671478 67793727 68918784 70023363 71248791 72540657 73645763 74547170
8144G4547170J015612J279374J263807J037053J081210J417803J487060J102690
$$ 74547170 75562782 76842156 78105963 79143016 80224226 81642029 83129089 84231779
8136H4231779Q40582J091651J367708J103744O14417N65037Q77710R25642N97389
$$ 84231779 85072361 86164012 87531720 88635464 89249881 89814918 90692628 91618270 92215659
8127I2215659M00468N72603Q02144Q61371Q73626Q78410P33926N58656O93755
$$ 92215659 92616127 93188730 93990874 94852245 95725871 96604281 97338207 97896863 98590618
8118I8590618J080358J219815R38813O91148Q80600J323621J602646J578091J376088
$$ 98590618 99670976 100890791 101829604 102520752 103401352 104724973 106327619 107905710 109281798
8109A09281798J210492J321629J738963K079404K000329J810259K069844K622922
$$ 109281798 110492290 111813919 113552882 115632286 117632615 119442874 121512718 124135640
8101A24135640K755911K393787K275737K690391K961159K654145K388429K756504
$$ 124135640 126891551 129285338 131561075 134251466 137212625 139866770 142255199 145011703
8093A45011703L236237L039786K425011K204165K371459K196878J452261O32543
$$ 145011703 148247940 151287726 153712737 155916902 158288361 160485239 161937500 162570043
8085A62570043O5962l84398p96058j096492j432563j951164k314605k124035j690468
$$ 162570043 162636005 162251607 161455549 160359057 158926494 156975330 154660725 152536690 150846222
8076A50846222j633446j842380j675378j114492p91813q27060o22082p47M20389
$$ 150846222 149212776 147370396 145695018 144580526 143788713 142961653 142339571 142338824 142759213
8067A42759213L27400K58330O23752J022711J052569J030541J319299J619853
$$ 142759213 143086613 143344943 143968695 144991406 146043975 147074516 148393815 150013668
8059A50013668J577583J492751J751905K071832K012223J799308J913022K210815
$$ 150013668 151591251 153084002 154835907 156907739 158919962 160719270 162632292 164843107
8051A64843107K199705J913987J793369J871035J790414J520178J370828J333215
$$ 164843107 167042812 168956799 170750168 172621203 174411617 175931795 177302623 178635838
8043A78635838J036925M03063k19640o23922r48688j268635j469484j614491j973625
$$ 178635838 179672763 180075826 179856186 179232264 178283576 177014941 175545457 173930966 171957341
8034A71957341k555617l000463l080666k990573l010620l145974l198989k997874
$$ 171957341 169401724 166401261 163320595 160330022 157319402 154173428 150974439 147976565
8026A47976565k518468j961429j667219j739438j834164j580953j112700q66276
$$ 147976565 145458097 143496668 141829449 140090011 138255847 136674894 135562194 134695918
8018A34695918r41180j010525q35359n15735k23749q296J08959J15091R1890J01360
$$ 134695918 133754738 132744213 131908854 131393119 131169370 131161074 131270033 131385124 131477014 131578374
8008A31578374M9268j19946k39696k03086k26262m86572p36138p16050p05183
$$ 131578374 131627642 131507696 131268000 131064914 130838652 130352080 129615942 128899892 128194709
7999A28194709j093826j623498j734647j544216j695880k241023k514778k277283
$$ 128194709 127100883 125477385 123742738 122198522 120502642 118261619 115746841 113469558
7991A13469558k123546k446476k793916k691734k388130k271948k203142j992226
$$ 113469558 111346012 108899536 106105620 103413886 101025756 98753808 96550666 94558440
7983I4558440j943863k262142k428087j917234j168308j060818j635840k068353
$$ 94558440 92614577 90352435 87924348 86007114 84838806 83777988 82142148 80073795
7975H0073795j832253j252797r06795j005633j386878j690049j563977j052858
$$ 80073795 78241542 76988745 76081950 75076317 73689439 71999390 70435413 69382555
7967F9382555o68011p41346r33457q03668n70114p13791j070898j052438o68953
$$ 69382555 68714544 67973198 67039741 66236073 65665959 64952168 63881270 62828832 62159879
7958F2159879n43353q39664r76804o43489l55497o00820j039901j070133p51698
$$ 62159879 61616526 60776862 59800058 59156569 58801072 58200252 57160351 56090218 55338520
7949E5338520o18510q23749j007264r26876p66278p62850q57176q49022p21293
$$ 55338520 54720010 53896261 52888997 51962121 51195843 50432993 49575817 48726795 48005502
7940D8005502o42570o82735o81010n02277l23378m31648p38900q16723n39976
$$ 48005502 47362932 46680197 45999187 45496910 45173532 44741884 44002984 43186261 42646285
7931D2646285l26989m81511o81141n28866k61769l54191o72273o87472m04118
$$ 42646285 42319296 41837785 41156644 40627778 40366009 40011818 39339545 38652073 38247955
7922C8247955l51885o38463p40780m04252p8530j82175m93273n81402l99073j75525
$$ 38247955 37896070 37257607 36516827 36112575 36034045 35851870 35358597 34777195 34378122 34202597
7912C4202597r8722k72993o05708o76242k17832K63066L2470o47173p19489O083
$$ 34202597 34103875 33830882 33225174 32548932 32331100 32594166 32626636 31979463 31259974 31266057
7902C1266057M21880j38589p76826m77877K33890J92107n15230p96156l50654
$$ 31266057 31687937 31549348 30772522 30294645 30528535 30720642 30205412 29409256 29058602
7893B9058602L6810q4007k82045k29083k02123l61040l95180j86851j03705l39201
$$ 29058602 29095412 29011405 28729360 28500277 28298154 27937114 27541934 27355083 27251378 26912177
7883B6912177n69640n10419k81330o0028J03170M7365l37596o65583m34121R2443
$$ 26912177 26342537 25832118 25550788 25490760 25593930 25641295 25303699 24638116 24203995 24296438
7873B4296438J30389l87831o69509l57619n3770j91871l29881r4743O7948k18573
$$ 24296438 24426827 24038996 23369487 23011868 22958098 22766227 22436346 22341603 22409551 22190978
7863B2190978m41558r8307K82484k5736o35450o10655O115L02214k7227l50908
$$ 22190978 21749420 21651113 21933597 21907861 21272411 20661756 20667871 20970085 20942858 20591950
7853B0591950k65413j11371j57748j43408P6159J58405r6626l40634k60857p9114
$$ 20591950 20326537 20215166 20057418 19914010 19990169 20148574 20051948 19711314 19450457 19371343
7843A9371343j15978k69394k76722j64040j07434j11643j14066j78609l22634
$$ 19371343 19255365 18985971 18709249 18545209 18437775 18326132 18212066 18033457 17710823
7834A7710823l54722j44356J01048O8763k42852n22842n02366k01231J13487J62427
$$ 17710823 17356101 17211745 17312793 17381556 17138704 16615862 16113496 15912265 16025752 16188179
7824A6188179o3169k51464j39396J02463P9456k36798m28220k31055Q8590J44937
$$ 16188179 16125010 15873546 15734150 15836613 15916069 15679271 15251051 15019996 15108586 15253523
7814A5253523m0415j77582j91462k54246l95563l93106j39419J07909L2045k75232
$$ 15253523 15213108 15035526 14844064 14589818 14194255 13801149 13661730 13769639 13801684 13526452
7804A3526452l74676o3342L04079K60650j39479m08136k95597l8547J03447J66680
$$ 13526452 13151776 13088434 13392513 13653163 13513684 13105548 12809951 12771404 12874851 13041531
7794A3041531J87578Q341l38021m41283j06090K11093L6199l40832k94969J19534
$$ 13041531 13229109 13237450 12899429 12458146 12352056 12563149 12599348 12258516 11963547 12083081
7784A2083081K40071j62882n63477m89824r0735K49235L72342K75877J1891k06559
$$ 12083081 12323152 12160270 11596793 11106969 11016234 11265469 11637811 11913688 11925579 11719020
7774A1719020j78932n7938j26400k64397j37590J29968R6822j78866j87510R3454
$$ 11719020 11540088 11482150 11355750 11091353 10953763 11083731 11180553 11001687 10814177 10907631
7764A0907631J27182j53302j65439J71356J24796m93989p21375K4915P84255M61191
$$ 10907631 11034813 10881511 10716072 10887428 11012224 10518235 9796860 9821775 10606030 11067221
7754A1067221m20140n90492n1008J52237j92548k61212J83132L74211l1236l68262
$$ 11067221 10647081 10056589 10005581 10157818 9965270 9704058 9887190 10261401 10230165 9861903
7744I861903j83208O1481l9242j37096P1336K27688N2458q8053O5616R6384k71509
$$ 9861903 9678695 9740176 9700934 9563838 9635174 9862862 9915320 9827267 9892883 9989267 9717758
7733I717758m95119r0598M23980K89992k59071m02355n2287J29392r8816k44490
$$ 9717758 9222639 9132041 9556021 9846013 9586942 9184587 9132300 9261692 9162876 8918386
7723H918386k174K63324J67331j26972k51329j48373o338N5253M2865k024l2009
$$ 8918386 8916212 9179536 9346867 9219895 8968566 8820193 8813855 8869108 8911973 8909949 8877940
7712H877940l1191m9356j11005j39744q4115k9391m7173m6304N8518J46698O3803
$$ 8877940 8846749 8797393 8686388 8546644 8462529 8433138 8385965 8339661 8398179 8544877 8608680
7701H608680r4901r1456R8065K22464P0515k55909m11669j67298K60772L54774
$$ 8608680 8513779 8422323 8520388 8742852 8813367 8557458 8145789 7978491 8239263 8594037
7691H594037n2539m31231k14462L20573L74777j63113n09416j99537K17490J30539
$$ 8594037 8541498 8110267 7895805 8216378 8591155 8428042 7918626 7719089 7936579 8067118
7681H067118j72608j24063J19317O4037j53235m7012K39783J38866k86123l86239
$$ 8067118 7894510 7770447 7889764 7953801 7800566 7753554 7993337 8132203 7846080 7459841
7671G459841l8613J68058k5196j75095k1597P8588p5664j04993J79921L05620
$$ 7459841 7421228 7589286 7564090 7388995 7367398 7445986 7370322 7265329 7445250 7750870
7661G750870l8770l45539q9546L39994K29199l03946n03648j45589K23471K01565
$$ 7750870 7712100 7366561 7277015 7617009 7846208 7542262 7038614 6893025 7116496 7318061
7651G318061K3855J0933P7780L2208m3262J596N8068o1036k46794j91962J33400
$$ 7318061 7341916 7352849 7430629 7462837 7419575 7421171 7479239 7418203 7171409 6979447 7112847
7640G112847L51402J55486k35482l34683o2074J37076m3239l06282k27549P3169
$$ 7112847 7464249 7619735 7384253 7049570 6987496 7124572 7081333 6775051 6547502 6620671
7630F620671J47797m4632j08765J00290K61835J57892o952k5187j3732j09009
$$ 6620671 6768468 6723836 6615071 6715361 6977196 7135088 7128136 7102949 7089217 6980208
7620F980208j92486j44283o0534k0281N9564J63358J06669r3117j43462K2124
$$ 6980208 6787722 6643439 6582905 6562624 6622188 6785546 6892215 6799098 6655636 6677760
7610F677760P0274j54724l05554j08250J50070J04785q6165o9269R2547J03770
$$ 6677760 6748034 6593310 6287756 6179506 6329576 6434361 6348196 6278927 6371474 6475244
7600F475244k0211n4630m737j4438l1404L3771K9746j50757k49866l5793K42803
$$ 6475244 6455033 6400403 6395666 6381228 6349824 6383595 6413341 6262584 6012718 5976925 6219728
7589F219728K50517J30719J66093J78058j21985m48897l16871Q8363J62833j00796
$$ 6219728 6470245 6600964 6767057 6945115 6823130 6374233 6057362 6145725 6308558 6207762
7579F207762j47212J20159J91509q1383k08343K7538J71168p1768l17390k03774
$$ 6207762 6060550 6180709 6372218 6290835 6082492 6110030 6281198 6209430 5892040 5688266
7569E688266K3678M3711J1907J42366K35813P9315j08641o8054M6172K380p9758
$$ 5688266 5711944 5755655 5767562 5909928 6145741 6225056 6116415 6048361 6094533 6096913 6017155
7558F017155l6069k9815k01337k86949l1318L05218K95237k0665k48966k08052
$$ 6017155 5981086 5951271 5749934 5462985 5431667 5736885 6032122 6011457 5762491 5554439
7548E554439l0434J20148J33887n4337l07458l36334j08478P6986R4229J73081
$$ 5554439 5524005 5644153 5778040 5723703 5416245 5079911 4971433 5048419 5142648 5315729
7538E315729L60554L01236j07593l68126j41599J48406J0647k93883k55201q988
$$ 5315729 5676283 5977519 5869926 5501800 5360201 5508607 5519254 5225371 4970170 4961182
7528D961182j3494j75519o7193K27676K59863M1046l4012M1341m3870j89701l3841
$$ 4961182 4947688 4772169 4704976 4932652 5192515 5233561 5199549 5240890 5197020 5007319 4973478
7517D973478K38040Q9146l51691l72989J08243L49340L3239k18150K7796K64776
$$ 4973478 5211518 5300664 4948973 4575984 4684227 5033567 5066806 4848656 4876452 5141228
7507E141228j5544m08279l03639Q3306J30606j51824k29353M6987K91377K43617
$$ 5141228 5125684 4717405 4413766 4497072 4627678 4475854 4246501 4293488 4584865 4828482
7497D828482M7345r6250j44173j03948j4103J2200n6943p5786L6865J21283L3844
$$ 4828482 4875827 4779577 4635404 4531456 4517353 4529553 4472610 4396824 4433689 4554972 4588816
7486D588816j03175j05578L919J10471J88148K00643N2702j91798k94586k03987
$$ 4588816 4485641 4380063 4383982 4494453 4682601 4883244 4935946 4744148 4449562 4245575
7476D245575j41347j72010n6790K49313L64133P2253k33812j21369J90170J74497
$$ 4245575 4104228 3932218 3875428 4124741 4488874 4561127 4327315 4205946 4396116 4570613
7466D570613j82876l92350j88606J61960K69328N3374k22737k16625J01424L00796
$$ 4570613 4387737 3995387 3806781 3968741 4238069 4291443 4068706 3852081 3953505 4254301
7456D254301O569m38548l21411L18295N76365L1729n13496k30105M49245N34059
$$ 4254301 4260870 3822322 3500911 3819206 4395571 4427300 3913804 3683699 4132944 4667003
7446D667003j2343l75493k16514L0269O4962N3403O4692l6448j24894L2536J92060
$$ 4667003 4654660 4279167 4062653 4092922 4157884 4211287 4275979 4239531 4114637 4147173 4339233
7435D339233n1193m23580k91037K05798K78616j68604l50073K6715K58457p4774
$$ 4339233 4288040 3864460 3573423 3779221 4057837 3889233 3539160 3565875 3824332 3749558
7425C749558l61869p8540K85301J37888j84664j04921J64468J28259k7608J30251
$$ 3749558 3387689 3309149 3594450 3732338 3547674 3442753 3607221 3735480 3707872 3838123
7415C838123L55187J47329k53093k35815P3676L0622l51056m01257K3851K89801
$$ 3838123 4193310 4340639 4087546 3851731 3925407 3956029 3604973 3203716 3227567 3517368
7405C517368O0790k11189j26241O8831N4068j3164R9546K28524J28371q9854j65698
$$ 3517368 3578158 3366969 3240728 3309559 3363627 3350463 3450009 3678533 3806904 3717050 3551352
7394C551352q0037J5957N3378L9133j8776n7623j2252K6037p9707k24973j57625
$$ 3551352 3471315 3487272 3540650 3579783 3561007 3503384 3491132 3517169 3437462 3212489 3054864
7383C054864J12557K89042K15526L7503r6702j88407k06802q1255P5265N9300
$$ 3054864 3167421 3456463 3671989 3709492 3612790 3424383 3217581 3136326 3211591 3270891
7373C270891o9535o8033M5533K4090j10602p4490J05520O0327k26490k67611J18336
$$ 3270891 3201356 3133323 3178856 3202946 3092344 3017854 3123374 3183701 2957211 2689600 2807936
7362B807936M15409K06658j61405j76062M4339Q9770j358N1724J36047l0899k59266
$$ 2807936 3223345 3430003 3268598 3092536 3136875 3226645 3225287 3277011 3413058 3382159 3122893
7351C122893j53579J13502J7916l57319l48635J79690N15760J90118k96402k82906
$$ 3122893 2969314 3082816 3100732 2743413 2394778 2574468 3090228 3280346 2983944 2701038
7341B701038P4740J95725K5672m2455M7588j4847k15339j51497K18513L59324
$$ 2701038 2775778 2971503 2997175 2954720 3002308 2987461 2772122 2620625 2839138 3198462
7331C198462k3633m31531k61573K75048M38739K9387l72177k87218M3061J55652
$$ 3198462 3174829 2743298 2481725 2756773 3195512 3224899 2852722 2565504 2608565 2764217
7321B764217N9149M2677P8171q8160l49310k76829J62411M18315J33732k89978
$$ 2764217 2823366 2866043 2944214 2856054 2506744 2229915 2392326 2810641 2944373 2654395
7311B654395k65985J22899K89936L2195k29174j39507R1515P9637j52799k62477
$$ 2654395 2388410 2511309 2801245 2833440 2604266 2464759 2556274 2635911 2483112 2220635
7301B220635r9430J36631K24609J78448J12617J9628j65327l35154k47464J13326
$$ 2220635 2121205 2257836 2482445 2660893 2773510 2793138 2627811 2292657 2045193 2158519
7291B158519L71052J81852k34744k98190J20965M38033J55178l78664m35859K6006
$$ 2158519 2529571 2711423 2476679 2178489 2299454 2737487 2892665 2514001 2078142 2104148
7281B104148L10478L5941l15890j73880K58771L54906M320k97837k17363L8576
$$ 2104148 2414626 2450567 2134677 1960797 2219568 2574474 2578794 2280957 2063594 2102170
7271B102170J58206J29446O1867n5063k03777k07391J0529K21073J88642K5277
$$ 2102170 2260376 2389822 2451689 2396626 2192849 1985458 1995987 2217060 2405702 2430979
7261B430979j1237N4282k920j63912j60407N1396J64356N876j61501m5856K11277
$$ 2430979 2419742 2474024 2471104 2307192 2146785 2198181 2362537 2368413 2206912 2161056 2372333
7250B372333K55281M5383j31097r4231N3117J58774J78409R1490j09732l09779
$$ 2372333 2627614 2672997 2541900 2447669 2500786 2659560 2837969 2929459 2819727 2509948
7240B509948l41347k03207m1866Q1885K08252K65712J04504j92918k98996p2632
$$ 2509948 2168601 1965394 1923528 2005413 2213665 2479377 2583881 2390963 2091967 2019335
7230B019335K13920K38730M2131r5071m3284P9886J12565P701j43074j65335J9767
$$ 2019335 2233255 2471985 2514116 2419045 2375761 2455647 2568212 2575913 2432839 2267504 2287271
7219B287271K27964J84206p6828j96833Q032K70684K66152N4433r3398j14896
$$ 2287271 2515235 2699441 2622613 2425780 2433812 2704496 2970648 3025081 2931683 2816787
7209B816787j38499j90201j86159j26557o9869l447P1868O2659k1446J4742K02399
$$ 2816787 2678288 2488087 2301928 2175371 2105502 2102055 2173923 2236582 2215136 2229878 2432277
7198B432277K17826j24608m29128k22175K66649L65501m8724l90720k69467J0956
$$ 2432277 2650103 2525495 2096367 1874192 2140841 2506342 2457618 2066898 1797431 1808387
7188A808387M9492n7333k6707R1713O9560o8905j00942L1512J56177J10465q0010
$$ 1808387 1857879 1800546 1773839 1865552 1935112 1866207 1765265 1796777 1952954 2063419 1983409
7177A983409k10028p5667K39115L43505L5478l10657k19474J32906J55641j93544
$$ 1983409 1773381 1697714 1936829 2280334 2315812 2005155 1785681 1918587 2074228 1880684
7167A880684l22059m57K60802J24481m747K04709L16591r1887n35525l27566K33952
$$ 1880684 1558625 1558168 1818970 1943451 1938704 2143413 2460004 2368117 1832592 1505026 1738978
7156A738978K98382j55998l36209J4896K55187p08k63933o8386K70585K65600
$$ 1738978 2037360 1881362 1545153 1560049 1815236 1814528 1550595 1482209 1752794 2018394
7146B018394L5286l6343L1385m409r9808p8027l5004j33511k01575O982L03741
$$ 2018394 2053680 2017337 2048722 2044313 1944505 1866478 1831474 1697963 1496388 1503370 1807111
7135A807111K83713j9782j56754M2497K21891P4471j99855k30400k1509J06999
$$ 1807111 2090824 2071042 1914288 1956785 2178676 2253147 2053292 1822892 1801383 1908382
7125A908382J0353j18725q6786L1047O9954N4887J05603J52719J5413k22498k23626
$$ 1908382 1918735 1800010 1713224 1744271 1814225 1869112 1974715 2127434 2142847 1920349 1696723
7114A696723P3618K44505k8782m09662l44729J05859L41796J03393k03028j67982
$$ 1696723 1770341 2014846 1986064 1576402 1231673 1337532 1679328 1782721 1579693 1411711
7104A411711P6123J85903J21178N5433L5439Q985J1477P6329R3233k9855j72720
$$ 1411711 1487834 1673737 1794915 1850348 1885787 1894772 1906249 1982578 2075811 2045956 1873236
7093A873236j58905j7758O9655K0976p1632o9057O7119J99771J18783j60622k95260
$$ 1873236 1714331 1696573 1766228 1787204 1715572 1646515 1713634 1913405 2032188 1871566 1576306
7082A576306m7325K75315J77647k56752m24399j00875K38449J93950O184K0163
$$ 1576306 1528981 1804296 1981943 1725191 1300792 1199917 1438366 1632316 1638500 1658663
7072A658663Q5462o4995k53735j85709o413l364l0645K01571M89060L95944J1688
$$ 1658663 1744125 1679130 1425395 1239686 1233273 1229909 1199264 1400835 1889895 2285839 2297527
7061B297527j72931o7741l4517j58355j22873J09588J42584j41648l08378p9766
$$ 2297527 2124596 2056855 2022338 1863983 1741110 1850698 1993282 1851634 1543256 1463490
7051A463490K03554J58286n0401o9956M5341J7043j19755p9088J72757L25390
$$ 1463490 1667044 1825330 1774929 1704973 1750314 1767357 1647602 1568514 1741271 2066661
7041B066661J54307j74981k98864p8113K19747K12137j12113l48847k23457M5184
$$ 2066661 2220968 2045987 1747123 1669010 1888757 2100894 1988781 1639934 1416477 1461661
7031A461661J44989J64103L09212L79973N8187m19335m91076j42850R1693L5885
$$ 1461661 1606650 1770753 2079965 2459938 2518125 2098790 1607714 1464864 1556557 1592442
7021A592442P3352L14263L14333q5734l64878j67727J16097P7909m0534O9102
$$ 1592442 1665794 1980057 2294390 2208656 1843778 1676051 1792148 1870057 1829523 1898625
7011A898625J42614r5186k92045p8964J88134M3582k02170k4401K86356J05736
$$ 1898625 2041239 1946053 1654008 1575044 1763178 1806760 1604590 1580189 1866545 1972281
7001A972281l19885k03523L79166N12167o5244n38396l30660J22051K56959J80945
$$ 1972281 1652396 1448873 1828039 2340206 2274962 1736566 1405906 1527957 1784916 1965861
6991A965861J56621O0391j63334j71114J55513L36484M0050l28781k87032k2948
$$ 1965861 2122482 2182873 2019539 1848425 2003938 2340422 2380472 2051691 1764659 1741711
6981A741711L5244n8613k6187O0651K2635K9963K47333L53347K0249m02206l26512
$$ 1741711 1776955 1718342 1692155 1752806 1775441 1805404 2052737 2406084 2426333 2024127 1697615
6970A697615J34300L16424Q873l06955k30677Q1342K82357K48044N6955j12715
$$ 1697615 1831915 2148339 2157212 1850257 1619580 1700922 1983279 2231323 2288278 2175563
6960B175563o5293J57646K06603q8453l46659j53040K51553L02160j4228j88166
$$ 2175563 2110270 2267916 2474519 2386066 2039407 1886367 2137920 2440080 2425852 2237686
6950B237686k7264J37912J04475N1299N7447m7503k16160j37377J63996K41077
$$ 2237686 2210422 2348334 2452809 2504108 2561555 2514052 2297892 2160515 2324511 2565588
6940B565588m2679k50784j09085N5805m6789j40116P9713L46977K70394n188r3199
$$ 2565588 2522909 2272125 2163040 2218845 2172056 2031940 2111653 2458630 2729024 2723836 2630637
6929B630637j2033k9846j29016j34400j38078k71434k74931J24225N72728M73002
$$ 2630637 2618604 2588758 2459742 2325342 2187264 1915830 1640899 1765124 2337852 2810854
6919B810854n7722k77486P1808M03454K25407j62814k36454k1664J04687N8872
$$ 2810854 2753132 2475646 2547454 2950908 3176315 3013501 2777047 2755383 2860070 2918942
6909B918942O2883J83627K35307R8596j21810k55369k24339n8466J48580L05991
$$ 2918942 2981825 3165452 3400759 3499355 3377545 3122176 2897837 2839371 2987951 3293942
6899C293942L72201L06730N4187k88380l94867o3896L98042M79315J68412k4895
$$ 3293942 3666143 3972873 4027060 3738680 3343813 3279917 3677959 4157274 4325686 4300791
6889D300791J52583L30920J51501j51025j59695N9682J39205L6280J9548J42937
$$ 4300791 4453374 4784294 4935795 4784770 4625075 4684757 4823962 4860242 4879790 5022727
6879E022727J84184P9508J1109M3696M2729j2561J0965Q5157K7408j11912n2404
$$ 5022727 5206911 5286419 5297528 5341224 5383953 5371392 5382357 5467514 5494922 5383010 5330606
6868E330606K12273L13094R4948q7700O3407K91736K16579l3089n8281J30186
$$ 5330606 5542879 5855973 5950921 5863221 5926628 6218364 6434943 6401854 6343573 6473759
6858F473759J66652l764k6836K20675L72583J66794r3615J1975L77383N38166
$$ 6473759 6640411 6636647 6609811 6830486 7203069 7369863 7276248 7288223 7665606 8203772
6848H203772L52199J40239J52667K38140J57313l6071j14977j7184J35391K56661
$$ 8203772 8555971 8696210 8848877 9087017 9244330 9208259 9093282 9076098 9211489 9468150
6838I468150L34139L08518J40583j2598O8912L15312M04794K50448J63509L45201
$$ 9468150 9802289 10110807 10251390 10238792 10307704 10623016 11027810 11278258 11441767 11786968
6828A1786968N15370L59610Q9020J20467L68192L87592J75494K12347N88699P31336
$$ 11786968 12302338 12661948 12750968 12871435 13239627 13627219 13802713 14015060 14603759 15335095
6818A5335095L16369j21205L6711N61469P81330N73370L45837K77431K28463K67335
$$ 15335095 15651464 15530259 15566970 16128439 16909769 17483139 17828976 18106407 18334870 18602205
6808A8602205N98028R87854R50744N77761N23613J003981J442590J362964J039679
$$ 18602205 19200233 20188087 21138831 21716592 22240205 23244186 24686776 26049740 27089419
6799B7089419R44259J070474J170505J207572J219710J143247J083772J330114
$$ 27089419 28033678 29104152 30274657 31482229 32701939 33845186 34928958 36259072
6791C6259072J810454K044387J957875K142654K890183L655964M045603M571662
$$ 36259072 38069526 40113913 42071788 44214442 47104625 50760589 54806192 59377854
6783E9377854N647826O625244O941977P544067R636763J2259002J2732454R761926
$$ 59377854 65025680 71650924 78592901 86136968 95773731 108032733 120765187 130527113
6775A30527113M693042n91740n472525r657699j2062355j1942685j0238177q543338
$$ 130527113 135220155 134628415 129155890 119498191 107435836 95493151 85254974 76711636
6767G6711636p313054o092084m877659m081900l583802k992164k560037k715567
$$ 76711636 69398582 63306498 58428839 54346939 50763137 47770973 45210936 42495369
6759D2495369k948007k380346j325138r77041j487943j675423r57298k85732n72747
$$ 42495369 39547362 37167016 35841878 34864837 33376894 31701471 30744173 30458441 29885694
6750B9885694j309661j531662j263234j133104j213543j130849q90856p86496
$$ 29885694 28576033 27044371 25781137 24648033 23434490 22303641 21412785 20626289
6742B0626289p78477o49652n13643n65308o03804l96905k27380m46254p54210
$$ 20626289 19847812 19198160 18684517 18119209 17515405 17118500 16891120 16444866 15690656
6733A5690656o13859j72551n6465l65370n90555m90199l44078l16955k49592j55033
$$ 15690656 15076797 14904246 14847781 14482411 13891856 13401657 13057579 12740624 12491032 12335999
6723A2335999k65142m75650l91848o3832j5728l54500n27709k36307Q4521M3086
$$ 12335999 12070857 11595207 11203359 11139527 11123799 10769299 10241590 10005283 10089804 10132890
6713A0132890j09708q9135j41084m57544o19263k72247J39880M3261k86217k10909
$$ 10132890 10023182 9934047 9792963 9335419 8716156 8443909 8583789 8627050 8340833 8129924
6703H129924J34296R9829k76334l09652Q1791J76493k78055n52271j33037L95191
$$ 8129924 8264220 8364049 8087715 7778063 7859854 8036347 7758292 7206021 7072984 7468175
6693G468175K69307k98575n61867l63608j31578p5038n3979m3582j18449j21525
$$ 7468175 7737482 7438907 6877040 6513432 6381854 6306816 6252837 6209255 6090806 5969281
6683E969281R3085K38160j5820l80079l14068N2921Q5711k75515l86197l362K80358
$$ 5969281 6062366 6300526 6284706 5904627 5590559 5643480 5729191 5453676 5067479 5064117 5344475
6672E344475M1178k80669j75072R3786M2527j55473m4908K37988K06969q9146
$$ 5344475 5385653 5104984 4929912 5023698 5066225 4910752 4865844 5103832 5310801 5221655
6662E221655j62983L5785O4167j88623l08878j04017Q3916l728j56442j44209
$$ 5221655 5058672 5094457 5158624 4970001 4661123 4557106 4641022 4637294 4480852 4336643
6652D336643o9442m5528K9168J51018R7967j34103k19658o8811l2481k51265l11331
$$ 4336643 4267201 4221673 4250841 4401859 4499826 4365723 4146065 4077254 4044773 3793508 3482177
6641C482177M3900L55447J39468k75666k42370J59123K65330r9827l87463j99349
$$ 3482177 3526077 3881524 4020992 3745326 3502956 3662079 3927409 3827582 3440119 3240770
6631C240770J89750L22939J19881j93495l63426k35500R1949K39099j0847l08507
$$ 3240770 3430520 3753459 3873340 3679845 3316419 3080919 3172868 3411967 3401120 3092613
6621C092613j82035K07412K76614m3662k06089K2972J91537l1249l00808k22897
$$ 3092613 2910578 3117990 3394604 3350942 3144853 3167825 3359362 3328113 3027305 2804408
6611B804408O694L4178l6418N2827J73464Q6295n4753O138J01833m9419k45616
$$ 2804408 2811102 2845280 2808862 2861689 3035153 3121448 3066695 3072833 3174666 3125247 2879631
6600B879631j03566K07994J78549j70863k90751k4659J41401o7943k45163j0586
$$ 2879631 2776065 2984059 3162608 2991745 2700994 2676335 2817736 2749793 2504630 2494044
6590B494044L24615K46463j65546l98393k62970n2875k0925q1346o6477J3568
$$ 2494044 2818659 3065122 2899576 2501183 2238213 2185338 2164413 2083067 2016590 2030158
6580B030158O6002Q3556J04937J04499K4653j04595j56184n3168J10409J66199
$$ 2030158 2096160 2179716 2284653 2389152 2413805 2309210 2153026 2099858 2210267 2376466
6570B376466Q5225o389m7278j24190k50452k45492j5842K03668J43826p3107j01218
$$ 2376466 2461691 2455302 2408024 2283834 2033382 1787890 1772048 1975716 2119542 2046435 1945217
6559A945217Q8706J70508j4333k27972k22049n7335Q4880J47993J22974k5016
$$ 1945217 2033923 2204431 2190098 1962126 1740077 1682742 1767622 1915615 2038589 2013573
6549B013573k02509j92099K7985J87218J09055l1706k4029M0435j5718j01881
$$ 2013573 1811064 1618965 1646950 1834168 1943223 1911517 1887488 1927923 1912205 1810324
6539A810324j3861J83979K21686J7473k29403l11999j95324L4404K28661K33051
$$ 1810324 1796463 1980442 2202128 2219601 1990198 1678199 1482875 1517279 1745940 1978991
6529A978991M5896j27284j15483o251J1243o6418r0936n431J07972J57830R0756
$$ 1978991 2024887 1897603 1782120 1775869 1787112 1720694 1629758 1624327 1732299 1890129 1980885
6518A980885r4959k62472k06827M2476J69582Q438j79359j08179P6359P4676l9939
$$ 1980885 1885926 1623454 1416627 1459103 1628685 1637123 1457764 1349585 1425944 1500620 1460681
6507A460681J1433J58813P4190k23934l41523j28701J24327J93864J86054J80501
$$ 1460681 1472114 1630927 1705117 1481183 1139660 1010959 1135286 1329150 1515204 1695705
6497A695705N6727j51943j57624J06599K94367J66281o0547j26269j18671j70181
$$ 1695705 1752432 1600489 1442865 1549464 1843831 2010112 1949565 1823296 1704625 1534444
6487A534444j41912M9146J36160p5572k99705j97992N8183J01101r434L3362J82741
$$ 1534444 1392532 1441678 1577838 1502266 1202561 1004569 1062752 1163853 1154419 1187781 1370522
6476A370522J47635l5467p5748J7007j2020j18165l3401J44575M9717k35582k13183
$$ 1370522 1518157 1482690 1406942 1423949 1411929 1293764 1260363 1404938 1454655 1219073 1005890
6465A005890J63756L33851N8382j73736n377J94848N8512r4102J06902K99285
$$ 1005890 1169646 1503497 1561879 1388143 1382766 1577614 1636126 1542024 1648926 1948211
6455A948211j4322m89123l95064J63685L55621p3874m46464k53519J45636K25418
$$ 1948211 1933889 1444766 1049702 1213387 1569008 1495134 1048670 795151 940787 1166205
6445A166205N5250k6627K103K490K6453J19145R3595j18837j97942P9761L61973
$$ 1166205 1221455 1194828 1196931 1199421 1225874 1345019 1438614 1319777 1121835 1201596 1563569
6434A563569J91859k46546l66930o5536J63487K4145j77954r2392J35816J54390
$$ 1563569 1755428 1508882 1141952 1076416 1239903 1264048 1086094 993702 1129518 1283908
6424A283908m1703j49895l7030R0492J2598j72607j52058J69686M47620K71434
$$ 1283908 1242205 1092310 1055280 1145772 1158370 985763 833705 1003391 1451011 1722445
6414A722445k34374m51896p7985L87180K93467k31865m87556k38466L0407j1916
$$ 1722445 1488071 1036175 958190 1345370 1638837 1406972 919416 680950 711357 699441
6404F99441m0439K39782M62286J69112l63653m69533p2766K62273K01692p84n8983
$$ 699441 659002 898784 1361070 1530182 1166529 696996 624230 886503 1088195 1087411 1028428
6393A028428l7186l9020K2571J47529J37162k7249o1284J34061K22839l8595l58096
$$ 1028428 991242 952222 974793 1122322 1259484 1232235 1170951 1305012 1527851 1489256 1131160
6382A131160l35446n0497J50127K01822K39536J88066p5958l00592j38482K07754
$$ 1131160 795714 745217 895344 1097166 1336702 1524768 1448810 1148218 1009736 1217490
6372A217490J93322j83375l14830L8400L32089J22308k13132j23677K03863J94285
$$ 1217490 1410812 1227437 912607 951007 1283096 1405404 1192272 1068595 1272458 1466743
6362A466743j50845l02828r9872O9027J043k4684J55334K58179Q3644j04350n6099
$$ 1466743 1315898 1013070 913198 982225 983268 958584 1113918 1372097 1455741 1351391 1295292
6351A295292J1558j59550l20720p4328M10581N43946J42693l23128l72598n6018
$$ 1295292 1306850 1147300 826580 752252 1162833 1706779 1849472 1526344 1153746 1097728
6341A097728K37825K41740j7360k86233k58643J15454M60315L48369j20453l93926
$$ 1097728 1335553 1577293 1559933 1273700 1015057 1130511 1590826 1939195 1818742 1424816
6331A424816k02301R8133Q2478j50322k13816l3667J22674J03549L5612M0166
$$ 1424816 1222515 1320648 1403126 1252804 1038988 1005321 1127995 1231544 1267156 1307322
6321A307322N1667l0981j83297k87830k36634k8747J58859J01782j51264k37631
$$ 1307322 1358989 1328008 1144711 856881 620247 591500 750359 852141 700877 463246
6311D63246M7559L94750L67552K1083k12496j83405j48900k14689j26461J99998
$$ 463246 510805 905555 1273107 1294190 1081694 898289 749389 534700 408239 608237
6301F08237L83297J36385k13963j73640J69785K91645L1751k06650j07924J19941
$$ 608237 991534 1127919 913956 740316 910101 1201746 1233497 1026847 918923 1038864
6291A038864J35936k4517r1586k0934j4182j34154j81015k5646J47810R5901j11729
$$ 1038864 1174800 1150283 1058697 1037763 1023581 889427 708412 682766 830576 926477 814748
6280H14748j87782n9819M1329j3005k5535J61637L23386J77782j16196j77111
$$ 814748 626966 567147 608476 595471 569936 731573 1054959 1232741 1116545 939434
6270I39434k9106m7666k60742k35727J59231M15850J55508k21635j37461K56292
$$ 939434 910328 862662 601920 366193 525424 941274 1096782 875147 737686 993978
6260I93978L36128k5958l44295l10718j42757q7234p2367J5559J11773J67584
$$ 993978 1330106 1304148 959853 649135 506378 419144 346777 362336 474109 641693
6250F41693K35642K65207J31718o5997q3667L7119J563k01238k31092L921J47861
$$ 641693 877335 1142542 1274260 1208263 1124596 1161715 1163278 962040 730948 734869 882730
6239H82730K558j34244j6400J15853M443j37721l3442J20300N429k08782j35795
$$ 882730 885288 751044 734644 850497 854940 717219 683777 804077 809506 600724 464929
6228D64929J42614J97269m2662k16429j34094J6709P8528J10438J27911M6718
$$ 464929 607543 804812 762150 545721 411627 428336 506864 617302 745213 791931
6218G91931o2509k2731J00490N1579j60937k20963k27K41502K59791J21566j5025
$$ 791931 729422 706691 807181 858760 697823 476860 476633 718135 977926 1099492 1084467
6207A084467j28549k18644k17322j31516n6716J6934J74862L17649K19778q3664
$$ 1084467 955918 737274 519952 388436 331720 348654 523516 841165 1060943 977279
6197I77279k69703j79110L34R4949J66294K42539J65121j01477k93973j99961
$$ 977279 707576 528466 528800 623749 790043 1032582 1197703 1096226 802253 602292
6187F02292M2683J74812J31109j6597j96308k81451j49444P9948J33415J0673
$$ 602292 644975 819787 950896 934299 737991 456540 307096 387044 520459 531132
6177E31132r721J06038M8985k24449k85630N1594L09933Q2181k72307k13486R0393
$$ 531132 521411 627449 676434 451985 166355 217949 527882 610063 337756 124270 214663
6166B14663J13328q4288j0061L07295L11789r9409l48617j16319J73463J03929
$$ 214663 327991 243703 233642 540937 852726 753317 404700 288381 461844 565773
6156E65773q9800k2369J68976J21130j06789j61818K485R7424Q769n7507K2613
$$ 565773 475973 453604 622580 743710 636921 475103 477588 575012 583781 526274 548887
6145E48887P3464n4646j75631j7707L03862L45706l9952l99465k59418J66105
$$ 548887 622351 567705 392074 374367 678229 1023935 983983 584518 325100 491205
6135D91205K62484n1580k19031J5492J89970k0710j81497J05087L65986J9642
$$ 491205 753689 702109 483078 498570 688540 667830 486333 591420 957406 977048
6125I77048m81248k64761M46069N63967j07083n30562j29995L36776J36268k64124
$$ 977048 495800 231039 677108 1241075 1133992 603430 473435 810211 946479 682355
6115F82355j49225J91534R5779k42604j76174K03454K67268k6718j56061k6482
$$ 682355 533130 724664 820443 577839 401665 605119 872387 845669 689608 663126
6105F63126l8583k24272j81348J07181K00759J8568m7441O8470j5355k96667k55836
$$ 663126 624543 400271 218923 326104 526863 545431 497990 566460 551105 254438 -1398
6094a398J82676L68246l656l07547q634M17282K60275k53889l42314R9662M15676
$$ -1398 181278 549524 545868 238321 229687 646969 907244 653355 311041 410703 826379
6083H26379K31427j17952k46350k12138k01683j74644m5715Q1042P2891j2150
$$ 826379 1057806 939854 693504 481366 279683 105039 59324 140366 213257 201107
6073B01107k4928O1178J43614J36210N6185q985j870L8255M0641K3187N6916J04839
$$ 201107 176179 237357 380971 517181 573366 564381 562511 600766 641407 664594 721510 826349
6061H26349L7019j39252k19613q2004J03350Q6206j17792k34151o8157K51467
$$ 826349 863368 724116 504503 422499 525849 612055 494263 260112 191955 443422
6051D43422L89636J69438j81231k43295N6328K79686N1852l62081l98304k5128
$$ 443422 833058 1002496 821265 577970 634298 913984 965836 603755 205451 180323
6041A80323K21488P3970j02509K2501K03335R0377j53397j45170P8794J68110
$$ 180323 401811 475781 373272 395773 599108 689485 536088 390918 469712 637822
6031F37822L3638j03332j25560r7258j7532J32538J77522l8604k87085k00381
$$ 637822 671460 568128 442568 345310 327778 460316 637838 599234 312149 111768
6021A11768J37748K60611J5587k17662j22244J14557J47750k2114j23389k4529
$$ 111768 249516 510127 525714 308052 185808 300365 448115 426001 302612 278083
6011B78083J30980J35785m8811k47530k42962l0600J54148J37269K5809K800M2593
$$ 278083 409063 544848 496037 248507 5545 -25055 129093 266362 292171 294971 337564
6000C37564J6783n0279n4739j7674J3359J12239K62126K02802j54378l81518q8370
$$ 337564 354347 304068 249329 231655 245014 357253 619379 822181 667803 286285 197915
5989A97915L54203K57138k86054m53256M6984N10743L29590j40269k61200r0652
$$ 197915 552118 809256 523202 69946 116930 627673 957263 816994 555794 465142
5979D65142q4012k32767j58103J42814K64777O6126j35318p9727J08123J79065
$$ 465142 381130 148363 -9740 133074 397851 463977 328659 248932 357055 536120
5969E36120P0531r8528j67027o7824O7308L3360j26610j27622Q9902J80702p4076
$$ 536120 606651 508123 341096 273272 340580 373940 247330 119708 209610 390312 316236
5958C16236l50070k41539J07437K48699J25124O4677J81147K43306J26538k3351
$$ 316236 -33834 -275373 -167936 80763 205887 270564 451711 695017 821555 798204
5948G98204j04063j68606j94456p9679R9760J39965L3304m7818o7686j15092j24907
$$ 798204 694141 525535 331079 251400 351160 491125 524429 476611 408925 293833 168926
5937A68926K3052J65857L1867k50109k61947M3722K62961K02817J25379J79301
$$ 168926 191978 357835 389702 139593 -122354 -78632 184329 387146 512525 691826
5927F91826J10010k00976l92610j82362J26083J04860j26102j23295J74529L86095
$$ 691826 801836 600860 208250 25888 151971 256831 130729 7434 181963 568058
5917E68058K60289l3070j86606j01574O6642R9722l0550j07792J1992J13728o4660
$$ 568058 828347 795277 608671 507097 573739 673461 642911 535119 547111 660839 596179
5906E96179l07696j63803K56885L05205j82620n08124j55805L71943L37027r9260
$$ 596179 288483 124680 381565 686770 504150 -3974 -159779 212164 549191 449931
5896D49931k24291P4306K68014J27870m6706q8501j40890j59585P4277L74012
$$ 449931 225640 299946 567960 695830 649124 560623 419733 260148 334425 708437
5886G08437K68392j70147l16752j0820J47603j62068l81406j8513M53463L16757
$$ 708437 976829 806682 489930 479110 626713 464645 83239 64726 518189 834946
5876H34946k36951m27576r6099J71454N1298j11792n266J65140J20926l0958o7887
$$ 834946 597995 170419 74320 245774 297072 185280 180014 345154 466080 435122 367235
5865C67235l4353o5225q1097M1935J70009Q2288j41111j96046j6373J19371K5792
$$ 367235 332882 267657 186560 228495 398504 480792 339681 143635 127262 246633 272425
$$ [...]
##END NTUPLES=NMR SPECTRUM
##END=
