##TITLE=1H ikalashn
CG-1218-6
18.11.2024
##JCAMPDX= 6.0         $$ Bruker NMR JCAMP-DX V2.0
##DATA TYPE= NMR SPECTRUM
##DATA CLASS= NTUPLES
##ORIGIN= UXNMR, Bruker Analytische Messtechnik GmbH
##OWNER= root
$$ TOPSPIN		Version 1.3
$$ 2024-11-18 11:10:08.531 +0400  Irina@DPX200
$$ Compression mode = diff/dup
##.OBSERVE FREQUENCY= 200.131300845
##.OBSERVE NUCLEUS= ^1H
##.ACQUISITION MODE= SIMULTANEOUS
##.ACQUISITION SCHEME= undefined
##.AVERAGES= 64
##.DIGITISER RES= 18
##SPECTROMETER/DATA SYSTEM= spect
##.PULSE SEQUENCE= zg
##.SOLVENT NAME= CDCl3
##.SHIFT REFERENCE= INTERNAL, CDCl3, 1, 17.49637
##AUDIT TRAIL= $$ (NUMBER, WHEN, WHO, WHERE, WHAT)
$$ ##TITLE= Audit trail, TOPSPIN		Version 1.3
$$ ##JCAMPDX= 5.01
$$ ##ORIGIN= Bruker BioSpin GmbH
$$ ##OWNER= Irina
$$ $$ F:/spectra/data/iren/nmr/1H/4/pdata/1/auditp.txt
$$ ##AUDIT TRAIL=  $$ (NUMBER, WHEN, WHO, WHERE, VERSION, WHAT)
(   1,<2024-11-18 11:09:37.015 +0400>,<Irina>,<DPX200>,<TOPSPIN 1.3>,
      <created by zg
	started at 2024-11-18 11:05:24.187 +0400,
	POWCHK disabled, PULCHK disabled
       configuration hash MD5:
       BE 6D 3F 07 2A EA 11 49 91 17 2B D3 AF B3 58 0D
       data hash MD5: 16K
       DF 80 39 08 0F 30 C9 0F 17 14 4C EA DD B5 B7 7F>)
(   2,<2024-11-18 11:09:41.281 +0400>,<Irina>,<DPX200>,<TOPSPIN 1.3>,
      <Start of raw data processing
       efp BC_mod = 2 LB = 0.02 FT_mod = 6 PKNL = 1 PHC0 = 315.389 PHC1 = 12.68712 SI = 32K 
       data hash MD5: 32K
       01 39 3A 9B 8E 9D C3 E1 93 D2 55 4B B9 02 62 D9>)
(   3,<2024-11-18 11:09:43.656 +0400>,<Irina>,<DPX200>,<TOPSPIN 1.3>,
      <apk 
       data hash MD5: 32K
       96 7F 11 28 A0 68 33 6C 8D A1 97 BB 31 19 10 81>)
(   4,<2024-11-18 11:09:54.843 +0400>,<Irina>,<DPX200>,<TOPSPIN 1.3>,
      <pk fgphup PHC0 = 14.06433 PHC1 = -20 
       data hash MD5: 32K
       DB E4 2F 7D 72 2D 92 B6 51 BC 07 6B 56 B1 66 44>)
(   5,<2024-11-18 11:09:58.750 +0400>,<Irina>,<DPX200>,<TOPSPIN 1.3>,
      <abs n ABSG = 5 
       data hash MD5: 32K
       86 B8 82 67 D7 27 A8 8F A6 EE 6A 9A A6 B5 F4 A5>)
$$ ##END=
$$ 
$$ $$ hash MD5
$$ $$ C0 4F 41 3F 16 68 5E AA C4 2D 2A 6D 30 AF FD FD
##$RELAX= 
##$RELAX= 
##$RELAX= 
##$RELAX= 
##$RELAX= 
##$RELAX= 
##$RELAX= 
##$RELAX= 
##$RELAX= 
$$ Bruker specific parameters
$$ --------------------------
##$DU= <F:/spectra>
##$EXPNO= 4
##$NAME= <1H>
##$PROCNO= 1
##$TYPE= <nmr>
##$USER= <iren>
##$AMP= (0..31)
100 100 100 100 100 100 100 100 100 100 100 100 100 100 100 100 100 100 
100 100 100 100 100 100 100 100 100 100 100 100 100 100 
##$ANAVPT= -1
##$AQSEQ= 0
##$AQ_mod= 1
##$AUNM= <au_zg>
##$AUTOPOS= <>
##$BF1= 200.13
##$BF2= 200.13
##$BF3= 200.13
##$BF4= 200.13
##$BF5= 200.13
##$BF6= 200.13
##$BF7= 200.13
##$BF8= 200.13
##$BYTORDA= 1
##$CFDGTYP= 0
##$CFRGTYP= 5
##$CHEMSTR= <none>
##$CNST= (0..63)
1 1 145 1 1 1 1 1 1 1 1 1 1 1 1 1 1 1 1 1 1 1 1 1 1 1 1 1 1 1 1 1 1 1 
1 1 1 1 1 1 1 1 1 1 1 1 1 1 1 1 1 1 1 1 1 1 1 1 1 1 1 1 1 1 
##$CPDPRG= <>
##$CPDPRG1= <>
##$CPDPRG2= <>
##$CPDPRG3= <>
$$ [...]
##$SW_h= 4401.40845070422
##$TD= 16384
##$TD0= 1
##$TE= 300
##$TE2= 300
##$TE3= 300
##$TEG= 300
##$TL= (0..7)
0 120 120 120 120 120 120 120 
##$TP= (0..7)
150 150 150 150 150 150 150 150 
##$TP07= 0
##$TPNAME0= <>
##$TPNAME1= <>
##$TPNAME2= <>
##$TPNAME3= <>
##$TPNAME4= <>
##$TPNAME5= <>
##$TPNAME6= <>
##$TPNAME7= <>
##$TPOAL= (0..7)
0.5 0.5 0.5 0.5 0.5 0.5 0.5 0.5 
##$TPOFFS= (0..7)
0 0 0 0 0 0 0 0 
##$TUNHIN= 0
##$TUNHOUT= 0
##$TUNXOUT= 0
##$USERA1= <user>
##$USERA2= <user>
##$USERA3= <user>
##$USERA4= <user>
##$USERA5= <user>
##$V9= 5
##$VALIST= <valist>
##$VCLIST= <CCCCCCCCCCCCCCC>
##$VD= 0
##$VDLIST= <DDDDDDDDDDDDDDD>
##$VPLIST= <PPPPPPPPPPPPPPP>
##$VTLIST= <TTTTTTTTTTTTTTT>
##$WBST= 1024
##$WBSW= 25
##$XGAIN= (0..3)
0 0 0 0 
##$XL= 0
##$YL= 0
##$YMAX_a= 4003320
##$YMIN_a= -1865229
##$ZGOPTNS= <>
##$ZL1= 120
##$ZL2= 120
##$ZL3= 120
##$ZL4= 120
##$ABSF1= 17.49637
##$ABSF2= -4.496376
##$ABSG= 5
##$ABSL= 3
##$ALPHA= 0
##$AQORDER= 0
##$ASSFAC= 0
##$ASSFACI= 0
##$ASSFACX= 0
##$ASSWID= 0
##$AUNMP= <proc_1d>
##$AXLEFT= 0
##$AXRIGHT= 0
##$AXTYPE= 0
##$AXUNIT= <>
##$AZFE= 0.1
##$AZFW= 0.1
##$BCFW= 0
##$BC_mod= 2
##$BYTORDP= 0
##$COROFFS= 0
##$CY= 7568.61572265625
##$DATMOD= 1
##$DC= 0
##$DFILT= <>
##$DTYPP= 0
##$F1P= 17.9538593292236
##$F2P= -4.03888763876832
##$FCOR= 0.5
##$FTSIZE= 32768
##$FT_mod= 6
##$GAMMA= 0
##$GB= 0
##$INTBC= 0
##$INTSCL= 1.367314e-010
##$ISEN= 128
##$LB= 0.02
##$LEV0= 0
##$LPBIN= 0
##$MAXI= 945.577
##$MC2= 0
##$MEAN= 0
##$ME_mod= 0
##$MI= -402.1523
##$NCOEF= 0
##$NC_proc= -4
##$NLEV= 6
##$NOISF1= 8.587773
##$NOISF2= 6.764455
##$NSP= 0
##$NTH_PI= 0
##$NZP= 0
##$OFFSET= 17.49637
##$PC= 1
##$PHC0= 119.5718
##$PHC1= 5.60677
##$PH_mod= 1
##$PKNL= yes
##$PPARMOD= 0
##$PPDIAG= 0
##$PPIPTYP= 0
##$PPMPNUM= 100
##$PPRESOL= 1
##$PSCAL= 0
##$PSIGN= 0
##$REVERSE= no
##$SF= 200.13
##$SI= 32768
##$SIGF1= 16.12182
##$SIGF2= -4.496377
##$SINO= 3.521527
##$SIOLD= 32768
##$SREGLST= <1H.CDCl3>
##$SSB= 0
##$STSI= 32768
##$STSR= 0
##$SW_p= 4401.40845070422
##$SYMM= 0
##$S_DEV= 0
##$TDeff= 16384
##$TDoff= 0
##$TI= <>
##$TILT= no
##$TM1= 0
##$TM2= 0
##$TOPLEV= 0
##$USERP1= <user>
##$USERP2= <user>
##$USERP3= <user>
##$USERP4= <user>
##$USERP5= <user>
##$WDW= 1
##$XDIM= 32768
##$YMAX_p= 299127230
##$YMIN_p= -831772
$$ End of Bruker specific parameters
$$ ---------------------------------
##NTUPLES= NMR SPECTRUM
##VAR_NAME=  FREQUENCY,     SPECTRUM/REAL,   SPECTRUM/IMAG
##SYMBOL=    X,             R,               I
##VAR_TYPE=  INDEPENDENT,   DEPENDENT,       DEPENDENT
##VAR_FORM=  AFFN,          ASDF,            ASDF
##VAR_DIM=   32768,         32768,           32768
##UNITS=     HZ,            ARBITRARY UNITS, ARBITRARY UNITS
##FACTOR=    0.134324425510551, 1,           1
##FIRST=     4401.40845070422, -177271,      -893823
##LAST=      0,             -6441,           -1261078
##MIN=       0,             -831772,         0
##MAX=       4401.40845070422, 299127230,    0
$$ Real data points
##PAGE= N=1
##DATA TABLE= (X++(R..R)), XYDATA
$$ [...]
12360D6743574J395384J642069J689590J683689J788714J943683K023509K063891
12352F0974103K172234K331749K447576K509039K555259K534667K360621K088492
12344G9973740J873295J728369J480375J025458M95571P9105k08446m52935o36657
12335H5357875o75639o22888o35703p00214n80947j67723K73341L84753J95774
12326H2828629J15888M27471R57821J333731J425721J421196J543243J835815
12318I1889515K203334K537753K778963K926062L025585L117214L182024L165648
12310A14826098L034512K774993K368456J827056J232415O62888Q7693n80602
12302A26233509j309831j915097k260740k433239k628951k886747l020582k858690
$$ plain form
12360 46743574 48138958 49781027 51470617 53154306 54943020 56886703 58910212 60974103
12352 60974103 63146337 65478086 67925662 70434701 72989960 75524627 77885248 79973740
12344 79973740 81847035 83575404 85055779 86081237 86576808 86655913 86447467 85994532 85357875
12335 85357875 84682236 84059348 83423645 82723431 82142484 81974761 82248102 82632855 82828629
12326 82828629 82944517 83371988 84329809 85663540 87089261 88510457 90053700 91889515
12318 91889515 94092849 96630602 99409565 102335627 105361212 108478426 111660450 114826098
12310 114826098 117860610 120635603 123004059 124831115 126063530 126726418 126814111 126233509
12302 126233509 124923678 123008581 120747841 118314602 115685651 112798904 109778322 106919632
12294A06919632k492519k196975k091625j985894j656204j200667r41721r70297
12286I3383730r98763p71300m22967k45713k54664k32535j01882L0923J51288
12277I0538117L43450N20851M84021L02207K82342M45982M18033K5661l89758
12268I2970906n44725p00889j168467j668975j734099j509255j541110j866558
12260H2236828j973088j696766j483281j581154j628567j354317j093594j173784
12252G0252277j297057j063131o99221o64401q15591o30609j24754J21572j38117
12243F4940968m99173n99772n85319o85530q03536p92109p64622q46677r10047
12234E8454183q27464p46613q34419r50346q58145o16356m81039n14971n54810
$$ plain form
12294 106919632 104427113 102230138 100138513 98152619 96496415 95295748 94354027 93383730
12286 93383730 92384967 91613667 91190700 90944987 90690323 90457788 90355906 90386829 90538117
12277 90538117 90881567 91402418 91886439 92188646 92470988 92916970 93335003 93360664 92970906
12268 92970906 92426181 91725292 90556825 88887850 87153751 85644496 84103386 82236828
12260 82236828 80263740 78566974 77083693 75502539 73873972 72519655 71426061 70252277
12252 70252277 68955220 67892089 67192868 66528467 65712876 65082267 64957513 65079085 64940968
12243 64940968 64441795 63842023 63256704 62571174 61767638 60975529 60210907 59364230 58454183
12234 58454183 57626719 56880106 56045687 55095341 54237196 53620840 53139801 52624830 52070020
12225E2070020n17372m92098n19380m86033l13449j21853j09461k96228m59238
12216D8754908l76547j20160M814j31047k86887k15214n1063o9408j86213q6222
12206D7236961J87733K33832k8400j61131Q0550K99903Q0617l22386l71695o9145
12196D7166839J03062p3100l35457m22594l51240k11729n4852m783j60834l65731
12186D5289581l63058j83153q3243j27502j42964p7615o3949j16039r9899k5658
12176D4006501l5142q6972r792J21293N6778j50521j74249J7545Q9745o0007j26026
12165D3649153K2258J01432k3963p8027M8819K4322k53873k96314J65749N57331
12155D3916887K90641k38803k32335K68826N29626L12970R0370J20826J44049
$$ plain form
12225 52070020 51552648 51060550 50541170 50055137 49741688 49619835 49510374 49214146 48754908
12216 48754908 48378361 48258201 48263015 48131968 47845081 47629867 47578804 47509396 47323183 47236961
12206 47236961 47424694 47658526 47630126 47468995 47549545 47849448 47930065 47607679 47235984 47166839
12196 47166839 47269901 47196801 46861344 46438750 46087510 45875781 45820929 45816146 45655312 45289581
12186 45289581 44926523 44743370 44660127 44532625 44389661 44312046 44248097 44132058 44032159 44006501
12176 44006501 43971359 43884387 43874595 43995888 44052666 43902145 43727896 43745441 43835186 43775179 43649153
12165 43649153 43671411 43772843 43748880 43670853 43719672 43743994 43490121 43193807 43359556 43916887
12155 43916887 44207528 43968725 43736390 44005216 44534842 44847812 44938182 45059008 45203057
12146D5203057O3222J56433M36011N02928K65313J55006L76955N65440M73131
12137D8197496L87407N18180N72745L57875K39250N04907P75610O10456K72004
12128E2435930K80323N52239O27721M91461M99072O47645N91243L22276J99288
12119E6647198K82055K37589k4109j88617j26837j06939k49634k81050n8043J16909
12109E6248522j6007k55639l02471k10176j75485j63108n3916O4483O6041O0136
12099E5262380K01661L83008M04054L19459L27456M12495L92234K65654K30112
12090E8198513L54224M79838M76651L92511L18230K75499K75236L41722M42447
12081F1554871N07932N34839N63535N66274M90372M08857M71660O70720Q01482
$$ plain form
12146 45203057 45266279 45422712 45858723 46361651 46626964 46781970 47158925 47724365 48197496
12137 48197496 48584903 49103083 49675828 50033703 50272953 50777860 51553470 52163926 52435930
12128 52435930 52716253 53268492 53896213 54387674 54886746 55534391 56125634 56447910 56647198
12119 56647198 56929253 57166842 57142733 56954116 56827279 56720340 56470706 56189656 56131613 56248522
12109 56248522 56232515 55976876 55674405 55464229 55288744 55125636 55071720 55136203 55202244 55262380
12099 55262380 55464041 55847049 56251103 56570562 56898018 57310513 57702747 57968401 58198513
12090 58198513 58552737 59032575 59509226 59901737 60219967 60495466 60770702 61112424 61554871
12081 61554871 62062803 62597642 63161177 63727451 64217823 64626680 65098340 65769060 66570542
12072F6570542P31395N87850N84368P45402R12569R75823R81097J009640J061022
12063G4159708J105804J172496J291325J387676J341856J167944J029128J037395
12055H3693332J143580J277451J460240J678757J803600J804986J907195K281799
12047I7050940K688314K729828K429911K202407K208327K126145J699213J137270
12039A14272355P41737M59032J03308k46431m09217m55102n51920o29428n41246
12030A12743088l98214l64249k75450R9569N37721O10578M20049N24527J053427
12021A14951046J473103J442331J347314J639858K110013K265319K097271J985317
12013A29311572K051158K085668K005403J933810J859098J611148J208330Q90522
$$ plain form
12072 66570542 67301937 67889787 68474155 69219557 70132126 71107949 72089046 73098686 74159708
12063 74159708 75265512 76438008 77729333 79117009 80458865 81626809 82655937 83693332
12055 83693332 84836912 86114363 87574603 89253360 91056960 92861946 94769141 97050940
12047 97050940 99739254 102469082 104898993 107101400 109309727 111435872 113135085 114272355
12039 114272355 115014092 115473124 115576432 115330001 114920784 114465682 113913762 113284334 112743088
12030 112743088 112344874 111980625 111705175 111804744 112342465 112953043 113373092 113897619 114951046
12021 114951046 116424149 117866480 119213794 120853652 122963665 125228984 127326255 129311572
12013 129311572 131362730 133448398 135453801 137387611 139246709 140857857 142066187 142956709
12005A42956709P48088N91975K52938k12993o54919r69869j115200j172282j364152
11996A39060295j787033k172810k186539j920502j776950j872506j929388j805004
11988A23609563j714833j781921j770492j505423j197074j059496r35608o46590
11980A12998126m05625m52432n23416k03289L36276N15034K38851L0471J60948
11971A12694944K34419j04890n79170p83070q64869j214647j752921k060023k070916
11962A03498857k116016k304369k374420k223699k110464k169729k148939j855843
11954H6195378j519480j431272j504522j477792j328636j194364j084435r81353
11946G5673524j043010j353515j619786j512025j217205j222533j566749j766584
$$ plain form
12005 142956709 143704797 144296772 144549710 144336717 143681798 142711929 141596729 140424447 139060295
11996 139060295 137273262 135100452 132913913 130993411 129216461 127343955 125414567 123609563
11988 123609563 121894730 120112809 118342317 116836894 115639820 114580324 113644716 112998126
11980 112998126 112592501 112140069 111616653 111413364 111749640 112264674 112503525 112533996 112694944
11971 112694944 112929363 112824473 112245303 111462233 110597364 109382717 107629796 105569773 103498857
11962 103498857 101382841 99078472 96704052 94480353 92369889 90200160 88051221 86195378
11954 86195378 84675898 83244626 81740104 80262312 78933676 77739312 76654877 75673524
11946 75673524 74630514 73276999 71657213 70145188 68927983 67705450 66138701 64372117
11938F4372117j560632j261858j195870j227195j118519r79588r97886j016062
11930E5014507p93045m93900m84149p30332q33200o47190m58279m77450n33972
11921D9562990m22015k42101j93406k48752k52084j93350j84593k47483k95411
11912D7283795k83857k49404k26243k20254k44132l05560l77043m23343m38125
11903D4515834m32004m19984m29412m71863n09064n08826n19543n99849o88524
11894C9936765o63139n34260m49784m79855n31487n16203m64372m19826l60596
11885C5517243k90904k74897l07838k96234k40021k67856l90150m03691j98842
11876C2846810Q727m2574k75995l94208k95310j44728q4385r6774j41461k12074
$$ plain form
11938 64372117 62811485 61549627 60353757 59126562 58008043 57028455 56030569 55014507
11930 55014507 54221462 53727562 53243413 52513081 51679881 51032691 50574412 50096962 49562990
11921 49562990 49140975 48898874 48705468 48456716 48204632 48011282 47826689 47579206 47283795
11912 47283795 46999938 46750534 46524291 46304037 46059905 45754345 45377302 44953959 44515834
11903 44515834 44083830 43663846 43234434 42762571 42253507 41744681 41225138 40625289 39936765
11894 39936765 39273626 38739366 38289582 37809727 37278240 36762037 36297665 35877839 35517243
11885 35517243 35226339 34951442 34643604 34347370 34107349 33839493 33449343 33045652 32846810
11876 32846810 32855537 32812963 32536968 32142760 31847450 31702722 31618337 31521563 31380102 31168028
11866C1168028k46020j68113m5573k8746j18741j59575q2142O413J323q6083k08915
11855C0031856l19496l17336j46201M0258J5234j83718k80307j82164j18635k37380
11845B8302111l34907j96074K6232M2576j17015j76341n9503L8358J2680r555
11835B7528562N6164R4760J6927o6557l7833J9352k8889j12140m3916J62474K49388
11824B7838292M9071k56612l25777p7388J91110J57694j29626l21492k17385q012
11814B6899875O049j78624k95446k04411q1480j49890l60669m69640l73467k25297
11804B4567000j97896k54754k41927j40032j00797k19428l78626l92859k49824
11795B2390857j18259j30243k36034k87131k06575o0576O672q4469k42761k79365
$$ plain form
11866 31168028 30922008 30753895 30708322 30679576 30560835 30401260 30319118 30325531 30326854 30240771 30031856
11855 30031856 29712360 29395024 29248823 29289081 29304315 29120597 28840290 28658126 28539491 28302111
11845 28302111 27967204 27771130 27797362 27839938 27722923 27546582 27487079 27525437 27538117 27528562
11835 27528562 27584726 27679486 27696413 27629856 27592023 27611375 27582486 27470346 27426430 27588904 27838292
11824 27838292 27887363 27630751 27304974 27227586 27418696 27576390 27446764 27125272 26907887 26899875
11814 26899875 26905924 26727300 26431854 26227443 26145963 25996073 25635404 25165764 24792297 24567000
11804 24567000 24369104 24114350 23872423 23732391 23631594 23412166 23033540 22640681 22390857
11795 22390857 22272598 22142355 21906321 21619190 21412615 21352039 21358711 21274242 21031481 20752116
11785B0752116j37615J1453o010j17416j28603m4385m7455j49298j25143R5986
11775B0103630K32529M6680k57962l04095q8578L7834r0087k34568j46395P7748
11765A9376736J70401O1152q8146j29773p1107M176M6509M9299N977q9976j96216
11754A9139032k23046j46337q7336j69915l05884k83868j08038l9068j91649l27832
11744A7256059k42396j13704j82779k97553j66925P8270N2429k05089k43714L8644
11734A5973242J97841p776k11656q9220R3808Q244j12219Q6389L61421K39585
11724A6539659j19757j27938K38490L74936O7998j44740J01590L75595J87929
11715A7493762j73896j18476K80194M11975R5585j85676o0487K32145L04042J84044
$$ plain form
11785 20752116 20614501 20625954 20619944 20502528 20373925 20329540 20282085 20132787 20007644 20103630
11775 20103630 20336159 20382839 20124877 19820782 19732204 19770038 19679951 19445383 19298988 19376736
11765 19376736 19547137 19608289 19520143 19390370 19319263 19323439 19369948 19419247 19425224 19335248 19139032
11754 19139032 18915986 18769649 18682313 18512398 18206514 17922646 17814608 17775540 17583891 17256059
11744 17256059 17013663 16899959 16717180 16419627 16252702 16330972 16383401 16178312 15934598 15973242
11734 15973242 16171083 16163307 15951651 15862431 15956239 15964483 15852264 15938653 16300074 16539659
11724 16539659 16419902 16291964 16530454 16905390 16973388 16828648 16930238 17305833 17493762
11715 17493762 17319866 17201390 17481584 17893559 17989144 17803468 17742981 17975126 18279168 18463212
11705A8463212J48656K35068K37375R8600J8442J24422K45546J50236r7841k03771
11695A9419945o3013O6028q1819l94352n40087m32205l04159l27570m03307m00973
11685A6538488l65871l56520k90187j29763m6521j81740l78457l80489k05447
11676A4203493q6998j14017j69960j90147k22162k33152j20848M0981K4448j98375
11666A2933263l57421k61609o6006j4954j02061j63185j58382j58331j53129q6866
11656A1411319k5433q1276j90123j67272p217P1164n0901j98096j54137K0169
11646A0628197Q4648k7422j33830r3905o090k5823j10707r6279K8497R6158L0413
11635A0373857l1188K9853J07242M1009j12903j65772r0074k9519l1278J1926
$$ plain form
11705 18463212 18611868 18846936 19084311 19182911 19201353 19325775 19571321 19721557 19623716 19419945
11695 19419945 19356932 19422960 19341141 18946789 18406702 17974497 17670338 17342768 16939461 16538488
11685 16538488 16172617 15816097 15525910 15396147 15349626 15167886 14789429 14408940 14203493
11676 14203493 14116495 14002478 13832518 13642371 13420209 13187057 13066209 13107190 13131638 12933263
11666 12933263 12575842 12314233 12248227 12233273 12131212 11968027 11809645 11651314 11498185 11411319
11656 11411319 11385886 11304610 11114487 10947215 10939998 11011162 10960261 10762165 10608028 10628197
11646 10628197 10712845 10685423 10551593 10457688 10451598 10425775 10315068 10218789 10247286 10343444 10373857
11635 10373857 10342669 10372522 10479764 10520773 10407870 10242098 10152024 10122505 10091227 10103153
11625A0103153J13248J09311p0424k46280k42289j34530q2431o1007L3988J28732
11615I651471O4666j01782j42737p614J04972O4331k5611n0280o2197j19799j35810
11604I239610l5876P7825P8962J2736j7505m0679j13990j38750m183J56963J12267
11593I327380r3703j80367p5062j9305j34575j90686m039K09041J66734J286M2713
11582I049417K41783K25108p4468k72289j39267M6192j4790j50605m8650J81780
11572I044211J83028n1417j76181o3651L7834k7611q7182p875N2413l3056r1354
11561H779159L7209J67833N9164j50995j36617R6235K27010J25080l426q473j3980
11550I178199j33413k38565j74571r860R5058J22930J46003J54246R9449L1186
$$ plain form
11625 10103153 10216401 10325712 10255288 10009008 9766719 9632189 9549758 9488751 9522739 9651471
11615 9651471 9716137 9614355 9471618 9464004 9568976 9633307 9607696 9557416 9495219 9375420 9239610
11604 9239610 9203734 9281559 9360521 9373257 9355752 9315073 9201083 9062333 9058150 9215113 9327380
11593 9327380 9233677 9053310 8978248 8958943 8824368 8633682 8629643 8838684 9005418 9006704 9049417
11582 9049417 9291200 9516308 9441840 9169551 9030284 9076476 9061686 8911081 8862431 9044211
11572 9044211 9227239 9175822 8999641 8935990 8973824 8946213 8859031 8851156 8903569 8870513 8779159
11561 8779159 8816368 8984201 9043365 8892370 8755753 8851988 9078998 9204078 9200652 9192179 9178199
11550 9178199 9044786 8806221 8631650 8621790 8716848 8839778 8985781 9140027 9239476 9270662
11540I270662L4010P4326M6814m7732q9058k023J53786K64030K67655J88199J06683
11529A0267352R6728J51503J90999J66384J24021J35786K05313K80383L19633
11520A1938102L05680K25133P9965r4296k40782l00511k41599j20857q4187k06788
11510A1259860l47908l00458r9158q991j40426k63722j48078P4455R1428j32844
11500I984158l11261k36664k8382P3357J0696p2383l6659Q7884J32718o612j99874
11489I396978k02019J1010J60840M1937j58708j18920J33374K52438Q3033j31232
11479I468731j22388M6195J27199L3809r9968j11754L3955K18251K48095M5769
11469I887894k17942k85268j22668N7364R8358N8989L3701M162m6980m9146K3140
$$ plain form
11540 9270662 9304672 9378998 9425812 9378080 9289022 9286999 9440785 9704815 9972470 10160669 10267352
11529 10267352 10364080 10515583 10706582 10872966 10996987 11132773 11338086 11618469 11938102
11520 11938102 12243782 12468915 12548880 12454584 12213802 11913291 11671692 11550835 11466648 11259860
11510 11259860 10911952 10611494 10512336 10503345 10362919 10099197 9951119 10025574 10117002 9984158
11500 9984158 9672897 9436233 9407851 9481208 9491904 9419521 9382862 9470746 9603464 9596852 9396978
11489 9396978 9194959 9205969 9366809 9408746 9250038 9131118 9264492 9516930 9599963 9468731
11479 9468731 9346343 9392538 9519737 9553546 9453578 9341824 9375779 9594030 9842125 9887894
11469 9887894 9669952 9384684 9262016 9319380 9417738 9476727 9510428 9514590 9467610 9418464 9441604
11458I441604P9871P3984P6681J05114N4846q3854j37797k3265Q9374N5125m74
11447I731209P5705J69644J04295k3761Q89J40475J81817R7754L8312L4908R719
11436A0560966J1290J27534K28114J36514J913J05560L26076K63016n9594j33855
11426A1567534K18238M93141K72651j20148j46136J34658K61201J36071O7019
11417A2884229J61397J90499O3016j4372O9513J47469R9516N2100J15979J78831
11407A3948177J11165j0192k8634O9303J64560J54449M3177l8574P8088L74969
11397A4866488N63205M07320Q6727o915J78828K97613J44192o4958q5185j2235
11387A6375080l9512j01127l4269Q3247O0760n0309l5403R7863J16159m0991j40312
$$ plain form
11458 9441604 9521475 9595459 9672140 9777254 9832100 9748246 9610449 9587184 9676558 9731683 9731209
11447 9731209 9806914 9976558 10080853 10057092 10057981 10198456 10380273 10478027 10516339 10551247 10560966
11436 10560966 10572256 10699790 10927904 11064418 11066331 11171891 11497967 11760983 11701389 11567534
11426 11567534 11785772 12278913 12551564 12431416 12285280 12419938 12681139 12817210 12884229
11417 12884229 13045626 13236125 13299141 13284769 13354282 13501751 13601267 13653367 13769346 13948177
11407 13948177 14059342 14049150 14020516 14089819 14254379 14408828 14452005 14413431 14491519 14866488
11397 14866488 15429693 15837013 15923740 15916825 16095653 16393266 16537458 16472500 16387315 16375080
11387 16375080 16335568 16234441 16200172 16283419 16344179 16293870 16258467 16356330 16472489 16431498 16291186
11376A6291186j2762J99507K70094J82920P1510K872l8817m6771n455L9318K8390
11365A6981992k9021r5941j72777k40075k07522l7004J35381J39660J0225o5763
11355A6419155l2580k1085q3552p6605P7985K01993J14845n6255m8201J33544
11345A6629244K33515J48315M7577N6451P8346K9372R120R7616J88614J84659
11335A7702829J70884K22305K25488R7473L544J09328K67561K32215O4615J8587
11325A9114829J07807J23760M2081N3919J80352K13705J01589L8701Q5185N2290
11315B0114218r4567q6774J80669L71755J83674j70701k71138q1642Q8654P8041
11305B0312189J0056J2731P5692J54711K08693J77558Q9576R9416K50746L32469
$$ plain form
11376 16291186 16278424 16477931 16748025 16930945 17002455 17005327 16966510 16919739 16914284 16953602 16981992
11365 16981992 16952971 16857030 16684253 16444178 16236656 16199652 16335033 16474693 16484918 16419155
11355 16419155 16386575 16365490 16281938 16205333 16283318 16485311 16600156 16543901 16495700 16629244
11345 16629244 16862759 17011074 17058651 17115102 17193448 17222820 17231940 17329556 17518170 17702829
11335 17702829 17873713 18096018 18321506 18418979 18422523 18531851 18799412 19031627 19096242 19114829
11325 19114829 19222636 19346396 19388477 19442396 19622748 19836453 19938042 19976743 20061928 20114218
11315 20114218 20019651 19932877 20113546 20485301 20668975 20498274 20227136 20145494 20234148 20312189
11305 20312189 20322245 20334976 20410668 20565379 20774072 20951630 21041206 21140622 21391368 21723837
11295B1723837J77850l3649k2178J68834K74639K37867K31590L09971L44329K96221
11285B3709311K69107K81079K46039J84802K06623K88994L24299L54698M82752
11276B6347704N87579M61425K22101K20502M89938O65102N46808L74401L93860
11267C0309420N11871N58773N63764N71976N04970M08612N15232Q27439R76434
11258C5748491P74088N68304P04954R58173R23793P14121P55320J053802J203085
11249D3404131J079572J009789J182547J369640J377546J369934J533247J742941
11241E4069347J799124J762890J828433K017277K198538K306088K374062K436962
11233G0792721K525094K696174K964839L246513L447960L576369L714763L935716
$$ plain form
11295 21723837 21901687 21868038 21845860 22014694 22289333 22527200 22758790 23068761 23413090 23709311
11285 23709311 23978418 24259497 24505536 24690338 24896961 25185955 25510254 25864952 26347704
11276 26347704 26935283 27396708 27618809 27839311 28329249 28994351 29541159 29915560 30309420
11267 30309420 30821291 31380064 31943828 32515804 33020774 33429386 33944618 34772057 35748491
11258 35748491 36522579 37090883 37795837 38754010 39677803 40391924 41147244 42201046 43404131
11249 43404131 44483703 45493492 46676039 48045679 49423225 50793159 52326406 54069347
11241 54069347 55868471 57631361 59459794 61477071 63675609 65981697 68355759 70792721
11233 70792721 73317815 76013989 78978828 82225341 85673301 89249670 92964433 96900149
11225I6900149M264998M671301N067195N375211N608350N836718O078113O271469
11217A40073504O333395O180129N739367N027370M168195L234358K119456O99842
11209A73575616r06857k384046l516523m338845m998335n578485o041734o253675
11201A39557116o105863n706235n360107n226840n096282m689117m085327l622366
11193I9664979l427970l316336l133614k936065k790594k645447k460501k262454
11185G6691998k033357j743011j499982j441587j467248j339705j066691q94629
11177F5205788q91848q58228p07534n86837n15621k85194J24654M14663M65868
11168F2365711N89727J010043J463094J633985J629882J630427J414302P27173
$$ plain form
11225 96900149 101165147 105836448 110903643 116278854 121887204 127723922 133802035 140073504
11217 140073504 146406899 152587028 158326395 163353765 167521960 170756318 172875774 173575616
11209 173575616 172668759 170284713 166768190 162429345 157431010 151852525 145810791 139557116
11201 139557116 133451253 127745018 122384911 117158071 112061789 107372672 103287345 99664979
11193 99664979 96237009 92920673 89787059 86850994 84060400 81414953 78954452 76691998
11185 76691998 74658641 72915630 71415648 69974061 68506813 67167108 66100417 65205788
11177 65205788 64313940 63455712 62748178 62161341 61645720 61360526 61485180 61899843 62365711
11168 62365711 62955438 63965481 65428575 67062560 68692442 70322869 71737171 72464344
11160G2464344j41963p06519j037610j586776k324473k679449k419141k011181
11152E9557232j902981j935733j763668j453663j300292j302214j201873r37179
11144D7759629p32187p39285q21820p57480n34643l60480l92071n28446n43206
11135D2350011l98460k77266k61431j85071N1111K45073K16760J67121L84296
11126D2292144P41100Q88193Q65943J053824J478916J658411J285796O47676J37318
11117E1049321k72689p98306j390164j817414j997490j983661j802972j529031
11109C9457594j334240j261202j129120q56125o43649o23806n92381l78085k06884
11100C2432102l29892n21659l99369q8314o2698l67667n25739k97738l6873q5536
$$ plain form
11160 72464344 72322381 71615862 70578252 68991476 66667003 63987554 61568413 59557232
11152 59557232 57654251 55718518 53954850 52501187 51200895 49898681 48696808 47759629
11144 47759629 47027442 46288157 45466337 44708857 44174214 43813734 43421663 42893217 42350011
11135 42350011 41951551 41674285 41412854 41227783 41278894 41523967 41740727 41907848 42292144
11126 42292144 43033244 43921437 44787380 45841204 47320120 48978531 50264327 50912003 51049321
11117 51049321 50776632 49978326 48588162 46770748 44773258 42789597 40986625 39457594
11109 39457594 38123354 36862152 35733032 34876907 34233258 33609452 33017071 32638986 32432102
11100 32432102 32102210 31580551 31181182 31092868 31030170 30662503 30136764 29839026 29802153 29716617
11090B9716617k51755j89856J7002K2798k03432l26114j40522J63041K90355K14247
11080B9312381J62993L22069O24890Q39900Q49383Q11043R85806J401293J768751
11071C7078509J787783J474000J107452Q81632O92962L10875l03168r26335j332129
11062D0771581j535557j705816j884336j922097j725152j432174j249179j184117
11054B8133153j067073q15843n68116n05883o05752o37413m41161j65310j26110
11045B3200492l95156o51889n70263k47460n6923j39166k80109k85246k03367
11036B0370913j28607n5681k7119j52510l56560l84192k05088j14981k46163l09507
11026A8390505r2563J21335O36k54577k25242M2153J44481j7130j73525k07013
$$ plain form
11090 29716617 29464862 29275006 29292008 29314806 29111374 28785260 28644738 28807779 29098134 29312381
11080 29312381 29475374 29797443 30422333 31262233 32111616 32922659 33908465 35309758 37078509
11071 37078509 38866292 40340292 41447744 42329376 43022338 43333213 43030045 42103710 40771581
11062 40771581 39236024 37530208 35645872 33723775 31998623 30566449 29317270 28133153
11054 28133153 27066080 26250237 25682121 25176238 24570486 23933073 23491912 23326602 23200492
11045 23200492 22805336 22153447 21583184 21335724 21278801 21139635 20859526 20574280 20370913
11036 20370913 20242306 20186625 20159506 20006996 19650436 19266244 19061156 18946175 18700012 18390505
11026 18390505 18297942 18419277 18419913 18165336 17940094 17982247 18126728 18109598 17936073 17729060
11016A7729060k42065k50597p0961J61160J07669j80177k67504l6734J27822P618
11006A7085291j18498k9105O5842j925M356K54102M46510K97229N6613Q8335K43945
10995A8392695J47553j36961k35661j06323m9708j59161k27766j80244j66367
10986A7278057k08840j52155p033J1536j42563k53257j99854j22466j42440j72145
10976A5888840j06835k04M8887K9751k2297p1554o1702K5318R6983O3995o019
10965A5885163J4927J16621J96270K35669K73247K79822K34552K31085L23755
10956A7791111L81026K93680J87417J90217J57654o6910k91060k52571j16666
10947A8273898k39110n15500m87269j16130Q7482j55934m85165m82907k40679
$$ plain form
11016 17729060 17486995 17236398 17165437 17326597 17434266 17254089 16986585 16949851 17077673 17085291
11006 17085291 16966793 16937688 17003530 17001605 17005961 17260063 17706573 18003802 18060415 18148750 18392695
10995 18392695 18540248 18403287 18167626 18061303 18011595 17852434 17624668 17444424 17278057
10986 17278057 17069217 16917062 16910029 16921565 16779002 16525745 16325891 16203425 16060985 15888840
10976 15888840 15782005 15781801 15830688 15860439 15838142 15766588 15704886 15730204 15827187 15891182 15885163
10965 15885163 15900090 16016711 16212981 16448650 16721897 17001719 17236271 17467356 17791111
10956 17791111 18172137 18465817 18653234 18843451 19001105 18934195 18643135 18390564 18273898
10947 18273898 18034788 17519288 17032019 16915889 17003371 16847437 16362272 15879365 15638686
10938A5638686q3773q9880j46271j96521j95369p0937Q6941O8323q5841p9932
10928A4845426J21860J71316o5785k21835l5969J82578R0643q9098J5436K43108
10918A5257680J86848p0133r2958J55929K87354J70145Q8618J72241J89559K9016
10908A6374299p9375P047Q9505j668j18287q5992m718l8662j25531j10779j5503
10897A5890336K0902l3792q0882l1693J05969K26049J94798J0262j31523n8061
10887A6112365J28744J90334R9962L9567O7718M8113n5431q0017M4362J43326
10877A6739043P5463l2640J5456J91388K92614K00501j9903k12100k50302j28405
10867A6871115L4751J25994J55537J76162J56980O7854R566Q0414J84682J85459
$$ plain form
10938 15638686 15554913 15465033 15318762 15122241 14926872 14855935 14942876 15011199 14925358 14845426
10928 14845426 14967286 15138602 15072817 14850982 14815013 14997591 15088234 14999136 15014572 15257680
10918 15257680 15444528 15374395 15281437 15437366 15724720 15894865 15983483 16155724 16345283 16374299
10908 16374299 16294924 16301971 16391476 16389808 16271521 16185529 16180811 16142149 16016618 15905839 15890336
10897 15890336 15911238 15877446 15796564 15764871 15870840 16096889 16291687 16301949 16170426 16112365
10887 16112365 16241109 16431443 16531405 16570972 16638690 16686803 16631372 16551355 16595717 16739043
10877 16739043 16814506 16781866 16797322 16988710 17281324 17481825 17461922 17249822 16999520 16871115
10867 16871115 16905866 17031860 17187397 17363559 17520539 17588393 17597959 17678373 17863055 18048514
10857A8048514J72439L14168N04077M75061K53875J47517K39937K77597J46580
10848B0579765P3992J95868K97569J95095L2782l3520j15683k86298l23526r3806
10838B0522238J04364l7404l05808k68663N9611K75741K05849N6891K551P079
10828B0622449N7144K11954L89066M06671K77579J98467K32571K57212K23586
10819B2876699K04060J84390Q2678k3356K6170J56583J19742r2539k06689j09519
10809B3218219k3421j25217k73668k69884j55718r0336j08297j39670j31826n9793
10799B1840389N3677R3578p761q9330N2677K96803L06867N3229j12329m121J35786
10788B2619465R4820M1476J60340K69098J38805o4716m0474J29997J20382r2539
$$ plain form
10857 18048514 18220953 18535121 19039198 19514259 19768134 19915651 20155588 20433185 20579765
10848 20579765 20653757 20849625 21147194 21342289 21375071 21341551 21225868 20939570 20616044 20522238
10838 20522238 20626602 20589198 20283390 20014727 20074338 20350079 20555928 20612819 20615370 20622449
10828 20622449 20679593 20891547 21280613 21687284 21964863 22163330 22395901 22653113 22876699
10819 22876699 23080759 23265149 23347827 23324471 23350641 23507224 23626966 23534427 23327738 23218219
10809 23218219 23194798 23069581 22795913 22526029 22370311 22279975 22171678 22032008 21900182 21840389
10799 21840389 21894066 21987644 21979883 21890553 21943230 22240033 22546900 22600129 22487800 22483679 22619465
10788 22619465 22714285 22755761 22916101 23185199 23324004 23259288 23218814 23348811 23469193 23376654
10778B3376654k10614j10366P149r579o0027l9334k5117j09121k27936k61375
10768B2330334j86370q0205m2520j04967j61496p1884R0519O2383j88519k91197
10758B1356078J862L30688J88920k56941l37812R9870M17891J44304l18409l31281
10748B1295170L6208K03143r306k06337j21062J4331p9407k88309l26358j59838
10738B0358235k83L167r8737j66931j22077j5427J0568j14010k62591k47968p9034
10727A9264912N4521O7009O5591R5576J7604k04892k99784l1647L59518L85214
10717A9773622j7632l52138k13635J90317L63939J68292j01743j68873m0494J37301
10707A9738956K43760J83410m9844k50945j58753J71532L48841J38765j98487
$$ plain form
10778 23376654 23166040 23055674 23062823 23053244 22993217 22953883 22928766 22819645 22591709 22330334
10768 22330334 22143964 22063759 22021239 21916272 21754776 21682892 21773411 21835794 21647275 21356078
10758 21356078 21357940 21688628 21877548 21620607 21282795 21382665 21800556 21944860 21626451 21295170
10748 21295170 21331378 21534521 21525215 21318878 21197816 21212147 21132740 20844431 20518073 20358235
10738 20358235 20357952 20361119 20262382 20095451 19973374 19957947 19968515 19854505 19591914 19343946 19264912
10727 19264912 19319433 19386442 19452033 19547609 19565213 19360321 19060537 19028890 19388408 19773622
10717 19773622 19755990 19403852 19190217 19380534 19744473 19912765 19811022 19642149 19601655 19738956
10707 19738956 19982716 20166126 20116282 19865337 19706584 19878116 20226957 20365722 20167235
10698B0167235k52568j7218J37526J205k18336k27895m2177Q4060J3619j22262
10688A9523189j21120L3971J60385J02800p1824j52797m6015J26930K19217K45095
10678B0019831K86822L08847K20177Q8530J08078L06377M43753L12187K6178j21620
10668B1999160m1900O6133K4294p4982k2698J89600L51521L33335K58674K99445
10658B3382582M11787M13074K60690R0554q423q5002j69391k09027k16043k88249
10648B3582552l96143l56336j49000l6603j64471k64777m8271K86463L04327J553
10638B2759294j87173n1242J43461J55782J17690J97124K67776J71663L8040O3742
10628B3676157J80194K05927J66249K06205L21313M09494M62431M89722M02885
$$ plain form
10698 20167235 19914667 19897449 20034975 20036180 19817844 19589949 19547772 19631832 19645451 19523189
10688 19523189 19402069 19436040 19596425 19699225 19627401 19474604 19428589 19555519 19774736 20019831
10678 20019831 20306653 20615500 20835677 20924207 21032285 21338662 21782415 22094602 22120780 21999160
10668 21999160 21957260 22023393 22047687 21972705 21950007 22139607 22491128 22824463 23083137 23382582
10658 23382582 23794369 24207443 24468133 24558687 24550264 24465262 24295871 24086844 23870801 23582552
10648 23582552 23186409 22830073 22681073 22644470 22479999 22215222 22166951 22453414 22757741 22759294
10638 22759294 22572121 22520879 22664340 22820122 22937812 23134936 23402712 23574375 23612415 23676157
10628 23676157 23856351 24062278 24228527 24434732 24756045 25165539 25627970 26117692 26520577
10619B6520577K03345J17945K87541M94265M91492M16026N15000O53120N49803
10610C0249114L70075N22847Q98994R31310N30250L26412P05642J190186J197609
10601C6922439R19381R14223J198054J341591J255706J268611J499860J718842
10593D7038707J825735J951991K032016J781742J221988P49444N17850K02047
10585E7321520l91598r11057r74626p49938o49479p12490o78163m91714l45643
10576E1416812l09773k68033j79828j09625l1526J33610L27741M44847N46088
10567E1970313P37028R21011R64773J013000J287559J645345J744592J618524
10559F1902145J603680J655289J291250M10557l87945o44313o98928j060539j539151
$$ plain form
10619 26520577 26723922 26841867 27129408 27623673 28115165 28531191 29046191 29699311 30249114
10610 30249114 30619189 31142036 32041030 32972340 33502590 33829002 34534644 35724830 36922439
10601 36922439 37841820 38756043 39954097 41295688 42551394 43820005 45319865 47038707
10593 47038707 48864442 50816433 52848449 54630191 55852179 56601623 57119473 57321520
10585 57321520 56929922 56018865 55044239 54294301 53644822 52932332 52254169 51762455 51416812
10576 51416812 51107039 50839006 50659178 50549553 50518027 50651637 50979378 51424225 51970313
10567 51970313 52707341 53628352 54593125 55606125 56893684 58539029 60283621 61902145
10559 61902145 63505825 65161114 66452364 66862921 66474976 65830663 65131735 64071196 62532045
10550F2532045j594461j264369j085312j197036j184023q51759n53637n75408
10542E4226040p06034o55008m78557l41307k15004p4115o9788k35390l03444r6434
10532E1050959J59175J94257J16457J51063K05700O5000j75695k77081l10180
10523E1179655n07991p57770p20197m46314l75759o22642p50932m71151j22559
10514D6404340j43370m01861m45892k01900q453l9741r2649J5309J63918J68309
10504D5418010O9465K9374P1359Q1932J3661n1254m6956l4401j11491k58955l51735
10493D4829009l30076k81042k98951l34780k79585j54040q7724j13120j17351
10484D2832340l3289N4942O5450N9446J33008K55846L21519L00484K51860K30621
$$ plain form
10550 62532045 60937584 59673215 58587903 57390867 56206844 55355085 54801448 54226040
10542 54226040 53520006 52864998 52386441 52045134 51830130 51756015 51686227 51450837 51147393 51050959
10532 51050959 51210134 51404391 51520848 51671911 51877611 51942611 51766916 51489835 51179655
10523 51179655 50671664 49913894 49193697 48747383 48371624 47748982 46998050 46526899 46404340
10514 46404340 46260970 45859109 45413217 45211317 45202864 45163123 45070474 45085783 45249701 45418010
10504 45418010 45487475 45516849 45588208 45670140 45683801 45632547 45585591 45551190 45439699 45180744 44829009
10493 44829009 44498933 44217891 43918940 43584160 43304575 43150535 43062811 42949691 42832340
10484 42832340 42799051 42853993 42919443 42978889 43111897 43367743 43689262 43989746 44241606 44472227
10474D4472227K64732L77861N54061P19564Q25811Q96962R34298Q67398P09353
10465E0622267O62461Q91988J236297J347175J147190R52794J056878J358840
10457E9275890J549356J539282J520873J650088J854905J987358K018532K017201
10449G3413485K037417K093278K158384K125506J865461J418548J024192Q24139
10441H6960410O33531K05773l40110o30422n93308n84944q22780j012010q11004
10432H3005136m18819l11503n09204n31703j11350M40333P10725P14635P53110
10423H3741360R71592J266194J494984J618218J707793J894999K205757K431688
10415I7332585K342477K038561J841444J792729J589640J132703P53835O65308
$$ plain form
10474 44472227 44736959 45114820 45668881 46388445 47214256 48111218 49045516 49912914 50622267
10465 50622267 51284728 52176716 53413013 54760188 55907378 56860172 57917050 59275890
10457 59275890 60825246 62364528 63885401 65535489 67390394 69377752 71396284 73413485
10449 73413485 75450902 77544180 79702564 81828070 83693531 85112079 86136271 86960410
10441 86960410 87593941 87799714 87459604 86829182 86235874 85650930 84828150 83816140 83005136
10432 83005136 82586317 82274814 81765610 81233907 81122557 81562890 82273615 82988250 83741360
10423 83741360 84712952 85979146 87474130 89092348 90800141 92695140 94900897 97332585
10415 97332585 99675062 101713623 103555067 105347796 106937436 108070139 108823974 109489282
10407A09489282N57721R4516n14092q59857j005137j310652j767400k040032k100238
10398A00544111k254481k518801k533050k225971k022843k157974k262068j949270
10390H2619653j418121j102088j024765q91758o21269m04967l40867l14249j99105
10381G6302464L1414L27255N45526N37603L85211L60374M92117M24081n9022o27477
10371G8719546q59650q75119j110190j612127k007463k115574k139030k218144
10363F5782249k232002k138532k111989k189583k134067j837503j557270j535592
10355E0045711j637991j593375j385377j186803j081555j058325j118392j187136
10347C9796757j079096p68308n40849o35971q69810q88989o91284n77544o35471
$$ plain form
10407 109489282 110047003 110141519 109627427 108767570 107762433 106451781 104684381 102644349 100544111
10398 100544111 98289630 95770829 93237779 91011808 88988965 86830991 84568923 82619653
10390 82619653 81201532 80099444 79074679 78182921 77561652 77156685 76815818 76501569 76302464
10381 76302464 76333878 76661133 77206659 77744262 78129473 78489847 78981964 79406045 79347023 78719546
10371 78719546 77859896 76984777 75874587 74262460 72254997 70139423 68000393 65782249
10363 65782249 63550247 61411715 59299726 57110143 54976076 53138573 51581303 50045711
10355 50045711 48407720 46814345 45428968 44242165 43160610 42102285 40983893 39796757
10347 39796757 38717661 37949353 37408504 36772533 35902723 35013734 34322450 33744906 33109435
10338C3109435o26414m36338k93307l79203n10459m39459k69837k82318m49329
10329B9422771m42110j47535J13116K4721k70982l78281j89337K1276K9541n7372
10319B8125808l8720O6983J06274N4873J6034L1148O7911J44109K80857L73975
10309B9229252L21996K66894M60929Q55490J088195R81656P85368P47762P11526
10300C5449068M05931o4967l78933n28493p98310j207627j389293j166042q82682
10291B9438652r08217j079574r75393n88039l47116m84843p23346p01709m48817
10282B3181598k56569k60025l46803l91307l79792l23846k18459j10838q5063
10273B0808896j41324j85267j65510j27971j02542m0859P4346J53938J20121K7035
$$ plain form
10338 33109435 32483021 32046683 31753376 31374173 30863714 30424255 30154418 29872100 29422771
10329 29422771 28980661 28833126 28946242 28970963 28699981 28321700 28132363 28153639 28183180 28125808
10319 28125808 28087088 28154071 28260345 28315218 28331252 28362400 28430311 28574420 28855277 29229252
10309 29229252 29551248 29818142 30279071 31134561 32222756 33204412 33989780 34737542 35449068
10300 35449068 35854999 35790032 35411099 34882606 34084296 32876669 31487376 30321334 29438652
10291 29438652 28530435 27450861 26475468 25887429 25540313 25055470 24332124 23630415 23181598
10282 23181598 22925029 22665004 22318201 21926894 21547102 21223256 21004797 20893959 20808896
10273 20808896 20667572 20482305 20316795 20188824 20086282 20045423 20119769 20273707 20393828 20420863
10263B0420863k7840n4857j30850k42751k83801k04073p5748j280k2810j14079
10253A9262774j93922j66993l2116P1635K3701r3038q6983O6349J87858J64944
10243A9204209J04107J38249K23060K43663K19117K58258L67668M40621M19157
10234B1618109L50682K80727J88331N3714p4317j11510k6015R9778J02446r8556
10224B2383389l40794l22345M1791M44577N02841K16170l6958K4619K55087K94080
10214B3462457K429m13330o63246o62468n51618m99608n37918n83845n75180n25287
10204A8452386m52376l36070j93100j28509k20478l79153m16593k70157q1295
10195A5974655k7567j33862k75120l18250k34789j09208n6134j03514j57460j21249
$$ plain form
10263 20420863 20393023 20338166 20207316 19964565 19680764 19476691 19400943 19399663 19376853 19262774
10253 19262774 19068852 18901859 18869743 18941378 18965079 18872041 18785058 18851407 19039265 19204209
10243 19204209 19308316 19446565 19669625 19913288 20132405 20390663 20758331 21198952 21618109
10234 21618109 21968791 22249518 22437849 22491563 22417246 22305736 22279721 22379499 22481945 22383389
10224 22383389 22042595 21720250 21762041 22206618 22709459 22925629 22888671 22913290 23168377 23462457
10214 23462457 23464886 23051556 22388310 21725842 21174224 20674616 20136698 19552853 18977673 18452386
10204 18452386 18000010 17663940 17470840 17342331 17121853 16742700 16326107 16055950 15974655
10195 15974655 15947088 15813226 15538106 15219856 14985067 14875859 14819725 14716211 14558751 14437502
10185A4437502l6429l2312j26187j72593p1668N9096L1007j39155k30965j16383
10175A3601913P0293J25041L6805m5370l9002J0227O2438J26084J53972O0033
10165A4162434j01574j38320j774R5419k561j17212L400K67036L63985K54536
10155A4785369K03962L08282L34403J53674Q60Q5866K24551J35413r8615j72906
10145A5960859l6520Q2449N7761j8062o9133j21012j51287r7135k0915m4681j16668
10134A5425656p2687O2488Q3201n4555j52554r7206j8268k5739k6860O4212J46236
10123A5333924J15001N3624Q1040J54157J72365J53484J59197J57643J05728P1398
10113A6557561J31780K28727K57187K28611K25114K52864K56794K31076K09483
$$ plain form
10185 14437502 14401073 14368761 14242574 14069981 13998313 14057409 14088416 13949261 13718296 13601913
10175 13601913 13672206 13797247 13834052 13788682 13749680 13759907 13822345 13948429 14102401 14162434
10165 14162434 14060860 13922540 13920766 14016185 14013624 13896412 13899812 14166848 14530833 14785369
10155 14785369 14989331 15297613 15632016 15785690 15786550 15872416 16096967 16232380 16133765 15960859
10145 15960859 15924339 16006788 16064549 16046487 15977354 15856342 15705055 15607920 15587005 15542324 15425656
10134 15425656 15352969 15415457 15498658 15444103 15291549 15194343 15176075 15150336 15123476 15187688 15333924
10123 15333924 15448925 15502549 15583589 15737746 15910111 16063595 16222792 16380435 16486163 16557561
10113 16557561 16689341 16918068 17175255 17403866 17628980 17881844 18138638 18369714 18579197
10104A8579197J81519J05491j4050j10573r8417N8546K54353K60394j7446l23644
10094A8875370k99722K9025K51729J34713p5131o0066J09148J57538N8447K0220
10084A9201271J15897J90905J25419o258n1098N8616K37189K89766J14241j01909
10074B0174039n2825K47953M28117K86291R9625J87757M24223M78775L44068K80059
10064B2898082L70482M76306N38034O01611O23653N60658N58999P33663Q68741
10055B8230229P07203M32352M26255O10949N23893P4542k83027k52106r2098j30090
10045C0248102l00251l99769m35210m65274m10230k58077j87697k68945k97994
10036B7224655j31832O8382J17805P6467N8505L4105r001K0435Q7902K3122j17980
$$ plain form
10104 18579197 18760716 18866207 18852157 18741584 18643167 18701713 18956066 19216460 19199014 18875370
10094 18875370 18575648 18604673 18856402 18991115 18915984 18855918 18965066 19122604 19181051 19201271
10084 19201271 19317168 19508073 19633492 19627234 19576136 19634752 19871941 20161707 20275948 20174039
10074 20174039 20121214 20369167 20797284 21083575 21183200 21370957 21795180 22273955 22618023 22898082
10064 22898082 23268564 23744870 24282904 24884515 25508168 26068826 26627825 27361488 28230229
10055 28230229 28937432 29369784 29796039 30406988 30930881 31005423 30722396 30470290 30378192 30248102
10045 30248102 29947851 29548082 29112872 28647598 28237368 27979291 27791594 27522649 27224655
10036 27224655 27092823 27161205 27279010 27355477 27413982 27448087 27439086 27459521 27547423 27570545 27452565
10025B7452565n2655J93434J92109j89066m69182k93780k3047j18751l76577l33834
10015B5981216q6279n7976k08559j46456J06779J34341j34796l21460k46594j24322
10005B4895894q3755l3016j6734j71946l13109j20916K33703K54866m4566j32020
9995B4468401J23034K37139K2828m8755K64389M66978J88914j15587P0497M36945
9985B6114783L98906Q5241L9688K62924L08714J32104R8354K43083K34472N8835
9975B7977104O7780K86681L20805P4182m7485J55257L27425J79497m1099j1715
9965B9288432J50011J75728J12799J45761K13997J56423M2357L4181P4948J9424
9955C0414061n1220M4629K31239K48414N5330j15952j24732q6813j19024j42380
$$ plain form
10025 27452565 27399910 27593344 27785453 27596387 27127205 26833425 26810378 26691627 26315050 25981216
10015 25981216 25894937 25836961 25628402 25481946 25588725 25723066 25588270 25266810 25020216 24895894
10005 24895894 24812139 24779123 24762389 24590443 24277334 24156418 24390121 24644987 24600421 24468401
9995 24468401 24591435 24828574 24851402 24802647 25067036 25534014 25722928 25607341 25677838 26114783
9985 26114783 26513689 26598930 26638618 26901542 27210256 27342360 27440714 27683797 27918269 27977104
9975 27977104 28044884 28331565 28652370 28726552 28679067 28834324 29161749 29341246 29300147 29288432
9965 29288432 29438443 29614171 29726970 29872731 30086728 30243151 30285508 30319689 30394637 30414061
9955 30414061 30362841 30407470 30638709 30887123 30942453 30826501 30701769 30614956 30495932 30353552
9945C0353552n4036O2141M3049j04836j95164j01474Q4508J80786J50652J24878
9935C0544056J83207K24857J41399K3280L8332J48825J48538J398p5520M1681
9925C1420053J67268R8641n6934p6916j3720j00884l16584l68571j81399q0830
9915C0490124l09321o17419o15873l65929k74675m57840n85366m39332k58676
9906B6565693l15661m53708l71630j63810j76176m04335m69755k45892q0590k19842
9896B3664294l95085k73480j4851l049k14872k79557r9229J5787j13545k44722
9886B2041691j27511Q8199R2026j19073k55925j48703O0825J43737N8073n1829
9876B1781510o0714p18J7793j6304M921J23759K09156J29894l2587p6578M3779
$$ plain form
9945 30353552 30299516 30361657 30404706 30299870 30104706 30003232 30087740 30268526 30419178 30544056
9935 30544056 30727263 30952120 31093519 31116799 31155131 31303956 31452494 31453892 31378372 31420053
9925 31420053 31587321 31685962 31629028 31552112 31538392 31437508 31120924 30752353 30570954 30490124
9915 30490124 30180803 29563384 28947511 28581582 28306907 27849067 27263701 26824369 26565693
9906 26565693 26250032 25796324 25424694 25260884 25084708 24680373 24210618 23964726 23884136 23664294
9896 23664294 23269209 22995729 22980878 22977829 22762957 22483400 22384171 22399958 22286413 22041691
9886 22041691 21914180 22002379 22094405 21975332 21719407 21570704 21631529 21775266 21833339 21781510
9876 21781510 21720796 21720078 21737871 21721567 21726488 21850247 22059403 22189297 22156710 22080132 22123911
9865B2123911J73175J86140J28623J03175J32274J79217K12570K08362J58722
9856B3606169J07566J20284K01280K84590L02364K32911J17763N8060J15197J79075
9846B5325259O6591j79162k71611r4388Q6523L8258m8825Q9767K71213J44277
9836B5427902j41496r5504K81211M16286P3885k38696p1271K81787L14576J10482
9826B6359162R9374K97077L35797J29602K995J54958L96609M71268L39693J19692
9816B8706227k3292N8377L21710M78624L34491R8920J12641L55088N05062M21282
9806C1369130K63807J78080J52714J74156K52191L12665L07751L61423N38744
9797C3910661N96839L24511J4569J39720N96826P89500N22284K73141M05585O38109
$$ plain form
9865 22123911 22297086 22483226 22611849 22715024 22847298 23026515 23239085 23447447 23606169
9856 23606169 23713735 23834019 24035299 24319889 24622253 24855164 24972927 25030987 25146184 25325259
9846 25325259 25391850 25212688 24941077 24846689 24933212 24971470 24922645 25012412 25283625 25427902
9836 25427902 25286406 25190902 25472113 25888399 25962284 25723588 25652317 25934104 26248680 26359162
9826 26359162 26458536 26755613 27091410 27221012 27224007 27378965 27775574 28246842 28586535 28706227
9816 28706227 28682935 28741312 29063022 29541646 29876137 29975057 30087698 30442786 30947848 31369130
9806 31369130 31632937 31811017 31963731 32137887 32390078 32702743 33010494 33371917 33910661
9797 33910661 34507500 34832011 34846580 34986300 35583126 36372626 36894910 37168051 37573636 38211745
9787C8211745N92301M12000M44959O43325P06373O13276O14225P91452R56752
9778D3986408R50412Q15203P05909P63476R98561J211996J178370R83792R61357
9769E2555484J192103J357784J255529J137359J282498J537091J611049J577169
9761F3506066J696928J947153K118051K232818K457601K698437K718305K615866
9753H1991225K763334L237512L694423L880114L933223M092426M393215M753097
9745A12738569N124047N483339N855864O358378P043846P763563Q409433R177244
9737A67954283J0269559J1452306J2324066J2948549J3694924J4420949J4403312
9730B57467948J3256881J1350553R028437O005256K018155k369103o206409r152822
$$ plain form
9787 38211745 38804046 39216046 39661005 40304330 41010703 41623979 42238204 43029656 43986408
9778 43986408 44936820 45752023 46457932 47221408 48219969 49431965 50610335 51594127 52555484
9769 52555484 53747587 55105371 56360900 57498259 58780757 60317848 61928897 63506066
9761 63506066 65202994 67150147 69268198 71501016 73958617 76657054 79375359 81991225
9753 81991225 84754559 87992071 91686494 95566608 99499831 103592257 107985472 112738569
9745 112738569 117862616 123345955 129201819 135560197 142604043 150367606 158777039 167954283
9737 167954283 178223842 189676148 202000214 214948763 228643687 243064636 257467948
9730 257467948 270724829 282075382 291103819 297109075 299127230 296758127 290551718 281398896
9722B81398896j1481196j3270983j4208502j4202370j3665078j3029806j2344109
9715A89196852j1471745j0409120r276591q211480p352020o745284o242132n677216
9707A23811264n146078m864760m761973m513329m036617l633029l507878l456855
9699H9890745l225408k909367k734094k639808k401605k054820j877732j955326
9691G0092585k041596j920929j682367j530221j493881j459847j378939j295649
9683E7289156j225076j136022j047339j022468j043200r91795q18340o48177o32307
9674D8724432p30903p52921o15291m55484m37576n32516n74144m87341l68846
9665D3769410l44629m17763m78185m27289k76381j30744p3379p2640m0664K5203
$$ plain form
9722 281398896 269917700 256646717 242438215 228235845 214570767 201540961 189196852
9715 189196852 177725107 167315987 158039396 149827916 142475896 135730612 129488480 123811264
9707 123811264 118665186 113800426 109038453 104525124 100488507 96855478 93347600 89890745
9699 89890745 86665337 83755970 81021876 78382068 75980463 73925643 72047911 70092585
9691 70092585 68050989 66130060 64447693 62917472 61423591 59963744 58584805 57289156
9683 57289156 56064080 54928058 53880719 52858251 51815051 50823256 50004916 49356739 48724432
9674 48724432 47993529 47240608 46625317 46169833 45732257 45199741 44625597 44138256 43769410
9665 43769410 43424781 43007018 42528833 42101544 41825163 41694419 41621040 41548400 41507736 41532939
9655D1532939L8089j6388j6777J15110K60048K47967J05109J3430M0493N8480
9645D2378500m5863k21326l68103m84547o17328p50379q29890q47887q31278p88949
9635C6592950p26035o69735o31291n87013n43345n61239o49674o92901n78782
9626C0952935l72192k60885l24305m42234m56537l53082k44821k23551k74317
9617B8001011l15109k85953k03650j45055j68923k45878k81534k24219j33146
9608B5997544j09947j66869k07485j63384j01054j21569j80916j32597J6688M6102
9598B4876513j56807l47098k25111P4187J04528k20608m27226j65986K14497J52100
9588B3878989k69309m26993r4495K47327J74347r3693j61362r5000j70996k92892
$$ plain form
9655 41532939 41571028 41554640 41537863 41652973 41913021 42160988 42266097 42279527 42320020 42378500
9645 42378500 42332637 42111311 41743208 41258661 40641333 39890954 39061064 38213177 37381899 36592950
9635 36592950 35866915 35197180 34565889 33978876 33435531 32874292 32224618 31531717 30952935
9626 30952935 30580743 30319858 29995553 29553319 29096782 28743700 28498879 28275328 28001011
9617 28001011 27685902 27399949 27196299 27051244 26882321 26636443 26354909 26130690 25997544
9608 25997544 25887597 25720728 25513243 25349859 25248805 25127236 24946320 24813723 24830411 24876513
9598 24876513 24719706 24372608 24147497 24221684 24326212 24105604 23678378 23512392 23726889 23878989
9588 23878989 23609680 23182687 23088192 23335519 23509866 23416173 23254811 23159811 22988815 22695923
9578B2695923j72961P1205N2768j89788j94469J43949L47330J16748j90667j70368
9568B2509670o469p2291k52252j74258J08110K02149L4533r3661p2969r7695j86174
9557B1898693j02879J30500J46250j51216l41443j34358J52938J09367j26247
9548B1581605j41961P3354J69300J8096j47103j40262l2114M8762N6540k6873
9538B1459344j61922j91089k1454J72176J41561q0796k38570k15692j19174m3425
9528B0700959J1724J8426n1288j01442l6929L5497l2738j40821q8029N0365K6283
9517B0392007j37223j72906m7070j5245j43325j83772m0923N3484j1891k2664
9507A9670472J08425J08479j49702l16530j08689J75058J15155j47793j84209
$$ plain form
9578 22695923 22522962 22594167 22646935 22457147 22262678 22406627 22753957 22870705 22680038 22509670
9568 22509670 22503201 22430910 22178658 22004400 22112510 22314659 22349192 22255531 22182562 22084867 21898693
9557 21898693 21795814 21926314 22072564 21921348 21579905 21445547 21598485 21707852 21581605
9548 21581605 21439644 21512998 21682298 21700394 21553291 21413029 21380915 21429677 21486217 21459344
9538 21459344 21297422 21106333 21084879 21257055 21398616 21317820 21079250 20863558 20744384 20700959
9528 20700959 20712683 20731109 20679821 20578379 20541450 20576947 20544209 20403388 20315359 20365724 20392007
9517 20392007 20254784 20081878 20034808 20019563 19876238 19692466 19651543 19705027 19693136 19670472
9507 19670472 19778897 19887376 19737674 19421144 19312455 19487513 19602668 19454875 19270666
9498A9270666r783p567k21064k73896j7743K29519J95859k526j56176k42404k66442
9487A8498443j42711Q9484J88591K6811k11318k88150j96737p1433Q331J2734
9477A7914045p1685j61967j23045J6377O0886n0111j31631o0524J1569p8162k07322
9466A7118430j54086L7912J14607j1845j54504j39810l6576k7560j48460k43863
9456A6354245j73499k64Q3851R459q9304r5225q7087j71952k54202j75274j1063
9445A5389685K3174o0441m4218P7747M1732k04577l09891m4275K76683K15424
9435A5361043j41216l22483j54480P0450R1119q329n7224p1219j21304j47080
9425A4499277p3986J4506j5362j33008j73075o6033N9980L6840j28313k43998
$$ plain form
9498 19270666 19260883 19253316 19032252 18758356 18740613 18970132 19165991 19163465 19007289 18764885 18498443
9487 18498443 18355732 18445216 18633807 18660618 18449300 18161150 17964413 17892980 17901311 17914045
9477 17914045 17842360 17680393 17557348 17573725 17634611 17584500 17452869 17392345 17403914 17325752 17118430
9466 17118430 16964344 17002256 17116863 17105018 16950514 16810704 16774128 16746568 16598108 16354245
9456 16354245 16180746 16180482 16264333 16273792 16184488 16089263 16002176 15830224 15576022 15400748 15389685
9445 15389685 15412859 15352418 15308200 15385947 15427679 15223102 14913211 14868936 15145619 15361043
9435 15361043 15219827 14897344 14742864 14813314 14904433 14896104 14838880 14767661 14646357 14499277
9425 14499277 14425291 14439797 14424435 14291427 14118352 14052319 14112299 14149139 14020826 13776828
9415A3776828j60846L0147J01770r880j26365r7525j6160m4593j43214j50507
9405A3159655p0080o7783j78611k25753j03634L4748k178j57094k07868q5669
9395A2095733M4855L6665m3229m7371J3203P57r5799j10284J9810Q9581p5705
9384A1928216k83001k07173P1305J09935k17887m47750j75306L10345M07981M4794
9374A1541459k77724k26342p430O5612o645p9322j42060k12153j79359O790J54793
9363A0637619P0398j29366j68754j4696J00445M0919o7905q2392n5205r7499j59696
9352A0073868j04383N0004J19364K1672q4344l3714P3267J1214j88659k27364
9342I710925J1758K29254J14528j86672k74515p7161P5409k7716j87109j38449
$$ plain form
9415 13776828 13615982 13646129 13747899 13738019 13611654 13514129 13497969 13453376 13310162 13159655
9405 13159655 13089575 13021792 12843181 12617428 12513794 12548542 12546364 12389270 12181402 12095733
9395 12095733 12140588 12177253 12134024 12086653 12099856 12100613 12004814 11894530 11914340 12003921 11928216
9384 11928216 11645215 11438042 11509347 11619282 11401395 10953645 10778339 11088684 11496665 11541459
9374 11541459 11263735 11037393 11029963 11095575 11088930 11009608 10867548 10655395 10476036 10482826 10637619
9363 10637619 10708017 10578651 10409897 10395201 10495646 10536565 10468660 10386268 10331063 10233564 10073868
9352 10073868 9969485 10019489 10138853 10160525 10076181 10042467 10115734 10126948 9938289 9710925
9342 9710925 9722683 9951937 10066465 9879793 9605278 9528117 9603526 9575810 9388701 9250252
9332I250252N5424J40351M5689o7838o5847J1043M4725r501p7931n1790O3623
9321I338200J08627l9844k60702l02341j11432R7223J30570K5688p8970j20966
9311H786053r1915L587P7272j274j86935k34387k2186K33492K42410J6266j73824
9300H648559j48055J2743J08375K7552j51936k19056n2439J88105K16590K516
9290H632954j74437j23219P105J14j04248j32773n7000L8134J15937J39759K0848
9279H363174j95959k63822o5313J58964J45811j0012p3072n9719q8562m5178J93006
9268H059318L61089J24658k92640l36559K0572K18623P143j85136j4045K06336
9258H169359P4089k10887k04399M5616J27468l8835j25093K5198J69506Q7431
$$ plain form
9332 9250252 9305676 9446027 9491716 9423878 9358031 9369074 9413799 9404298 9326367 9274577 9338200
9321 9338200 9446827 9406983 9146281 8843940 8732508 8829731 8960301 8985989 8907019 8786053
9311 8786053 8694138 8697725 8774997 8773723 8586788 8352401 8330215 8563707 8806117 8822383 8648559
9300 8648559 8500504 8513247 8621622 8649174 8497238 8278182 8225743 8413848 8630438 8632954
9290 8632954 8458517 8335298 8342403 8342517 8238269 8105496 8048496 8086630 8202567 8342326 8363174
9279 8363174 8167215 7903393 7838080 7997044 8142855 8132843 8059771 8000052 7911490 7866312 8059318
9268 8059318 8420407 8545065 8252425 7915866 7936438 8155061 8162204 7977068 7963023 8169359
9258 8169359 8243448 8032561 7828162 7873778 8001246 7962411 7837318 7862516 8032022 8119453
9248H119453r2902j15954M7109J86138J16820j02608k19828q3436J39124J63615
9238H157531k287o1189J14784K82010K10522J8763o5200n0285o3465p8533j1683
9227H450968O6078M8788j0957m0635j14585k61054k97706j20160M7800j0299j27083
9216G631155n4123P2750j2867j76534r6755J16636O5891k18515k84468k3729J53857
9205G173298L6534p5652K4581R2681m2680j21466L2241J20986q8322k73503q0289
9194F798409K30483J86485j24593k37035o8802M7350j8496p1758l9630m8707p1605
9183F582101M3891J93740J17124j10855j44829L8990R4784p7211j68270m6748
9173F522717P855j31813j51101J25973L31780J29664j92730j66113J17163K01222
$$ plain form
9248 8119453 8026551 7910597 7957706 8143844 8260664 8158056 7938228 7854792 7993916 8157531
9238 8157531 8155244 8094055 8208839 8490849 8701371 8720134 8654934 8604649 8541184 8462651 8450968
9227 8450968 8517046 8565834 8554877 8514242 8399657 8138603 7840897 7720737 7768537 7758238 7631155
9216 7631155 7577032 7649782 7636915 7460381 7363626 7480262 7546153 7327638 7043170 7019441 7173298
9205 7173298 7209832 7134180 7158761 7251442 7208762 7087296 7119537 7240523 7152201 6878698 6798409
9194 6798409 7028892 7215377 7090784 6853749 6784947 6832297 6813801 6742043 6702413 6653706 6582101
9183 6582101 6625992 6819732 6936856 6826001 6681172 6720162 6814946 6737735 6569465 6522717
9173 6522717 6530572 6398759 6247658 6373631 6705411 6835075 6642345 6476232 6593395 6794617
9163F794617J4844r4309P187O7972n5858j67382r1389O5611J37599J19792O3448
9152F862132k7765j05968p8334K6832O9295K2299N613N2859N0706l0967o1430
9141F785272J1787N1901k6470r4762k6529Q1617N8485q2140j69072r4427Q2008
9130F577670J89818Q0684j95895l52736j66037J78613K67188K4560j76947p6932
9120F349986J17895J23249J1562j1876Q038n4011q2614N7092J70287K0965j84303
9109F526270p1386K36445K50721q8831k97956j20674J16645J06706O604K0395
9099F684939J0369j40183j96518P280J83953N6737j16752L4082L14614K52326
9089G090847j05577k53841l6421J58084N5185j45817j85507r8256j2799N1611
$$ plain form
9163 6794617 6809461 6715152 6722339 6790311 6734453 6567071 6475682 6541293 6678892 6798684 6862132
9152 6862132 6834367 6728399 6650065 6676897 6746192 6768491 6774104 6826963 6877669 6846702 6785272
9141 6785272 6797059 6848960 6822490 6727728 6701199 6782816 6841301 6759161 6590089 6495662 6577670
9130 6577670 6767488 6848172 6652277 6299541 6133504 6312117 6579305 6603865 6426918 6349986
9120 6349986 6467881 6591130 6602692 6590816 6598854 6544843 6462229 6519321 6689608 6710573 6526270
9109 6526270 6454884 6691329 6942050 6853219 6555263 6434589 6551234 6657940 6664544 6684939
9099 6684939 6695308 6555125 6358607 6365887 6549840 6606577 6489825 6523907 6838521 7090847
9089 7090847 6985270 6731429 6695008 6853092 6908277 6762460 6576953 6478697 6465898 6517509
9079F517509O5609k2494r0855M3082K44506J64000j81088l37621j03601J32715
9069F431762Q918k36599j70805J37740K51731M5446j55634r3371R5910J37115
9059F452213j5809j61801j18861M8075R4146p0966k07049o9519J77955J69439
9049F297823p5737j60133L3039J37724n4392k14751m8901J80145J10745r4271
9039F111291o2475J33241J53601J6947N066R1233J4123j63143j25483R1425J22754
9028F388580q2253j82441o5076J393p0066k3696J86151K28767k572j45036J9236
9017F252987J93296J03176o1523p0664o8622j99381k38531j0981K01416J06059
9007F207232q5309l8792J18893P9748o5002l4196Q7883K9863j24334r8645L4204
$$ plain form
9079 6517509 6583118 6560624 6469769 6512851 6757357 6921357 6740269 6402648 6299047 6431762
9069 6431762 6440680 6204081 6033276 6171016 6422747 6468193 6312559 6219188 6315098 6452213
9059 6452213 6436404 6274603 6155742 6203817 6297963 6226997 6019948 5950429 6128384 6297823
9049 6297823 6222086 6061953 6094992 6232716 6178324 5963573 5914672 6094817 6205562 6111291
9039 6111291 6048816 6182057 6335658 6352605 6357671 6448904 6463027 6299884 6174401 6265826 6388580
9028 6388580 6306327 6123886 6058810 6060203 5990137 5966441 6152592 6381359 6378787 6233751 6252987
9017 6252987 6446283 6549459 6487936 6417272 6348650 6149269 5910738 5899757 6101173 6207232
9007 6207232 6121923 6083131 6202024 6281772 6216770 6182574 6270457 6300320 6175986 6077341 6111545
8996F111545Q705q9047L679J44301l253k68931j71281K04924K61609r1727k40741
8985E869783Q1295L11828K1586l43227k22585J30042J27153j66207k20398L8215
8975E627485J82654N5505n3365k122N881r4687o7971J43160K24922P358k00771
8964E828049p5789K00879K14341n5538k20754o9991J45275J09806r9785j60648
8954E815845J176J17946J9414r1684J8679K02024J50198p8386j28874N2862J12767
8943F191967r6951k28819k6593J98582O8507k05780j58935J47678K35712J6433
8933F141801r7227O5802J56860m3086k21885q1395J53440J38423k5916m5725K3240
8922F164332n7927j84183m3418K81557L43957K4938k56634j77080M7662Q1085
$$ plain form
8996 6111545 6120250 6031203 6034882 6179183 6175930 5906999 5735718 5940642 6202251 6110524 5869783
8985 5869783 5951078 6262906 6284492 5941265 5718680 5848722 5975875 5809668 5589270 5627485
8975 5627485 5810139 5865644 5812279 5810157 5816038 5721351 5653380 5796540 6021462 6028820 5828049
8964 5828049 5752260 5953139 6167480 6111942 5891188 5821197 5966472 6076278 5976493 5815845
8954 5815845 5817021 5934967 5954381 5862697 5881376 6083400 6233598 6155212 6026338 6079200 6191967
8943 6191967 6095016 5866197 5839604 6038186 6106693 5900913 5741978 5889656 6125368 6141801
8933 6141801 6044574 6110376 6267236 6224150 6002265 5920870 6074310 6212733 6186817 6141092 6164332
8922 6164332 6106405 5922222 5878804 6160361 6504318 6529256 6272622 6095542 6143204 6224289
8912F224289q891L8696J80790J60767j4009o5921P3821J33937l7674j89831n4178
8901F441796K06236K18504l6049j90329m1339J59828J00496j33009k02075p499
8891F516560K02380K01532N3520n0641n8851n3037p2642o3818J7033J29195J83790
8880G005021J25535q309r8065m8131R4690J73441J02125l3213r5077o3079j7896
8869G137042K10K5532O6250O5753K670m1023K0735J38328J57540Q829j81338k14281
8857G186247m6204J55487K04446J05131K1997O0208J49977J66069Q9140m561n8867
8846H029070o7995k4020P4602J63452J52945N4970j1723J8392P1434O3947L7053
8835H562127P0452J25770R7045o069n2632J9467J21334J51177J12305N5388J560
$$ plain form
8912 6224289 6215398 6254094 6434884 6595651 6581642 6515721 6589542 6723479 6685805 6495974 6441796
8901 6441796 6648032 6866536 6830487 6640158 6598819 6758647 6859143 6726134 6524059 6516560
8891 6516560 6718940 6920472 6973992 6923351 6864500 6811463 6738821 6675003 6692036 6821231 7005021
8880 7005021 7130556 7122247 7024182 6976051 7070741 7244182 7346307 7313094 7218017 7154938 7137042
8869 7137042 7137252 7162784 7229034 7294787 7297457 7256434 7277169 7415497 7573037 7581866 7400528 7186247
8857 7186247 7140043 7295530 7499976 7605107 7627104 7687312 7837289 8003358 8092498 8087937 8029070
8846 8029070 7961075 7937055 8011657 8175109 8328054 8383024 8371301 8389693 8461127 8525074 8562127
8835 8562127 8632579 8758349 8855394 8849325 8796693 8816160 8937494 9088671 9200976 9256364 9257924
8824I257924l0436j3920K1578J0949k2519J6047J05436R6386k9175p6053M5904
8813I382121J26509l037j28241L6661L31560L31444L651k27935j25778O5749R6815
8802I889519Q0250J66151K13599Q0669n3183J7487J42140P1682r2601o9953J17511
8791A0563271J98933J05248J8242K5107M9629Q1350J59597J81193M3228q5532
8781A1340266J6653K01516J45206p9500q6585J53832K40877M3254n6584J63254
8771A2082189L49381J61171j49138j43598J25351K56512J09825r5649j53061l6562
8761A2506421J74799L08133J92179o1739r7620J64491L41698J78526k6428O3550
8751A3744010K43380J65345j1339O4896K38798J16571j43421l7739L42283L61400
$$ plain form
8824 9257924 9227488 9213568 9235146 9246095 9223576 9239623 9345059 9441445 9412270 9336217 9382121
8813 9382121 9508630 9505593 9377352 9414013 9745573 10077017 10080668 9852733 9726955 9792704 9889519
8802 9889519 9969769 10135920 10349519 10430188 10377005 10394492 10536632 10608314 10515713 10445760 10563271
8791 10563271 10762204 10867452 10885694 10910801 10960430 11041780 11201377 11382570 11425798 11340266
8781 11340266 11356919 11558435 11703641 11624141 11537556 11691388 11932265 11975519 11918935 12082189
8771 12082189 12431570 12592741 12443603 12300005 12425356 12681868 12791693 12696044 12542983 12506421
8761 12506421 12681220 12989353 13181532 13119793 13022173 13186664 13528362 13706888 13680460 13744010
8751 13744010 13987390 14152735 14141396 14206292 14445090 14561661 14418240 14380501 14722784 15084184
8741A5084184p5564k83614R7078M98153L42508o9849j28977J27147K23365Q1778
8731A5896209L5334J81795K73537J90983P7787K7764L757L7293J80289K98031
8721A7202779K23043O9414Q1802K19562K25297Q2141M3392J78170K49400J38204
8711A8713204N3760J66185L17995K99295J83474J64762K26189K10442J28254J53797
8701B0617357L22831M44907L74455K16416J64681K37434L02033L12316L53573
8692B3346003M24032L59770J13518m5659J54977N47789O75299M10293J34574J87884
8682B6308480M18189M79393L47419K76064L82283N46528O55040P02485O91014
8673C0806895O31509O15025P05836Q05167P87689P10996P11659P67761P65936
$$ plain form
8741 15084184 15008620 14725006 14822084 15320237 15662745 15592896 15463919 15591066 15814431 15896209
8731 15896209 15931543 16113338 16386875 16577858 16655645 16683409 16687166 16724459 16904748 17202779
8721 17202779 17425822 17495236 17577038 17796600 18021897 18104038 18147430 18325600 18575000 18713204
8711 18713204 18766964 18933149 19251144 19550439 19733913 19898675 20124864 20335306 20463560 20617357
8701 20617357 20940188 21385095 21759550 21975966 22140647 22378081 22680114 22992430 23346003
8692 23346003 23770035 24129805 24243323 24197664 24352641 24900430 25575729 25986022 26120596 26308480
8682 26308480 26726669 27206062 27553481 27829545 28211828 28758356 29413396 30115881 30806895
8673 30806895 31438404 32053429 32759265 33564432 34352121 35063117 35774776 36542537 37308473
8664C7308473P31481P68128Q33661Q19184P94038Q99329J038983R87024P99657
8655D4979958P80434R79491J076901Q85623O32212N51253N11870L02122K9110
8646E0728974p7016r0137k83371o63017r24066r00388p99315q87359j120192j223410
8636D3760703j060060p85844o37870o68082p47811p76727p68651p28395n99592
8627C6987671m17973l63270n07596o39229n30862k78983j47931j67095j61556
8618C3773176j22071k08524l80912l91717k27162j95860m31434o46277n80515
8609C0588704l88739l39723m03494m09113l82520m34269m92649m38034l56121
8600B6944042l83837m41354l90789l26590m12579n40855m68218k28868j04164
$$ plain form
8664 37308473 38039954 38808082 39641743 40460927 41254965 42154294 43193277 44180301 44979958
8655 44979958 45760392 46739883 47816784 48702407 49334619 49885872 50397742 50699864 50728974
8646 50728974 50651958 50561821 50278450 49615433 48691367 47790979 46991664 46104305 44984113 43760703
8636 43760703 42700643 41914799 41276929 40608847 39861036 39084309 38315658 37587263 36987671
8627 36987671 36569698 36206428 35698832 35059603 34528741 34249758 34101827 33934732 33773176
8618 33773176 33651105 33442581 33061669 32669952 32442790 32246930 31815496 31169219 30588704
8609 30588704 30199965 29860242 29456748 29047635 28665115 28230846 27738197 27300163 26944042
8600 26944042 26560205 26118851 25728062 25401472 24988893 24448038 23979820 23750952 23646788
8591B3646788k01971l43725l72980l30239l02752l05422l27903l45714l05890
8582B0810192k26386k25931l19958l30037j75194p2177k02715l70778k99138r4241
8572A8493637n3076j52616j41892l4574n9471j82408j54676j9049o5304k60023
8562A7370548k58196o0095p8643l88333n06676k00493P1466r0249l60456k67446
8552A5231427M903k6657k99053l36071o5055R8382n0754k48838k52902j50085
8542A3905297r0000o2216l7876n4568q7056o4032m2973j39915k77251k46734m5190
8531A2757486R4831M6307o9050j25211j59936k26335k62147j96678o5641L9664
8521A1833290N6869j8864j16226j35931r1522j12172k10673j95339K7694K24582
$$ plain form
8591 23646788 23444817 23101092 22728112 22397873 22095121 21789699 21461796 21116082 20810192
8582 20810192 20583806 20357875 20037917 19707880 19532686 19460509 19257794 18887016 18587878 18493637
8572 18493637 18440561 18287945 18146053 18111479 18052008 17869600 17714924 17695875 17630571 17370548
8562 17370548 17112352 17052257 16973614 16585281 16078605 15878112 15949578 15859329 15498873 15231427
8552 15231427 15236330 15209673 14910620 14574549 14509494 14607876 14557122 14308284 14055382 13905297
8542 13905297 13815297 13753081 13715205 13660637 13573581 13509549 13466576 13326661 13049410 12802676 12757486
8531 12757486 12852317 12898624 12829574 12704363 12544427 12318092 12055945 11859267 11793626 11833290
8521 11833290 11890159 11871295 11755069 11619138 11527616 11415444 11204771 11009432 11037126 11261708
8511A1261708J32552j42518k83502k09471r3438k9892J7146J0359j00418j69218
8501A0393308k9610J68277J38984o3443j29419k5236j5979j43809j51076k531
8491A0139466O565j85403k32214K666J46727m8490k38764o0308K27526J60927
8481I918698j66439k88195j18402J2638k4146k6911N5108M426k09315k84151n8583
8470H814728K03971J95135j7085j39772o6431M0977O168j49776k42365j37419
8460H508131P1634J55430M6850o9699m7715K225o2609j38867n7608Q6119P1968
8449H565859n3059m0747J13910J31877q2470k52864j48738P1400J14036m5744
8439H373460k01210k17618j22277J6543J37164J58310M1710j25952j99693j27754
$$ plain form
8511 11261708 11394260 11251742 10968240 10758769 10665331 10635439 10652585 10662944 10562526 10393308
8501 10393308 10363698 10531975 10670959 10607516 10478097 10452861 10436882 10293073 10141997 10139466
8491 10139466 10146031 9960628 9728414 9731080 9877807 9829317 9590553 9530245 9757771 9918698
8481 9918698 9752259 9464064 9345662 9358300 9334154 9307243 9362351 9366777 9157462 8873311 8814728
8470 8814728 9018699 9213834 9196749 9056977 8990546 9031523 9037691 8887915 8645550 8508131
8460 8508131 8579765 8735195 8782045 8712346 8664631 8666856 8604247 8465380 8407772 8493891 8565859
8449 8565859 8512800 8472053 8585963 8717840 8635370 8382506 8233768 8305168 8419204 8373460
8439 8373460 8172250 7954632 7832355 7848898 7986062 8144372 8186082 8060130 7860437 7732683
8429G732683M126O9550K1372p2204j08172o9337k9118k3178J484N6723M2474q3742
8417G542661j69617o1972J30816J58203j5969j65002j20911K5003Q5514J1727
8407G420453q5102p2488N4518J33001R608k03492k07916M4058K10302N3838j64693
8396G192087r8638J05725O7244j54300j64079M5683O8110j62625k10490P1086
8386F759803K10486p4559l18848n4066L61285K71909k25368m32003j15610K22164
8376F605193J72423o4730j42470p6272n5096p4498j8023Q4513R8114l831j06246
8365F419077r7532J4438J12597R4106n878o6325o2988p9855j12893m8307Q9100
8354F255540R5594p0580j58904k3926J13183M3069o9279j0000P0993m1986j69881
$$ plain form
8429 7732683 7736809 7806359 7827731 7755527 7647355 7578018 7548900 7525722 7527206 7583929 7626403 7542661
8417 7542661 7373044 7311072 7441888 7600091 7584122 7419120 7298209 7323212 7408726 7420453
8407 7420453 7335351 7262863 7317381 7450382 7459990 7256498 7048582 7092640 7302942 7356780 7192087
8396 7192087 7093449 7199174 7266418 7112118 6948039 6993722 7061832 6899207 6688717 6759803
8386 6759803 6970289 6895730 6576882 6522816 6884101 7156010 6930642 6498639 6383029 6605193
8376 6605193 6777616 6712886 6570416 6494144 6439048 6364550 6346527 6431040 6529154 6525323 6419077
8365 6419077 6321545 6335983 6448580 6542686 6536808 6470483 6407495 6327640 6214747 6166440 6255540
8354 6255540 6351134 6280554 6121650 6097724 6210907 6253976 6184697 6174697 6245690 6203704 6033823
8343F033823l3304J96733J54262p0243r4867M2605l8251k96130k54350J52105
8333E792383L83716J53944j44119j38904k1481n7504j06829j2019L2046r6235
8323E784998j20219J05265K07690p5605l40046j45770K08474J82698q6625q3111
8313E637749J38326Q3037k31775k68142P5318K75250Q2963j11013k5967O8742
8303E724488m3480j01633P9015J72596q8324l57826j95092J95749K72352j3299
8293E644546k11350j04626N0427K9495m4039q167M4788k7382j29644o3105J38649
8282E319592K11258L3122j62681r3471J40108J65294q7237k23030J2426K76555
8272E591936J33351k21565k37222R9640K36707k4586k02241M0812L20722J72858
$$ plain form
8343 6033823 6000519 6197252 6351514 6281271 6186404 6229009 6190758 5894628 5640278 5792383
8333 5792383 6176099 6330043 6185924 6047020 6025539 5968035 5861206 5849187 5881233 5784998
8323 5784998 5664779 5770044 5977734 5902129 5562083 5416313 5624787 5807485 5720860 5637749
8313 5637749 5776075 5859112 5627337 5359195 5434513 5709763 5792726 5681713 5655746 5724488
8303 5724488 5681008 5579375 5658390 5830986 5742662 5384836 5189744 5385493 5657845 5644546
8293 5644546 5433196 5328570 5378997 5408492 5364453 5356286 5401074 5373692 5244048 5180943 5319592
8282 5319592 5530850 5563972 5401291 5307820 5447928 5613222 5525985 5302955 5315381 5591936
8272 5591936 5725287 5503722 5266500 5366140 5602847 5578261 5376020 5416832 5737554 5910412
8262E910412j95003k71007l2134J35299R1019K5968K3000j1306m8581J9047R2836
8251E739550J086j40036p8794J14887J44541M212k5429R8322J08872n1688r7474
8240E818049Q0910J91487M0286j28529m5806J53056J92122Q5803J8379L639m8487
8229F360909q7844k2136O1320K3747p1038o2019L1386N7954j684k6999K8071R1964
8217F383631J11305Q2696M489o7897p504J86320K82323J08865j45217j62203L7257
8206F814065J37367K5902n7908N1081J66451P0140j17350j22644N2944J45401
8196G165449L8852p3639q068J18711O9145j32544j94293L3346L09599L00247K7625
8185G654430j59798n6458J56340K01416O5834o1151q3580o1206l4599M1477J79977
$$ plain form
8262 5910412 5715409 5444402 5412268 5547567 5638586 5664554 5687554 5676248 5627667 5646714 5739550
8251 5739550 5740636 5600600 5521806 5636693 5781234 5785446 5760017 5858339 5967211 5915523 5818049
8240 5818049 5898959 6090446 6130732 6002203 5956397 6109453 6301575 6387378 6405757 6409396 6360909
8229 6360909 6273065 6250929 6312249 6335996 6264958 6202939 6234325 6292279 6290595 6263596 6291667 6383631
8217 6383631 6494936 6577632 6582121 6514224 6506720 6693040 6975363 7084228 6939011 6776808 6814065
8206 6814065 6951432 6977334 6919426 6970507 7136958 7207098 7089748 6967104 7020048 7165449
8196 7165449 7204301 7130662 7122594 7241305 7310450 7177906 6983613 7016959 7326558 7626805 7654430
8185 7654430 7494632 7438174 7594514 7795930 7861764 7800613 7717033 7655827 7621228 7662705 7842682
8174G842682K97627L02996J89791L6236n5033m2007O872K027j3597Q8814K78352
8163H934760L24399J20139j08364r2512J06577K27243K01990J69427J62155P7902
8153A0123716m3076j4807J63070K53150J53052N5683J16107K12025J90080J16489
8143A1325489J03625J01726N9126Q5900K37957L30333K13687O0440R7390K14968
8133A2830641J64056Q938J1365J41600J19450o0477q2966J21326J99638m5201
8123A3408370k95400k06723P0835J82218J14921R6897J41153Q4715k7964O695
8113A3575717J59065J95685J04122J18038K70509L02892J34441M7973K13566L73516
8103A5495524K71943R8237J58054L34848K92733Q3274R0020L70055N07342K55769
$$ plain form
8174 7842682 8140309 8443305 8633096 8669332 8614299 8572292 8579164 8581191 8567594 8656408 8934760
8163 8934760 9259159 9379298 9270934 9178422 9284999 9512242 9714232 9883659 10045814 10123716
8153 10123716 10080640 10065833 10228903 10482053 10635105 10690788 10806895 11018920 11209000 11325489
8143 11325489 11429114 11530840 11589966 11675866 11913823 12244156 12457843 12518283 12615673 12830641
8133 12830641 12994697 13003635 13015000 13156600 13276050 13215573 13132607 13253933 13453571 13408370
8123 13408370 13112970 12906247 12977082 13159300 13274221 13371118 13512271 13596986 13569022 13575717
8113 13575717 13734782 13930467 14034589 14152627 14423136 14726028 14860469 14908442 15122008 15495524
8103 15495524 15767467 15865704 16023758 16358606 16651339 16734613 16824633 17194688 17702030 17957799
8093A7957799o8734p5006J31995J72813j3868j42629o8650K2147n4683k16924
8083A7644260k81970k25741j60789j56102j79447j73005j21824o5189n8148r7081
8073A6124964r8683n658J09325J24320L9092k9834k2249Q742K6136O8125J34929
8062A6479209J46564Q6183O2872J34713J86338J09899L758K7490J32999J33828
8052A7503853J4457l7007O9659J90493J80399Q5492Q197n6433j27968j34560n2777
8041A7643805k2710j41936k58533j91078o7139j64139m36409n20392k83710m9675
8031A5508084j05168k71926k27974l2680K319j61939k61108j91245j39047j93698
8021A3925618j76548K904J27262J3450j69041j64088k6256J2321o3654p8109j2021
$$ plain form
8093 17957799 17889065 17814059 17946054 18118867 18104999 17962370 17893720 17915867 17861184 17644260
8083 17644260 17362290 17136549 16975760 16819658 16640211 16467206 16345382 16280193 16222045 16124964
8073 16124964 16026281 16020623 16129948 16254268 16293360 16263526 16241277 16250019 16276155 16344280 16479209
8062 16479209 16625773 16711956 16774828 16909541 17095879 17205778 17209536 17237026 17370025 17503853
8052 17503853 17518310 17481303 17550962 17741455 17921854 18007346 18015543 17959110 17831142 17696582 17643805
8041 17643805 17621095 17479159 17220626 17029548 16962409 16798270 16361861 15841469 15557759 15508084
8031 15508084 15402916 15130990 14903016 14870336 14872655 14710716 14449608 14258363 14119316 13925618
8021 13925618 13749070 13751974 13879236 13892686 13723645 13559557 13533301 13545622 13481968 13403859 13391838
8010A3391838l6258j95480l15118k70060j40393m8122j8005m9272j52704k56192
8000A1910234k33099r4313j2500r0414k34389l13186l10055k63194j91965j39083
7990A0028036j51542j74048j10053k0426o8027k15663k22791m6043L1604j47280
7980H903767l09663j73217O0895k979l15998m40226k11286N2580O9420l9680n1254
7969G542359r741q0255k20937k30051m6105J61508J85436j0591k52718l11212
7959F727693j44049L4059R636j50853k14025j19570j8836M81K493N554n7937j39845
7947E934801r3477L3718M586j95550k53788k0948J91447P0334k00102k28386j5370
7936E227265J03461O982r3511n7865L575j6012p2797j19515j56444j19416L8447
$$ plain form
8010 13391838 13355580 13160100 12844982 12574922 12434529 12386407 12368402 12319130 12166426 11910234
8000 11910234 11677135 11582822 11570322 11479908 11245519 10932333 10622278 10359084 10167119 10028036
7990 10028036 9876494 9702446 9592393 9571967 9503940 9288277 9065486 9019443 9051047 8903767
7980 8903767 8594104 8420887 8481782 8478803 8162805 7722579 7511293 7563873 7633293 7593613 7542359
7969 7542359 7532618 7452363 7231426 7001375 6955270 7116778 7302214 7291623 7038905 6727693
7959 6727693 6583644 6617703 6627339 6476486 6262461 6142891 6124055 6124536 6127029 6132583 6074646 5934801
7947 5934801 5841324 5875042 5879628 5684078 5430290 5409342 5600789 5671123 5471021 5242635 5227265
7936 5227265 5330726 5337708 5244197 5186332 5189907 5173895 5101098 4981583 4825139 4705723 4744170
7925D744170J55479L1531k00849j98511M5049J37116r3000k82926r8171K15358
7915D455246J92725j40279l16618j20159J48816J54071l8171j43698p9863j3344
7905D098726o3915j29186m8882J38349K07855M6899j62172j74466l1225J3957
7895C895940r3331j22359L2994J31774k7001k29055j51801J06183J55334p7755
7885C620923k43975j23173P0043P6132j8012o46P8786J8990j63365k44959j36346
7874B934398K1801J02491J24179J07670p22j78303k54808j16572J08262J88890
7864C037286P0826q7365j32622p2951p491J1253J894j0750l1703o9376j01867
7853B607134q8604k3118L7272K7296l3064n0790L24J5470q3363j79135r0649J29342
$$ plain form
7925 4744170 4899649 4931180 4730331 4531820 4576869 4713985 4620985 4338059 4239888 4455246
7915 4455246 4647971 4507692 4191074 4070915 4219731 4373802 4335631 4191933 4112070 4098726
7905 4098726 4034811 3905625 3856743 3995092 4202947 4249846 4087674 3913208 3881983 3895940
7895 3895940 3802609 3680250 3713244 3845018 3818017 3588962 3437161 3543344 3698678 3620923
7885 3620923 3376948 3253775 3323818 3399950 3381938 3381292 3460078 3479068 3315703 3070744 2934398
7874 2934398 2956199 3058690 3182869 3290539 3289817 3111514 2856706 2740134 2848396 3037286
7864 3037286 3108112 3020747 2888125 2815174 2807683 2818936 2820830 2810080 2778377 2709001 2607134
7853 2607134 2518530 2495412 2532684 2559980 2526916 2476126 2476450 2491920 2408557 2229422 2138773 2268115
7841B268115K03364J2064k05005j79136L465O4136j9390j1556J38581J71320n0160
7830B395798k64222j84657N8548J23811k5078j09891n161R5808L7068n4772j5187
7819B052065Q1264O7075l7149q1496m7220n3718j25309j34527j8775R4335O2488
7808A859033o7105j30185o9904J7513M6463M0941M2558K2842m0578p7979k1539
7797A622060N8734L4122p9327j26143m0253O1637O2511l129m5934n0748k9602
7786A463928L3147R3845L7049j28623j95177l2975J78331J84186J2728j14508
7776A531931j29744j25082r1356N0032J86643J12010r8571j44864J1593P6177
7766A378769o3509j42257j3405O5496q2966j75515M8893L00444J66659j75595
$$ plain form
7841 2268115 2471479 2483543 2278538 2099402 2102867 2167003 2147613 2136057 2274638 2445958 2395798
7830 2395798 2131576 1946919 2005467 2129278 2104200 1994309 1989148 2084956 2122024 2067252 2052065
7819 2052065 2133329 2200404 2163255 2081759 2034539 1980821 1855512 1720985 1702210 1796545 1859033
7808 1859033 1791928 1661743 1591839 1609352 1655815 1696756 1739314 1762156 1721578 1643599 1622060
7797 1622060 1680794 1714916 1635589 1509446 1469193 1530830 1593341 1590212 1544278 1493530 1463928
7786 1463928 1497075 1590920 1627969 1499346 1304169 1271194 1449525 1633711 1646439 1531931
7776 1531931 1402187 1277105 1185749 1235781 1422424 1534434 1435863 1290999 1302592 1378769
7766 1378769 1315260 1173003 1159598 1225094 1142128 966613 1015506 1315950 1482609 1307014
7756A307014k15772O0666J75270l2551j83719m8405J01967M0269k4071J02500
7746A283168J87494j2995k71613k31203K4012J52602J15106J18046J40795j4610
7736A490802k51927k32905M9542J93780J2205j77767q8019Q4209K8257j40369
7726I67808q3993J72309K52602R652k53559k30013j0381J12108N8544k462M0017
7715A032632Q6656Q348j40244j73919j9519J69850J85638J8087j31198j06357
7705I29974J1239L5299n9510j16745m1110O1144M8374m0938m8573N7684J18967
7694I55805N253j85293k30878o4259J41540J91138R8302K9323N3675O1455m0455
7683A015606j58005j36105M437Q9225M4001j5270J1502N1985N181p5031p5503
$$ plain form
7756 1307014 1091242 1151908 1327178 1294627 1110908 1062503 1164470 1204739 1180668 1283168
7746 1283168 1470662 1457667 1186054 954851 978863 1131465 1246571 1364617 1505412 1490802
7736 1490802 1238875 1005970 1055512 1249292 1261497 1083730 995711 1079920 1108177 967808
7726 967808 883815 1056124 1308726 1318378 1064819 834806 824425 936533 995077 992615 1032632
7715 1032632 1119288 1127636 987392 813473 793954 963804 1149442 1167529 1036331 929974
7705 929974 941213 976512 917002 800257 759147 820291 868665 827727 779154 836838 955805
7694 955805 961058 775765 544887 480628 622168 813306 911608 940931 994606 1056061 1015606
7683 1015606 857601 721496 725933 815158 859159 843889 855391 907376 912557 837526 762023
7672G62023k3181k9513p7641l9947R0014J56503P4753m7081p8847k6396M3235
7661H03922J01007J12875L6197o7029o3917K1931Q74j52038j80785M6856K45829
7650I05722J08935j88449k37194l0672O4882n4808q6890J02712K14189L1493j90887
7639F39033j46018M1267P9692O839N1449J79193J60709j574p8962j0943L6511
7628I57196l074k2493j279m1399j16258p8087L9400K3393j41248j99557m2125
7617C74469J04283O0039j7271N7901J47641K8269j88780j84866P9133K86586J99077
7606I46481m9589j64091n3691R9977Q8471p5313j80274q9622P6641J18365M8515
7595G65870L7304Q8159J6334j88169k52902m1002J74746R8317j28789j50533N5014
$$ plain form
7672 762023 738842 709329 631688 591741 681755 838258 913011 865930 787083 760687 803922
7661 803922 904929 1017804 1054001 986972 923055 944986 945860 793822 613037 659893 905722
7650 905722 1014657 826208 589014 558342 623224 568416 481526 584238 798427 829920 639033
7639 639033 493015 534282 613974 620813 672262 851455 1012164 1010590 931628 920685 957196
7628 957196 954122 931629 930350 888951 772693 694606 734006 757399 616151 416594 374469
7617 374469 478752 538791 521520 579421 727062 755331 566551 381685 460818 747404 946481
7606 946481 896892 732801 679110 779087 867558 792245 611971 522349 598990 717355 765870
7595 765870 803174 891333 907667 719498 466596 425594 600340 698657 569868 419335 474349
7584D74349J81154Q7736m4061o4226m7143o5152m7921K9917O0503J4018J7801
7573E96975J04215R9360q2290k35800j52571N3974J24711L5459k6337J3007M6354
7562E77057J8886Q960N4951Q3204M8007l788l9557p5282q2255j3065M9212m8523
7550E77807k47378k57684L1163L05776K19727r4483j93431L1826K08058O6345
7540F47726j46959p5810J70249J84380r5304k83041j29443J28207J56783J586
7530E58374o6251L92J1221r1073j28956k06J35947R3451o5618j25652j9121R5709
7518C98217O3227n7964p6756O4342J94900J40462l2669j13063n1005o628o8195
7507D54868j09273j7676J07885J25717O4195J4554l9286j10108q9484M5524Q1073
$$ plain form
7584 474349 655503 743239 699178 634952 587809 522657 474736 504653 565156 579174 596975
7573 596975 701190 800550 718260 482460 329889 383863 508574 544033 517696 530703 577057
7562 577057 595943 604903 659854 743058 791065 787277 747720 672438 590183 577118 626330 577807
7550 577807 330429 72745 103908 409684 629411 534928 341497 373323 581381 647726
7540 647726 500767 424957 595206 779586 684282 401241 271798 400005 556788 558374
7530 558374 492123 492515 503736 412663 283707 283501 419448 512899 447281 321629 302508 398217
7518 398217 461444 403480 326724 391066 585966 726428 693759 580696 529691 523063 454868
7507 454868 345595 327919 435804 561521 625716 640270 600984 490876 401392 446916 527989
7496E27989j04540k36774l0338K66968J80223k02047k89834Q0640L58041J43214
7486F93542k00423j72433R0573J36715n0119j36081m4367L0153N7267J35874J44142
7475F84843q2680l15625j89064J52500K06975p8125k23503k5541J48736N3578
7465C32094l9302P9630J39407o8010k26377m1344J83725N2926j99212r7706K20778
7454C36609K18592j10537k23943L8063J98134j2515k00282j4897K37705J19886
7444E86815k03625k50221R717J66153M5587r4974o1439K671n2521j05789j954
7433D0420J57872J72758N9520P143O5620P6268n9911k04996j71234R657J29586
7422B82703Q2564k9768p8990n9992j0390P8675J70538J34178o0215k02473r4861
$$ plain form
7496 527989 423449 186675 156337 423305 603528 401481 111647 192287 550328 693542
7486 693542 493119 320686 411259 547974 497855 361774 317407 347560 404827 540701 684843
7475 684843 602163 286538 97474 249974 456949 378824 155321 129780 278516 332094
7465 332094 292792 372422 511829 443819 217442 176098 359823 412749 213537 115831 336609
7454 336609 555201 444664 220721 258784 456918 444403 244121 229224 466929 586815
7444 586815 383190 132969 142686 308839 354426 259452 198013 200684 148163 42374 40420
7433 40420 198292 371050 430570 437713 503333 579601 519690 314694 143460 153117 282703
7422 282703 365267 335499 256509 196517 186127 264802 435340 569518 509303 306830 211969
7411B11969J26264J51511m4591j69102o6212P0344M6555l5858j0338N1941R12
7400C33395r4939o4183N7205Q2994j0074o0927N735R6414J23888P9774l8624j81770
7388C28888j77399N8295K78031J59266j91869l17938o1397K07235J60112l4668
7378D08556o8196J3759m923p4146q294J06275M4704j00382k8605K07614K02311
7367F98673j42408l82068j67346K38103L52037J16886j49093k40164j88288m1232
7357I5100J59874K49807R0111j64554k17615m9487O8750l47q2884r133J28413
7346B68035J47581L4276q5441j08445j3682J27854J60263m768k11785k05260Q893
7335A17521J43144M1622j04431p2270P8554J69999J81332J62350N4343j62473
$$ plain form
7411 211969 338233 489744 445153 276051 209839 280183 326738 290880 280542 332483 333395
7400 333395 238456 174273 231478 314472 304398 243471 249206 345620 469508 549282 510658 328888
7388 328888 151489 209784 487815 647081 455212 137274 75877 283112 443224 408556
7378 408556 340360 354119 349196 275050 266756 373031 417735 317353 288748 496362 698673
7367 698673 556265 174197 6851 244954 596991 713877 564784 324620 136332 95100
7357 95100 254974 504781 594892 430338 212723 163236 231986 231639 148755 139622 268035
7346 268035 415616 449892 364451 256006 242324 370178 530441 525673 313888 108628 117521
7335 117521 260665 302287 197856 125586 204140 374139 555471 717821 772164 609691
7325F09691k89308j45163J13697J78513K5259j00178q2872l8923l1542J5515R1672
7314C46361P2673k1700j9157P8536M6118j67660k77126q0115J96724K01609n8871
7303C17392k64404k03617L6576K28520K08687L182j53899m3435K19628K69523
7293F18153j162k47705j63813Q2446J56761O8788M0611N1366q1426k63915k03370
7282E6734P7900K20315Q2745o5444j7484P0943J7251p6756n1311L4872N4628K4492
7270D28885r25l9123m8625P0150K10276R5739k34980l30614J2206L41494J87832
7259F92315k00237k48947L7735J47527o1874j78195O126J52573Q656j44120j065
7248B10494K21890J50633j28386k24832n0856J16756J01236Q862l6860n1452n1692
$$ plain form
7325 609691 320383 175220 288917 467430 492689 392511 309639 270716 239174 254689 346361
7314 346361 419034 397334 378177 456713 502831 335171 58045 -22070 174654 376263 317392
7303 317392 52988 -150629 -114053 114467 323154 326336 172437 129002 348630 618153
7293 618153 616991 369286 205473 287919 444680 513468 554079 605445 524019 260104 56734
7282 56734 134634 354949 437694 372250 354766 425709 442960 366204 314893 349765 404393 428885
7270 428885 427960 388837 340212 410362 620638 716377 481397 150783 162989 504483 692315
7259 692315 492078 243131 280866 428393 366519 188324 194450 347023 355679 211559 210494
7248 210494 432384 583017 454631 229799 178943 295699 396935 405797 368937 317485 265793
7237B65793M217R0449J05062L1075l0847j6980K8292M7821L4159m206m4448l0395
7225D79992N4630J21397Q0882j4551m3095P843N1846N6825N5903L2745n4971j43120
7213F86326j06720L8831J22883M9249p6055r7075J46R1477N5248j00913k15660
7202D47737j23413J11132K07165L4860j57586q2672J37853J49983p1005j92419
7192D61635p9068J5980o5929j13047L2709J48687L4421q7233M3958K11722N7679
7181F61514k59228k62119O1163K23454K6766j56654m5750J15294M7388p9301m03
7170C32124J49564R5553p5994q3464N1452P9987q285p466O8679o173k05113k08190
7158A82674O0910K46511J02117j16648o7856J33400J25467j01929j95389p973
$$ plain form
7237 265793 270010 360459 465521 496596 465749 448769 477061 524882 559041 554835 510387 479992
7225 479992 534622 656019 736901 722350 679255 687098 738944 795769 851672 884417 829446 686326
7213 686326 579606 618437 741320 790569 714514 617439 617585 709062 764310 663397 447737
7202 447737 324324 435456 642621 677481 519895 437223 575076 725059 654054 461635
7192 461635 382567 398547 332618 219571 252280 400967 435388 348155 392113 603835 661514
7181 661514 402286 140167 201330 424784 451550 294896 249146 364440 411828 332527 332124
7170 332124 481688 577241 501247 417783 469235 549222 540937 533471 602150 595977 390864 182674
7158 182674 243584 490095 592212 475564 407708 541108 666575 564646 369257 361284
7148C61284J67915N5298j83425j88158P0556K48835J13666j43616j88188J623
7138C15790J39508N5894q7673p7749L6565O4373o948j8529O7844J00613K494r0655
7126E01527n3612K2229j1549j01679o7526J01266J94522P0950j32289j73470k1815
7115C28554J19753J05076K8861M2770R7550L3985j12928j26899K3997Q6361o5468
7104E61612j68977J0831K23575P8705k72748k84011J32696M10908J76783j91217
7094F78157j80003Q5700J36994n8352j30382J4646P9580o0572j62584p4731K3836
7083C52289r524l1155Q6138J94837J22229m7145j25487p7575K4050J20973J26906
7072G36536l2450k18997j58314J38945K95281R9747j53450j22086N3994K8324
$$ plain form
7148 361284 529199 584497 401072 212914 283470 532305 645971 502355 314167 315790
7138 315790 455298 511192 423519 345770 382335 446708 439760 421231 489075 589688 592182 501527
7126 501527 447915 470144 458595 356916 289390 390656 585178 656128 523839 350369 328554
7115 328554 448307 553383 582244 625014 722564 756549 643621 516722 540719 627080 561612
7104 561612 392635 403466 627041 705746 432998 148987 281683 692591 869374 678157
7094 678157 498154 583854 720848 662496 532114 546760 626340 565768 403184 328453 352289
7083 352289 342765 311610 397748 592585 714814 667669 542182 464607 488657 609630 736536
7072 736536 704086 485089 326775 465720 761001 860748 707298 585212 639206 667530
7062F67530j53727j51962P4681K05576R3648l8488j5185L5056k8178j05890o8243
7051E14818J5781K6497n014M950L6858M0904L9950M9073J4016p1849j11455n6167
7039D98362J0597K4999L9089P8171O0622k8075m7398O6971J43784K9506j37560
7028G39068j22388L8159J02334R632n0869K7316J02505L2090r7218j08498N370
7017F77501Q7550M4085l8282k3121Q0220J16137r82j37861j06979N3815J19079
7006H71162J3128p7746j5995O4050N524p9557j068J57249J55513J100o4188K4661
6994A053833O2455m9350j27584l4872P5603K0554j07863r8313N3815J69353J45651
6983A163282L0482r2759j52429r1130M7459J07116K4108m1628O4830K14598J46014
$$ plain form
7062 667530 513803 361841 436522 642098 735746 697258 682073 717129 688951 583061 514818
7051 514818 530599 557096 552082 557032 593890 634794 674744 723817 737833 665984 554529 498362
7039 498362 508959 533958 573047 651218 711840 683765 636367 703338 847122 876628 739068
7028 739068 616680 654839 757173 766805 715936 743252 845757 877847 780629 672131 677501
7017 677501 765051 809136 770854 747733 827953 944090 943108 805247 698268 752083 871162
7006 871162 884290 806544 790549 854599 860123 780566 779498 936747 1092260 1093360 1029172 1053833
6994 1053833 1116288 1066938 939354 904482 980085 1000639 892776 794463 848278 1017631 1163282
6983 1163282 1193764 1101005 948576 857446 904905 1012021 1036129 994501 1059331 1273929 1419943
6972A419943j32048l03378j62262J08799J86157K0319j29666n5052J29474J45301
6962A227587n9554k08085n9739K29036K88690N0524j56826r0896O8767L7111j28192
6951A198423j48047K4739J55831J11026K7140N1593J19278Q3179o1900j72964
6941A388298j19288P7796K34433J76098l2938j31380j6064R6664J7546r2115m30
6930A598620J55923P4879j57010j46303J52334L15200J07342j70634j95030p4210
6920A661111k4292L3725K10152K99551R7545j73371j65618M7449J36447P1762
6910B194461Q1780J71723J43046L1316N7174J59841O4277j59903j21959K05530
6900B827286L53261J01696j50134n1859J36109L6879j83661j24357J61265K80170
$$ plain form
6972 1419943 1287895 984517 822255 931054 1117211 1137530 1007864 952812 1082286 1227587
6962 1227587 1168033 959948 900209 1129245 1417935 1468459 1311633 1220737 1289504 1326615 1198423
6951 1198423 1050376 1075115 1230946 1341972 1369112 1420705 1539983 1623162 1561262 1388298
6941 1388298 1269010 1346806 1581239 1757337 1724399 1593019 1576955 1673619 1691165 1599050 1598620
6930 1598620 1754543 1829422 1672412 1526109 1678443 1993643 2100985 1930351 1735321 1661111
6920 1661111 1636819 1670544 1880696 2180247 2277792 2104421 1938803 1986252 2122699 2194461
6910 2194461 2276241 2447964 2591010 2622326 2679500 2839341 2903618 2743715 2621756 2827286
6900 2827286 3180547 3282243 3132109 3080250 3216359 3253238 3069577 2945220 3106485 3386655
6890C386655J42857J3877K132m2834j36556r0361J04589J98730Q9018k1349J4499
6879C661257O1287j0955p5115K2601J74045J62212q810j21556l3425J71010K88722
6868D291273J88865o1127k21512j09899J56577K57708P6363j16129p889L10493
6858D764723M32185J65004j97289k32726Q3033L63598L18092R8995L5862J53939
6848E985416J76210j2974j63562l6356K22334K85335J06537m6321J7510J94574
6838F728703K81298K24589J29075J10771J76035K03951Q1991r9867r1839J83630
6828G928337M66561M78634K91686J82247K21652K54270K19613K23409K94840L32290
6818A0893539L15152L38200M13606M56967M71479N18822N35081M46467M26485
$$ plain form
6890 3386655 3529512 3543389 3545521 3502687 3366131 3275770 3380359 3579089 3668107 3646758 3661257
6879 3661257 3722544 3711589 3636474 3659075 3833120 3995332 3986522 3864966 3831541 4002551 4291273
6868 4291273 4480138 4419011 4197499 4087600 4244177 4501885 4578248 4462119 4454230 4764723
6858 4764723 5196908 5361912 5164623 4931897 5014930 5378528 5696620 5795615 5831477 5985416
6848 5985416 6161626 6148652 5985090 5948734 6171068 6456403 6562940 6516619 6534129 6728703
6838 6728703 7010001 7234590 7363665 7474436 7650471 7854422 7936413 7836546 7744707 7928337
6828 7928337 8394898 8873532 9165218 9347465 9569117 9823387 10043000 10266409 10561249 10893539
6818 10893539 11208691 11546891 11960497 12417464 12888943 13407765 13942846 14389313 14815798
6809A4815798O91714J048987J059141P16637N20261P23565R72943R21246P55778
6800B2226070P94042R43072R47135Q75650R78311J278179J637684K008110K334704
$$ plain form
6809 14815798 15507512 16556499 17615640 18332277 18852538 19576103 20549046 21470292 22226070
6800 22226070 23020112 23963184 24910319 25785969 26764280 28042459 29680143 31688253 34022957
$$ [...]
##END NTUPLES=NMR SPECTRUM
##END=
