##TITLE=1H ikalashn
CG-1218-5
18.11.2024
##JCAMPDX= 6.0         $$ Bruker NMR JCAMP-DX V2.0
##DATA TYPE= NMR SPECTRUM
##DATA CLASS= NTUPLES
##ORIGIN= UXNMR, Bruker Analytische Messtechnik GmbH
##OWNER= root
$$ TOPSPIN		Version 1.3
$$ 2024-11-18 10:33:23.859 +0400  Irina@DPX200
$$ Compression mode = diff/dup
##.OBSERVE FREQUENCY= 200.131300845
##.OBSERVE NUCLEUS= ^1H
##.ACQUISITION MODE= SIMULTANEOUS
##.ACQUISITION SCHEME= undefined
##.AVERAGES= 16
##.DIGITISER RES= 18
##SPECTROMETER/DATA SYSTEM= spect
##.PULSE SEQUENCE= zg
##.SOLVENT NAME= CDCl3
##.SHIFT REFERENCE= INTERNAL, CDCl3, 1, 17.49637
##AUDIT TRAIL= $$ (NUMBER, WHEN, WHO, WHERE, WHAT)
$$ ##TITLE= Audit trail, TOPSPIN		Version 1.3
$$ ##JCAMPDX= 5.01
$$ ##ORIGIN= Bruker BioSpin GmbH
$$ ##OWNER= Irina
$$ $$ F:/spectra/data/iren/nmr/1H/4/pdata/1/auditp.txt
$$ ##AUDIT TRAIL=  $$ (NUMBER, WHEN, WHO, WHERE, VERSION, WHAT)
(   1,<2024-11-18 10:31:43.343 +0400>,<Irina>,<DPX200>,<TOPSPIN 1.3>,
      <acquisition in progress>)
(   2,<2024-11-18 10:32:50.125 +0400>,<Irina>,<DPX200>,<TOPSPIN 1.3>,
      <Start of raw data processing
       efp BC_mod = 2 LB = 0.02 FT_mod = 6 PKNL = 1 PHC0 = 326.8341 PHC1 = -6.346261 SI = 32K 
       data hash MD5: 32K
       1D 5E 26 E2 AE E8 59 A7 32 ED 38 E0 24 3F 30 4F>)
(   3,<2024-11-18 10:32:53.375 +0400>,<Irina>,<DPX200>,<TOPSPIN 1.3>,
      <apk 
       data hash MD5: 32K
       19 10 90 E0 81 BA 20 62 26 14 4E 5B 48 5A 95 F7>)
(   4,<2024-11-18 10:32:55.812 +0400>,<Irina>,<DPX200>,<TOPSPIN 1.3>,
      <abs n ABSG = 5 
       data hash MD5: 32K
       0A 7C ED E4 36 B3 2C 26 92 79 B3 43 A0 F7 14 49>)
(   5,<2024-11-18 10:33:12.468 +0400>,<Irina>,<DPX200>,<TOPSPIN 1.3>,
      <pk fgphup PHC0 = -23.72461 PHC1 = 38.4 
       data hash MD5: 32K
       FB 1C 3B 54 4F B6 3A C7 AB 21 A3 18 82 94 B2 BB>)
(   6,<2024-11-18 10:33:13.984 +0400>,<Irina>,<DPX200>,<TOPSPIN 1.3>,
      <abs n ABSG = 5 
       data hash MD5: 32K
       E0 F1 A4 11 2E 2A AE 17 97 EF 17 A4 6B 04 4C E6>)
$$ ##END=
$$ 
$$ $$ hash MD5
$$ $$ D5 7E 10 0D C8 18 4B D1 A1 1A 1F 8B 7D 2B 43 30
##$RELAX= 
##$RELAX= 
##$RELAX= 
##$RELAX= 
##$RELAX= 
##$RELAX= 
##$RELAX= 
##$RELAX= 
##$RELAX= 
$$ Bruker specific parameters
$$ --------------------------
##$DU= <F:/spectra>
##$EXPNO= 4
##$NAME= <1H>
##$PROCNO= 1
##$TYPE= <nmr>
##$USER= <iren>
##$AMP= (0..31)
100 100 100 100 100 100 100 100 100 100 100 100 100 100 100 100 100 100 
100 100 100 100 100 100 100 100 100 100 100 100 100 100 
##$ANAVPT= -1
##$AQSEQ= 0
##$AQ_mod= 1
##$AUNM= <au_zg>
##$AUTOPOS= <>
##$BF1= 200.13
##$BF2= 200.13
##$BF3= 200.13
##$BF4= 200.13
##$BF5= 200.13
##$BF6= 200.13
##$BF7= 200.13
##$BF8= 200.13
##$BYTORDA= 1
##$CFDGTYP= 0
##$CFRGTYP= 5
##$CHEMSTR= <none>
##$CNST= (0..63)
1 1 145 1 1 1 1 1 1 1 1 1 1 1 1 1 1 1 1 1 1 1 1 1 1 1 1 1 1 1 1 1 1 1 
1 1 1 1 1 1 1 1 1 1 1 1 1 1 1 1 1 1 1 1 1 1 1 1 1 1 1 1 1 1 
##$CPDPRG= <>
##$CPDPRG1= <>
##$CPDPRG2= <>
##$CPDPRG3= <>
##$CPDPRG4= <mlev>
##$CPDPRG5= <mlev>
##$CPDPRG6= <mlev>
$$ [...]
##$SW_h= 4401.40845070422
##$TD= 16384
##$TD0= 1
##$TE= 300
##$TE2= 300
##$TE3= 300
##$TEG= 300
##$TL= (0..7)
0 120 120 120 120 120 120 120 
##$TP= (0..7)
150 150 150 150 150 150 150 150 
##$TP07= 0
##$TPNAME0= <>
##$TPNAME1= <>
##$TPNAME2= <>
##$TPNAME3= <>
##$TPNAME4= <>
##$TPNAME5= <>
##$TPNAME6= <>
##$TPNAME7= <>
##$TPOAL= (0..7)
0.5 0.5 0.5 0.5 0.5 0.5 0.5 0.5 
##$TPOFFS= (0..7)
0 0 0 0 0 0 0 0 
##$TUNHIN= 0
##$TUNHOUT= 0
##$TUNXOUT= 0
##$USERA1= <user>
##$USERA2= <user>
##$USERA3= <user>
##$USERA4= <user>
##$USERA5= <user>
##$V9= 5
##$VALIST= <valist>
##$VCLIST= <CCCCCCCCCCCCCCC>
##$VD= 0
##$VDLIST= <DDDDDDDDDDDDDDD>
##$VPLIST= <PPPPPPPPPPPPPPP>
##$VTLIST= <TTTTTTTTTTTTTTT>
##$WBST= 1024
##$WBSW= 25
##$XGAIN= (0..3)
0 0 0 0 
##$XL= 0
##$YL= 0
##$YMAX_a= 329287
##$YMIN_a= -773394
##$ZGOPTNS= <>
##$ZL1= 120
##$ZL2= 120
##$ZL3= 120
##$ZL4= 120
##$ABSF1= 17.49637
##$ABSF2= -4.496376
##$ABSG= 5
##$ABSL= 3
##$ALPHA= 0
##$AQORDER= 0
##$ASSFAC= 0
##$ASSFACI= 0
##$ASSFACX= 0
##$ASSWID= 0
##$AUNMP= <proc_1d>
##$AXLEFT= 0
##$AXRIGHT= 0
##$AXTYPE= 0
##$AXUNIT= <>
##$AZFE= 0.1
##$AZFW= 0.1
##$BCFW= 0
##$BC_mod= 2
##$BYTORDP= 0
##$COROFFS= 0
##$CY= 7568.61572265625
##$DATMOD= 1
##$DC= 0
##$DFILT= <>
##$DTYPP= 0
##$F1P= 17.9538593292236
##$F2P= -4.03888763876832
##$FCOR= 0.5
##$FTSIZE= 32768
##$FT_mod= 6
##$GAMMA= 0
##$GB= 0
##$INTBC= 0
##$INTSCL= 1.367314e-010
##$ISEN= 128
##$LB= 0.02
##$LEV0= 0
##$LPBIN= 0
##$MAXI= 945.577
##$MC2= 0
##$MEAN= 0
##$ME_mod= 0
##$MI= -402.1523
##$NCOEF= 0
##$NC_proc= -6
##$NLEV= 6
##$NOISF1= 8.587773
##$NOISF2= 6.764455
##$NSP= 0
##$NTH_PI= 0
##$NZP= 0
##$OFFSET= 17.49637
##$PC= 1
##$PHC0= 315.389
##$PHC1= 12.68712
##$PH_mod= 1
##$PKNL= yes
##$PPARMOD= 0
##$PPDIAG= 0
##$PPIPTYP= 0
##$PPMPNUM= 100
##$PPRESOL= 1
##$PSCAL= 0
##$PSIGN= 0
##$REVERSE= no
##$SF= 200.13
##$SI= 32768
##$SIGF1= 16.12182
##$SIGF2= -4.496377
##$SINO= 3.521527
##$SIOLD= 32768
##$SREGLST= <1H.CDCl3>
##$SSB= 0
##$STSI= 32768
##$STSR= 0
##$SW_p= 4401.40845070422
##$SYMM= 0
##$S_DEV= 0
##$TDeff= 16384
##$TDoff= 0
##$TI= <>
##$TILT= no
##$TM1= 0
##$TM2= 0
##$TOPLEV= 0
##$USERP1= <user>
##$USERP2= <user>
##$USERP3= <user>
##$USERP4= <user>
##$USERP5= <user>
##$WDW= 1
##$XDIM= 32768
##$YMAX_p= 287947163
##$YMIN_p= -332620
$$ End of Bruker specific parameters
$$ ---------------------------------
##NTUPLES= NMR SPECTRUM
##VAR_NAME=  FREQUENCY,     SPECTRUM/REAL,   SPECTRUM/IMAG
##SYMBOL=    X,             R,               I
##VAR_TYPE=  INDEPENDENT,   DEPENDENT,       DEPENDENT
##VAR_FORM=  AFFN,          ASDF,            ASDF
##VAR_DIM=   32768,         32768,           32768
##UNITS=     HZ,            ARBITRARY UNITS, ARBITRARY UNITS
##FACTOR=    0.134324425510551, 1,           1
##FIRST=     4401.40845070422, 214289,       -1404220
##LAST=      0,             -315034,         -1058417
##MIN=       0,             -332620,         0
##MAX=       4401.40845070422, 287947163,    0
$$ Real data points
##PAGE= N=1
##DATA TABLE= (X++(R..R)), XYDATA
$$ [...]
12663E182657n6061j10853j0787R1586M2757n1431p649J12776J06282j9507n6986
12652E222784M7700J08005J0819j08950r6936j397M2741J5721j3929k0677k1443
12641E184438r506K3150M2854K1799q388l951K3139K9187L664k5236l0220q259
12629E242671J9430K5237J0910J3647M7543O4258K0181m3455n2182j0142J4831
12618E352929N120P539L4189L8410M054k4469k2478j8324k4147r144L2026N5943
12606E431648M2188K0423M469k7185o3238n3362K17K8139O292m234K7043L6777
12594E449177j7921o8333l5722M5022Q4909O8933M5404L4848K6782K5960K8575
12583E687634n713q2869j20407n1172N5862P6112Q178l2505M962M1211Q832l8586
$$ plain form
12663 5182657 5126596 5015743 5004956 5096542 5139299 5087868 5080219 5192995 5299277 5279770 5222784
12652 5222784 5270484 5378489 5389308 5280358 5183422 5182025 5224766 5240487 5226558 5205881 5184438
12641 5184438 5174932 5198082 5240936 5262735 5254347 5250396 5273535 5302722 5306386 5281150 5250930 5242671
12629 5242671 5262101 5287338 5298248 5311895 5359438 5423696 5443877 5400422 5348240 5338098 5352929
12618 5352929 5358049 5365588 5399777 5438187 5442241 5417772 5395294 5376970 5352823 5343679 5375705 5431648
12606 5431648 5473836 5494259 5498728 5471543 5408305 5354943 5355160 5383299 5389591 5385357 5412400 5449177
12594 5449177 5431256 5362923 5327201 5372223 5457132 5526065 5571469 5606317 5633099 5659059 5687634
12583 5687634 5681921 5599052 5478645 5427473 5483335 5559447 5567625 5535120 5540082 5581293 5590125 5551539
12571E551539j8289M6481N7394j5253q4746n8176M3906J12203Q5027J8182l531
12560E734737J6358J1945k6853m1736j3982L524j1217m532M7478P6820L6021p954
12548E820609J8894O4284L0918n5915p9488r900O2795P3501N4868N0317M7936
12537F078819K9501J2841J6948L6470O2381Q1068O0222n865n1217j1666O8408
12526F377910Q7051L5462K272K4762M2800K2091J3410M6938O8303L5691n185q12
12514F750693L1532N7059P7566Q1499K8280n5426n9776M5098J24369O3844m4580
12503G100158l5783P2397J12511L3132l4058M769O9914N7663M514R663P0104R2631
12491G557615L9451k2195j8506L8059P3613M7124j613n560L8222O3900L7942J7607
$$ plain form
12571 5551539 5533250 5579731 5637125 5621872 5537126 5478950 5522856 5635059 5720086 5738268 5734737
12560 5734737 5751095 5763040 5736187 5694451 5680469 5683993 5672776 5668244 5715722 5792542 5828563 5820609
12548 5820609 5839503 5903787 5934705 5878790 5799302 5789402 5852197 5925698 5980566 6030883 6078819
12537 6078819 6108320 6121161 6138109 6174579 6236960 6318028 6378250 6372385 6321168 6309502 6377910
12526 6377910 6464961 6500423 6502695 6527457 6570257 6592348 6605758 6652696 6720999 6756690 6751505 6750693
12514 6750693 6782225 6839284 6916850 6998349 7026629 6971203 6911427 6956525 7080894 7144738 7100158
12503 7100158 7064375 7136772 7249283 7282415 7248357 7253126 7323040 7380703 7385217 7394880 7464984 7557615
12491 7557615 7597066 7574871 7556365 7594424 7668037 7715161 7713548 7707988 7746210 7810110 7848052 7865659
12479G865659N9419J11381P9764j3193m1406L6500J06008O8701q043m78P8934
12468H343246J07499M3176k1027k310O6838J09114J02505O8948K2853k0301k6644
12457H793897J6062O8875R0771Q8085P9883N4606J1511L235O4375J27042R8696
12446I497038J4216M711R7265J60392J02936J7205L1501J09137J19352N3810K7969
12435A0235532P9301J12171P3698M7719J05456J73609J47150N9506L4137J01143
12425A1169422J60832J29429M5665J2578P3568J63642J75452Q1780j1476K3894
12415A2024786J65288K43094J57455K0027M221J09635J80196J35693O8937Q8222
12405A3197554J62975J87045J34978Q4149R9058J51251J67475J28317R1157J11351
$$ plain form
12479 7865659 7925078 8036459 8116223 8103030 8061624 8098124 8204132 8272833 8264790 8264312 8343246
12468 8343246 8450745 8493921 8472894 8470584 8537422 8646536 8749041 8817989 8840842 8820541 8793897
12457 8793897 8809959 8878834 8969605 9057690 9137573 9192179 9203690 9206925 9271300 9398342 9497038
12446 9497038 9511254 9515965 9613230 9773622 9876558 9893763 9925264 10034401 10153753 10207563 10235532
12435 10235532 10314833 10427004 10500702 10548421 10653877 10827486 10974636 11034142 11068279 11169422
12425 11169422 11330254 11459683 11505348 11517926 11591494 11755136 11930588 12012368 12000892 12024786
12415 12024786 12190074 12433168 12590623 12610650 12614871 12724506 12904702 13040395 13109332 13197554
12405 13197554 13360529 13547574 13682552 13766701 13865759 14017010 14184485 14312802 14403959 14515310
12395A4515310J66055J88830J68383J58828J82375J90430J57867J42878J87113
12386A6058069K23700J79301J16078J51484K60068K91790K01006J21344J63692
12377A7766532K59942K83763K31873J94866K12807K48958K66847K59365K31986
12368A9956939K14809K53594L35097L68900L07157K32932K52273L40208L83089
12359B2644998L47113L09893L30555L76586L90969L63799L25472L18549L71385
12350B5779319M52140M73856M07843L55424M17305N25475N26715M21827L75600
12341B9735504M62734N58417N50888N16353N69164O54997O38246N25188M52275
12332C4663766M82644N45108N64053N35473M80566M29247M41693N40427O31998
$$ plain form
12395 14515310 14681365 14870195 15038578 15197406 15379781 15570211 15728078 15870956 16058069
12386 16058069 16281769 16461070 16577148 16728632 16988700 17280490 17481496 17602840 17766532
12377 17766532 18026474 18310237 18542110 18736976 18949783 19198741 19465588 19724953 19956939
12368 19956939 20171748 20425342 20760439 21129339 21436496 21669428 21921701 22261909 22644998
12359 22644998 22992111 23302004 23632559 24009145 24400114 24763913 25089385 25407934 25779319
12350 25779319 26231459 26705315 27113158 27468582 27885887 28411362 28938077 29359904 29735504
12341 29735504 30198238 30756655 31307543 31823896 32393060 33048057 33686303 34211491 34663766
12332 34663766 35146410 35691518 36255571 36791044 37271610 37700857 38142550 38682977 39314975
12323C9314975O12326N39704N66065O92967P58426P03280O74397P79772R09704
12314D5551616R28709Q99495R54483J057852J080281J034392J041535J107828
12306E3656191J130129J106805J140832J224601J227637J137816J110560J209117
12298F2943688J294728J271190J243529J305386J357456J306815J278010J414383
12290G3415185J600012J620947J518897J524406J670257J737813J614198J450723
12282H6152438J388248J347929J215787J055539R87415R76017Q88304O95936M99511
12273I5207124L89408L68358L83114L77550L43669L40807M12916M92126M81069
12264I8796141M31038M97651O86632Q08742P63823O99400P66428Q78849Q81233
$$ plain form
12323 39314975 39927301 40467005 41033070 41726037 42484463 43187743 43862140 44641912 45551616
12314 45551616 46480325 47379820 48334303 49392155 50472436 51506828 52548363 53656191
12306 53656191 54786320 55893125 57033957 58258558 59486195 60624011 61734571 62943688
12298 62943688 64238416 65509606 66753135 68058521 69415977 70722792 72000802 73415185
12290 73415185 75015197 76636144 78155041 79679447 81349704 83087517 84701715 86152438
12282 86152438 87540686 88888615 90104402 91159941 92147356 93123373 94011677 94707613 95207124
12273 95207124 95596532 95964890 96348004 96725554 97069223 97410030 97822946 98315072 98796141
12264 98796141 99227179 99724830 100411462 101220204 101984027 102683427 103449855 104328704 105209937
12255A05209937Q21467Q55302R69550J016118R76206R77069J054631J103917J088846
12246A14073043J112055J224530J330057J348321J336864J375665J438976J452417
12238A24691928J392412J277349J139207J036559J003753R55988P49505L79102
12230A32625803J2429k19799l61490n07175o59915p94110r50816j161557j351332
12221A26632038j423392j390389j331561j268766j175289j066237r86727r32701
12213A17056976q62397p69533o80308o00453n27370m87345m93260m89737m15609
12204A11730964l10253k81311l55577m25636l76071k28447j23685j58884k67210
12195A09203890k93999j93719r2119j09606j90343j99549j39105j30793k01332
$$ plain form
12255 105209937 106031404 106886706 107856256 108872374 109848580 110825649 111880280 112984197 114073043
12246 114073043 115185098 116409628 117739685 119088006 120424870 121800535 123239511 124691928
12238 124691928 126084340 127361689 128500896 129537455 130541208 131497196 132246701 132625803
12230 132625803 132638232 132418433 132056943 131549768 130889853 130095743 129144927 127983370 126632038
12221 126632038 125208646 123818257 122486696 121217930 120042641 118976404 117989677 117056976
12213 117056976 116194579 115425046 114744738 114144285 113616915 113129570 112636310 112146573 111730964
12204 111730964 111420711 111139400 110783823 110358187 109982116 109753669 109629984 109471100 109203890
12195 109203890 108909891 108716172 108624053 108514447 108324104 108124555 107985450 107854657 107653325
12186A07653325k42520k08124j85082k14174k09283j41883j35704k53972l51048
12177A05711535k92037j79712j81474k53027k43498j78606k03097k98684l06842
12168A03574558k16196j82713k48400k80115k33566k42648l65686m62369m34956
12159A00907909l98924m80565o07433o44207o06176n94809o25676o52526o71858
12150I5625735o82692o28414m94945l83505l72178l87296l25896k20684j61711
12141I1968414j37017q2854j8485N486K5876R5741J60519J51080J34216K07461
12131I2510437L03309K83703J89910J95059L19462M05677L94325M05760M95414
12122I5503056N46961N01418M87264N93515O95722O67097O07005O71172P97070
$$ plain form
12186 107653325 107410805 107202681 107017599 106803425 106594142 106452259 106316555 106062583 105711535
12177 105711535 105419498 105239786 105058312 104805285 104561787 104383181 104180084 103881400 103574558
12168 103574558 103358362 103175649 102927249 102647134 102413568 102170920 101805234 101342865 100907909
12159 100907909 100508985 100028420 99420987 98776780 98170604 97575795 96950119 96297593 95625735
12150 95625735 94943043 94314629 93819684 93436179 93064001 92676705 92350809 92130125 91968414
12141 91968414 91831397 91748543 91730058 91735544 91761420 91857161 92017680 92168760 92302976 92510437
12131 92510437 92813746 93097449 93287359 93482418 93801880 94207557 94601882 95007642 95503056
12122 95503056 96050017 96551435 97038699 97632214 98327936 98995033 99602038 100273210 101070280
12113A01070280Q13081P44252P77909R44814J063113J036101R99316J088375J233779
12104A09771020J304325J319564J374271J440298J406673J287273J234329J321712
12096A20459465J435481J431479J315455J203852J163059J155616J118333J034196
12088A30316936R31103Q46693P92580P34321O21473M53413K86920J56072K6295
12079A35165806j32143k72473l38883l66994m28653m97647m78571l75653l11891
12070A31962898l35322l22859j61593O6046J90833J96232K27618L76373N68058
12061A32768284O87637P28601P73424Q75812J006639J103797J153626J214422
12053A40312242J345884J520660J648642J703704J769372J919767K111985K255064
$$ plain form
12113 101070280 101883361 102627613 103405522 104350336 105413449 106449550 107448866 108537241 109771020
12104 109771020 111075345 112394909 113769180 115209478 116616151 117903424 119137753 120459465
12096 120459465 121894946 123326425 124641880 125845732 127008791 128164407 129282740 130316936
12088 130316936 131248039 132094732 132887312 133621633 134243106 134696519 134983439 135139511 135165806
12079 135165806 135033663 134761190 134422307 134055313 133626660 133129013 132650442 132274789 131962898
12070 131962898 131627576 131304717 131143124 131209170 131400003 131596235 131823853 132200226 132768284
12061 132768284 133455921 134184522 134957946 135833758 136840397 137944194 139097820 140312242
12053 140312242 141658126 143178786 144827428 146531132 148300504 150220271 152332256 154587320
12045A54587320K338222K421942K540208K683259K841755K991857L072362L062276
12037A76539201L046265L103168L158176L064569K823675K592582K451471K289177
12029A99068284J971675J523650J080561P34551M83123K70918L3869k53608n44343
12020B04368680p69031r24950j060739j183957j262748j312133j382430j461422
12012A95011270j494015j501607j559144j644637j654808j595247j593927j679465
12004A82288420j722146j669261j650813j740908j803832j727471j630152j648992
11996A68694845j686783j593657j461179j473143j561499j499018j286706j151139
11988A56981721j156015j116790r52153q26225q34652q16831o35896m23285l60200
$$ plain form
12045 154587320 156925542 159347484 161887692 164570951 167412706 170404563 173476925 176539201
12037 176539201 179585466 182688634 185846810 188911379 191735054 194327636 196779107 199068284
12029 199068284 201039959 202563609 203644170 204378721 204861844 205132762 205166631 204913023 204368680
12020 204368680 203599649 202674699 201613960 200430003 199167255 197855122 196472692 195011270
12012 195011270 193517255 192015648 190456504 188811867 187157059 185561812 183967885 182288420
12004 182288420 180566274 178897013 177246200 175505292 173701460 171973989 170343837 168694845
11996 168694845 167008062 165414405 163953226 162480083 160918584 159419566 158132860 156981721
11988 156981721 155825706 154708916 153756763 152930538 152095886 151279055 150643159 150219874 149859674
11979A49859674l87360l27600j73580o0946l4622j7224L4697Q8654J22352J39352
11969A49243397J30703J11819J50485K70231L83395M12209M11060M64711N31712
11960A52109722N12044M17762L41280K85335J61840m8206k62672m34806o06725
11951A52475574q07512r99569j152427j283039j396037j461412j478989j496098
11943A42400491j531324j540297j489700j417631j383808j384853j349570j222178
11935A31081130j047431r52197j002130j089693j043827q62911p30425p51123
11927A23601393q00945p37713o30959o26846o88193o70006n95132o26855p72616
11918A17452128q50224p96873p87507r50689j164587j263616j281952j343627
$$ plain form
11979 149859674 149472314 149144714 148971134 148910188 148875566 148858342 148893039 148981693 149104045 149243397
11969 149243397 149374100 149485919 149636404 149906635 150290030 150702239 151113299 151578010 152109722
11960 152109722 152621766 153039528 153380808 153666143 153827983 153779777 153517105 153082299 152475574
11951 152475574 151668062 150668493 149516066 148233027 146836990 145375578 143896589 142400491
11943 142400491 140869167 139328870 137839170 136421539 135037731 133652878 132303308 131081130
11935 131081130 130033699 129081502 128079372 126989679 125945852 125082941 124352516 123601393
11927 123601393 122800448 122062735 121431776 120804930 120116737 119446731 118851599 118224744 117452128
11918 117452128 116601904 115805031 115017524 114066835 112902248 111638632 110356680 109013053
11910A09013053j446764j518914j581939j693421j797685j799826j738936j730907
11902I5704661j772004j753774j658733j590936j602751j625558j595126j530115
11894H2575664j460231j380665j305179j269430j255169j201354j114290j072999
11886G2516347j096210j101129j035297r54306r15231q84641q23024p78804q07808
11877F4119897q57045q29047p34535o85946p41928q40752r01390r18034r23412
11868E6687808r17412q84741q53112q72662r34049r60830r11905q49017q51900
11859D8652180q95541q86789q17616p86452q35533q67248p92424o72836o17270
11850D1480471o11441n76108n33780n62055o13470n62014m35802m11284n26560
$$ plain form
11910 109013053 107566289 106047375 104465436 102772015 100974330 99174504 97435568 95704661
11902 95704661 93932657 92178883 90520150 88929214 87326463 85700905 84105779 82575664
11894 82575664 81115433 79734768 78429589 77160159 75904990 74703636 73589346 72516347
11886 72516347 71420137 70319008 69283711 68329405 67414174 66529533 65706509 64927705 64119897
11877 64119897 63262852 62433805 61699270 61013324 60271396 59430644 58529254 57611220 56687808
11868 56687808 55770396 54885655 54032543 53159881 52225832 51265002 50353097 49504080 48652180
11859 48652180 47756639 46869850 46052234 45265782 44430249 43563001 42770577 42097741 41480471
11850 41480471 40869030 40292922 39759142 39197087 38583617 38021603 37585801 37174517 36647957
11841C6647957n93121m85766l39599l27373m00790m16483l85432m06056m48152
11832C2845185m10174l29485l28347l87771l82244l18014l19027l76945l49265
11823B9643913k37324k18936l30232l67070k29773j22967k26399l78697l30475
11814B7202040j54863j24815k66907l32460k07304p3979j03126k15013k54737
11805B5468836k25732k20733k45517k41917k10877k01361k19654k33508k34713
11796B3434824k33799k20608j82541j39351j20935j30454j51890j67354j54751
11787B1933141j07143o5830q6605j58501k07736j98998j75392j75984j76087j44127
11777B0436738j02423r0379j09284j36979j58906j60768j33453j04859j17756
$$ plain form
11841 36647957 36054836 35569070 35229471 34902098 34501308 34084825 33699393 33293337 32845185
11832 32845185 32435011 32105526 31777179 31389408 31007164 30689150 30370123 29993178 29643913
11823 29643913 29406589 29187653 28857421 28490351 28260578 28137611 27911212 27532515 27202040
11814 27202040 27047177 26922362 26655455 26322995 26115691 26041712 25938586 25723573 25468836
11805 25468836 25243104 25022371 24776854 24534937 24324060 24122699 23903045 23669537 23434824
11796 23434824 23201025 22980417 22797876 22658525 22537590 22407136 22255246 22087892 21933141
11787 21933141 21825998 21760168 21673563 21515062 21307326 21108328 20932936 20756952 20580865 20436738
11777 20436738 20334315 20243936 20134652 19997673 19838767 19677999 19544546 19439687 19321931
11768A9321931j58610j64627j19633q0169q6798j17723j48292j76951j74563j06783
11758A7987782l3755o6886j78546j94699n9389M2322m6418k00789k04457q5688
11748A6959477n1119j41691j86788j05617l1065p2082j40487j12476k3683O061
11738A6100530m8244j09928j18347q2679n1579o5389j08093j07630l5351J9441
11728A5392731l7500j42824j49730n8340k1712r6869j53369r4169j0334j7724
11718A4610160p7074r5362q9825j17801j37136q0265o99k612o7353q6322m1126
11707A3814585k0475o3228j02507q0022k2935J2102L110m0496r1671j11742q3004
11696A3213717l2391L96k346m3652j05307j23871n0460M4838L1549q0452j27702
$$ plain form
11768 19321931 19163321 18998694 18879061 18798892 18712094 18594371 18446079 18269128 18094565 17987782
11758 17987782 17954027 17887141 17708595 17513896 17454507 17496829 17450411 17249622 17045165 16959477
11748 16959477 16908358 16766667 16579879 16474262 16443197 16371115 16230628 16118152 16094469 16100530
11738 16100530 16052286 15942358 15824011 15741332 15689753 15624364 15516271 15408641 15373290 15392731
11728 15392731 15355231 15212407 15062677 15004337 14982625 14885756 14732387 14638218 14627884 14610160
11718 14610160 14533086 14437724 14347899 14230098 14092962 14012697 14011998 14009386 13942033 13855711 13814585
11707 13814585 13794110 13730882 13628375 13548353 13525418 13537520 13540630 13500134 13408463 13296721 13213717
11696 13213717 13181326 13181722 13179376 13135724 13030417 12906546 12856086 12900924 12932473 12852021 12724319
11685A2724319m5545J9328m2563j07003l4731O2911n55j52864j61333j1044Q0884
11674A2331804K0264n6895n7109n1530o9222k0642Q4783Q5982n0611j29649m3489
11663A2043686L4219n3921j68030j08131L8727M4932p7467j11248K960R5169N8317
11652A1799213j6483l4608l3631o2171p9634n0382j9541k5766l1613l283J6928
11641A1459029j9007p5518p4106j12P1394N6190m2402j25500j07436k5022J1246
11630A1128756k5530n1924k4942j0265m4115m8959J7245M8619l7521j26674p5155
11619A0749535L6943K5907q1098q9121K0520M9844o4927j25398r319J03318K1644
11608A0637848j30280j06487O4967J28532k080j34860j10556j2019J5956j0922
$$ plain form
11685 12724319 12678774 12698102 12655539 12548536 12513805 12576716 12576161 12423297 12261964 12250920 12331804
11674 12331804 12352068 12295173 12238064 12186534 12117312 12096670 12181453 12267435 12216824 12087175 12043686
11663 12043686 12077905 12023984 11855954 11747823 11786550 11831482 11754015 11642767 11645727 11740896 11799213
11652 11799213 11782730 11748122 11714491 11652320 11572686 11522304 11502763 11476997 11445384 11442101 11459029
11641 11459029 11440022 11364504 11290398 11290286 11361680 11417870 11375468 11249968 11142532 11117510 11128756
11630 11128756 11103226 11051302 11026360 11016095 10971980 10923021 10940266 10988885 10951364 10824690 10749535
11619 10749535 10786478 10812385 10731287 10642166 10662686 10712530 10647603 10522205 10512886 10616204 10637848
11608 10637848 10507568 10401081 10466048 10594580 10592500 10457640 10347084 10335065 10351021 10340099
11598A0340099N173N2033L5875m1336o9751r553L3753l1911j33895j30831j7499
11587A0032157O9709M9552q009j5061O285m684l1336k4472m543k3702o6216p9443
11575I900237o9246p1187o3446j1734L4362P679m2710j6941N4439M4362n3888
11564I711927j04070m8006J1771j165k4662j11K1045n010k6596j1559j6948n6530
11552I450086m1671M3488O0845n7556j55796q7319L7836L5085m4166j7475R0667
11541I314024P7747q2327j71940o8313P4789P7213j6316n3786j2860R712k9607
11530I118336p4061o4682j0798L1392J8883l1718n9084l8659k2572n5128q9043
11519H722866n7793M685J0379l8308n4003r164K7579P400m0032p2515p5220l6309
$$ plain form
11598 10340099 10345272 10397305 10433180 10391844 10322093 10312540 10346293 10314382 10180487 10049656 10032157
11587 10032157 10101866 10151418 10143409 10128348 10134633 10129949 10098613 10074141 10069598 10045896 9979680 9900237
11575 9900237 9830991 9759804 9696358 9684624 9718986 9726665 9683955 9667014 9721453 9765815 9711927
11564 9711927 9607857 9559851 9571622 9570457 9545795 9545684 9566729 9561719 9535123 9523564 9506616 9450086
11552 9450086 9408415 9451903 9512748 9455192 9299396 9212077 9249913 9284998 9240832 9223357 9314024
11541 9314024 9391771 9309444 9137504 9069191 9143980 9221193 9204877 9151091 9138231 9147943 9118336
11530 9118336 9044275 8979593 8968795 9000187 9019070 8987352 8928268 8889609 8867037 8811909 8722866
11519 8722866 8665073 8669758 8680137 8641829 8587826 8578662 8606241 8613641 8573609 8501094 8425874 8389565
11507H389565K9177M3678m1541j33940j00965K3171P3241N175m5545L088N0843
11496H295947k711r0753r8771m2954j8256m2591n3391j4097M9263Q5018N2698
11485H119402l2644q4590m4768R347l5583j27337r8695N7975J45388N4716p6513
11474G886698r5414m4317j8322J0548P1829O5461o0174j43213l4570J28660J09315
11463G876501n7738j28714l4760N3394L4242j603J2779J0903m0874o2254j3988
11452G647888K8299J5052p727j2694k7931k9261M1186J17429N6260j07383j52654
11441G568464m527J28491O8141p1959r2549j1118K5407K116R772L9902N056p4673
11429G592523q3646j205O6938N1281p173m7648n3860k9588M856M166l8675n2161
$$ plain form
11507 8389565 8418742 8462420 8420879 8286939 8185974 8209145 8282386 8287561 8242016 8245104 8295947
11496 8295947 8293236 8202483 8103712 8060758 8042502 7999911 7946520 7932423 7981686 8066704 8119402
11485 8119402 8086758 8002168 7957400 7966747 7931164 7803827 7705132 7763107 7908495 7963211 7886698
11474 7886698 7791284 7746967 7728645 7739193 7811022 7876483 7816309 7673096 7638526 7767186 7876501
11463 7876501 7818763 7690049 7655289 7708683 7742925 7741322 7754101 7765004 7724130 7661876 7647888
11452 7647888 7676187 7691239 7683512 7670818 7642887 7613626 7654812 7772241 7828501 7721118 7568464
11441 7568464 7563937 7692428 7760569 7688610 7596061 7584943 7610350 7612466 7622238 7662140 7667196 7592523
11429 7592523 7508877 7507672 7574610 7625891 7618718 7571070 7517210 7487622 7492478 7496644 7457969 7405808
11417G405808Q810O4346K1479n8286l4066Q9034J50302O6614n3323p2009K418
11406G591127O2020M6982q424l6830p367M5396N6639J4986j5648M442J9281k3799
11394G748805n9728k071Q5694O1186o0145j05470j8074M4046k9915j09103l3600
11383G521625J05619Q9931q5615j96584j18405J5120L7361k6263n5029l3951l2686
11372G221123n4556l8739J1807K4136j9085n1576l9938l1440n1886m9589M034
11361F924291M3416J2772l2321j9039R076l3341j07655r6329m506L1420l4453
11350F693331p5277j274Q1879L6133q5517j15878k3243N4994K3580m7618m5518
11339F495592K6562O5141P125q9333j11580l1077N2196L7510l2834l5664L5597
$$ plain form
11417 7405808 7414618 7478964 7500443 7442157 7408091 7497125 7647427 7714041 7660718 7588709 7591127
11406 7591127 7653147 7700129 7691705 7654875 7647508 7692904 7749543 7764529 7748881 7753323 7772604 7748805
11394 7748805 7689077 7687006 7772700 7833886 7773741 7668271 7650197 7694243 7664328 7555225 7521625
11383 7521625 7627244 7717175 7631560 7434976 7316571 7331691 7369052 7342789 7287760 7253809 7221123
11372 7221123 7166567 7127828 7139635 7163771 7144686 7093110 7053172 7021732 6969846 6920257 6924291
11361 6924291 6967707 6980479 6948158 6929119 6938195 6904854 6797199 6700870 6696364 6727784 6693331
11350 6693331 6618054 6616780 6698659 6734792 6649275 6533397 6510154 6565148 6588728 6541110 6495592
11339 6495592 6522154 6587295 6594420 6505087 6393507 6362430 6414626 6452136 6419302 6383638 6419235
11328F419235N3566k7959p8810k297Q8221M1577q0468r6154J0094P8821L5316
11317F441142k4428k2972m927j1040m633K1151M240n5485n9062K6486R1692N4155
11305F456319j2859j1302L0369L6538J9777L0359M9072L4459J0175R783K423l2015
11293F623098k8278N6750J33586R9055O025j7566K6592K6190m1171p3046j5635
11282F795600N6922O3004J0788m8590p8650n4935J2974N1851K442p5492p2055
11271F663859R91K2601l9578p3202q323O5145M4540k5255l8239K02p93n6382p9623
11258F475943j8624O4168P6327R572o0331o5936j6005K8574L0714Q890q659k6956
11246F497677n3548n7245q261N7656P3239L2950n303j0436p730j3015n267J7342
$$ plain form
11328 6419235 6472801 6444842 6366032 6363735 6451956 6493533 6413065 6316911 6327005 6405826 6441142
11317 6441142 6416714 6393742 6388815 6377775 6373142 6394293 6398533 6343048 6283986 6310472 6402164 6456319
11305 6456319 6443460 6432158 6462527 6499065 6518842 6549201 6598273 6632732 6642907 6652690 6655113 6623098
11293 6623098 6594820 6651570 6785156 6884211 6890236 6872670 6899262 6925452 6884281 6811235 6795600
11282 6795600 6852522 6915526 6926314 6877724 6799074 6744139 6757113 6808964 6811406 6735914 6663859
11271 6663859 6664850 6687451 6647873 6574671 6566348 6631493 6676033 6650778 6612539 6612741 6611948 6555566 6475943
11258 6475943 6457319 6521487 6597814 6607386 6547055 6481119 6465114 6493688 6524402 6533292 6524633 6497677
11246 6497677 6444129 6386884 6378623 6436279 6509518 6542468 6537165 6526729 6518999 6505984 6500717 6518059
11234F518059J8940r563k4670K373M4078O7473P2765N7955P983m8225l8237M6444
11222F715375J05606N7027m0146o1010J7091R5590R1780K8496j7714p373L6291
11211G021013O2083M1126m067k3310J217L4160L5595Q750j3593p003L1691Q2047
11199G269709J00333N7358j0138k6525K4379P1640N5009N879n525L5208Q5964
11188G663291J11441J06476P9029M5442K7104K9581M2159O3189R2295R9352N7329
11177H416688Q281K0418O6978M6489m1955o0905N5968J72477J38079J2030l5080
11166H799468K6739Q2667P5839N6678M7294J3717j9872K0088J08827J27060N1592
11155I390097N374O2845J35147J22471O5465N4936Q2840Q0209L9632J1337J9770
$$ plain form
11234 6518059 6536999 6527436 6502766 6505139 6549217 6616690 6689455 6747410 6755393 6707168 6668931 6715375
11222 6715375 6820981 6878008 6837862 6776852 6793943 6889533 6981313 7009809 6992095 6984722 7021013
11211 7021013 7083096 7124222 7120155 7096845 7098062 7132222 7167817 7176567 7162974 7155971 7187662 7269709
11199 7269709 7370042 7427400 7417262 7390737 7415116 7486756 7541765 7547644 7542119 7577327 7663291
11188 7663291 7774732 7881208 7960237 8005679 8032783 8062364 8104523 8167712 8260007 8359359 8416688
11177 8416688 8424969 8445387 8512365 8558854 8516899 8455994 8511962 8684439 8822518 8834548 8799468
11166 8799468 8826207 8908874 8984713 9041391 9088685 9102402 9082530 9102618 9211445 9338505 9390097
11155 9390097 9395471 9458316 9593463 9715934 9781399 9836335 9919175 9999384 10039016 10050353 10070123
11144A0070123N2144R1982J13547Q7393L3269J5477N0355Q2251Q3364R3355J18390
11133A0891650R5561K4269J8846J30705K26610J75158O2655O3860J64670J98781
11123A2052765J31720J06388J82685K29033J50277N7274R3951K15346K66933K08937
11113A3695309J36348J18005J30293J35941J33090J24913J13545J24115J72060
11104A4883619K12703J91093J38705J42083K03043K17885J38018O7965J23713
11095A6318827K49625K83460J89159J07502J43836K18635K09920J55141J85504
11086A8061609K98546L42740K49511J45600J67350K69348L12218K66180K18336
11077B0331438K19989K38501K48860K70435L02543L08448K81877K59904K55664
$$ plain form
11144 10070123 10122267 10214249 10327796 10415189 10448458 10463935 10514290 10596541 10679905 10773260 10891650
11133 10891650 10987211 11011480 11030326 11161031 11387641 11562799 11625454 11689314 11853984 12052765
11123 12052765 12184485 12290873 12473558 12702591 12852868 12910142 13004093 13219439 13486372 13695309
11113 13695309 13831657 13949662 14079955 14215896 14348986 14473899 14587444 14711559 14883619
11104 14883619 15096322 15287415 15426120 15568203 15771246 15989131 16127149 16195114 16318827
11095 16318827 16568452 16851912 17041071 17148573 17292409 17511044 17720964 17876105 18061609
11086 18061609 18360155 18702895 18952406 19098006 19265356 19534704 19846922 20113102 20331438
11077 20331438 20551427 20789928 21038788 21309223 21611766 21920214 22202091 22461995 22717659
11068B2717659K46010K38909K77716L53201L86179L38793K78833K82435L25316
11059B5445051L29796K84642K55812K88890L50804L75474L42321K99476L07915
11050B8280181L60355L78851L22025K64271L04898M14257M58452L87721L01482
11041C1472493K88450L04121K74370K25335K14671K12439J67421J32949J90193
11032C3482442K78320K51990J10677J9004O4531J42512J45578J26691J70927K24288
11022C5016960J87285J01213R1827J65374K07349J75242J49970J78196J99243
11013C6472659J71359J47628J65290J69807J23347Q6975J06529J13104M4787k2535
11003C7578950N90L9462l2990j58173j62467n6495m3752j82925k67261j53704
$$ plain form
11068 22717659 22963669 23202578 23480294 23833495 24219674 24558467 24837300 25119735 25445051
11059 25445051 25774847 26059489 26315301 26604191 26954995 27330469 27672790 27972266 28280181
11050 28280181 28640536 29019387 29341412 29605683 29910581 30324838 30783290 31171011 31472493
11041 31472493 31760943 32065064 32339434 32564769 32779440 32991879 33159300 33292249 33482442
11032 33482442 33760762 34012752 34123429 34142433 34206964 34349476 34495054 34621745 34792672 35016960
11022 35016960 35204245 35305458 35397285 35562659 35770008 35945250 36095220 36273416 36472659
11013 36472659 36644018 36791646 36956936 37126743 37250090 37337065 37443594 37556698 37601485 37578950
11003 37578950 37579540 37619002 37586012 37427839 37265372 37208877 37165125 36982200 36714939 36561235
10993C6561235o203l8551j79213k06231j02257l6773n4995l3894N7119R3448L4549
10982C6088234O281P4819J39072J34877J51159K32205K56008J54105P4185J43123
10972C7454068K25183J34559l5265m9787P1634P8841r6489k31178j78461r1000
10962C7282105j49322k73444k76887j68564j15323j75955k42768k27367j65923
10953C5486552j28528j24161j20140r2882m0799J5244L9915J9888j2926j7904
10943C5024259N278K3002Q427l7780q9309j11858j06787j34527k46921l92865
10933C3940919m56016m07833l54360l92810m87903n42905n33700n06384m87063
10924B9771945m66367m46463m37075m19786l71840l13276k83768k84760k84072
$$ plain form
10993 36561235 36555032 36516481 36337268 36131037 36028780 35992007 35937012 35903118 35960237 36053685 36088234
10982 36088234 36094515 36169334 36308406 36443283 36594442 36826647 37082655 37236760 37310945 37454068
10972 37454068 37679251 37813810 37778545 37728758 37800392 37879233 37782744 37551566 37373105 37282105
10962 37282105 37132783 36859339 36582452 36413888 36298565 36122610 35879842 35652475 35486552
10953 35486552 35358024 35233863 35113723 35020841 34980042 34995286 35035201 35055089 35042163 35024259
10943 35024259 35029537 35052539 35060966 35023186 34933877 34822019 34715232 34580705 34333784 33940919
10933 33940919 33484903 33077070 32722710 32329900 31841997 31299092 30765392 30259008 29771945
10924 29771945 29305578 28859115 28422040 28002254 27630414 27317138 27033370 26748610 26464538
10915B6464538k63923k31831k02405j93471k13074k31317k07612j64880j74319
10906B4581706k37535k65114k21225j94463k47550k96667k52291j88124k23011
10897B2455726l05004k88691j89522j65503k44350k73659j88791j29637j97556
10888B0473013k74545k17559r3653o6778j46194k06087j97665j87765k08100k04236
10878A8670431j45803q2944o9470r8062j26453j22826q6319n4654p2386j25169
10868A7686345j44711j07690p0071o4648m6100L30p464j06314j71467p9695P8006
10857A6966521J06680o964r0354n6936j869k275l181L4526L6775m0856j09958
10846A6832109r2430n0174o2463q0258k7845L8570J4616o9221r2416m1474k2196
$$ plain form
10915 26464538 26200615 25968784 25766379 25572908 25359834 25128517 24920905 24756025 24581706
10906 24581706 24344171 24079057 23857832 23663369 23415819 23119152 22866861 22678737 22455726
10897 22455726 22150722 21862031 21672509 21507006 21262656 20988997 20800206 20670569 20473013
10888 20473013 20198468 19980909 19887256 19820478 19674284 19468197 19270532 19082767 18874667 18670431
10878 18670431 18524628 18441684 18372214 18274152 18147699 18024873 17938554 17883900 17811514 17686345
10868 17686345 17541634 17433944 17363873 17299225 17253125 17253455 17245991 17139677 16968210 16888515 16966521
10857 16966521 17073201 17066237 16975883 16918947 16917078 16914803 16911622 16946148 16982923 16942067 16832109
10846 16832109 16739679 16689505 16627042 16546784 16518939 16557509 16572125 16502904 16410488 16369014 16346818
10835A6346818p9123j31938j13384o2866m5412n8638o1518m0671j5069q447l0560
10824A5699192n9686n3137r368N293n5405j30141j21945m0798Q037k4539p8079
10813A5139424r1777q0635p5589o6012m0385k1026k0567j7236l321l980k2013
10802A4696883k3537n144q969m0272m4335n195J3818j8110l3076J7416O3483L1847
10790A4644809j7559J0119P0521M8048l4297l3780P5748J46477Q2472k0087l2335
10779A4940136K9233P5607R3848J15195J13515N4274n272J7992R5671J26019R2030
10768A5748248P2887J02565J26488J11672R6992J07495J11812R6996R7800J16070
10758A6789025J01450N6166O3019J46992K04877J57507Q4656J01572J75121J92043
$$ plain form
10835 16346818 16267695 16135757 16022373 15959507 15914095 15855457 15793939 15753268 15738199 15729752 15699192
10824 15699192 15639506 15586369 15577001 15582294 15526889 15396748 15274803 15234005 15242042 15217503 15139424
10813 15139424 15047647 14967012 14891423 14825411 14785026 14764000 14743433 14726197 14722876 14718896 14696883
10802 14696883 14673346 14668202 14659233 14618961 14574626 14569431 14583249 14565139 14532063 14549479 14612962 14644809
10790 14644809 14627250 14637369 14707890 14755938 14721641 14687861 14763609 14910086 14992558 14972471 14940136
10779 14940136 14969369 15044976 15138824 15254019 15367534 15421808 15416536 15434528 15530199 15656218 15748248
10768 15748248 15821135 15923700 16050188 16161860 16258852 16366347 16478159 16575155 16672955 16789025
10758 16789025 16890475 16946641 17009660 17156652 17361529 17519036 17603692 17705264 17880385 18072428
10748A8072428J56493J67941K23837K11119J16151P8520J69692K63011K25661
10739A9684853J26598J27877K41564L25312K87956J84919J17030J26293J91521
10730B1413923K53930K51217J86638J47229J92764K59593K52247J93101J78657
10721B3329299K13611K12075J60657J45283J91320K12540J69759J51359K22060
10712B5007963L06970L16104K82722K77682K79549K44336K21686K70155L23807
10703B7530974K90132K33498K96152M51278N07924L89812K50337K49442L50034
10694C0549583M16495M08042L81835L79605L99380M30341M47118M14863L55105
10685C4182367L53262M43505N43058N64872N36938N33799N46963N22325M89246
$$ plain form
10748 18072428 18228921 18396862 18620699 18831818 18947969 19026489 19196181 19459192 19684853
10739 19684853 19811451 19939328 20180892 20506204 20794160 20979079 21096109 21222402 21413923
10730 21413923 21667853 21919070 22105708 22252937 22445701 22705294 22957541 23150642 23329299
10721 23329299 23542910 23754985 23915642 24060925 24252245 24464785 24634544 24785903 25007963
10712 25007963 25314933 25631037 25913759 26191441 26470990 26715326 26937012 27207167 27530974
10703 27530974 27821106 28054604 28350756 28802034 29309958 29699770 29950107 30199549 30549583
10694 30549583 30966078 31374120 31755955 32135560 32534940 32965281 33412399 33827262 34182367
10685 34182367 34535629 34979134 35522192 36087064 36624002 37157801 37704764 38227089 38716335
10676C8716335N36790O60635P39875O98507O10426N99985O92887Q10107Q71832
10667D4937379Q63075Q17630P80828P88362Q50968R44264J021969J051207J037617
10658E3093299J012950J002589J016866J067370J158914J256561J305214J309977
10650F2223740J343455J423332J449391J353513J250178J295329J425206J417661
10642G3181805J235272J103919J167250J267402J215402J094928J091776J165074
10634H2522828J139048J033194J025007J113707J105196R58114Q65310R14054
10626I0676458R34182Q12682P10673P85481R04707Q59682P11608O83171P99900
10617I7878544Q81123Q45876Q00743Q21613Q48490Q32410Q25104Q74634R53793
$$ plain form
10676 38716335 39253125 39913760 40653635 41352142 41962568 42562553 43255440 44065547 44937379
10667 44937379 45800454 46618084 47398912 48187274 49038242 49982506 51004475 52055682 53093299
10658 53093299 54106249 55108838 56125704 57193074 58351988 59608549 60913763 62223740
10650 62223740 63567195 64990527 66439918 67793431 69043609 70338938 71764144 73181805
10642 73181805 74417077 75520996 76688246 77955648 79171050 80265978 81357754 82522828
10634 82522828 83661876 84695070 85720077 86833784 87938980 88897094 89762404 90676458
10626 90676458 91610640 92423322 93133995 93919476 94824183 95683865 96395473 97078644 97878544
10617 97878544 98759667 99605543 100406286 101227899 102076389 102908799 103733903 104608537 105562330
10608A05562330J028510J096553J139630J135370J126207J176644J258759J285040
10600A14809043J254183J247504J276308J261224J180837J108710J071546J000716
10592A24210071Q63854P14164N67407L73233J63340O5535Q1147J6049k32076m70050
10582A26352674m70978l21642k94934m43688n56689n14077m52026n09996o15229
10573A22173415o33191n82199n59225n53800m87770l86295l54522l88747l56604
10564A17871062k09255q9925j41046k86121l26763k26025j54868k27007l25120
10555A15884932k85230j48842q7358j28930j30476k5074P7444R4413J13384K26811
10545A15591074L56445L82388L54442M19010N90092P50930Q58979R90187J169403
$$ plain form
10608 105562330 106590840 107687393 108827023 109962393 111088600 112265244 113524003 114809043
10600 114809043 116063226 117310730 118587038 119848262 121029099 122137809 123209355 124210071
10592 124210071 125073925 125788089 126355496 126728729 126892069 126957604 127038751 127054800 126822724 126352674
10582 126352674 125881696 125560054 125265120 124821432 124264743 123750666 123298640 122788644 122173415
10573 122173415 121540224 120958025 120398800 119845000 119357230 118970935 118616413 118227666 117871062
10564 117871062 117661807 117571882 117430836 117144715 116817952 116591927 116437059 116210052 115884932
10555 115884932 115599702 115450860 115363502 115234572 115104096 115079022 115156466 115250879 115364263 115591074
10545 115591074 115947519 116329907 116684349 117103359 117693451 118444381 119303360 120293547 121462950
10536A21462950J303743J324131J272244J194992J048628P61660L23189k26721
10528A28464816q27770j399408j885436k316566k746026l112363l275573l222566
10520A09679108l118703l096849l107774l054193k959035k894139k834601k710621
10512H5903193k545020k415222k316327k179730k005127j862629j773083j686720
10504F9119335j577770j470783j376107j282598j208221j177487j160621j117904
10496E8747844j083162j105772j134284j081100r93266j012142j139926j200994
10488D9997198j097337r58434r41945j006484j002566r01959q07573p86421q09673
10479D1684806q29132q16445p53655o69662o49978p22948p79705p08505n66834
$$ plain form
10536 121462950 122766693 124090824 125363068 126558060 127606688 128368348 128691537 128464816
10528 128464816 127637046 126237638 124352202 122035636 119289610 116177247 112901674 109679108
10520 109679108 106560405 103463556 100355782 97301589 94342554 91448415 88613814 85903193
10512 85903193 83358173 80942951 78626624 76446894 74441767 72579138 70806055 69119335
10504 69119335 67541565 66070782 64694675 63412077 62203856 61026369 59865748 58747844
10496 58747844 57664682 56558910 55424626 54343526 53350260 52338118 51198192 49997198
10488 49997198 48899861 47941427 46999482 45992998 44990432 44088473 43280900 42494479 41684806
10479 41684806 40855674 40039229 39285574 38615912 37965934 37242986 36463281 35754776 35187942
10470C5187942n01319n29469n39329m91369m63487m78503m53014l72753l57379
10461C1001320m57541n31643m51689l15699l03236m02113m47285l86872l32778
10452B7372464l49039l60637l11968k67696k88313l23321l06821k66623k58332
10443B4639714k68143k62342k65683l04256l27705k81252k10940k00687k38242
10434B2280464k46011k22448k38451k92644k89998j97928j17776j42890k27627
10425B0304691k65762k38340k09959k17262k32940k23715j87611j41669j12765
10416A8474668j27116j73974j99414j72931j36886j46670j84683j86822j40607
10407A7005565r9522j01944j30759j58353j78197j79271j41817q2349n8014r4371
$$ plain form
10470 35187942 34686623 34157154 33617825 33126456 32662969 32184466 31731452 31358699 31001320
10461 31001320 30543779 30012136 29560447 29244748 28941512 28539399 28092114 27705242 27372464
10452 27372464 27023425 26662788 26350820 26083124 25794811 25471490 25164669 24898046 24639714
10443 24639714 24371571 24109229 23843546 23539290 23211585 22930333 22719393 22518706 22280464
10434 22280464 22034453 21812005 21573554 21280910 20990912 20792984 20675208 20532318 20304691
10425 20304691 20038929 19800589 19590630 19373368 19140428 18916713 18729102 18587433 18474668
10416 18474668 18347552 18173578 17974164 17801233 17664347 17517677 17332994 17146172 17005565
10407 17005565 16906043 16804099 16673340 16514987 16336790 16157519 16015702 15933353 15875339 15780968
10397A5780968j42552j42271j01804p8453r5005j15039j01760o8483n5723p5298
10387A4804580r7262r1985o8074n5354o0273o2337n5170n9757q3423r9234r1498
10376A3980213q7534j06457j11018o6727k2531n7388j52568k00108j53210q4631
10366A2938041o3756o2024l7307l0896r2201j62165j37963l4117K4367k3496r9868
10355A2218615j13280p6186n3506n8156n5493l4668k1083l2380n9041p9500p2894
10344A1562428l3435J0251J3412k7894o6131o9540o2863o9194n7061l123K9771
10333A1226621l7333j57242j79180m6866J05380J13288j6332j34837j44952q4656
10323A0643891l1291p837m342k1346m9959n3914j5279K8808L0796p212m8010p0354
$$ plain form
10397 15780968 15638416 15496145 15394341 15315888 15220883 15105844 15004084 14935601 14879878 14804580
10387 14804580 14707318 14615333 14547259 14491905 14431632 14369295 14314125 14254368 14170945 14071711 13980213
10376 13980213 13892679 13786222 13675204 13608477 13585946 13528558 13375990 13175882 13022672 12938041
10366 12938041 12874285 12812261 12774954 12744058 12651857 12489692 12351729 12317612 12341979 12318483 12218615
10355 12218615 12105335 12029149 11975643 11917487 11861994 11827326 11806243 11773863 11714822 11635322 11562428
10344 11562428 11528993 11539244 11552656 11524762 11458631 11389091 11326228 11257034 11199973 11196850 11226621
10333 11226621 11189288 11032046 10852866 10806000 10911380 11024668 11008336 10873499 10728547 10643891
10323 10643891 10612600 10604763 10600421 10579075 10529116 10475202 10459923 10488731 10519527 10512315 10464305 10393951
10311A0393951p2729m9928o475K2903R106k3838k7744N22K0403J1623r175l1585
10299A0237034n7737o3096j3106O3682Q3250K0697m1824k8972J8820J3892l9910
10288A0192730n5874M40O3251O7186L0175O389O229M224l798K248J9478J2331
10276A0345009l5067q0343o3281J6845Q9769R4032M7529J3559J4513J9150Q531
10265A0470246L340J6231K8663L5096N7682Q8801P6354R466l7332m235N9055O8922
10253A0872289L5197K9120N5833N5591J9249K463K0776K8092J4589K8435P3702
10242A1235336Q4472M1113J7740O0426J07215R5271O4704P6595J01908Q5726O3149
10231A2033655J05534J87511K14533J68109J24257J29129J49371J56694J75073
$$ plain form
10311 10393951 10321222 10271294 10264819 10287722 10296828 10272990 10245246 10245768 10266171 10277794 10268619 10237034
10299 10237034 10179297 10116201 10103095 10166777 10250027 10270724 10228900 10199928 10218748 10232640 10192730
10288 10192730 10136856 10137296 10200547 10267733 10297908 10304297 10310526 10314750 10310952 10313200 10332678 10345009
10276 10345009 10309942 10229599 10166318 10183163 10272932 10366964 10414493 10428052 10442565 10461715 10470246
10265 10470246 10473586 10489817 10518480 10553576 10611258 10700059 10776413 10785879 10748547 10744312 10803367 10872289
10253 10872289 10907486 10936606 10992439 11048030 11067279 11069742 11090518 11118610 11133199 11161634 11235336
10242 11235336 11319808 11360921 11378661 11439087 11546302 11641573 11706277 11782872 11884780 11970506 12033655
10231 12033655 12139189 12326700 12541233 12709342 12833599 12962728 13112099 13268793 13443866
10222A3443866K18670K53977K54885K41918K40153K43706K44547K55931K84813
10213A5682466L12287L16190K87178K20997J29034N4861L6496M6472J3021q8346
10203A7010656k01373k54558k26463j47540p8128q0057j57803k27131k00709j10297
10193A5326597p6618j41969k08442j78826q7375l3945m4397o5674o5323o3793
10183A4360235p6458q2813o1923k2700Q497J2603n812j4994J6816P6802J09995
10172A4320248Q3744L0666R266M0528R9733J51147J74232J72966J70704J80002
10162A5433236J80176J53603J33668J65383K22203K32172J97096K00440K64309
10153A7182286K93129K22635J36948J46246K15162K18819J25614J5958n3173r3656
$$ plain form
10222 13443866 13662536 13916513 14171398 14413316 14653469 14897175 15141722 15397653 15682466
10213 15682466 15994753 16310943 16598121 16819118 16948152 17003013 17039509 17085981 17099002 17010656
10203 17010656 16809283 16554725 16328262 16180722 16102594 16022537 15864734 15637603 15436894 15326597
10193 15326597 15249979 15108010 14899568 14720742 14633367 14599422 14555025 14489351 14424028 14360235
10183 14360235 14283777 14200964 14139041 14116341 14124838 14137441 14131629 14116635 14133451 14210253 14320248
10172 14320248 14403992 14434658 14443924 14484452 14584185 14735332 14909564 15082530 15253234 15433236
10162 15433236 15613412 15767015 15900683 16066066 16288269 16520441 16717537 16917977 17182286
10153 17182286 17475415 17698050 17834998 17981244 18196406 18415225 18540839 18556797 18503624 18409968
10143A8409968j11084r1984o4140o9089p4761j7686O8505Q2234K2618K028N9867
10132A8216476R8612O2862M6534J30063K29453K26054J55192J34624J73211J91404
10122A9664485J86155K23573K82822K63298J67896J32516K19889L11343K83065
10113B1735042J87856J62292K24648K75906K65665K45986K60395K76674K59258
10104B3893722K36045K49316K87091L09128L10679L13571L13746K91862K73257
10095B6478417L15941M14214M70042M14391L21829L29618M47278N30059M73596
10086C0195385L59813L43907M46793N47065N62780N46525N75935O30303O34299
10077C4842805N80530N42764N74868O47597O96725P00486O89336O94801P11270
$$ plain form
10143 18409968 18298884 18206900 18142760 18073671 17998910 17981224 18049729 18131963 18154581 18156609 18216476
10132 18216476 18315088 18377950 18424484 18554547 18784000 19010054 19165246 19299870 19473081 19664485
10122 19664485 19850640 20074213 20357035 20620333 20788229 20920745 21140634 21451977 21735042
10113 21735042 21922898 22085190 22309838 22585744 22851409 23097395 23357790 23634464 23893722
10104 23893722 24129767 24379083 24666174 24975302 25285981 25599552 25913298 26205160 26478417
10095 26478417 26794358 27208572 27678614 28093005 28414834 28744452 29191730 29721789 30195385
10086 30195385 30555198 30899105 31345898 31892963 32455743 33002268 33578203 34208506 34842805
10077 34842805 35423335 35966099 36540967 37188564 37885289 38585775 39275111 39969912 40681182
10068D0681182P12564O93507O78739O86832P02109O97799O76407O64340O70742
10059D6864221O79218O83568P01212P38300P71485P87101Q12459Q75337R49482
10050E3862383R80955R64855R54324R84498J026797J038884J025647J018728J020568
10041F2877639J008761R83350R66246R54645R19233Q59143Q16451Q14743Q19571
10032G1019782P87571P24565O64968O21937N90220N69089N46618M96096M33236
10023G6454082M33664N25947O10150N80335N00405N30437O76263P66151P26641
10014H1804075P16963Q75898J080718J132572J084936J170465J427269J626585
10006I0919481J622931J571379J684180J928921K119375K205453K304785K483824
$$ plain form
10068 40681182 41393746 42087253 42765992 43452824 44154933 44852732 45529139 46193479 46864221
10059 46864221 47543439 48227007 48928219 49666519 50438004 51225105 52037564 52912901 53862383
10050 53862383 54843338 55808193 56762517 57747015 58773812 59812696 60838343 61857071 62877639
10041 62877639 63886400 64869750 65835996 66790641 67709874 68569017 69385468 70200211 71019782
10032 71019782 71807353 72531918 73196886 73818823 74409043 74978132 75524750 76020846 76454082
10023 76454082 76887746 77413693 78023843 78604178 79104583 79635020 80311283 81077434 81804075
10014 81804075 82521038 83396936 84477654 85610226 86695162 87865627 89292896 90919481
10006 90919481 92542412 94113791 95797971 97726892 99846267 102051720 104356505 106840329
9998A06840329K666121K778771K871043L034036L269668L493770L644745L754567
9990A32353050L912047M163561M457608M704212M886273N077664N344162N673546
9982A70572123O025422O396692O796262P199942P579059P936446Q265537Q511653
9974B29283136Q623929Q601505Q427925Q008418P255474O207438M982610L645548
9966B85035983K204610P06570p75665k227232l639660m887711n810273o439778
9958B64166844o992595p567421q006520q155782q117124q094715q096930p969230
9950B01166527p670443p333597p052351o770021o417687o030609n672283n343141
9942A48876395n021322m717058m436663m158708l889727l681490l550852l442719
$$ plain form
9998 106840329 109506450 112285221 115156264 118190300 121459968 124953738 128598483 132353050
9990 132353050 136265097 140428658 144886266 149590478 154476751 159554415 164898577 170572123
9982 170572123 176597545 182994237 189790499 196990441 204569500 212505946 220771483 229283136
9974 229283136 237907065 246508570 254936495 262944913 270200387 276407825 281390435 285035983
9966 285035983 287240593 287947163 287171498 284944266 281304606 276416895 270606622 264166844
9958 264166844 257174249 249606828 241600308 233444526 225327402 217232687 209135757 201166527
9950 201166527 193496084 186162487 179110136 172340115 165922428 159891819 154219536 148876395
9942 148876395 143855073 139138015 134701352 130542644 126652917 122971427 119420575 115977856
9934A15977856l315212l199816l127317l055175k932732k790770k694677k639634
9926I2222523k563492k447773k338670k269169k217179k149295k063151j975346
9918G4198448j897107j830226j767915j698101j618058j539152j469404j407984
9910F0970501j362341j339762j312223j235473j125308j058502j059750j052733
9902E1424409r84416r27362r61684j012510r39120p67123o81282p59898q60253
9893D3530761q31929p16587o44990o43123o53130o62448o83905o67235n69844
9884C7457570m80650n24252o47508o58030n07009l80052m30850n57632n61820
9875C2709767m36419l52617l97657m73504m73840m33728m36609m60414m16239
$$ plain form
9934 115977856 112662644 109462828 106335511 103280336 100347604 97556834 94862157 92222523
9926 92222523 89659031 87211258 84872588 82603419 80386240 78236945 76173794 74198448
9918 74198448 72301341 70471115 68703200 67005099 65387041 63847889 62378485 60970501
9910 60970501 59608160 58268398 56956175 55720702 54595394 53536892 52477142 51424409
9902 51424409 50439993 49512631 48550947 47538437 46599317 45832194 45150912 44391014 43530761
9893 43530761 42698832 41982245 41337255 40694132 40041002 39378554 38694649 38027414 37457570
9884 37457570 36976920 36452668 35805160 35147130 34640121 34260069 33829219 33271587 32709767
9875 32709767 32273348 31920731 31523074 31049570 30575730 30142002 29705393 29244979 28828740
9866B8828740l10606k65712l48792m58160m47523l25974k46061k89737l61404
9857B5774771l41102k59254k31300k75069l05066k86207k73420k90744k90019
9848B3222590k60331k62503l05687l05202k31396j84906k31389k74907k18267
9839B0948002j45514j86936k82255k68125j59337j32278k25613k76756k07474
9830A9063714j56428k25841k94004k27792j17526j19312j89456j80159j13814
9821A7439382j37952k42490k52513j24599l6706j13017k39208k51132j64188j01039
9811A5776538j01042j20563j42419j69506j67535j19966r1366j34689j82745j42852
9801A4403855o1037o4246j53553j93147j25490o2631j04608j81245j66205p1778
$$ plain form
9866 28828740 28518134 28252422 27903630 27445470 26997947 26671973 26425912 26136175 25774771
9857 25774771 25433669 25174415 24943115 24668046 24362980 24076773 23803353 23512609 23222590
9848 23222590 22962259 22699756 22394069 22088867 21857471 21672565 21441176 21166269 20948002
9839 20948002 20802488 20615552 20333297 20065172 19905835 19773557 19547944 19271188 19063714
9830 19063714 18907286 18681445 18387441 18159649 18042123 17922811 17733355 17553196 17439382
9821 17439382 17301430 17058940 16806427 16681828 16645122 16532105 16292897 16041765 15877577 15776538
9811 15776538 15675496 15554933 15412514 15243008 15075473 14955507 14864141 14729452 14546707 14403855
9801 14403855 14342818 14278572 14125019 13931872 13806382 13743751 13639143 13457898 13291693 13219915
9791A3219915k3697p5884j50955j66560j37704j24916j37182j31088q7269m8449
9781A2136211o7908j32527j63240j10802l0879j9718p8857j09435o6701m1722
9771A1314422j17317k07646j60232J876P9990k3502j62799j64448o8632l1119
9761A0460593p1024p7948l1589l2460r7635j06454j5952L6945m1798j25359o2974
9750I834345N9891M8678p9707j17599J107J05808P2139k934j815J8177l5224r8333
9738I804533o5127Q896r658j08695j64062j54302j62320j82544j22306j3382j7903
9727H813130j56690k27503j09956K2250m1483k13124k34541p1248M6025k4572
9717G802288j49838j54151o6220k4558n6685q1768o7283n8559p5675q4802p2269
$$ plain form
9791 13219915 13196218 13120334 12969379 12802819 12665115 12540199 12403017 12271929 12184660 12136211
9781 12136211 12068303 11935776 11772536 11661734 11630855 11611137 11532280 11422845 11356144 11314422
9771 11314422 11197105 10989459 10829227 10831103 10911093 10887591 10724792 10560344 10491712 10460593
9761 10460593 10389569 10311621 10280032 10247572 10149937 10043483 10027531 10064476 10022678 9897319 9834345
9750 9834345 9894236 9942914 9863207 9745608 9746715 9852523 9924662 9921728 9919913 9938090 9902866 9804533
9738 9804533 9739406 9748302 9738644 9629949 9465887 9311585 9149265 8966721 8844415 8831033 8813130
9727 8813130 8656440 8428937 8318981 8341231 8299748 8086624 7852083 7780835 7826860 7802288
9717 7802288 7652450 7498299 7432079 7407521 7350836 7269068 7201785 7143226 7067551 6982749 6910480
9706F910480o5373p2054o8007n2646n3740o5138m7762j2945k9062j01946j25162
9695F216645k7059Q9348O2648q8180j65090o3173P5872O3563p0656j33654m6767
9684E913497O3510O3884j8305p6615p8483o2942n1952m4597n6870q9707q9223
9673E472197j7943N8246M0162n7533j18319q6776k9319j4793k6845l0485l6822
9662E151770m9662l0028K0698J9548p3289j55690j10415J8025Q4116M6086j0619
9651D910540l6730o8896j05145p5869J2381M0532l8019r9306l8655N1603K7760
9640D580196o7612p6853R402M0332l8359r3764k8551N8640L2284p1925j12205
9629D231585m6957L2873M3706q771o9698q6780l8369L4049M7174j7451o7593k7050
$$ plain form
9706 6910480 6845107 6773053 6705046 6652400 6598660 6533522 6485760 6472815 6443753 6341807 6216645
9695 6216645 6189586 6278934 6341582 6253402 6088312 6025139 6101011 6164574 6093918 5960264 5913497
9684 5913497 5977007 6040891 6022586 5945971 5867488 5804546 5752594 5707997 5651127 5561420 5472197
9673 5472197 5454254 5512500 5552662 5495129 5376810 5290034 5260715 5245922 5219077 5188592 5151770
9662 5151770 5102108 5072080 5092778 5112326 5039037 4883347 4772932 4790957 4875073 4921159 4910540
9651 4910540 4873810 4804914 4699769 4623900 4636281 4676813 4638794 4539488 4500833 4552436 4580196
9640 4580196 4512584 4435731 4445133 4485465 4447106 4353342 4324791 4383431 4415715 4343790 4231585
9629 4231585 4184628 4217501 4261207 4252436 4182738 4095958 4057589 4091638 4138812 4121361 4053768 4026718
9617D026718L8337J3606q0638j12105m0350K7146J0093l2203k2087N978j7130
9606C817365o2046m7824J6838M1601k510l8641m192N2870L9818n1487j24150q9335
9594C548307K1172Q1178K0484p9598q6318L296N5344q422r5810q1796R691N2626
9582C440154P292m1894k8930J3287L1559K3058k995n5123j08587r5063j57Q2987
9570C265588O1883l0097q0737m6704J1756L2768K0810K502k3505n9000o9885k4472
9558C060907M4397O0799K448n7821l9467L4384O1499L012n6566l1652L2864K5846
9546C140650n7412r8308k6241P7589R2225J0635p2407q3089k7720L8679N7033
9535C051634N454o5504p1773m989M4014J5467k6788l991L7805J598q5839j00430
$$ plain form
9617 4026718 4065055 4078661 3998023 3885918 3845568 3872714 3882807 3850604 3828517 3834495 3817365
9606 3817365 3755319 3707495 3724333 3765934 3763424 3724783 3720591 3773461 3813279 3761792 3637642 3548307
9594 3548307 3569479 3650657 3671141 3591543 3505225 3508521 3563865 3555443 3459633 3377837 3387528 3440154
9582 3440154 3447446 3405552 3376622 3389909 3421468 3444526 3441531 3386408 3277821 3182758 3182601 3265588
9570 3265588 3327471 3297374 3216637 3169933 3181689 3214457 3235267 3237769 3214264 3155264 3085379 3060907
9558 3060907 3105304 3166103 3168551 3110730 3071263 3105647 3167146 3170158 3113592 3081940 3114804 3140650
9546 3140650 3083238 2984930 2958689 3036278 3128503 3139138 3066731 2983642 2955922 2994601 3051634
9535 3051634 3057088 2991584 2919811 2914822 2958836 2974303 2947515 2943524 2981329 2982927 2897088 2796658
9523B796658j7383N0242L5094Q372L3633M8589j7934j04985j03948k3964L5221
9512B739595L6895K7359K5196p17m3544n0569j7617P03m151K5698R3751J06349
9500B938948J7150p0627m1329N2799O4311k1644o4092P874P8064K8868o2683m0176
9488B887463P8144J15227J0653p7491j5491R6336Q0657m0861q6413N522J00050
9477C153796Q6337K0245o401j831n03K5893Q3084Q4688j2386r1350l3481P6366
9465C384457O1366p1757j43360p9730j845p158l7814k8355k2818n4752n4087J5960
9453B960107N4081k0444j11298q9391n483K13o3482o6177P500L1051m1274r5654
9441B559749n1289J4346M667m8753o1573l0909r618r480o868r47k929k941K654
$$ plain form
9523 2796658 2779275 2829517 2864611 2872983 2906616 2955205 2937271 2832286 2728338 2704374 2739595
9512 2739595 2776490 2803849 2829045 2828328 2784784 2734215 2716598 2717301 2713150 2738848 2832599 2938948
9500 2938948 2956098 2885471 2844142 2896941 2961252 2939608 2875516 2883390 2961454 2990322 2927639 2887463
9488 2887463 2965607 3080834 3091487 3013996 2998505 3094841 3175498 3134637 3048224 3053746 3153796
9477 3153796 3240133 3260378 3253977 3252146 3251643 3277536 3360620 3445308 3432922 3341572 3308091 3384457
9465 3384457 3445823 3374066 3230706 3150976 3149131 3141973 3104159 3075804 3052986 2998234 2944147 2960107
9453 2960107 3014188 2993744 2882446 2793055 2787572 2787785 2724303 2658126 2665626 2696677 2655403 2559749
9441 2559749 2508460 2522806 2527473 2478720 2417147 2386238 2376620 2367140 2360272 2359325 2356396 2353455 2356109
9428B356109j2105n5096q4255o5996k7041p932n206j27j854j7463k0899M74Q183
9415B066792k8279p1863o9820l1820m043L308R704J4818P791n42j855j4991m1631
9402A837569m0767m49J8015k3902n9339j7858M5763L7122q702J6696Q9667O6871
9390A960686p3590j63688q4379O2325J08942M1103l6478o3553n0589j0616L3439
9379A723602K6670l8519p1847p280P7324O7055j2100m2019m254J1208k3257l5065
9367A671518N6J0396l0288m3253J1338M9141L149n2436k2497M6134M1260k8527
9355A655991n2725k647L2066K513k3357J1708M8303M055q8357j18053m7837M1172
9343A462832O0686J8973p999J8869N4366K8314n9827j23430q0965M0615J21620
$$ plain form
9428 2356109 2344004 2288908 2204653 2138657 2111616 2103684 2098478 2098351 2096497 2079034 2058135 2058609 2066792
9415 2066792 2038513 1966650 1896830 1865010 1860967 1864275 1873979 1888797 1896588 1896046 1894191 1879200 1837569
9402 1837569 1796802 1796353 1814368 1790466 1731127 1713269 1759032 1796154 1787452 1804148 1893815 1960686
9390 1960686 1887096 1723408 1639029 1701354 1810296 1851399 1814921 1751368 1700779 1690163 1723602
9379 1723602 1750272 1711753 1639906 1632626 1709950 1777005 1764905 1722886 1718632 1729840 1706583 1671518
9367 1671518 1671574 1681970 1651682 1608429 1619767 1668908 1672057 1619621 1597124 1643258 1684518 1655991
9355 1655991 1603266 1600619 1632685 1635198 1611841 1623549 1671852 1675907 1587550 1469497 1421660 1462832
9343 1462832 1523518 1542491 1534492 1553361 1607727 1636041 1576214 1452784 1371819 1412434 1534054
9332A534054P9334m0402j19287r5574j1980N2384O3982M4197K5221J5403J788
9321A549120k3244m1993k7338J5828M2694K2556j4468j5844J8573M0693K9858
9310A596435J4572J1480O16j7138k071M5078N1551j7962q0236m5884L4326L9949
9298A630716k8886n1551J9776Q8354O5332j4941p5324r1727o1693K0119R7376
9287A597551O9133n5063j22793m9322M7679L2596l9183l7766J3955M091m6927
9276A413951k5115N1675N1911k9409n4806Q629L3788k6563n3535O847L3615l8917
9264A372071q0929N69P5189J1409p8500k4860R8440R3365k9644q3662k4544Q481
9252A337385l2865l2280N1011Q9167R160p5521n0834K8249M9732O823l9377o0314
$$ plain form
9332 1534054 1613388 1572986 1453699 1358125 1346145 1398529 1462511 1506708 1531929 1547332 1549120
9321 1549120 1525876 1483883 1456545 1472373 1515067 1537623 1523155 1507311 1525884 1566577 1596435
9310 1596435 1611007 1622487 1623103 1605965 1603894 1648972 1700523 1682561 1602325 1556441 1590767 1630716
9298 1630716 1601830 1550279 1570055 1658409 1723741 1708800 1633476 1541749 1480056 1500175 1597551
9287 1597551 1666684 1611621 1488828 1439506 1487185 1519781 1480598 1442832 1456787 1460878 1413951
9276 1413951 1388836 1440511 1492422 1463013 1408207 1416836 1450624 1424061 1370526 1377373 1410988 1372071
9264 1372071 1291142 1291711 1366900 1378309 1299809 1274949 1373389 1466754 1437110 1353448 1328904 1337385
9252 1337385 1304520 1272240 1323251 1412418 1421578 1346057 1295223 1323472 1373204 1380027 1340650 1280336
9240A280336m8855L108N7057M7034q969j8861K3947J7496n8709p7793K2350J07361
9228A345502N0621n8781o2442J5168L0360l2541n6455m811L1540N965j5804J2241
9216A260563L9836J6566k9059m4901k1679J8148M3453K4196k7496m2132J5932
9205A253427P0996L5932m0545l8749L4679M8274l8150r7459l0438Q2740J05924
9194A386631L1272m5828o8777n0340q297M5739P7303N7636J0343j8236k0727k1836
9182A374883k8804k7374j3113M509J7409J7978J516j5950r512J1223P134k3437
9170A316462k7615K0887O7377M7642j8651n6166l6453k858K207q251N155M8332
9158A358068P8289M9391k5212p3131m4087K0709L4932k1758p9621o8547P892R1939
$$ plain form
9240 1280336 1231481 1234589 1291646 1338680 1329711 1310850 1334797 1352293 1293584 1215791 1238141 1345502
9228 1345502 1396123 1337342 1274900 1290068 1320428 1287887 1231432 1226621 1258161 1264126 1248322 1260563
9216 1260563 1300399 1316965 1287906 1243005 1221326 1239474 1282927 1307123 1279627 1237495 1253427
9205 1253427 1324423 1360355 1319810 1281061 1315740 1364014 1325864 1228405 1197967 1280707 1386631
9194 1386631 1417903 1372075 1303298 1252958 1244661 1290400 1367703 1425339 1435682 1417446 1396719 1374883
9182 1374883 1346079 1318705 1305592 1310101 1327510 1345488 1347004 1331054 1321542 1332765 1339899 1316462
9170 1316462 1288847 1309734 1377111 1424753 1406102 1349936 1313483 1310625 1312832 1304581 1309736 1358068
9158 1358068 1436357 1485748 1460536 1387405 1343318 1364027 1398959 1377201 1297580 1229033 1236925 1328864
9146A328864J24693P9364j2583o9324m3201R362M739l5643k0775M5344N4379k1442
9134A443777o4996q84P5923N2976k4476m5674j2937n6m142K1924M2778o704p6325
9121A401184n7666L0958O5971K0360q881J4569J2826m1030n9716k551M1990R452
9109A427466l1852j0932K1606l198m3585k7125J9408K6842O632J1817K6446r29
9097A422596m9246n0677l856K6321J0353j7056k0008L937L6801M4603p06o5495
9085A337567p0345n263L9133J2681q802L6251O5603r707j01078n9349P1563J02529
9073A410783o233q7952l9912L1767J1464m2886k2731M7283O6102J5204m3114o6183
9061A273592m6424J3549O8302L9894o3585j13959l3699P4821P2728j3113n1572
$$ plain form
9146 1328864 1453557 1532921 1520338 1451014 1407813 1417175 1421914 1386271 1365496 1410840 1465219 1443777
9134 1443777 1378781 1377897 1453820 1506796 1482320 1436646 1423709 1423653 1419511 1441435 1484213 1477509 1401184
9121 1401184 1343518 1374476 1440447 1460807 1451926 1466495 1479321 1438291 1378575 1376024 1418014 1427466
9109 1427466 1395614 1384682 1406288 1403090 1359505 1332380 1351788 1378630 1385262 1397079 1423525 1422596
9097 1422596 1373350 1322673 1318817 1345138 1355491 1338435 1318427 1322364 1359165 1403768 1403062 1337567
9085 1337567 1267222 1261959 1301092 1313773 1304971 1341222 1406825 1397118 1296040 1236691 1308254 1410783
9073 1410783 1404550 1316598 1276686 1308453 1319917 1277031 1254300 1301583 1367685 1382889 1339775 1273592
9061 1273592 1227168 1240717 1309019 1348913 1285328 1171369 1137670 1212491 1285219 1272106 1220534
9050A220534j4367J5375P623J2086K6945j1833q8638r5148n933N7402N851p7480
9038A052417o2563L8913J01922O1694k3006o2436l1740K0865L0382j0839l1580
9027A084029K7609J05169P5272o3804j52222q0214N1405P5993l780m5957L657
9016A077157N0544K2070k9323l3400p637K949R327L3315L9975r728p5339p7921
9004A001989r950N4428N4983O243l6489l7007l142K4216J0936k6289l2814Q264
8992A015368M2059J7326l3064l8251J353J4703k6417o0498l1155K5130L4202l729
8980I57027j4719L6697Q5713M7360o1486j19666m0230J08225J59474M3026j18560
8969A082861j48268k9490P9963N5800m1305o8198J605O0665L4138k4862l4080
$$ plain form
9050 1220534 1206167 1221542 1229165 1241251 1268196 1256363 1167725 1072577 1066644 1124046 1129897 1052417
9038 1052417 989854 1028767 1130689 1192383 1169377 1106941 1075201 1096066 1126448 1115609 1084029
9027 1084029 1111638 1216807 1292079 1228275 1076053 995839 1047244 1123237 1119457 1073500 1077157
9016 1077157 1127701 1149771 1120448 1087048 1079411 1082360 1091687 1125002 1164977 1155249 1079910 1001989
9004 1001989 992039 1046467 1101450 1107693 1071204 1034197 1031055 1055271 1066207 1039918 1007104 1015368
8992 1015368 1057427 1074753 1041689 1003438 1004791 1019494 993077 932579 901424 926554 960756 957027
8980 957027 942308 979005 1064718 1112078 1050592 930926 890696 998921 1158395 1201421 1082861
8969 1082861 934593 905103 985066 1040866 999561 931363 932968 993633 1027771 1002909 968829
8958I68829k885M779j7843k0674Q157K6356K2665L7550P0566N0560m1960r9406
8946A006694k9221Q1666O8916n9160j15934j0477J14977R8919j1039n9616k2877
8935A062848l224l3914l9768J1138N3379M5146K7424K8798J4946k5574m0544q760
8923A091895J0508k0917m6132l902O9916R5311N2992j7011p3593q4496l0369N2527
8911A096729Q4270M0145j5221k9098k7322l7525k8445J5513M3008K6262J5566
8900A183882L2555J2831n6087o1327M6533J17335K1528j08369o7599P8730R5970
8889A295982k5732o4692L5389O8617n2245j19559J0155J47589P5042r2521j01176
8878A176849L7744J02637L1089k9155m522J3451k6510m9982j5372J5882J2088
$$ plain form
8958 968829 965944 970723 952880 932206 940363 966719 989384 1026934 1097500 1148060 1106100 1006694
8946 1006694 977473 1059139 1128055 1068895 952961 942484 1057461 1156380 1145341 1085725 1062848
8935 1062848 1059624 1025710 985942 997080 1050459 1095605 1123029 1151827 1166773 1141199 1100655 1091895
8923 1091895 1102403 1081486 1035354 1031452 1101368 1196679 1249671 1232660 1159067 1074571 1044202 1096729
8911 1096729 1180999 1221144 1205923 1176825 1149503 1111978 1083533 1099046 1142054 1168316 1183882
8900 1183882 1216437 1229268 1173181 1111854 1158387 1275722 1297250 1188881 1121282 1200012 1295982
8889 1295982 1270250 1205558 1240947 1309564 1257319 1137760 1147915 1295504 1370546 1278025 1176849
8878 1176849 1214593 1317230 1348319 1319164 1314642 1328093 1301583 1251601 1236229 1252111 1264199
8867A264199K4129O0255M6181l5585q7684m0712M4427P4424M1771m340l1811k6031
8855A329223J8688O9504P3615L3381O322J3075J1574j6891k7539R762N3706M9668
8843A624088O87m5296m5904M299N8820M9427k3015n9658N006Q2689M5406o7790
8831A628759r1159J7586J11698P7789j3085m1840r460J3596J1015P933O257O323
8819A725412L1394P2173P2515K0727j8931j2541o681k1558J639P7054J08324L9430
8807B088957l3323j1049M2754J7330m7636k9750O3997J07864N7589l233j3727
8796B239773m338n494Q51K1101L0443K5745K7857L4513L2232L2104L3189j890
8784B466086o0728m2032Q9794J87342J03438o8540j11268k983P5475M3855J6806
$$ plain form
8867 1264199 1288328 1348583 1394764 1359179 1271495 1230783 1275210 1349634 1391405 1387065 1355254 1329223
8855 1329223 1347911 1417415 1491030 1524411 1530733 1543808 1555382 1538491 1510952 1520714 1574420 1624088
8843 1624088 1624775 1579479 1533575 1537874 1596694 1646121 1623106 1563448 1568454 1651143 1696549 1628759
8831 1628759 1537600 1555186 1666884 1744673 1731588 1689748 1680288 1693884 1704899 1712832 1719089 1725412
8819 1725412 1756806 1828979 1901494 1922221 1903290 1890749 1884068 1862510 1864149 1941203 2049527 2088957
8807 2088957 2055634 2044585 2087339 2104669 2057033 2027283 2091280 2199144 2256733 2253500 2239773
8796 2239773 2235435 2229941 2230792 2251893 2282336 2308081 2335938 2370451 2402683 2434787 2467976 2466086
8784 2466086 2405358 2363326 2453120 2640462 2743900 2675360 2564092 2561109 2636584 2680439 2697245
8773B697245O1556Q1075K1088p111P1471J42447Q9511q001j6639K9454J3465m3602
8761C131959k1385Q4138J45362R7049J3489j7533O037M1700O2445O1484N1299
8750C656044N8092P9351P1620K2156q473K7863Q1758P6578K6955Q948L7051N2259
8738D190202K4341o577L727M7723Q2910P6047L7983K4791P0603J15309O8675l5016
8726D700718m9194O3324J39800N2621p5816m5385J11830J79299Q5956p885K0667
8715E175935Q8996Q3849M7110P4043J35965J33804P0727M8715J06518J61226J30736
8704F257624M6839P940M9058J01500Q9710L6113K8324Q8642J37761J16423P9759
8693G039693J09155J77460J85382J12915M8928O3501J23042J53820J38180J21145
$$ plain form
8773 2697245 2758801 2839876 2860964 2853853 2925324 3067771 3157282 3149281 3132642 3162096 3175561 3131959
8761 3131959 3110574 3194712 3340074 3437123 3450612 3433079 3439116 3480816 3543261 3604745 3656044
8750 3656044 3714136 3793487 3865107 3887263 3878790 3906653 3988411 4064989 4091944 4100892 4137943 4190202
8738 4190202 4214543 4207966 4211693 4259416 4342326 4418373 4456356 4481147 4551750 4667059 4735734 4700718
8726 4700718 4651524 4714848 4854648 4907269 4831453 4786068 4897898 5077197 5163153 5155268 5175935
8715 5175935 5264931 5348780 5395890 5469933 5605898 5739702 5810429 5859144 5965662 6126888 6257624
8704 6257624 6304463 6312403 6361461 6462961 6552671 6588784 6617108 6705750 6843511 6959934 7039693
8693 7039693 7148848 7326308 7511690 7624605 7673533 7737034 7860076 8013896 8152076 8273221
8683H273221J45776J96495K08883J55169J09145J62548K71099K86511J83954J29075
8673A0121876K25531L31166K77738J57610J85453L44981M11245L10636K16338
8664A2582574K49598L15500L08246K70976K55783K13159J29955J06420J79413
8655A4611624K26605J65272R1965J00417J18870P0455L9739J14643K03280J87877
8645A5930747J35222J64973K25969K10359J87425K95060M68876N11582L91798
8636A8522011K55359J72105Q9243R644j1911m1011k00722m28106n22917m59011
8626A7384684m14021m58344m62999l75694l32384l95353m22013l22758k29444
8617A3971674k62054l29003l15694k83096l10554l20136k41705j85379k48472
$$ plain form
8683 8273221 8418997 8615492 8824375 8979544 9088689 9251237 9522336 9808847 9992801 10121876
8673 10121876 10347407 10678573 10956311 11113921 11299374 11644355 12055600 12366236 12582574
8664 12582574 12832172 13147672 13455918 13726894 13982677 14195836 14325791 14432211 14611624
8655 14611624 14838229 15003501 15095466 15195883 15314753 15385208 15424947 15539590 15742870 15930747
8645 15930747 16065969 16230942 16456911 16667270 16854695 17149755 17618631 18130213 18522011
8636 18522011 18777370 18949475 19038718 19048362 19036451 18995440 18794718 18366612 17843695 17384684
8626 17384684 16970663 16512319 16049320 15673626 15341242 14945889 14523876 14201118 13971674
8617 13971674 13709620 13380617 13064923 12781827 12471273 12151137 11909432 11724053 11475581
8608A1475581l05922k14622q6231j08387k09335j76094k9960J1469p9911r7385
8598A0179203L1228J20468N8100l158Q6303K34230K92957L04859L85869N03934
8588A2193993N64132O13163P48944Q73475P57995L89356O1854K0124J33254O1897
8578A6418187l02301p10460q86124q43991p91214q11093p98761o86751n59951
8569A0027541m93083m28587l18440k55929l23010m05954l38814j73937j18311
8560G171476k14045k77765j89978o1504l9498j00108j28322q9852l1774K127j4144
8549F026613p8043j12747l1288J06775J28308K107q3081M094J34197J35827P7589
8538F310351J36744K87388L48703K98289K96775L88319M08608K58785P2153N414
$$ plain form
8608 11475581 11169659 10955037 10868806 10760419 10551084 10374990 10345030 10356499 10276588 10179203
8598 10179203 10210431 10330899 10388999 10385841 10472144 10706374 10999331 11304190 11690059 12193993
8588 12193993 12758125 13371288 14120232 14993707 15751702 16141058 16202912 16223036 16356290 16418187
8578 16418187 16115886 15405426 14519302 13675311 12884097 12073004 11274243 10587492 10027541
8569 10027541 9534458 9105871 8787431 8531502 8208492 7802538 7463724 7289787 7171476
8560 7171476 6957431 6679666 6489688 6428184 6388686 6288578 6160256 6070404 6038630 6040757 6026613
8549 6026613 5948570 5835823 5804535 5911310 6039618 6041725 5958644 5962738 6096935 6232762 6310351
8538 6310351 6447095 6734483 7083186 7381475 7678250 8066569 8475177 8733962 8806115 8811529
8528H811529K0342j3616j24124k56227l81875m74917m69050l60978k78279l20699
8518F152106l99869l66775k40000j60561j61991j52668j15005j39020k24538k30971
8508C960708j04067P032k7400j14539j02315l4090n9430j57087j54458k0784O4183
8497C257753q112j05652p2795K7822L1211o6464j17073n4180K7619L0350k7828
8486B922651p5145q0374n4791k2881j3213l2528m3912j5620J9777J2599j5538
8475B601025o003K7296J4830m1729o2405k5901n457l3884m5318o694N628n8291
8463B363097j12104o4214K3898L1095l1054m9146K784L6882P164l2032l7118l5996
8451B103256n1410n6293l6876k2021k1308n996K3031K1367j6520l3672m223J9824
$$ plain form
8528 8811529 8831871 8818255 8694131 8437904 8056029 7581112 7112062 6751084 6472805 6152106
8518 6152106 5752237 5385462 5145462 4984901 4822910 4670242 4555237 4416217 4191679 3960708
8508 3960708 3856641 3863673 3836273 3721734 3619419 3585329 3525899 3368812 3214354 3193570 3257753
8497 3257753 3249641 3143989 3071194 3099016 3130227 3063763 2946690 2892510 2920129 2950479 2922651
8486 2922651 2847506 2767132 2712341 2689460 2676247 2643719 2599807 2584187 2603964 2616563 2601025
8475 2601025 2595022 2622318 2637148 2595419 2533014 2507113 2501656 2467772 2422454 2415760 2421388 2363097
8463 2363097 2250993 2186779 2210677 2241772 2210718 2161572 2164356 2201238 2208402 2176370 2139252 2103256
8451 2103256 2051846 1995553 1958677 1936656 1915348 1909352 1932383 1953750 1937230 1903558 1899335 1919159
8439A919159k690l2147j7201K2727L8868L0727K5810J9083q930l9427l7257j0950
8427A907772Q0q764j899L1974N0089R666o7913j10088p3985L28L6351J5296j0935
8414A777972p943p666l6831n5857k9838n497l2855n9349j2060N2931K2652o8434
8402A537225p1817K2870N5767k8412p3704J3731Q5894Q187q7692k2675J02974
8391A542348O5059r4404j26180O942P6101j4769p9985J071P4049K969p8277j2404
8379A362520Q9978M5169p4882p1062L2407M2279n3235p0036L4362Q3228l325o7532
8367A349871N126Q3710J7879j06306j10368n145N1112Q452l2327r524J8000o879
8355A263601n0595n4514j5753K4931L2227L324k6150j3916K8247L8090l326l3089
$$ plain form
8439 1919159 1916469 1884322 1867121 1889848 1928716 1959443 1985253 2004336 1995406 1955979 1918722 1907772
8427 1907772 1907852 1899088 1897189 1929163 1979252 1988918 1921005 1810917 1736932 1737260 1773611 1788907 1777972
8414 1777972 1770029 1762363 1725532 1669675 1639837 1634340 1601485 1542136 1530076 1583007 1605659 1537225
8402 1537225 1465408 1488278 1544045 1515633 1441929 1455660 1541554 1549741 1462049 1439374 1542348
8391 1542348 1607407 1513003 1386823 1393765 1469866 1455097 1375112 1376183 1450232 1453201 1374924 1362520
8379 1362520 1452498 1497667 1422785 1351723 1384130 1426409 1373174 1303138 1337500 1420728 1417403 1349871
8367 1349871 1354997 1438707 1456586 1350280 1239912 1234767 1285879 1294331 1262004 1252480 1270480 1263601
8355 1263601 1213006 1158492 1142739 1167670 1199897 1203221 1177071 1163155 1191402 1229492 1226166 1193077
8343A193077q893J2894k5517o9866l7521L3513M0227r040j1655L8975L1459o2134
8331A125519j13625l9341N8817N1177k8977o5917m4751k7024r928M8379J00130
8320A054459N2457o3394j06900l3263M4113L4546p547k786J8548r156n5457l9981
8308H85639K8750N7267M017o3093n9123J4833P6761N2896l9371r5906l7806P8310
8296I03174J12859K6606n8106l2028L8280J7432p9535j05150j3034O6555L2609
8285I09662l1573k953P5717O3426m9584j19118o3861K0810J8382l8600l9477K3766
8273G66597N0719l207n3399j0455Q7586J22938N0557n1350q4567m1879O903J3808
8261H54251P1L429J6595Q319j5533j7511N967J5177j743l788K2777J9802m4834
$$ plain form
8343 1193077 1184184 1197078 1171561 1101695 1064174 1097687 1137914 1128874 1117219 1156194 1187653 1125519
8331 1125519 1011894 972553 1031370 1082547 1053570 987653 942902 915878 905950 954329 1054459
8320 1054459 1106916 1043522 936622 903359 947472 982018 974471 971685 990233 981077 925620 885639
8308 885639 914389 971656 975673 912580 853457 868290 945051 997947 958576 862670 824864 903174
8296 903174 1016033 1042639 984533 952505 990785 1008217 928682 823532 810498 877053 909662
8285 909662 878089 875136 950853 1014279 964695 845577 781716 802526 820908 782308 742831 766597
8273 766597 817316 814109 760710 750255 837841 960779 1011336 959986 875419 833540 840443 854251
8261 854251 854322 857751 874346 882665 867132 849621 855588 870765 869022 865234 888011 907813 862979
8248H62979q8733j9569J01869J20537J2422p5102m4057K1368J3984k6445j1446
8237H67807K7430N971m3269k1441N0284N0772l7034r1603m3182L7512P3301P4477
8225I51025N9228P384n5451n0858J6153L5518k7936o0865J0287Q7912O5567q20
8213A037144q480J6187k455l1187l750K8545j3950p0557l4775M3842M0617j1902
8201I89279J7816J00583P8751l8381o1720M7483Q9995l0647j25702l2626J05393
8190A140224P1050p8116j16538m159Q9662O6533J040k5550k0774j724L6955O2082
8178A220685K7568l0318k9916K2382M1654P961j0306J3487K2285j0519k7987Q730
8166A255706N1414M5715J5174J5017M6853O2730L1333k4953m9564r350N6229O8115
$$ plain form
8248 862979 774246 754677 856546 977083 989505 914403 870346 891714 905698 879253 867807
8237 867807 895237 901208 857939 836498 886782 937554 900520 808917 765735 803247 876548 951025
8225 951025 1010253 1017637 962186 911328 927481 962999 935063 874198 884485 972397 1037964 1037144
8213 1037144 1028664 1044851 1042396 1011209 1007459 1036004 1022054 951497 916722 960564 1001181 989279
8201 989279 1007095 1107678 1186429 1148048 1086328 1133811 1223806 1193159 1067457 1034831 1140224
8190 1140224 1211274 1133158 1016620 1012461 1102123 1168656 1169696 1144146 1123372 1121648 1158603 1220685
8178 1220685 1248253 1217935 1188019 1210401 1252055 1260016 1249710 1263197 1285482 1274963 1246976 1255706
8166 1255706 1307120 1352835 1368009 1383026 1429879 1492609 1523942 1498989 1449425 1440075 1496304 1564419
8154A564419J3259k5324J1714O1104L0514n0337o7672M252O9965N9232J4088L519
8142A688733K6568L6660J3658j7207j3293M0126R1746O1609m4295j05437l9795
8131A739073O5898P3885k40k3154L7539P2357K2814k5600N387O0341M7425k1657
8119B054068o1307k9520L7613P5610N1332K924J1394Q6789J20215L1386q1741
8108B298763o4805N3116R8559K6879k4125J8570N5697K1768O061O3361Q2855j6952
8096B619747j16325p4246M4305Q3482L6577O938J2274p533m8272n8570m9517n4918
8084B393942m0546K0028N0597j1304q1488n9057n301k8421p5010k7823O1028M8262
8072B244907l9630m9749K1739L2493l4077m1936L2414N0050k8900o8413p561L6745
$$ plain form
8154 1564419 1577678 1552354 1564068 1625172 1655686 1605349 1537677 1541929 1611894 1671126 1685214 1688733
8142 1688733 1715301 1751961 1765619 1748412 1735119 1775245 1866991 1928600 1884305 1778868 1739073
8131 1739073 1804971 1878856 1878616 1855462 1893001 1965358 1988172 1962572 1967959 2028300 2075725 2054068
8119 2054068 1992761 1963241 2000854 2076464 2127796 2130720 2142114 2228903 2349118 2380504 2298763
8108 2298763 2233958 2287074 2385633 2412512 2388387 2406957 2462654 2484422 2490483 2553844 2636699 2619747
8096 2619747 2503422 2429176 2473481 2556963 2593540 2600478 2612752 2605219 2556947 2498377 2448860 2393942
8084 2393942 2353396 2373424 2424021 2412717 2331229 2272172 2266871 2238450 2163440 2135617 2196645 2244907
8072 2244907 2205277 2155528 2177267 2209760 2175683 2133747 2166161 2216211 2187311 2118898 2111337 2148082
8060B148082r42j9878L7255O9492J8861j5622K1109K6815m6562p4509L737M0345
8048B208183n8612j32912l6570Q6301L7270q9557p2703M8528N1534p4801j19868
8037A846793k1908M4631j2465o3567r817N2983K1652m8004o5663n0512n3930n7656
8025A582537l4233j0753n252J0734L6083J9533m1338p6067n6303l6206m0181j8031
8013A330523M1378O2972J1891l7964k9307j4332m5324o9559k7911K2958l759p1868
8001A169698o8589J8106P3838K0152p7570r8113j7171O7845O0419j8540o6003
7990A064072l9663r476l9565q2466n6458K1817O8162O0000L9497J3689m0548q5935
7978I13126n7447J2474K1557l7147o1213j1896K7639M322k2266r76K7488K5763
$$ plain form
8060 2148082 2147140 2127262 2164517 2234009 2252870 2237248 2258357 2285172 2238610 2164101 2167838 2208183
8048 2208183 2149571 2016659 1980089 2066390 2103660 2014103 1941400 1989928 2041462 1966661 1846793
8037 1846793 1824885 1869516 1857051 1793484 1783667 1836650 1858302 1810298 1744635 1694123 1640193 1582537
8025 1582537 1548304 1537551 1532299 1543033 1579116 1598649 1557311 1481244 1424941 1388735 1348554 1330523
8013 1330523 1371901 1434873 1446764 1408800 1379493 1365161 1319837 1250278 1222367 1245325 1241566 1169698
8001 1169698 1101109 1119215 1193053 1213205 1135635 1037522 1020351 1088196 1148615 1130075 1064072
7990 1064072 1024409 1014933 975368 892902 836444 858261 926423 986423 1025920 1039609 999061 913126
7978 913126 855679 868153 889710 852563 791350 779454 807093 811415 789149 788173 815661 841424
7966H41424K4017L0548n054p6253q7108o773O3738N4869L1011M3882K2971p4087
7954H63185j36238o5027M6699N3055k2056n3425k2342J529J2249L9311L1647o1761
7942F86826j47724r7776L7333R3220M0747m292L232n973m8728n7073k3936j6137
7930D59719l0531J784N8845M2828l5003n6861n691R136l8770m5091K0488N1674
7918D32527N098k5411P51j578n1367m0004M6606N8153n0795j02629K086Q8822
7906C62259P118r0233r524J27416Q0020r0769j19755J5387P4514k3339q1265J3188
7894B65017R9865L5062p2620o1868L0423P0394M2343J6636L315k7442m8998k0642
7882C31485K1743J4534k9361m4479j3260K1463K3634k239k6282j6998K4369M4490
$$ plain form
7966 841424 865441 895989 890935 814682 727574 720801 784539 839408 870419 914301 937272 863185
7954 863185 726947 661920 708619 761674 739618 686193 663851 665380 677629 716940 748587 686826
7942 686826 539102 441326 478659 571879 612626 608334 611566 605593 556865 499792 475856 459719
7930 459719 429188 430972 489817 532645 497642 440781 435090 444226 405456 360365 380853 432527
7918 432527 437625 412214 412965 411387 360020 320016 366622 424775 373980 271351 273437 362259
7906 362259 369377 279144 269620 397036 477056 386287 266532 281919 356433 333094 251829 265017
7894 265017 364882 399944 327324 265456 295879 366273 408616 425252 428567 401125 352127 331485
7882 331485 353228 367762 338401 293922 280662 302125 325759 323520 297238 280240 304609 349099
7870C49099m658q4239j01311l2687M6288O8095M0226n540n2575o7436j2075P7660
7858B20847J02781K9693o1011q8265o1242k3702J2470L5091J1261m8777p3829
7847E5317k5647M8229Q7969Q0465K5032o8600j24171n5721P8619J10288O868o3593
7835A55055j662N7951j3088r7209k9883R4780O3550q7489j15566L0200J25708
7824A82347L7886p9484o1003J6686L823o5440n4973L8995R7091O4927M19l4800
7812A46474k9455O286M4541M1210n929l7299j9613r03k3307m4625j4203L4375
7800I7552M1597J7292K213r877l4260l8220m426J1624k2089l2163L5942Q7765
7788A52950J5760r7182q2207M2156R3842K3157k2346L1057O0840j3047o8611m13
$$ plain form
7870 349099 344441 260202 158891 126204 172492 240587 280813 275273 222698 155262 143187 220847
7858 220847 323628 353321 292310 204045 142803 119101 131571 166662 177923 129146 55317
7847 55317 29670 77899 165868 246333 271365 202765 78594 22873 101492 211780 218648 155055
7835 155055 153393 211344 198256 101047 71164 165944 229494 142005 26439 56639 182347
7824 182347 220233 140749 79746 96432 100255 34815 -20158 18837 115928 180855 181274 146474
7812 146474 117019 123305 167846 209056 203127 165828 146215 145312 122005 77380 63177 97552
7800 97552 139149 156441 158654 148777 114517 76297 71871 83495 61406 29243 65185 152950
7788 152950 168710 71528 -10679 31477 125319 148476 126130 157187 218027 204980 136369 135956
7776A35956P4248O527j17395j06309K2127P5329l8n5449o266M5809J4729k6446
7764F2822L028M5454K3132j6240r6J7292n1013j40236j04596M3312J22888M5277
7752E1024n9413m3277M7309O5009q091m9629M788P3898O6665P636k8200l4508
7740I3211n3299p7117n5480R595N1875L7785R238O200Q067j2151l0901j9616j151
7727c3744n927j1342J3160L6139J2457k6744j7260K3328K2057j2834L519P1563
7715G4372P7334j9652r1465k9799P3710O0812n0763j01655l3378N0142O1178K7567
7703I8403q390n5766r4562n5413N1558R8392J6665q1293o0184L8241P2903K4055
7691D4609j719L5301N4091R741l0337j8225j6517p6159j16165l6725R8188J16753
$$ plain form
7776 135956 210204 216731 99336 -6973 15154 90483 90445 34996 28730 74539 89268 62822
7764 62822 65850 111304 134436 118196 118100 135392 84379 -55857 -160453 -117141 5747 51024
7752 51024 -8389 -51666 -4357 60652 52561 2932 7720 81618 148283 155919 127719 93211
7740 93211 39912 -37205 -92685 -83090 -31215 6570 15808 22008 30075 17924 -12977 -32593 -33744
7727 -33744 -39671 -51013 -37853 -1714 10743 -16001 -33261 -9933 12124 -710 2809 74372
7715 74372 151706 132054 40589 10790 84500 145312 94549 -7106 -40484 9658 70836 98403
7703 98403 90013 34247 -60315 -115728 -64170 34222 50887 -30406 -90590 -52349 20554 44609
7691 44609 42890 78191 132282 142023 111686 93461 76944 785 -115380 -152105 -53917 62836
7679F2836j9828j44484r8529O1551J43946O6653n9497r1664k3366M2903L9662
7668a9817n666l5737l0473k846K6139L0157p639n8898o0584R229R0653J08990
7656D3508O1631L617l1962n2985o0070l6287O844K5001M236j4206J399K3571J6038
7643i665j154J4204M8616M6099l476m5549m2917k3280j8382p214L2959N9623J7547
7630F7411n7877o8115N466O2550K5021n1379o6189j9907Q835l494p857J3205K1334
7617g0996J1120K4328N0221J6694p0365q8518J7578J14904O3323o0893p4212K5474
7605d1342N8733l8055j04209j7945R8947P1726n0605p6453K8193R7714L0702o5540
7593h134n4468K9640N6466j363n1807l6579J456J2522J4734L6935N0952J8386
$$ plain form
7679 62836 43008 -101476 -200005 -138454 5492 72145 12648 -79016 -102382 -59479 -19817
7668 -19817 -25483 -61220 -91693 -94539 -68400 -38243 -45882 -104780 -165364 -156135 -65482 43508
7656 43508 105139 108756 76794 23809 -36261 -72548 -65704 -40703 -36467 -50673 -49274 -25703 -9665
7643 -9665 -10819 3385 52001 98100 94624 49075 6158 -17122 -35504 -42718 -9759 49864 67411
7630 67411 9534 -58581 -53115 9435 34456 -16923 -83112 -103019 -94184 -97678 -105535 -92330 -70996
7617 -70996 -59876 -35548 14673 31367 -38998 -127516 -109938 4966 68289 7396 -66816 -41342
7605 -41342 17391 -20664 -124873 -142818 -43871 27855 -22750 -99203 -71010 26704 57406 -8134
7593 -8134 -62602 -32962 23504 22141 -29666 -66245 -64789 -52267 -37533 -598 50354 68740
7581F8740l2065l9189p127j031l8596n5319q586M6354L8631p185j3440K2337K3122
7568c354l9914r2029n8426L0916Q0783M6900k1290m3898P31N0568L0957m3300
7556f1356p1204j771P9336O4679j3801l6049J4166L2091k0896m9443M728N5438
7544d082K0933l5658k4112J2590j5356p4083o3982M250L7445K8008M2897O6103
7532e047J4602q5318j03656j7499M4694J7181m978M6672Q5699L3573k7900L542
7520A565O8938M8992l6270p6795o0963o1938p3146j7336Q4145J05070Q364q3416
7508i2790o2388K3053O0610K7960j1549j4656K796Q826n584k3605k2646l474P471
7495a05976O66N020L4510M5390J68n4448m5001J0345K3529k4820n3886n656P6435
$$ plain form
7581 68740 36675 -2514 -9641 -10672 -49268 -104587 -113173 -66819 -28188 -35373 -48813 -26476 -3354
7568 -3354 -43268 -135297 -193723 -162807 -82024 -35124 -56414 -100312 -99581 -49013 -18056 -61356
7556 -61356 -132560 -134331 -54995 9684 -4117 -40166 -26000 6091 -14805 -64248 -59520 -4082
7544 -4082 16851 -18807 -42919 -30329 -45685 -119768 -183750 -179500 -142055 -114047 -71150 -5047
7532 -5047 9555 -75763 -179419 -196918 -152224 -135043 -140021 -93349 -7650 25923 -1977 1565
7520 1565 70503 119495 83225 6430 -54533 -116471 -189617 -206953 -122808 -17738 -9374 -92790
7508 -92790 -155178 -132125 -71515 -43555 -55104 -69760 -66964 -58138 -63722 -87327 -109973 -113447 -105976
7495 -105976 -105310 -100290 -65780 -20390 -20222 -74670 -119671 -109326 -85797 -110617 -164503 -170159 -93724
7482i3724J13420P2974k3748j12106j04812J3060J15435O8862o4887r6049M495
7471a07080N5677l0621r0725J3168J36576P4242r5196j28679o553O2755N700k3057
7459a33793M9173P8661j6443q5893o893R0842M5064n9354m1984O4457Q4426J034
7447F9297m4475j8036k7365q8487p9394L0245J01883M9282l3944m6016k1497j8231
7435a26738m305M3490N7425P23m3878j2987K2830n949l3892J0931N8022K1979
7423a2349k6445J2626O3928j162j08768p5274P4509J22436M928r3052m7765K7916
7411e8472J2830k7753k427L1487O0l1695Q154M1640j8734q5822l2179Q0853R5127
7398A3069J1743l5527j8862k9892p0222l3256P9239J13831K416j17170j00711
$$ plain form
7482 -93724 19696 92670 68922 -43184 -147996 -134936 -19501 49361 -15526 -111575 -107080
7471 -107080 -51403 -82024 -172749 -159581 -23005 51237 -43959 -172638 -179191 -116436 -110736 -133793
7459 -133793 -84620 -5959 -22402 -108295 -115188 -24346 20718 -38636 -80620 -16163 68263 69297
7447 69297 24822 6786 -20579 -109066 -188460 -158215 -56332 -7050 -40994 -87010 -108507 -126738
7435 -126738 -131043 -87553 -30128 -29405 -73283 -86270 -63440 -69389 -103281 -92350 -34328 -12349
7423 -12349 -38794 -26168 37760 36598 -72170 -147444 -72935 49501 54429 -38623 -86388 -58472
7411 -58472 -45642 -73395 -75822 -44335 -44275 -75970 -67816 -26176 -44910 -130732 -162911 -82058 13069
7398 13069 24812 -10715 -29577 -59469 -129691 -162947 -83708 30123 32539 -84631 -185342
7387a85342Q142P2408N3179J4983N164J0420J799k8621n7640m4925J1163M4746
7375i4524O713m4485k1018M5355M4890k4320m6720J3141M9331K700l6129N070
7363i9996M5575k917p2498n3663J5777K1667k7401k2316N3415R5595M6449l0106
7351c0419n6383k8509J9491N7918N5251J727n1537m2324J0400K9661k632k3966
7339f1322K697L2299J3829l2094m6171j0084L3411L0721j9048n4067k4079K9080
7327a04828J7691n2176o5677K9097J18750P7274m8306j09924o6227k676K2906
7316a84096L0838K8826n033m2927k5097L1095M6098J1217l144J8215J3447k4358
7304a04919k2170L0658M6167m685k8934K4836O7501K3361l4515j2864L7423J2263
$$ plain form
7387 -185342 -177200 -104792 -51613 -36630 -31466 -21046 -19247 -47868 -105508 -150433 -139270 -94524
7375 -94524 -87811 -132296 -153314 -107959 -63069 -87389 -134109 -120968 -71637 -68937 -105066 -99996
7363 -99996 -54421 -57338 -129836 -183499 -167722 -146055 -173456 -195772 -142357 -46762 -313 -30419
7351 -30419 -86802 -115311 -95820 -37902 17349 19076 -32461 -74785 -64385 -34724 -37356 -61322
7339 -61322 -58625 -26326 -12497 -44591 -90762 -100846 -67435 -36714 -55762 -109829 -133908 -104828
7327 -104828 -87137 -139313 -204990 -175893 -57143 20131 -28175 -138099 -204326 -207002 -184096
7316 -184096 -153258 -124432 -129465 -172392 -197489 -166394 -120296 -109079 -112223 -94008 -80561 -104919
7304 -104919 -127089 -96431 -50264 -54949 -83883 -59047 8454 31815 -2700 -15564 21859 34122
7292C4122o2417p2254NN4661K9460k7559m2968k504N2373O5749J6464m4950m3174
7279d2992J2825K8932k9795p5235l5637K9574L6747J3467K3622L6003q495o1866
7267g2850l9290K0976J4156m2682l3777M9164Q1610J0215o4831n6291r732L70
7255a42962j5651j6457p470m016R486L2861L0774K522K068M7015P5742L8935k7755
7242B5092o2541n3024k0731J3932K6604O062r028K4628O9074M8224j9561l6948
7230A1783J0422L0182q949k3799J6867K2265m1998n9201L6190J06371J7674j18145
7218c38r7650N6856J32706M4466p6154j05572o6089j7442L0180N7876K9055k3687
7206c5793k2536J8856P348n7812o5361J5890P2127L3893j3855N905K8675j5569
$$ plain form
7292 34122 -28295 -100549 -100544 -45883 -16423 -43982 -86950 -89454 -37081 28668 45132 182 -42992
7279 -42992 -30167 -1235 -31030 -106265 -141902 -112328 -75581 -62114 -38492 -2489 -10984 -72850
7267 -72850 -112140 -91164 -77008 -119690 -153467 -104303 -22693 -12478 -77309 -133600 -143332 -142962
7255 -142962 -158613 -175070 -182540 -186556 -177070 -144209 -113435 -110913 -108845 -61830 13912 52847 25092
7242 25092 -37449 -90473 -111204 -97272 -70668 -64606 -73634 -49006 20068 68292 48731 11783
7230 11783 22205 52387 43438 19639 36506 58771 16773 -42428 -6238 100133 117807 -338
7218 -338 -97988 -41132 91574 136040 59886 -45686 -111775 -129217 -99037 -41161 -12106 -35793
7206 -35793 -58329 -39473 -32125 -89937 -155298 -139408 -67281 -33388 -47243 -41338 -12663 -28232
7194b8232n8593j7355M1591Q411p5109q1998j0195L1792J9772L0715O8759M2051
7182b8391n5475r7165k0634O6051N6122k1j0068j474m0907p6016j0776J03639
7170a15115J15767J1775n2667L424O1671L336r7558r7900q964M2733K3843J5335
7158i4320M2254L2240l3849o7057j8205L6978K9005P397L6751O9056K4962n9872
7146E340q2032k8178K0628K2261J0684Q534j526j5968p655J0513q31k7905j9137
7133a05272J8378K5607q36m079J8514L379n0461n4991J6292O3925J8376m3330
7121i4498k5711L0536K8958j6707j6644L4316M8774q911p0062o2725N922P4380
7109g2372Q4135K1554n5971o3335J071L7457o848m3091J4785Q7404M4545o9870
$$ plain form
7194 -28232 -86825 -104180 -62589 -54178 -129287 -211285 -221480 -189688 -169916 -139201 -70442 -28391
7182 -28391 -83866 -181031 -201665 -135614 -79492 -79513 -89581 -91055 -131962 -207978 -218754 -115115
7170 -115115 652 12427 -40240 -36816 24855 28191 -69367 -167267 -176231 -133498 -109655 -94320
7158 -94320 -52066 -19826 -53675 -120732 -138937 -101959 -72954 -65557 -28806 40250 65212 5340
7146 5340 -76692 -104870 -84242 -61981 -51297 -42763 -44289 -60257 -67912 -57399 -58230 -86135 -105272
7133 -105272 -86894 -61287 -62123 -66202 -47688 -44309 -94770 -149761 -133469 -69544 -51168 -94498
7121 -94498 -120209 -89673 -60715 -77422 -94066 -59750 -10976 -19887 -89949 -152674 -146752 -72372
7109 -72372 11763 33317 -22654 -85989 -84918 -47461 -54309 -97400 -82615 4789 49334 -20536
7097b0536r1192L241O2446J4265l2459K889L8865M125k1139L2604O5156k5458
7085C2807j31929q8093M8320P7130j7434n0657M0328R2968Q007p8244l4070M3612
7073e7255J0724o8238m3176M8556N2003k0873j1338Q7730R3741n2002j57697p4418
7061a92243P6280J08384M3784J2173J2033l3221p5416j2831Q9313O8332n8787
7050C7801j04342j3292N9487K3693j2800K8555M7668k7358p6464L277Q8624K5760
7038H0609r5477q1941M0397P9760N038k3624N0426Q9659J2221p4130o3505n616
7026A3817J6527J6857K8397K1961j4015k5860j311r433o1292n5816M5443J14654
7014H9929M2614q0634r7105o432O9355P5914N0997J4236l7849o4637k7771K4754
$$ plain form
7097 -20536 -111728 -108487 -46041 -31776 -64235 -61346 -22481 -18356 -39495 -6891 58265 32807
7085 32807 -99122 -187215 -138895 -61765 -79199 -129856 -89528 3440 11447 -66797 -100867 -57255
7073 -57255 -46531 -114769 -157945 -109389 -57386 -78259 -89597 -1867 91874 39872 -117825 -192243
7061 -192243 -115963 -7579 36205 48378 60411 27190 -48226 -61057 28256 96588 37801
7050 37801 -66541 -79833 -20346 3347 -9453 19102 66770 39412 -37052 -33775 54849 80609
7038 80609 -14868 -96809 -56412 23348 28386 4762 55188 144847 157068 82938 19433 13817
7026 13817 30344 47201 75598 97559 83544 57684 56373 46940 -14352 -70168 -24725 89929
7014 89929 132543 51909 -45196 -51628 17727 93641 144638 158874 121025 56388 28617 53371
7002E3371K4163o719p002N331j7110l5989P896N7768J5414p4199p0811L3120R3143
6989G8376L9533l2958l8630j4970r830O096M5990N0972K943j9941K0856M2218
6977A70655j7915p9781m9215K2283K4864k6171k2347N3150R3376K5570q8124j29100
6965b2755n3475O4206R9715J0272r5881p2671O6234J45037O2587o5707q1113l732
6953E2717L2979M08j2810K3819L8258m795m4725l3931m360Q519K0873M3114M3687
6940A63753R971j7587q938J1308J3615P342O658l48k1493l9169l7770j5525L3877
6927A05694J00834J24192N0081o2550q2450J4260R2715M2987o5326q8855q492
6916B23090O8542O7481J7041k3243k7678J71L2039K0190m1751p5422o682J07959
$$ plain form
7002 53371 77534 70815 63813 69144 52034 16045 23941 81709 97123 22924 -47887 -14767 78376
6989 78376 117909 84951 46321 31351 21521 27617 73607 124579 127522 107581 128437 170655
6977 170655 152740 72959 23744 46027 70891 44720 22373 75523 168899 194469 106345 -22755
6965 -22755 -76230 -12024 87691 97963 2082 -70589 -4355 140682 203269 137562 56449 52717
6953 52717 85696 86104 73294 97113 135371 130576 85851 51920 47560 56079 76952 120066 163753
6940 163753 173724 156137 147199 158507 172122 179464 186122 185774 164281 125112 87342 71817 105694
6927 105694 206528 330720 380801 318251 235801 250061 342776 385763 320437 231582 223090
6916 223090 291632 359113 376154 352911 325233 325404 357443 377633 335882 260460 253778 361737
6904C61737J28626K0563r0380q6669m165M7523M1078K9987L6141L0023Q708O164
6892E29336J8122k219n0013m9033K8082Q9570M5537m7698n3249N0563J32011Q4742
6880G75751l2356q1864k4391N1088N5200J149l1724m277M1298M6712J8751J3750
6868H29087M4901N5951J4510k2901L416N2180M5457L361Q952N4507N1038J466
6856A141925J6804J11707J38855K0087j00277o2478O8747J24968R4197Q2128Q8642
6845A725305K7492o4398m9921O4809J10295J9013p0844l9820M7918Q1796O4390
6834A916035M8630L6284K2373L9632Q7794J09561Q8186P3611P8150N8123K3595
6823B581974L4055O6873N0176M0632J61244L27856K95005O0385o0243R3642K71996
$$ plain form
6904 361737 490363 510926 420546 333877 329712 377235 418313 448300 484441 514464 523172 529336
6892 529336 547458 545239 495226 446193 474275 563845 609382 561684 508435 558998 691009 775751
6880 775751 743395 661531 637140 688228 743428 744577 712853 708576 749874 796586 815337 829087
6868 829087 873988 929939 944449 921548 924964 977144 1022601 1025962 1034914 1089421 1140459 1141925
6856 1141925 1158729 1270436 1409291 1429378 1329101 1266623 1335370 1460338 1554535 1636663 1725305
6845 1725305 1752797 1688399 1638478 1703287 1813582 1832595 1761751 1721931 1769849 1851645 1916035
6834 1916035 1964665 2000949 2023322 2062954 2150748 2260309 2348495 2422106 2500256 2558379 2581974
6823 2581974 2616029 2682902 2733078 2773710 2934954 3262810 3557815 3618200 3557957 3651599 3923595
6812C923595K33232J21575J56801K30612J54183O4269J83171L66355L28141J73833
$$ plain form
6812 3923595 4156827 4278402 4435203 4665815 4819998 4884267 5067438 5433793 5761934 5935767
$$ [...]
##END NTUPLES=NMR SPECTRUM
##END=
