##TITLE=1H ikalashn
CG-1218-4
18.11.2024
##JCAMPDX= 6.0         $$ Bruker NMR JCAMP-DX V2.0
##DATA TYPE= NMR SPECTRUM
##DATA CLASS= NTUPLES
##ORIGIN= UXNMR, Bruker Analytische Messtechnik GmbH
##OWNER= root
$$ TOPSPIN		Version 1.3
$$ 2024-11-18 09:51:37.968 +0400  Irina@DPX200
$$ Compression mode = diff/dup
##.OBSERVE FREQUENCY= 200.131300845
##.OBSERVE NUCLEUS= ^1H
##.ACQUISITION MODE= SIMULTANEOUS
##.ACQUISITION SCHEME= undefined
##.AVERAGES= 16
##.DIGITISER RES= 18
##SPECTROMETER/DATA SYSTEM= spect
##.PULSE SEQUENCE= zg
##.SOLVENT NAME= CDCl3
##.SHIFT REFERENCE= INTERNAL, CDCl3, 1, 17.49637
##AUDIT TRAIL= $$ (NUMBER, WHEN, WHO, WHERE, WHAT)
$$ ##TITLE= Audit trail, TOPSPIN		Version 1.3
$$ ##JCAMPDX= 5.01
$$ ##ORIGIN= Bruker BioSpin GmbH
$$ ##OWNER= Irina
$$ $$ F:/spectra/data/iren/nmr/1H/4/pdata/1/auditp.txt
$$ ##AUDIT TRAIL=  $$ (NUMBER, WHEN, WHO, WHERE, VERSION, WHAT)
(   1,<2024-11-18 09:40:49.640 +0400>,<Irina>,<DPX200>,<TOPSPIN 1.3>,
      <created by zg
	started at 2024-11-18 09:39:41.421 +0400,
	POWCHK disabled, PULCHK disabled
       configuration hash MD5:
       BE 6D 3F 07 2A EA 11 49 91 17 2B D3 AF B3 58 0D
       data hash MD5: 16K
       EB C7 AE FE A2 F8 9A 04 08 9E 0C 9F 57 5F 5D AB>)
(   2,<2024-11-18 09:51:24.375 +0400>,<Irina>,<DPX200>,<TOPSPIN 1.3>,
      <Start of raw data processing
       efp BC_mod = 2 LB = 0.02 FT_mod = 6 PKNL = 1 PHC0 = 328.0979 PHC1 = -5.66965 SI = 32K 
       data hash MD5: 32K
       8C 03 76 F3 12 56 BD CC B1 C3 97 DF 2D 15 53 13>)
(   3,<2024-11-18 09:51:26.796 +0400>,<Irina>,<DPX200>,<TOPSPIN 1.3>,
      <apk 
       data hash MD5: 32K
       AB BD E3 15 01 52 8C 05 5E D4 D3 24 D8 1E 87 89>)
(   4,<2024-11-18 09:51:29.046 +0400>,<Irina>,<DPX200>,<TOPSPIN 1.3>,
      <abs n ABSG = 5 
       data hash MD5: 32K
       99 5B 74 72 A4 21 18 D8 4A D1 27 D0 B5 11 8C 04>)
$$ ##END=
$$ 
$$ $$ hash MD5
$$ $$ 90 25 85 94 8E A7 CC 49 AB DD 57 86 6C A0 3C 96
##$RELAX= 
##$RELAX= 
##$RELAX= 
##$RELAX= 
##$RELAX= 
##$RELAX= 
##$RELAX= 
##$RELAX= 
##$RELAX= 
$$ Bruker specific parameters
$$ --------------------------
##$DU= <F:/spectra>
##$EXPNO= 4
##$NAME= <1H>
##$PROCNO= 1
##$TYPE= <nmr>
##$USER= <iren>
##$AMP= (0..31)
100 100 100 100 100 100 100 100 100 100 100 100 100 100 100 100 100 100 
100 100 100 100 100 100 100 100 100 100 100 100 100 100 
##$ANAVPT= -1
##$AQSEQ= 0
##$AQ_mod= 1
##$AUNM= <au_zg>
##$AUTOPOS= <>
##$BF1= 200.13
##$BF2= 200.13
##$BF3= 200.13
##$BF4= 200.13
##$BF5= 200.13
##$BF6= 200.13
##$BF7= 200.13
##$BF8= 200.13
##$BYTORDA= 1
##$CFDGTYP= 0
##$CFRGTYP= 5
##$CHEMSTR= <none>
##$CNST= (0..63)
1 1 145 1 1 1 1 1 1 1 1 1 1 1 1 1 1 1 1 1 1 1 1 1 1 1 1 1 1 1 1 1 1 1 
1 1 1 1 1 1 1 1 1 1 1 1 1 1 1 1 1 1 1 1 1 1 1 1 1 1 1 1 1 1 
##$CPDPRG= <>
##$CPDPRG1= <>
##$CPDPRG2= <>
##$CPDPRG3= <>
##$CPDPRG4= <mlev>
##$CPDPRG5= <mlev>
##$CPDPRG6= <mlev>
##$CPDPRG7= <mlev>
##$CPDPRG8= <mlev>
##$CPDPRGB= <>
##$CPDPRGT= <>
##$D= (0..63)
0 2 0 0 0 0 0 0 0 0.06 0 0.03 0 0 0 0 0.0002 0 0 0 0 0 0 0 0 0 0 0 0 0 
$$ [...]
##$SW_h= 4401.40845070422
##$TD= 16384
##$TD0= 1
##$TE= 300
##$TE2= 300
##$TE3= 300
##$TEG= 300
##$TL= (0..7)
0 120 120 120 120 120 120 120 
##$TP= (0..7)
150 150 150 150 150 150 150 150 
##$TP07= 0
##$TPNAME0= <>
##$TPNAME1= <>
##$TPNAME2= <>
##$TPNAME3= <>
##$TPNAME4= <>
##$TPNAME5= <>
##$TPNAME6= <>
##$TPNAME7= <>
##$TPOAL= (0..7)
0.5 0.5 0.5 0.5 0.5 0.5 0.5 0.5 
##$TPOFFS= (0..7)
0 0 0 0 0 0 0 0 
##$TUNHIN= 0
##$TUNHOUT= 0
##$TUNXOUT= 0
##$USERA1= <user>
##$USERA2= <user>
##$USERA3= <user>
##$USERA4= <user>
##$USERA5= <user>
##$V9= 5
##$VALIST= <valist>
##$VCLIST= <CCCCCCCCCCCCCCC>
##$VD= 0
##$VDLIST= <DDDDDDDDDDDDDDD>
##$VPLIST= <PPPPPPPPPPPPPPP>
##$VTLIST= <TTTTTTTTTTTTTTT>
##$WBST= 1024
##$WBSW= 25
##$XGAIN= (0..3)
0 0 0 0 
##$XL= 0
##$YL= 0
##$YMAX_a= 253990
##$YMIN_a= -558847
##$ZGOPTNS= <>
##$ZL1= 120
##$ZL2= 120
##$ZL3= 120
##$ZL4= 120
##$ABSF1= 17.49637
##$ABSF2= -4.496376
##$ABSG= 5
##$ABSL= 3
##$ALPHA= 0
##$AQORDER= 0
##$ASSFAC= 0
##$ASSFACI= 0
##$ASSFACX= 0
##$ASSWID= 0
##$AUNMP= <proc_1d>
##$AXLEFT= 0
##$AXRIGHT= 0
##$AXTYPE= 0
##$AXUNIT= <>
##$AZFE= 0.1
##$AZFW= 0.1
##$BCFW= 0
##$BC_mod= 2
##$BYTORDP= 0
##$COROFFS= 0
##$CY= 7568.61572265625
##$DATMOD= 1
##$DC= 0
##$DFILT= <>
##$DTYPP= 0
##$F1P= 17.9538593292236
##$F2P= -4.03888763876832
##$FCOR= 0.5
##$FTSIZE= 32768
##$FT_mod= 6
##$GAMMA= 0
##$GB= 0
##$INTBC= 0
##$INTSCL= 1.367314e-010
##$ISEN= 128
##$LB= 0.02
##$LEV0= 0
##$LPBIN= 0
##$MAXI= 945.577
##$MC2= 0
##$MEAN= 0
##$ME_mod= 0
##$MI= -402.1523
##$NCOEF= 0
##$NC_proc= -7
##$NLEV= 6
##$NOISF1= 8.587773
##$NOISF2= 6.764455
##$NSP= 0
##$NTH_PI= 0
##$NZP= 0
##$OFFSET= 17.49637
##$PC= 1
##$PHC0= 326.8341
##$PHC1= -6.346261
##$PH_mod= 1
##$PKNL= yes
##$PPARMOD= 0
##$PPDIAG= 0
##$PPIPTYP= 0
##$PPMPNUM= 100
##$PPRESOL= 1
##$PSCAL= 0
##$PSIGN= 0
##$REVERSE= no
##$SF= 200.13
##$SI= 32768
##$SIGF1= 16.12182
##$SIGF2= -4.496377
##$SINO= 3.521527
##$SIOLD= 32768
##$SREGLST= <1H.CDCl3>
##$SSB= 0
##$STSI= 32768
##$STSR= 0
##$SW_p= 4401.40845070422
##$SYMM= 0
##$S_DEV= 0
##$TDeff= 16384
##$TDoff= 0
##$TI= <>
##$TILT= no
##$TM1= 0
##$TM2= 0
##$TOPLEV= 0
##$USERP1= <user>
##$USERP2= <user>
##$USERP3= <user>
##$USERP4= <user>
##$USERP5= <user>
##$WDW= 1
##$XDIM= 32768
##$YMAX_p= 402149476
##$YMIN_p= -821438
$$ End of Bruker specific parameters
$$ ---------------------------------
##NTUPLES= NMR SPECTRUM
##VAR_NAME=  FREQUENCY,     SPECTRUM/REAL,   SPECTRUM/IMAG
##SYMBOL=    X,             R,               I
##VAR_TYPE=  INDEPENDENT,   DEPENDENT,       DEPENDENT
##VAR_FORM=  AFFN,          ASDF,            ASDF
##VAR_DIM=   32768,         32768,           32768
##UNITS=     HZ,            ARBITRARY UNITS, ARBITRARY UNITS
##FACTOR=    0.134324425510551, 1,           1
##FIRST=     4401.40845070422, 549804,       -1470926
##LAST=      0,             -383872,         -1375017
##MIN=       0,             -821438,         0
##MAX=       4401.40845070422, 402149476,    0
$$ Real data points
##PAGE= N=1
##DATA TABLE= (X++(R..R)), XYDATA
$$ [...]
12579G669947n0658O4048J17975J16746J23366O4847j13294k35461j03210J57123
12569G811429K15855L060j89858j21918R2192J89577J09985k042m3854m1158k2791
12558H000477L2032R6035P9403j9738o1223M1309J59403J18726l0167p6558L2254
12547H371953J24660Q5033M480j9853l5606o9104j0390J65221K47571Q6721j18143
12536H832543q8531R7965J45072K5322j6744P6519R1818k7780n3621J01246J90287
12525I374096O5536l8173Q5326K20821Q8265j42919r6605J84550K80066M3305
12515A0064268j87210j17199J01852J69467P9570M3336J15078J33671J3679r8465
12505A0318047l1767J51098K21584R9511k7923K3612J57598J46735k405n6919
$$ y = [7669947, 7619289, 7683337, 7801312, 7918058, 8041424, 8106271, 7992977, 7757516, 7654306, 7811429, 8027284, 8030344, 7840486, 7718568, 7810760, 8000337, 8110322, 8108280, 8064426, 8023268, 8000477, 8032509, 8128544, 8207947, 8188209, 8126986, 8168295, 8327698, 8446424, 8416257, 8339699, 8371953, 8496613, 8581646, 8586126, 8566273, 8530667, 8461563, 8451173, 8616394, 8863965, 8950686, 8832543, 8744012, 8841977, 8987049, 9012371, 8995627, 9072146, 9163964, 9136184, 9082563, 9183809, 9374096, 9439632, 9401459, 9486785, 9707606, 9795871, 9652952, 9556347, 9740897, 10020963, 10064268, 9877058, 9759859, 9861711, 10031178, 10110748, 10154084, 10269162, 10402833, 10416512, 10318047, 10286280, 10437378, 10658962, 10758473, 10730550, 10754162, 10911760, 11058495, 11056090, 10999171]
12495A0999171N9066J39840M7182o2692j7438Q8360Q9200L2394L4577L2153n9294
12484A1382519r5400P6846K72107J91106p4676j36306R7636K95232K29950P4883
12474A2313897N0935J05872J05627P3441O5289L4550k0408J3396J36782J60591
12464A3039972J5015q5063K8762J93187J78030N1513L4573J31065J61533P9662
12454A3828249J3963L6600R3448J37835J67207J56042R4936N8026J04961J68128
12444A4859395J58000J14043J24213J64601J53006J00879Q4983J23336J85307
12435A6067763K55255K95745K46824J51270J45560K24173J93251N392p1988J54674
12425A7667919M44799M38980J85262L2101J01304K06218K33822K57440K79545
$$ y = [10999171, 11058237, 11198077, 11245259, 11182567, 11165129, 11253489, 11342689, 11375083, 11409660, 11441813, 11382519, 11287119, 11363965, 11636072, 11827178, 11752502, 11616196, 11713832, 12009064, 12239014, 12313897, 12364832, 12470704, 12576331, 12649772, 12715061, 12749611, 12729203, 12742599, 12879381, 13039972, 13054987, 12969924, 12998686, 13191873, 13369903, 13421416, 13455989, 13587054, 13748587, 13828249, 13842212, 13878812, 13972260, 14110095, 14277302, 14433344, 14528280, 14586306, 14691267, 14859395, 15017395, 15131438, 15255651, 15420252, 15573258, 15674137, 15759120, 15882456, 16067763, 16323018, 16618763, 16865587, 17016857, 17162417, 17386590, 17579841, 17585233, 17513245, 17667919, 18112718, 18551698, 18736960, 18769061, 18870365, 19076583, 19310405, 19567845, 19847390]
12416A9847390K02830Q4522J03941K40566K89124K26739K41622L51413L44958
12407B1933105J89813J34898K74163L64931K55252J46937K20284L25795K96332
12398B4141510K53845L26744L61937K36869J72851L67046N69675M58079K22630
12389B7111186K87609N80615O23716L31381J61663L71491O42989O54437N57901
12380C1322988O01445O71557N72444M58603N82078Q08327Q06743O18405O06935
12371C7049525Q51185J004021Q59396O90794Q18865J120357J238087J110775J003931
12362D5746936J080533J218637J276979J298039J352849J372055J273942J140994
12354E5760964J110889J149475J083384Q49634N82594M27797L71339L00116J62509
$$ y = [19847390, 20050220, 20134742, 20238683, 20479249, 20768373, 20995112, 21236734, 21588147, 21933105, 22122918, 22257816, 22531979, 22896910, 23152162, 23299099, 23519383, 23845178, 24141510, 24395355, 24722099, 25084036, 25320905, 25493756, 25860802, 26430477, 26888556, 27111186, 27398795, 27979410, 28603126, 28934507, 29096170, 29467661, 30110650, 30765087, 31322988, 31924433, 32595990, 33168434, 33627037, 34209115, 35017442, 35824185, 36442590, 37049525, 37900710, 38904731, 39764127, 40454921, 41273786, 42394143, 43632230, 44743005, 45746936, 46827469, 48046106, 49323085, 50621124, 51973973, 53346028, 54619970, 55760964, 56871853, 58021328, 59104712, 59954346, 60536940, 60964737, 61336076, 61636192, 61798701]
12345F1798701J6255n2025j7265O9744J50936K36054L75917N55086O79326P11072
12335F4523801P38649Q37569R44496R76160J000076J146867J399666J619268J744693
12326G4931245J816925J846176J836555J901584K129371K347781K288120K006610
12318I1104367J845145J897596J847435J495239J112435J009250J034323Q43527
12310A02189317M71011K59075L15888M00443L30638K01091J70070K66507M26813
12301A05030853N41088M97617L60373M08715P71062J139199J153903R72177J062064
12292A11937051J473098J764625J726043J692533J948120K248396K249505K079431
12284A27118802K106672K346543K470588K308526K016787J780397J612667J454025
$$ y = [61798701, 61814956, 61762931, 61745666, 61815410, 61966346, 62202400, 62578317, 63133403, 63812729, 64523801, 65262450, 66100019, 67044515, 68020675, 69020751, 70167618, 71567284, 73186552, 74931245, 76748170, 78594346, 80430901, 82332485, 84461856, 86809637, 89097757, 91104367, 92949512, 94847108, 96694543, 98189782, 99302217, 100311467, 101345790, 102189317, 102660328, 102919403, 103235291, 103635734, 103966372, 104167463, 104337533, 104604040, 105030853, 105571941, 106069558, 106429931, 106838646, 107609708, 108748907, 109902810, 110874987, 111937051, 113410149, 115174774, 116900817, 118593350, 120541470, 122789866, 125039371, 127118802, 129225474, 131572017, 134042605, 136351131, 138367918, 140148315, 141760982, 143215007]
12276A43215007J265149J010525O99253M33268K94373K20090J08630p744k2332
12267A47216219O6485J66214K32741K75357K71797K13809J93408L03451M82893
12258A49422374N96612O41876P30517Q76307R55676R13436Q74260R77341J181895
12249A57170294J320692J322978J312743J452483J722970J934660J979205J968929
12241A70184954K041427K134086K111153K024804K018482K012825J775831J332007
12233A85635569R83228Q25234N77967P0810m39710o94552q61523j200230j564399
12224A83332394j659027j607879j784624k151721k259071j944214j584150j524289
12216A68817419j642688j653397j516330j346708j185046j063399j080882j212535
$$ y = [143215007, 144480156, 145490681, 146189934, 146623202, 146917575, 147137665, 147246295, 147238551, 147216219, 147282704, 147448918, 147681659, 147957016, 148228813, 148442622, 148636030, 148939481, 149422374, 150018986, 150660862, 151391379, 152267686, 153223362, 154136798, 155011058, 155988399, 157170294, 158490986, 159813964, 161126707, 162579190, 164302160, 166236820, 168216025, 170184954, 172226381, 174360467, 176471620, 178496424, 180514906, 182527731, 184303562, 185635569, 186618797, 187444031, 188021998, 188092808, 187653098, 186958546, 186097023, 184896793, 183332394, 181673367, 180065488, 178280864, 176129143, 173870072, 171925858, 170341708, 168817419, 167174731, 165521334, 164005004, 162658296, 161473250, 160409851, 159328969, 158116434]
12208A58116434j228924j001041p23882o44194p10438o98752n73156m99273n55035
12199A51481739o31572o19204n31271m21061l02058j97572j82609l00237m55563
12190A47840592m70499l01715j61434l00075o49571q43429o88927m51687m93604
12181A43479651p70734r36175q52875p20182p12218p70986p86626p34826o03393
12172A36591636m15104l31800m77710o61029n79247l17325k76404n40811p29769
12163A32262437o28952n38989p41713j015598j022312q52573q07024q87094q97963
12154A24870219q60297r18088r80906q55088o35961n91570p18037p68924o86504
12145A17854844o57039p49747q24268q04268p55090o89939n68307m71330n10586
$$ y = [158116434, 156887510, 155886469, 155162587, 154518393, 153807955, 153109203, 152536047, 152036774, 151481739, 150850167, 150230963, 149699692, 149278631, 148976573, 148779001, 148596392, 148296155, 147840592, 147370093, 147068378, 146906944, 146606869, 145957298, 145113869, 144424942, 143973255, 143479651, 142708917, 141772742, 140919867, 140199685, 139487467, 138716481, 137929855, 137195029, 136591636, 136176532, 135844732, 135367022, 134705993, 134126746, 133809421, 133533017, 132992206, 132262437, 131633485, 131094496, 130352783, 129337185, 128314873, 127462300, 126655276, 125768182, 124870219, 124009922, 123091834, 122110928, 121255840, 120619879, 120028309, 119310272, 118541348, 117854844, 117197805, 116448058, 115623790, 114819522, 114064432, 113374493, 112806186, 112334856, 111824270]
12136A11824270n87083n09750l16791k00204j61535m9683J07045J43010R6429
12127A10345708J53096K69853K35802J07428J67263M11631N15809L89333L16883
12118A12912806M24697M72606L55963L43509N67266P26651O08789M83620O23314
12109A17519221Q19248P91651P28756R36858J232194J213714R64316R35022J204201
12100A26345181J379317J262418J135799J270607J538847J674923J641586J583943
12092A37832621J615815J761696J967288K110142K116586K067789K072215K087615
12084A53631767K019380J913478J862381J803459J627604J406314J273242J164962
12076A66702587R48633P25605O94796P68379O72734M20212L10658M29802N29680
$$ y = [111824270, 111237187, 110727437, 110410646, 110210442, 110048907, 109999224, 110106269, 110249279, 110345708, 110498804, 110768657, 111004459, 111111887, 111279150, 111690781, 112206590, 112595923, 112912806, 113337503, 113810109, 114166072, 114509581, 115076847, 115803498, 116412287, 116895907, 117519221, 118338469, 119130120, 119858876, 120795734, 122027928, 123241642, 124205958, 125140980, 126345181, 127724498, 128986916, 130122715, 131393322, 132932169, 134607092, 136248678, 137832621, 139448436, 141210132, 143177420, 145287562, 147404148, 149471937, 151544152, 153631767, 155651147, 157564625, 159427006, 161230465, 162858069, 164264383, 165537625, 166702587, 167651220, 168376825, 169071621, 169840000, 170512734, 170932946, 171243604, 171673406, 172203086]
12067A72203086M93511N28770P45620R16512Q75203Q31173J024116J329801J489965
12058A80437757J521821J611472J767173J873261J975498K222354K572124K811487
12050A96792947K860045K859225K953175L133078L301947L381556L365247L340777
12042B21987997L420417L595081L743777L843194M031243M366848M686732M853326
12034B54528615M997081N310206N705899N913012N862735N758286N754451N757524
12026B99587809N584511N181494M633230M040940L427128K733714J930584J121986
12018C28241396M46058j50793q70675j712733k369313k640714k758490l051963
12010C15132773l449408l616696l498913l379335l409344l424818l298041l154931
$$ y = [172203086, 172696597, 173225367, 173970987, 174887499, 175762702, 176593875, 177617991, 178947792, 180437757, 181959578, 183571050, 185338223, 187211484, 189186982, 191409336, 193981460, 196792947, 199652992, 202512217, 205465392, 208598470, 211900417, 215281973, 218647220, 221987997, 225408414, 229003495, 232747272, 236590466, 240621709, 244988557, 249675289, 254528615, 259525696, 264835902, 270541801, 276454813, 282317548, 288075834, 293830285, 299587809, 305172320, 310353814, 314987044, 319027984, 322455112, 325188826, 327119410, 328241396, 328687454, 328536661, 327665986, 325953253, 323583940, 320943226, 318184736, 315132773, 311683365, 308066669, 304567756, 301188421, 297779077, 294354259, 291056218, 287901287]
12002B87901287l111317l061878k903965k760905k788598k903595k890233k695826
11994B64784970k471176k368622k405180k484852k487774k375283k230580k138651
11986B45822852k048423j867123j657285j560065j528296j364552j067901q87130
11978B33842077r30605r89937r08332q56187j010979j201048j163714r83309r45933
11969B24852033j070640j119042j006029q61097p03497m07536k7359J84449J71681
11960B20012963J78473L47430N14268N42624N57762O49998O32778L55800J8814
11951B23810910j28807k13729n30136j037763j430083j642147j915662k337222
11943B14575361k671252k751524k725006k758683k772318k648126k487893k447799
$$ y = [287901287, 284789970, 281728092, 278824127, 276063222, 273274624, 270371029, 267480796, 264784970, 262313794, 259945172, 257539992, 255055140, 252567366, 250192083, 247961503, 245822852, 243774429, 241907306, 240250021, 238689956, 237161660, 235797108, 234729207, 233842077, 232911472, 231921535, 231013203, 230157016, 229146037, 227944989, 226781275, 225797966, 224852033, 223781393, 222662351, 221656322, 220795225, 220091728, 219684192, 219656833, 219841282, 220012963, 220191436, 220538866, 221053134, 221595758, 222153520, 222803518, 223436296, 223792096, 223810910, 223682103, 223468374, 222938238, 221900475, 220470392, 218828245, 216912583, 214575361, 211904109, 209152585, 206427579, 203668896, 200896578, 198248452, 195760559, 193312760]
11935A93312760k471629k396152k212254k032396j889186j748107j642011j607290
11927A77313735j546922j347834j098037r97175j063529j113116j038137r32265
11919A68176720r12490r76148j073432j178955j251805j255795j250730j332021
11911A58945344j461207j511926j507748j623100j884203k073502k047568j963444
11903A44872646k033536k213587k318165k324978k361386k459372k516304k470776
11895A26174542k366355k268501k237219k323130k465532k474880k265391k020533
11887A07753001j959905k034230k048443j985625j955950j905226j688436j414062
11879I2761124j373342j575418j689770j552267j396316j433754j537481j544891
$$ y = [193312760, 190841131, 188444979, 186232725, 184200329, 182311143, 180563036, 178921025, 177313735, 175766813, 174418979, 173320942, 172323767, 171260238, 170147122, 169108985, 168176720, 167264230, 166288082, 165214650, 164035695, 162783890, 161528095, 160277365, 158945344, 157484137, 155972211, 154464463, 152841363, 150957160, 148883658, 146836090, 144872646, 142839110, 140625523, 138307358, 135982380, 133620994, 131161622, 128645318, 126174542, 123808187, 121539686, 119302467, 116979337, 114513805, 112038925, 109773534, 107753001, 105793096, 103758866, 101710423, 99724798, 97768848, 95863622, 94175186, 92761124, 91387782, 89812364, 88122594, 86570327, 85174011, 83740257, 82202776, 80657885]
11871H0657885j558158j678118j730078j574034j434268j549543j707299j553463
11863F7872924j214747j132147j340719j427779j238488j095355j175392j188222
11855E8060075r39365p47511r19855j180547j082939p41764o49081q80667j001305
11846D9917041p80895n30943n81612q00922q55749o94037n34556n27564o19999
11837D3990764o76937o10663m53953l67119m74106o57869o69459m87333l70860
11828C9222465m64772n75519n00339l58153l62646m51173m26386l34387l72346
11819C5376744m89481m38652k29646j61980l23700m19248k59221q7130j75563
11810C2792123l75791l76184k08232j53687k64469l23149k44309j86002k35459
$$ y = [80657885, 79099727, 77421609, 75691531, 74117497, 72683229, 71133686, 69426387, 67872924, 66658177, 65526030, 64185311, 62757532, 61519044, 60423689, 59248297, 58060075, 57120710, 56373199, 55453344, 54272797, 53189858, 52448094, 51799013, 50918346, 49917041, 49136146, 48605203, 48023591, 47222669, 46366920, 45672883, 45138327, 44610763, 43990764, 43313827, 42703164, 42249211, 41882092, 41407986, 40750117, 40080658, 39593325, 39222465, 38757693, 38182174, 37681835, 37323682, 36961036, 36509863, 36083477, 35749090, 35376744, 34887263, 34448611, 34218965, 34056985, 33733285, 33314037, 33054816, 32967686, 32792123, 32416332, 32040148, 31831916, 31678229, 31413760, 31090611, 30846302, 30660300, 30424841]
11801C0424841k79055k51041k47632l01599k88435j80573j67901l55650n27934
11792B7825021m22243j23657L0476j06290l30938l80205k27807n1690l601p0322
11782B6138744j29864j05887m8635m9645j03457j15650m6148L2718M2433p283
11772B5607326n4592n2477J3566J04133J22382K4040p4903k4744J19932J48595
11762B5933258J5000p6795J1327J35831J00779o1426j93590k56622k97640k97966
11752B5012156k40761k34402l75864n60413o06740n09188l97853l23216k60353
11743B1503366k49038l29332m00488l44699k31744k03640k36223k32756k49937
11734A9025509l60057l93109j57797J44108J19904j98447l64921k06427n0406
$$ y = [30424841, 30145786, 29894745, 29647113, 29345514, 29057079, 28876506, 28708605, 28352955, 27825021, 27402778, 27279121, 27309597, 27203307, 26872369, 26492164, 26264357, 26212667, 26209066, 26138744, 26008880, 25902993, 25854358, 25804713, 25701256, 25585606, 25539458, 25572176, 25614609, 25607326, 25552734, 25500257, 25513823, 25617956, 25740338, 25764378, 25689475, 25664731, 25784663, 25933258, 25948258, 25871463, 25882790, 26018621, 26119400, 26057974, 25864384, 25607762, 25310122, 25012156, 24771395, 24536993, 24161129, 23600716, 22993976, 22484788, 22086935, 21763719, 21503366, 21254328, 20924996, 20524508, 20179809, 19948065, 19744425, 19508202, 19275446, 19025509, 18665452, 18272343, 18114546, 18258654, 18378558, 18180111, 17815190, 17608763, 17558357]
11725A7558357j30145k25442j29899l7901j43213k37783j01224L4155j44818m42840
11715A5999247m26266j28017J5280j34885k67547j91841r9829j57456k27439j60036
11705A4221211n2315m7782j10248j44503j56686j77010j77687j50062j26007q7233
11695A2991678l893L7759o5419k16686k24704j19618j07674k04289k07705p6961
11685A1802488j1759p3438o6886O9532J04539o9730j99611q7639O2347j257j58547
11674A1370039j66586q0936q6571j18912k0442R6616K6800j25178j08304J6880
11664A0803406q353j52472j52708j9853k4320j69373j59886L2299P0952j27978
11654A0091714j86654P8417K65795J3897l77178l85358m7911J60108N6022r8776
$$ y = [17558357, 17428212, 17202770, 17072871, 17034970, 16891757, 16653974, 16552750, 16586905, 16442087, 15999247, 15572981, 15444964, 15460244, 15325359, 15057812, 14865971, 14766142, 14608686, 14381247, 14221211, 14168896, 14121114, 14010866, 13866363, 13709677, 13532667, 13354980, 13204918, 13078911, 12991678, 12987785, 13025544, 12960125, 12743439, 12518735, 12399117, 12291443, 12087154, 11879449, 11802488, 11790729, 11717291, 11650405, 11719937, 11824476, 11754746, 11555135, 11467496, 11529843, 11528586, 11370039, 11203453, 11122517, 11035946, 10917034, 10896592, 10993208, 11020008, 10894830, 10786526, 10803406, 10795053, 10642581, 10489873, 10470020, 10445700, 10276327, 10116441, 10148740, 10219692, 10091714, 9905060, 9983477, 10249272, 10263169, 9885991, 9500633, 9452722, 9612830, 9668852, 9570076]
11644I570076j01595m1702k7021l1353n0158j17599j43898q160J69618J31872
11634I350080j03174k18969o7337J19018R8039m7713j05686n9592m0588q8513
11624H835565j28312j06559l7560K3621l073j39991k51634j65108O5353J83096
11614H275398Q5478l6986k0228K4530n8352j82129j71985n9417J991J503K4035
11603G883838L5310m1477j08450j5881J38749J11529q7975j79024l8462J23697
11593G821854J07160q740o3740o6659r0365r1992q669Q9829R6518K5515m2574
11582G768137q2510r3382m9880J9079J5856o5406r0578l007N6019k4081j25955
11571G324292j01998k4705l7981q4153j6807J02726Q2378o6749j33768m7487L5348
$$ y = [9570076, 9468481, 9426779, 9399758, 9368405, 9318247, 9200648, 9056750, 9048590, 9218208, 9350080, 9246906, 9027937, 8960600, 9079618, 9177657, 9129944, 9024258, 8964666, 8924078, 8835565, 8707253, 8600694, 8563134, 8586755, 8583682, 8443691, 8192057, 8026949, 8092302, 8275398, 8360876, 8323890, 8303662, 8328192, 8269840, 8087711, 7915726, 7856309, 7858300, 7859803, 7883838, 7919148, 7877671, 7769221, 7753340, 7892089, 8003618, 7915643, 7736619, 7698157, 7821854, 7929014, 7920274, 7856534, 7789875, 7699510, 7607518, 7598849, 7688678, 7785196, 7810711, 7768137, 7685627, 7592245, 7542365, 7561444, 7577300, 7511894, 7421316, 7418309, 7474328, 7450247, 7324292, 7222294, 7197589, 7159608, 7075455, 7058648, 7161374, 7243752, 7177003, 7043235, 6995748, 7031096]
11560G031096J3870k0466O327K1305k6015n2450j698M1095k835p6640r7295p1065
11548F765229k1339O6984J47655J00105p3928j72917n1165J51407J85688L1867
11538G129586r3464m5816P4173Q6797k2497r1596q43J48821J40107o7002k44064
11527G014202j84707N475O3543m5983j06946r944R2348N3255m9758p0632l946
11516F756907O8313R8764N3576q6013k19247j82814Q29J05895K7030p4223n4984
11505F494033k130j6050j8891M0475L1653q8273j02293R7851K23429J5458k65496
11494F409766k00464R9492J54399j02823k29758j3795J98490Q6920j54597j69645
11484F077985L3721J73481J06887o6265j75954j12850Q8353K21701J18832q7378
$$ y = [7031096, 7044966, 7024500, 7030827, 7052132, 7026117, 6973667, 6971969, 7013064, 7010229, 6933589, 6836294, 6765229, 6743890, 6810874, 6958529, 7058634, 6984706, 6811789, 6760624, 6912031, 7097719, 7129586, 7036122, 6990306, 7064479, 7151276, 7128779, 7037183, 7036340, 7185161, 7325268, 7258266, 7014202, 6829495, 6834970, 6898513, 6852530, 6745584, 6735640, 6827988, 6881243, 6831485, 6760853, 6756907, 6825220, 6923984, 6977560, 6891547, 6672300, 6489486, 6490315, 6596210, 6623240, 6549017, 6494033, 6491903, 6475853, 6456962, 6497437, 6529090, 6440817, 6338524, 6436375, 6659804, 6675262, 6409766, 6209302, 6308794, 6463193, 6360370, 6130612, 6116817, 6315307, 6402227, 6247630, 6077985, 6111706, 6285187, 6392074, 6325809, 6149855, 6037005, 6125358, 6347059, 6465891, 6378513]
11474F378513j16361L0772P3741p4241j69026p0449L8271K2022K6535J29959J20891
11463F390627r9555k30748k6960K51289K21797k3802j20571l2956j1125p4289
11453F243707p952J65315J70694k5595j22494K4765J82888J36702l571m1504J0082
11442F733037K8402j1842o0779q4053m9741M9521J25680Q4647r068k0009K1182
11431F806977k7913j37428j18151N0608J57320R0093o966K844N7938P5055R6559
11420G046936J38298R6952m9179j32279m1274Q5803P4522k0781l1779N1211Q8569
11409G306999J3765q9303j06072p943J26731J78516J15663M2746M8770O6218J2886
11398G708976j1475J12849K35756J09047j62697j99066N9859K16554L0732k09039
$$ y = [6378513, 6262152, 6292924, 6366665, 6292424, 6123398, 6052949, 6091220, 6113242, 6139777, 6269736, 6390627, 6291072, 6060324, 6033364, 6284653, 6506450, 6482648, 6362077, 6329121, 6317996, 6243707, 6235755, 6401070, 6571764, 6546169, 6423675, 6448440, 6631328, 6768030, 6764459, 6722955, 6733037, 6761439, 6749597, 6688818, 6604765, 6555024, 6604545, 6730225, 6814872, 6805804, 6785795, 6806977, 6779064, 6641636, 6523485, 6574093, 6731413, 6821506, 6814540, 6817384, 6875322, 6950377, 7046936, 7185234, 7282186, 7233007, 7100728, 7059454, 7145257, 7219779, 7198998, 7167219, 7218430, 7306999, 7320764, 7231461, 7125389, 7117446, 7244177, 7422693, 7538356, 7581102, 7629872, 7696090, 7708976, 7697501, 7810350, 8046106, 8155153, 7992456, 7793390, 7853249, 8069803, 8100535, 7891496]
11388G891496j69461K1576O7668L358K8774P7520m0416k17308j84500J3247P8229
11377G570183m2518j04192j3013M4455k6953p5437j1253L4312k5287p4113k8592
11366G247592L803o5701j39577j08342k2240L0597O3490R9198Q3417k391o9963
11355G119883n9977k5663l246N9423J52863J35435n5031k36071j79086Q7315L02400
11344G298245K77610P9899q3236r4274j9993J1075o549L6299J52674J86373N5036
11333G893159o6225J0571J63007J28684n8723j04133O6391J83076Q4325k8228
11323H271904M5534J71567J44102M4984O6710J50028R7268n7044r0762K8540R5362
11312H968193J6858m3055N2341J87363J73677L1470l5064R6452L08122L61755
$$ y = [7891496, 7722035, 7743611, 7811279, 7814637, 7843411, 7920931, 7880515, 7663207, 7478707, 7491954, 7570183, 7527665, 7423473, 7410460, 7454915, 7427962, 7352525, 7341272, 7375584, 7350297, 7276184, 7247592, 7251395, 7185694, 7046117, 6937775, 6915535, 6946132, 7009622, 7108820, 7192237, 7189846, 7119883, 7059906, 7034243, 7030997, 7090420, 7243283, 7378718, 7323687, 7087616, 6908530, 6995845, 7298245, 7575855, 7655754, 7572518, 7478244, 7458251, 7469326, 7462777, 7499076, 7651750, 7838123, 7893159, 7826934, 7837505, 8000512, 8129196, 8070473, 7966340, 8032731, 8215807, 8300132, 8271904, 8317438, 8489005, 8633107, 8678091, 8744801, 8894829, 8992097, 8935053, 8844291, 8872831, 8968193, 8985051, 8941996, 8994337, 9181700, 9355377, 9386847, 9351783, 9448235, 9756357, 10118112]
11302A0118112J62191j16551k04778l6871J87995K60201J80138P9065L1142L4775
11292A0695419Q9027J74928K20708J88468J43624J50697J68430J44458J32249
11283A2108008J92967K57308K26927J52190J54659K19493K30881J83823J82723
11274A3908979K37131K45567K01391K21530L16379L24779J79442O3522J54215
11265A5852935L40773L78659K49096J68711K56231L85138M14371L85701L86128
11256A8817743L67344K69492K16280L59364N66717N40296K98514K40795N59959
11247B2236504Q78021P66111M06147L31122O23638Q46407P78431P12660Q72178
11238B8451219J023837R55423R02606J115095J355064J292970J132576J309553
$$ y = [10118112, 10280303, 10163752, 9958974, 9922103, 10110098, 10370299, 10550437, 10629502, 10660644, 10695419, 10784446, 10959374, 11180082, 11368550, 11512174, 11662871, 11831301, 11975759, 12108008, 12300975, 12558283, 12785210, 12937400, 13092059, 13311552, 13542433, 13726256, 13908979, 14146110, 14391677, 14593068, 14814598, 15130977, 15455756, 15635198, 15698720, 15852935, 16193708, 16572367, 16821463, 16990174, 17246405, 17631543, 18045914, 18431615, 18817743, 19185087, 19454579, 19670859, 20030223, 20596940, 21137236, 21435750, 21676545, 22236504, 23114525, 23880636, 24286783, 24617905, 25241543, 26087950, 26866381, 27579041, 28451219, 29475056, 30430479, 31333085, 32448180, 33803244, 35096214, 36228790, 37538343]
11230C7538343J730613J889144J701752J644713J960357K280297K265236K145986
11222E3156441K295823K614115K716153K521968K284569K131722J904235J440139
11214G1065165P76187M0967o77957j322489j838441k206819k451496k606309k694285
11205E8084523k717895k657680k510911k323255k136939j938202j724412j571270
11197D0503959j527489j497162j364036j181696j078396j028441r19603q00324
11189C1106812q11591q90871q29779o50324o09968p55069p97299n76546l32946
11180B4852419l22065m42517m78546m58229n01121n22350l85631k00619j79548
11171B1361793k99227l61671l07589k38768k05600j83274j84606k10639j80798
$$ y = [37538343, 39268956, 41158100, 42859852, 44504565, 46464922, 48745219, 51010455, 53156441, 55452264, 58066379, 60782532, 63304500, 65589069, 67720791, 69625026, 71065165, 71841352, 71882319, 71204362, 69881873, 68043432, 65836613, 63385117, 60778808, 58084523, 55366628, 52708948, 50198037, 47874782, 45737843, 43799641, 42075229, 40503959, 38976470, 37479308, 36115272, 34933576, 33855180, 32826739, 31907136, 31106812, 30295221, 29404350, 28574571, 27924247, 27314279, 26559210, 25761911, 25185365, 24852419, 24530354, 24087837, 23609291, 23151062, 22649941, 22127591, 21741960, 21541341, 21361793, 21062566, 20700895, 20393306, 20154538, 19948938, 19765664, 19581058, 19370419, 19189621]
11162A9189621q4604p8538k43943l92121l25202j46052p4892j05596j01736q7119
11152A7549818j52842k05831j15601L420l1452j28849r0501j372p9880k40560
11142A6506350k18654o0607m7090j63528j23222P3551J08211o3313j06287P6746
11132A5982157J51388l1327j41056M0479K25146J45507J9978J04544J98430M8145
11122A6743391j15683M4390L32949K99996j8406j74379l1458R9786L1636o9109
11112A7143113o2871l5243l8488O666P3492J7516j21987j16782O8941J87166R9872
11101A7221395j2394L5623J55901J72586R0831L2369M5923J02156J65222J85971
11091A8195583J27877N3589P9152K07985L19007L32541K71860J71898O8049N4095
$$ y = [19189621, 19105017, 19026479, 18782536, 18390415, 18065213, 17919161, 17844269, 17738673, 17636937, 17549818, 17396976, 17191145, 17075544, 17078964, 17047512, 16918663, 16828162, 16826790, 16746910, 16506350, 16287696, 16227089, 16179999, 16016471, 15893249, 15966800, 16075011, 16011698, 15905411, 15982157, 16133545, 16102218, 15961162, 16001641, 16226787, 16372294, 16392272, 16496816, 16695246, 16743391, 16627708, 16672098, 17005047, 17305043, 17286637, 17112258, 17080800, 17180586, 17212222, 17143113, 17080242, 17044999, 17006511, 17013177, 17086669, 17104185, 16982198, 16865416, 16934357, 17121523, 17221395, 17209001, 17244624, 17400525, 17573111, 17663942, 17696311, 17742234, 17844390, 18009612, 18195583, 18323460, 18377049, 18456201, 18664186, 18983193, 19315734, 19587594, 19759492, 19827541, 19881636]
11081A9881636J81556L17136K87474J50473J11871J86490J97357J27563J77427
11072B1618983L90727N21022M13767K52416K40615K82930K07919J04377J66619
11063B4199375L38221L84624K58777J47398J66318K22060K01789J36040J22768
11054B6177370J90091K72014K75148J76160P5961R9141K08196K20564P9127j8491
11044B7755281J14009L58459M30724K60663O4873M6093J71023K76354K76150K10614
11034B9964243J60034J60939J85979J91079J78810J81982J81149J11678j2077
11025C1303816o7812J0154J18037J24751N6090K9698O5247Q5131O7741O4801P6921
11014C1934575M8231k653J6929J01951J12453j0399j03798J5211K69621L92632
$$ y = [19881636, 20063192, 20380328, 20667802, 20818275, 20930146, 21116636, 21313993, 21441556, 21618983, 22009710, 22530732, 22944499, 23196915, 23437530, 23720460, 23928379, 24032756, 24199375, 24537596, 24922220, 25180997, 25328395, 25494713, 25716773, 25918562, 26054602, 26177370, 26367461, 26639475, 26914623, 27090783, 27166744, 27265885, 27474081, 27694645, 27773772, 27755281, 27869290, 28227749, 28658473, 28919136, 28984009, 29030102, 29201125, 29477479, 29753629, 29964243, 30124277, 30285216, 30471195, 30662274, 30841084, 31023066, 31204215, 31315893, 31303816, 31236004, 31246158, 31364195, 31488946, 31545036, 31574734, 31639981, 31725112, 31792853, 31857654, 31934575, 31982806, 31980153, 31997082, 32099033, 32211486, 32201087, 32097289, 32112500, 32382121, 32774753]
11004C2774753K77687J09595Q5437J41941R4530m3388p5945M8590J38164N4105
10994C3605469q7798j36054j39925j93925k16222j15868m3076j83197l90275l60054
10984C1739075j38239q7343l03551m52591l15020j22031j40581k56572k36033
10975B9687114j22104p6622n8891K6853O4269o4679j70675j1099K72658L37640
10965B9884464J77835J08385K44980L68360L30615K54080K59299K89826K88501
10956C2206345L00965L35839L34046L08783L08623K52496M4525j71074j59069
10947C3761479R246K6113j68621l16886k97480k79785l40530l20821k00799k16040
10937C1655876m08186m55024j99747K6788p8429k94000k53044k7764O3200K423
$$ y = [32774753, 33052440, 33162035, 33247472, 33389413, 33483943, 33440555, 33364610, 33413200, 33551364, 33605469, 33517671, 33381617, 33241692, 33047767, 32831545, 32715677, 32672601, 32489404, 32099129, 31739075, 31600836, 31513493, 31209942, 30757351, 30442331, 30320300, 30179719, 29923147, 29687114, 29565010, 29488388, 29429497, 29456350, 29520619, 29455940, 29285265, 29274166, 29546824, 29884464, 30062299, 30170684, 30415664, 30784024, 31114639, 31368719, 31628018, 31917844, 32206345, 32507310, 32843149, 33177195, 33485978, 33794601, 34047097, 34091622, 33920548, 33761479, 33770725, 33796838, 33628217, 33311331, 33013851, 32734066, 32393536, 32072715, 31871916, 31655876, 31247690, 30792666, 30592919, 30619707, 30541278, 30247278, 29994234, 29966470, 30029670, 30032093]
10927C0032093J0292R9252J09560Q2272J92126L69416L69807J90919O2117L5625
10917C1553479n8401k38282l01520j86469r5165j75512l36835m46592m81451m40711
10907B8792541l31943k66516l45643m49813l85698k28985k32578l90044m20232
10898B5741089k37239r0538j33797j94222j25052o9244j72051l04686k94192k02580
10888B3917488j66282j60491j24616j28659k14358k54805j66385p4816q1365p2567
10878B2473144K5945L7279j59324l28786k09646L4890N1883j46301k40313j33860
10868B1404911l1674k0681K3373Q9371l511k13010k41265l0274R0276n8425j85605
10857B0823486j9763K10555J38697j37680k23206n8996L6079o7607j21202L5107
$$ y = [30032093, 30042385, 30141637, 30251197, 30333469, 30525595, 30895011, 31264818, 31455737, 31517854, 31553479, 31495078, 31256796, 30955276, 30768807, 30673642, 30498130, 30161295, 29714703, 29233252, 28792541, 28460598, 28194082, 27848439, 27398626, 27012928, 26783943, 26551365, 26161321, 25741089, 25503850, 25413312, 25279515, 25085293, 24960241, 24890997, 24718946, 24414260, 24120068, 23917488, 23751206, 23590715, 23466099, 23337440, 23123082, 22868277, 22701892, 22627076, 22545711, 22473144, 22499089, 22536368, 22377044, 22048258, 21838612, 21873502, 21925385, 21779084, 21538771, 21404911, 21373237, 21352556, 21375929, 21465300, 21461789, 21248779, 21007514, 20977240, 21067516, 21009091, 20823486, 20803723, 21014278, 21152975, 21015295, 20792089, 20733093, 20769172, 20701565, 20580363, 20615470]
10847B0615470J83953R6832r3987j29337l1595j0576p9574n6388P6978J01997
10837B0673773p4543k23892j10332J55649K56996Q0992j76073k80259j90419k7364
10827B0084528O0759lj38115j78732n9785L8153p2288k64747k36531K0663J54650
10816A9408552l6056k84554k44428J2338J40412K6297j27729j55213r1326o130
10806A8642163P8522R4877j8237j46123j03051O7159J30658M4973L2705J78512
10796A9002158K36245K2419k40368k25863J4263J47717N1436p2132n0614M0428
10786A8925689O2388J6199j8939j1998K5084P1054Q0834K7973j7667L6159J31851
10775A9328627J03443n4596j16050O3389K95302K96177R5425q573J06630K19021
$$ y = [20615470, 20799423, 20896255, 20802268, 20672931, 20641336, 20630760, 20551186, 20494798, 20571776, 20673773, 20599230, 20375338, 20265006, 20420655, 20677651, 20758643, 20582570, 20302311, 20111892, 20084528, 20145287, 20145284, 20007169, 19828437, 19768652, 19806805, 19734517, 19469770, 19233239, 19253902, 19408552, 19372496, 19087942, 18843514, 18855852, 18996264, 19022561, 18894832, 18739619, 18648293, 18642163, 18720685, 18815562, 18797325, 18651202, 18548151, 18615310, 18745968, 18790941, 18823646, 19002158, 19238403, 19260822, 19020454, 18794591, 18808854, 18956571, 19008007, 18935875, 18885261, 18925689, 18988077, 19004276, 18985337, 18973339, 18998423, 19069477, 19150311, 19178284, 19160617, 19196776, 19328627, 19432070, 19377474, 19261424, 19324813, 19620115, 19916292, 20011717, 20003144, 20109774, 20328795]
10765B0328795J25808l3192L151K06401L02980J88768N7973P7875J60407J66984
10755B1585950J47850K08749K77231K06349M1981j4776J03361K52018K91740K30627
10745B3331080J39772P0543P5341J75673K85937K91322K12178J65101J68720J45842
10735B5061509J15110J84071L20572L43995K15646J28661K08473L26200L33387
10726B7237624K84542K77910K65820J98458J80325K87196L85456L41716K62469
10717B9721516L00204L67858L03740J92110K27262L50309L34917J86406J35700
10708C2120022K42938L21470K82751K52313K89698K88366K31525K63065M03630
10699C4695778M64663L61211K58458K85313L47635L54152L80795M67256M95056
$$ y = [20328795, 20454603, 20421411, 20424562, 20630963, 20933943, 21122711, 21180684, 21258559, 21418966, 21585950, 21733800, 21942549, 22219780, 22426129, 22468110, 22453334, 22556695, 22808713, 23100453, 23331080, 23470852, 23541395, 23616736, 23792409, 24078346, 24369668, 24581846, 24746947, 24915667, 25061509, 25176619, 25360690, 25681262, 26025257, 26240903, 26369564, 26578037, 26904237, 27237624, 27522166, 27800076, 28065896, 28264354, 28444679, 28731875, 29117331, 29459047, 29721516, 30021720, 30389578, 30693318, 30885428, 31112690, 31462999, 31797916, 31984322, 32120022, 32362960, 32684430, 32967181, 33219494, 33509192, 33797558, 34029083, 34292148, 34695778, 35160441, 35521652, 35780110, 36065423, 36413058, 36767210, 37148005, 37615261, 38110317]
10690C8110317M24615M09434N07574N37402M14785L61916N35180P08441O27968
10681D2637632M52065M90270O87771P48709O48056O27862P47923Q24404P99466
10672D8664158Q08165Q65448Q36593P51794Q05519R88920J066668R95059J008564
10663E6790888J177277J244987J087566R85633J190553J505438J583658J422775
10655F6988775J271434J223824J206215J231159J355788J466583J401680J251973
10647G7397431J267386J473381J643012J667050J690543J818401J930928J913295
10639I0801427J872016J963153K133983K203667K135026K068663K098384K146788
10631A07423107K099634J968739J856068J806175J767370J683584J552176J385892
$$ y = [38110317, 38534932, 38944366, 39451940, 39989342, 40404127, 40766043, 41301223, 42009664, 42637632, 43089697, 43579967, 44267738, 45016447, 45664503, 46292365, 47040288, 47864692, 48664158, 49472323, 50337771, 51174364, 51926158, 52731677, 53720597, 54787265, 55782324, 56790888, 57968165, 59213152, 60300718, 61286351, 62476904, 63982342, 65566000, 66988775, 68260209, 69484033, 70690248, 71921407, 73277195, 74743778, 76145458, 77397431, 78664817, 80138198, 81781210, 83448260, 85138803, 86957204, 88888132, 90801427, 92673443, 94636596, 96770579, 98974246, 101109272, 103177935, 105276319, 107423107, 109522741, 111491480, 113347548, 115153723, 116921093, 118604677, 120156853, 121542745]
10623A21542745J197438J047807J015673J059543J013893Q23961O80100P63625
10615A29144785R45098R46905P66685O87284Q38604J013378J016780R56228J028850
10606A37344597J216810J369628J438409J463845J466960J502270J672887J936183
10598A49411589K056884J935032J810602J925547K150514K207655K114072K094371
10590A65706266K156113K090361J852724J613630J429317J175010Q27945N18200
10582A77369566K63674n2240l99422o01750o74952q47339j160028j371010j372580
10573A71153919j371496j494943j549054j385444j204355j228942j331447j269579
10565A60318659j089740j000689j003503r34770p65327n99960m75284l80733l72780
$$ y = [121542745, 122740183, 123787990, 124803663, 125863206, 126877099, 127701060, 128381160, 129144785, 130089883, 131036788, 131803473, 132490757, 133329361, 134342739, 135359519, 136315747, 137344597, 138561407, 139931035, 141369444, 142833289, 144300249, 145802519, 147475406, 149411589, 151468473, 153403505, 155214107, 157139654, 159290168, 161497823, 163611895, 165706266, 167862379, 169952740, 171805464, 173419094, 174848411, 176023421, 176851366, 177369566, 177633240, 177581000, 177181578, 176579828, 175904876, 175057537, 173897509, 172526499, 171153919, 169782423, 168287480, 166738426, 165352982, 164148627, 162919685, 161588238, 160318659, 159228919, 158228230, 157224727, 156289957, 155524630, 154924670, 154449386, 154068653, 153695873]
10556A53695873m54708m65125l04323j34147j16779j08026J06208M03512M83976
10547A53106461L53571L10279M75400O60227P08720O77463O42117N87147N26951
10538A58048336N12886N06316M51667M42471N75547O91850N49935K19289k4089
10529A61974208j80285n40853j188166j856700k379680k899309l497656l975278
10521A45456281m174245m205377m177285m008189l693839l450466l376140l264482
10513A15106258k976141k694445k569428k423202k103282j827259j829950j929576
10505I6752975j820520j575868j467829j480136j408101j283898j280825j328425
10497H5107373j258148j212046j431262j723641j669172j340306j255777j539442
$$ y = [153695873, 153241165, 152776040, 152471717, 152337570, 152220791, 152112765, 152218973, 152622485, 153106461, 153460032, 153770311, 154245711, 154905938, 155614658, 156292121, 156934238, 157521385, 158048336, 158561222, 159067538, 159519205, 159961676, 160537223, 161229073, 161779008, 161998297, 161974208, 161793923, 161253070, 160064904, 158208204, 155828524, 152929215, 149431559, 145456281, 141282036, 137076659, 132899374, 128891185, 125197346, 121746880, 118370740, 115106258, 112130117, 109435672, 106866244, 104443042, 102339760, 100512501, 98682551, 96752975, 94932455, 93356587, 91888758, 90408622, 89000521, 87716623, 86435798, 85107373, 83849225, 82637179, 81205917, 79482276, 77813104, 76472798, 75217021, 73677579]
10489G3677579j699043j433531j113160j145576j334858j276365j031711r50920
10481F3692415j047241j015580p82692o16494o69307p56297o79494n20077m74504
10472E7130729n49912n65798m16165k22204j79833k94115l60357k48436q8366
10463E4205543n2980p0952L8548K20724K48029J23507J17335L28162N09625M73054
10453E6140595L83139M56036N99365N87149M18113K66114J99640J57539R7988
10444E9305678o058k07910m60788n79538m95525m08295n02880o64886o76246n45912
10434E4757640m27070l48770k64059k25341k61614k20423l935J79522J07839m4352
10424E3249437N7719L63590N22779M57545M24692N07916M98608L53139L18624
$$ y = [73677579, 71978536, 70545005, 69431845, 68286269, 66951411, 65675046, 64643335, 63692415, 62645174, 61629594, 60846902, 60230408, 59561101, 58804804, 58125310, 57605233, 57130729, 56580817, 56015019, 55598854, 55376650, 55196817, 54902702, 54542345, 54293909, 54205543, 54152563, 54081611, 54120159, 54340883, 54588912, 54712419, 54829754, 55157916, 55667541, 56140595, 56523734, 56979770, 57579135, 58166284, 58584397, 58850511, 59050151, 59207690, 59305678, 59299620, 59091710, 58630922, 58051384, 57555859, 57147564, 56644684, 55979798, 55303552, 54757640, 54330570, 53981800, 53717741, 53492400, 53230786, 53010363, 53006428, 53185950, 53293789, 53249437, 53307156, 53670746, 54193525, 54651070, 55075762, 55583678, 56082286, 56435425, 56754049]
10415E6754049M58483M77053K19198m5929q4840q0782k62865m81388n01439m55517
10405E5996023o16724r06827j025786r57500r59026j095914j158156j050398r29799
10396D7295893q95755q36876o82537n58139n68256o18624n76859m58895l43042
10387D1756910k30537j10108n3489j13206j88111j22509P3074K08091J44206l7183
10377D1327138j58419j92107k84956n12905p26836p54186o78240p38013r57338
10368C6324138j085084r78288q34642q86853j033657r96503p53958n78202o39318
10359B8537633p82494p63334n61066l69689l48352m54870n21747m68804l97094
10350B3870183m21713m65194l63553j70827j38163l11537m03662k41889q9674
$$ y = [56754049, 57212532, 57689585, 57908783, 57862854, 57778014, 57697232, 57434367, 56952979, 56451540, 55996023, 55379299, 54472472, 53446686, 52489186, 51530160, 50434246, 49276090, 48225692, 47295893, 46400138, 45563262, 44880725, 44322586, 43754330, 43135706, 42558847, 42099952, 41756910, 41526373, 41416265, 41362776, 41249570, 41061459, 40938950, 41012024, 41220115, 41364321, 41327138, 41168719, 40976612, 40691656, 40178751, 39451915, 38697729, 38019489, 37281476, 36324138, 35239054, 34260766, 33426124, 32539271, 31505614, 30509111, 29755153, 29176951, 28537633, 27755139, 26991805, 26430739, 26061050, 25712698, 25257828, 24736081, 24267277, 23870183, 23448470, 22983276, 22619723, 22448896, 22310733, 21999196, 21595534, 21353645, 21263971]
10341B1263971k40193n02339m72372j91432q5231k63814l58638j68094j532j42104
10331A8838222l65243l26791j27394r8449k29412k32454q0354m9946k14744k93667
10321A6819768j21012O7378M393k06298k86639k08658j68885k25002k15980n7983
10311A5401082R4144O5005j02240k24796k08311r9618J8631P7912J8203j40385
10301A4899627k40389j41418N8690J09269m6485j80437j21667o163k9470j18963
10291A4182594q3558K6685l292j57788j77476J6140J76459J16711k6087o2589
10281A4007799m7998j09452j72455r5831N1629Q7592P782m1160k5529m2951j00876
10270A3518550q8687J2145P4110K3536n1280m3984K6292O4317K0341o6560j04333
$$ y = [21263971, 21023778, 20521439, 20049067, 19857635, 19772404, 19508590, 19149952, 18981858, 18980326, 18838222, 18472979, 18146188, 18018794, 17920345, 17690933, 17458479, 17378125, 17328179, 17113435, 16819768, 16698756, 16766134, 16770527, 16564229, 16277590, 16068932, 15900047, 15675045, 15459065, 15401082, 15495226, 15560231, 15457991, 15233195, 15024884, 14925266, 14943897, 15021809, 15040012, 14899627, 14659238, 14517820, 14576510, 14685779, 14639294, 14458857, 14337190, 14331027, 14301557, 14182594, 14099036, 14125721, 14122429, 13964641, 13787165, 13803305, 13979764, 14096475, 14070388, 14007799, 13959801, 13850349, 13677894, 13582063, 13633692, 13721284, 13729066, 13687906, 13662377, 13619426, 13518550, 13429863, 13442008, 13516118, 13539654, 13488374, 13444390, 13470682, 13534999, 13555340, 13488780, 13384447]
10259A3384447l2851R5935J64020J39804R8612N8235n3292j81215j04219K01099
10249A3770575L63290Q2895l49253l80051J3186K84452J27307j24175q7334Q8879
10239A3789771N3685j41909j67738K4656J60030J07050L1753N7571P9823N394
10229A4000086o8121l2566M8948O0859R867k4441j8344O440M4179P8143O0613
10218A4165663q518m6874o238L7222k795o5663j3338J46767K23763Q3940j47139
10207A4366790k14211m2847J73504K20508J09403R309L087K5882K5285M3126R6480
10196A4816316J04823K6812k7409N5081J86311J68192j8274j57715q0647J17146
10186A5190636K15915J51425M8990J6638K2752J771j7797L4305J36717J83921
$$ y = [13384447, 13351596, 13447531, 13611551, 13751355, 13849967, 13908202, 13854910, 13673695, 13569476, 13770575, 14133865, 14216760, 13867507, 13487456, 13500642, 13785094, 13912401, 13788226, 13700892, 13789771, 13843456, 13701547, 13533809, 13558465, 13718495, 13825545, 13857298, 13914869, 13994692, 14000086, 13931965, 13899399, 13948347, 14009206, 14019073, 13994632, 13976288, 13982728, 14026907, 14105050, 14165663, 14157145, 14110271, 14104033, 14141255, 14138460, 14072797, 14059459, 14206226, 14429989, 14513929, 14366790, 14152579, 14109732, 14283236, 14503744, 14613147, 14622456, 14625543, 14651425, 14676710, 14719836, 14816316, 14921139, 14947951, 14920542, 14975623, 15161934, 15330126, 15311852, 15154137, 15073490, 15190636, 15406551, 15557976, 15606966, 15623604, 15646356, 15648127, 15630330, 15664635, 15801352, 15985273]
10176A5985273J29729N0287L7486Q9669J48674J90605K20064K15165J53195P4068
10166A7294215M8737R0028J50282J89569J85920J13468R43k0028J48559L85849
10156A8587542M44081K64589O9479P2978K21371L08709K52756J50632J19917J75761
10146B0667815K35231J95699N1074n5949J9226K13182L14222K56625J94052K25037
10136B2316214K43096J71703J41352K57458L74947L19565J80790J49289K02661
10127B4357075K13009K32053L62658M61837L34244J50031K54367N65172O20061
10118B7550507L12093J00666K87136N36629M38426J53402R5852K62104L37824
10109C0074639K89359L60371N46192N46460K90645R9717K01631M17736M84877
$$ y = [15985273, 16115002, 16165289, 16202775, 16292444, 16441118, 16631723, 16851787, 17066952, 17220147, 17294215, 17342952, 17432980, 17583262, 17772831, 17958751, 18072219, 18073162, 18053134, 18201693, 18587542, 19031623, 19296212, 19365691, 19438669, 19660040, 19968749, 20221505, 20372137, 20492054, 20667815, 20903046, 21098745, 21149819, 21093870, 21113096, 21326278, 21640500, 21897125, 22091177, 22316214, 22559310, 22731013, 22872365, 23129823, 23504770, 23824335, 24005125, 24154414, 24357075, 24570084, 24802137, 25164795, 25626632, 25960876, 26110907, 26365274, 26930446, 27550507, 27862600, 27963266, 28250402, 28787031, 29225457, 29378859, 29474711, 29736815, 30074639, 30363998, 30724369, 31270561, 31817021, 32107666, 32207383, 32409014, 32826750, 33311627]
10100C3311627M19118L85262M15810M43784M66834N07657N10051M21325L17084
10091C7198552L29034M82230O72972P72086P16790N60452M58304N29112P02843
10082D2422375P88023P19450O43003P05478Q52257R08754Q08528O71674O71300
10073D9190842Q49103J058778J113815J011822R46561J039511J162211J150905
10065E7523548J090837J180620J375396J424642J271583J141041J166596J205647
10057F7379910J136707J065804J075146J034963Q81744Q29392J024104J209611
10049G5637381J078541P96255P86084J078460J286680J223935J123397J168148
10041H4178881J215767J158587J183466J420961J634685J557660J320274J235923
$$ y = [33311627, 33730745, 34116007, 34531817, 34975601, 35442435, 35950092, 36460143, 36881468, 37198552, 37527586, 38009816, 38682788, 39454874, 40171664, 40732116, 41190420, 41719532, 42422375, 43210398, 43929848, 44572851, 45278329, 46130586, 47039340, 47847868, 48519542, 49190842, 50039945, 51098723, 52212538, 53224360, 54170921, 55210432, 56372643, 57523548, 58614385, 59795005, 61170401, 62595043, 63866626, 65007667, 66174263, 67379910, 68516617, 69582421, 70657567, 71692530, 72574274, 73403666, 74427770, 75637381, 76715922, 77512177, 78298261, 79376721, 80663401, 81887336, 83010733, 84178881, 85394648, 86553235, 87736701, 89157662, 90792347, 92350007, 93670281, 94906204]
10033I4906204J319853J336333J219881J129035J122853J085646R78034Q90684
10025A03988523Q26538O93880N53419N91392P64132P59026M63960K13801L49495
10016A09204166P38195R91622J010253J016213J132146J251539J333638J512784
10008A18190556J816178K034326K028788J973580K110467K406575K649993K790657
10000A36001120K974061L262690L521676L623519L629638L708010L947864M293510
9992A64962088M609906M803504M924368N133188N511352N941907O263715O502067
9984B08652095O829436P325110P912385Q518760R131015R683877J0096336J0471974
9976B78620988J1035973J1751438J2225279J2194202J1904728J1730773J1549192
$$ y = [94906204, 96226057, 97562390, 98782271, 99911306, 101034159, 102119805, 103097839, 103988523, 104815061, 105508941, 106062360, 106653752, 107417884, 108176910, 108640870, 108854671, 109204166, 109942361, 110933983, 111944236, 112960449, 114092595, 115344134, 116677772, 118190556, 120006734, 122041060, 124069848, 126043428, 128153895, 130560470, 133210463, 136001120, 138975181, 142237871, 145759547, 149383066, 153012704, 156720714, 160668578, 164962088, 169571994, 174375498, 179299866, 184433054, 189944406, 195886313, 202150028, 208652095, 215481531, 222806641, 230719026, 239237786, 248368801, 258052678, 268149014, 278620988, 289656961, 301408399, 313633678, 325827880, 337732608, 349463381, 361012573]
9969C61012573J0848364R442878P721743O082462M432487K456141J52828k149958
9961C99999518m213538o071110p807200r350210j0538722j1291711j1671713j1829071
9953C27226243j1888772j1853009j1628611j1181329j0623517j0100061r626375
9946B50324569r100442q453541p740090p092373o608192o250408n855036n311743
9938A93912744m745693m405554m329296m264559m010850l687726l518464l493759
9930A61456843l457046l411647l479177l598201l554716l345827l234099l341730
9922A34034400l437578l274835k940946k702266k653968k692238k707180k636450
9914A10988939k436083k166155k014548k073691k180316k138537k006502j973835
$$ y = [361012573, 371860937, 381303815, 389025558, 395108020, 399540507, 401996648, 402149476, 399999518, 395785980, 389714870, 381907670, 372557460, 362018738, 350727027, 339055314, 327226243, 315337471, 303484462, 291855851, 280674522, 270051005, 259950944, 250324569, 241224127, 232770586, 225030496, 217938123, 211329931, 205079523, 199224487, 193912744, 189167051, 184761497, 180432201, 176167642, 172156792, 168469066, 164950602, 161456843, 157999797, 154588150, 151108973, 147510772, 143956056, 140610229, 137376130, 134034400, 130596822, 127321987, 124381041, 121678775, 119024807, 116332569, 113625389, 110988939, 108552856, 106386701, 104372153, 102298462, 100118146, 97979609, 95973107, 93999272]
9906I3999272k040445k037497j916749j787225j682528j528940j359503j319976
9898H0326409j405259j412053j240163j042769r75845r82790r52131r26479j006355
9889G0382565j163182j286601j334805j331872j299704j279624j325719j397811
9881E9963247j373120j242515j159060j198249j226513j128447r96045r39566
9873E0699732q87451p67956p10587q18166r00465p43353n21725n79987q55978
9864D3914064r27220o65670m35414n08310o68304o17146m47242m22479n28008
9855C8694271n53389m71435m29113m47715m11414l15517k80604l29187l56977
9846C5098920l25155k97973k90552k50076j89790j82369k18711k23937k08508
$$ y = [93999272, 91958827, 89921330, 88004581, 86217356, 84534828, 83005888, 81646385, 80326409, 78921150, 77509097, 76268934, 75226165, 74250320, 73267530, 72315399, 71388920, 70382565, 69219383, 67932782, 66597977, 65266105, 63966401, 62686777, 61361058, 59963247, 58590127, 57347612, 56188552, 54990303, 53763790, 52635343, 51639298, 50699732, 49812281, 49044325, 48333738, 47515572, 46615107, 45871754, 45350029, 44770042, 43914064, 42986844, 42321174, 41885760, 41377450, 40709146, 40092000, 39644758, 39222279, 38694271, 38140882, 37669447, 37240334, 36792619, 36381205, 36065688, 35785084, 35455897, 35098920, 34773765, 34475792, 34185240, 33935164, 33745374, 33563005, 33344294, 33120357, 32911849]
9837C2911849k48124l18292l15272k48869k40509l03500l01685j79278o6457q0574
9827C0609289j63476j99820j76598j41980j10947r3146j22335j82988j91480j18046
9817B9108473m4930l9982n8492l9103j2465l4530p9514p8261j8081N1679P5771
9806B8830565L2230l0474l104J42113K38085J08263j27218j43345J21403L27994
9796B9496512K18158k584R74J72013J92003K2657m6170J07351K46585J83456P1620
9785C0662575J21023K56117K72500J73113J23149J64868J96253J92536K41209
9776C2403343L43637L65736K51156J45911K14065M11415N45401N24736M51816
9767C5657216M64192N71930O91788P73259Q19853Q30257Q15513Q60270J046910
$$ y = [32911849, 32663725, 32345433, 32030161, 31781292, 31540783, 31237283, 30935598, 30756320, 30689863, 30609289, 30445813, 30245993, 30069395, 29927415, 29816468, 29723322, 29600987, 29417999, 29226519, 29108473, 29063543, 29023561, 28965069, 28925966, 28913501, 28878971, 28799457, 28721196, 28703115, 28754794, 28830565, 28862795, 28832321, 28829217, 28971330, 29209415, 29317678, 29190460, 29047115, 29168518, 29496512, 29714670, 29712086, 29713060, 29885073, 30077076, 30099733, 30053563, 30160914, 30407499, 30590955, 30662575, 30783598, 31039715, 31312215, 31485328, 31608477, 31773345, 31969598, 32162134, 32403343, 32746980, 33112716, 33363872, 33509783, 33723848, 34135263, 34680664, 35205400, 35657216, 36121408, 36693338, 37385126, 38158385, 38978238, 39808495, 40624008, 41484278, 42531188]
9758D2531188J290575J379920J261103J163699J322171J663557J923391K008188
9750E4543792K063935K209384K398180K575795K791874L088476L423151L771207
9742G6865794M168256M584790M902135N089815N250275N380312N242702M616423
9734A16100502L545793K198877O24656j152687k913269m352702n368783o036730
9726A02645657o358150o271604n886121n443642n020823m509841l932678l504952
9718F1717846l295314l088312k733357k387234k224690k134151j934337j701110
9710D2219341j605990j581220j451013j285929j286429j372479j264697r85389
9702C1386195q79258j037993j109651q76536o35519p00326q60551p43249m68721
$$ y = [42531188, 43821763, 45201683, 46462786, 47626485, 48948656, 50612213, 52535604, 54543792, 56607727, 58817111, 61215291, 63791086, 66582960, 69671436, 73094587, 76865794, 81034050, 85618840, 90520975, 95610790, 100861065, 106241377, 111484079, 116100502, 119646295, 121845172, 122469828, 121317141, 118403872, 114051170, 108682387, 102645657, 96287507, 90015903, 84129782, 78686140, 73665317, 69155476, 65222798, 61717846, 58422532, 55334220, 52600863, 50213629, 47988939, 45854788, 43920451, 42219341, 40613351, 39032131, 37581118, 36295189, 35008760, 33636281, 32371584, 31386195, 30506937, 29468944, 28359293, 27482757, 26847238, 26146912, 25286361, 24543112, 24074391]
9693B4074391m56686o97592p47529m69879k57267l66160n20850m42958l36657
9684A9778813m70960o33088m71889j54962j55278m78214o37609m28221k01419
9675A6147173k35698l23176k28596j27877k46056m00227l08614j09717j35698
9666A4031514l27409l37157j44312r1038k72432l60412j75994r320j29135l26755
9656A1857550k67080m2593j5383k36374l76297k23795L6566J05591o5894k71739
9646A0500552l02854j54212j9414o5598k05216j96769j3019P4540r1683k66228
9636I260099j61080P7114P7013j66492k92363j61434m2883j19333j98158j04156
9626H168327o265q7778j86626q4935P3557J3796j84544k11915m9616K0474r5033
$$ y = [24074391, 23617705, 22920113, 22172584, 21702705, 21445438, 21079278, 20558428, 20115470, 19778813, 19307853, 18674765, 18202876, 18047914, 17892636, 17414422, 16776813, 16348592, 16147173, 15911475, 15588299, 15359703, 15231826, 14985770, 14585543, 14276929, 14167212, 14031514, 13704105, 13366948, 13222636, 13131598, 12859166, 12498754, 12322760, 12313440, 12184305, 11857550, 11590470, 11547877, 11532494, 11296120, 10919823, 10696028, 10732594, 10838185, 10772291, 10500552, 10197698, 10043486, 10024072, 9958474, 9753258, 9556489, 9543470, 9618010, 9526327, 9260099, 9099019, 9176133, 9253146, 9086654, 8794291, 8632857, 8589974, 8470641, 8272483, 8168327, 8162062, 8074284, 7887658, 7802723, 7876280, 7890076, 7705532, 7493617, 7444001, 7464475, 7369442]
9615G369442j79822j16675o0851j09509j23247j7459N2619l4988j51747j45276
9605F482487o9603k3718K7534R4287M0316j69392l03627j86473K193J1655p2201
9594E833458j6255J11590N2852j60101k24792p1589L4961m4270j28097q7576o2836
9583E237345j45583j66711j2572J23676M9319j00768j01965q744j1643q6131p5248
9572D700975o387k9660j12939q7404L9539R1776L1238o102J7745l131p1219n5951
9560D508480M0356M6632p1724j25591k3905O2894k675r7120o9849K150j2889n7913
9548D198846l4539l1551j52073k40153p6231K15916K73042K1549j99607j34316
9538C840883M6932N7801p5180j19350k9547K0337m4844r3401l2352L9798J4512
$$ y = [7369442, 7189620, 7072945, 7012094, 6902585, 6779338, 6761879, 6814498, 6779510, 6627763, 6482487, 6412884, 6389166, 6416700, 6510987, 6551303, 6381911, 6078284, 5891811, 5894004, 5905659, 5833458, 5817203, 5928793, 5981645, 5821544, 5596752, 5525163, 5560124, 5515854, 5387757, 5300181, 5237345, 5091762, 4925051, 4912479, 5036155, 5085474, 4984706, 4882741, 4873997, 4862354, 4776223, 4700975, 4694588, 4664928, 4551989, 4464585, 4504124, 4595900, 4627138, 4621036, 4638781, 4635650, 4564431, 4508480, 4548836, 4595468, 4523744, 4398153, 4374248, 4437142, 4434467, 4337347, 4267498, 4269648, 4256759, 4198846, 4164307, 4132756, 3980683, 3740530, 3664299, 3880215, 4153257, 4174806, 3975199, 3840883, 3887815, 3945616, 3870436, 3751086, 3721539, 3741876, 3697032, 3603631, 3571279, 3611077, 3625589]
9527C625589m7397l9820o19k6019o6578J2092J74079K04722J6854j93873k06086
9516C452944o2694K9239m18m0622j2453L2110K7132k0944p7156j04848n3521P0540
9504C239309J38222L7026j31075j49000N242J22127P3717k3964l6657j1046l1518
9493C232383m9016j188L8540o199n2303L223Q4671N7563l8406o3059j4434J56
9481C191931j6981L4642J44129J85784J26363N8137K1321l1107q3058n1395M1533
9470C621299O6870r22m0911L056L4461j3569o5554m4757R260K9139K832p2999
9458C528205j84689k19319o6794J50049J55139q3180k53094j34655P9042Q7288
9448C057992p6549j51614p0340j984l0421n3465j6586j4558r5720j46708o5634
$$ y = [3625589, 3578192, 3538372, 3537753, 3511734, 3445156, 3457248, 3631327, 3836049, 3852903, 3659030, 3452944, 3390250, 3419489, 3419071, 3378449, 3365996, 3398106, 3425238, 3404294, 3327138, 3222290, 3168769, 3239309, 3377531, 3414557, 3283482, 3134482, 3139724, 3261851, 3335568, 3311604, 3274947, 3263901, 3232383, 3183367, 3182179, 3220719, 3214520, 3162217, 3165440, 3250111, 3307674, 3269268, 3206209, 3191775, 3191931, 3174950, 3209592, 3353721, 3539505, 3665868, 3724005, 3745326, 3714219, 3631161, 3579766, 3621299, 3688169, 3687247, 3646336, 3649392, 3683853, 3670284, 3604730, 3559973, 3569233, 3598372, 3601204, 3528205, 3343516, 3124197, 3057403, 3207452, 3362591, 3279411, 3026317, 2891662, 2970704, 3057992, 2981443, 2829829, 2759489, 2757505, 2727084, 2673619, 2657033, 2642475, 2546755, 2400047, 2334413]
9437B334413P1205J09710J6521r7846j23391o6586k0941m1139p4366m6921J2662
9426B073321J7380k5885k8213L953m1585j60411j76195j8595J18329N7165q0266
9415A738998p5731L0044L0132q3789j17728j2075P5939M3738l4712q8727j32409
9404A373680j29606l029J63924J61001k6466j44455l1723J44305J48576K116j05911
9393A552412r0205n942P2367P7151l9380j97845k09771k6318J46005J10991m8732
9382A340733j14476l8580N1850P5318N6735K5072n392k042J9644k7498j41949
9371A239415j61151l930J38296N7326j32415j59663k5639K3888o7091q0624O9340
9360H97752J64211N0111r4549n3236Q2906Q6878m0692j13480o9690j6061r986
$$ y = [2334413, 2405618, 2515328, 2531849, 2434003, 2310612, 2244026, 2223085, 2181946, 2107580, 2060659, 2073321, 2090701, 2064816, 2036603, 2040556, 1998971, 1838560, 1662365, 1643770, 1762099, 1819264, 1738998, 1663267, 1693311, 1723443, 1639654, 1521926, 1509851, 1585790, 1629528, 1594816, 1506089, 1373680, 1244074, 1241045, 1404969, 1565970, 1539504, 1395049, 1363326, 1507631, 1656207, 1658323, 1552412, 1462207, 1456265, 1528632, 1605783, 1566403, 1368558, 1158787, 1132469, 1278474, 1389465, 1340733, 1226257, 1187677, 1239527, 1314845, 1371580, 1396652, 1391260, 1389218, 1408862, 1381364, 1239415, 1078264, 1074334, 1212630, 1269956, 1137541, 977878, 952239, 976127, 909036, 828412, 897752, 1061963, 1112074, 1017525, 964289, 1047195, 1134073, 1093381, 979901, 910211, 894150, 884164]
9349H84164k884J2161k1427q6196q7298j0351N1599N2721M6816N4964J5242p9037
9337H30474j17011l3504O5755M9580l8670m8644M3930J01290L2464p7471r8041
9326G10152k8678L0298L1256J8783K8379K7093j8502o9374n5314K6634R3709O9260
9314H63696k2115p4397k6950N0918M4121m5262q9211j8584O3731L1147p2363j01228
9302F03503l2034K2862J9474M0424J13352J33154M2031o0323q4319q6872j23368
9291E87884j10722O715R4060K5829p0092m208J30927Q9911r6473j39455L3638
9280E48014J51416M4581r4656o4520K2451r049o8814K935J05126M5979r3918r0205
9268D99340K2083J1896j16537j09497Q4560J96978P8240o4372l3296L8941m0985
$$ y = [884164, 881280, 893441, 872014, 785818, 698520, 688169, 739768, 792489, 839305, 894269, 909511, 830474, 713463, 679959, 745714, 795294, 756624, 707980, 751910, 853200, 885664, 808193, 710152, 681474, 711772, 743028, 761811, 790190, 817283, 798781, 729407, 674093, 700727, 794436, 863696, 841581, 767184, 740234, 791152, 835273, 790011, 700800, 682216, 745947, 777094, 704731, 603503, 571469, 594331, 613805, 654229, 767581, 900735, 942766, 882443, 798124, 711252, 587884, 477162, 483877, 577937, 603766, 533674, 529466, 660393, 750304, 653831, 514376, 548014, 699430, 744011, 649355, 584835, 607286, 598237, 529423, 532358, 637484, 683463, 589545, 499340, 521423, 533319, 416782, 307285, 391845, 588823, 667063, 602691, 569395, 608336, 567351]
9257E67351j64825r9971J14495K22462J31753n186o2095o6868n6226m020P1073
9246F47943Q9698M3221R252J3833Q325l765L7973J07376R8724J3263k4958Q950
9234A049835j7521j47093k15264j09102L1534L8122j9149Q110N6265k8100j66741
9223D80896j36830M8307J37914M7033l1438J2421L0895o4604j01838L5977J46270
9212F05003K1884j69435j28275Q5089J39041m1295j73645p6793Q1815R4514Q936
9201D46839k5881q118j7100l7213l713N7960O3796n078r0091j24467p4659K8443
9189B10718Q3011K3619o1001l0628Q2359J01449j5582j03369n8186L084m1348
9178A94126j12575p8429L0731R6049Q7739M0438l5692r7090m7173R2605J31620
$$ y = [567351, 402526, 302555, 417050, 639512, 771265, 766079, 703984, 637116, 580890, 576870, 647943, 737641, 780862, 790114, 803947, 812272, 808507, 846480, 953856, 1052580, 1065843, 1040885, 1049835, 1032314, 885221, 669957, 560855, 592389, 630511, 611362, 619472, 675737, 647637, 480896, 344066, 392373, 530287, 577320, 545882, 558303, 589198, 524594, 422756, 458733, 605003, 626887, 457452, 329177, 414266, 553307, 512012, 338367, 261574, 343389, 437903, 446839, 420958, 412840, 395740, 358527, 354814, 412774, 476570, 471492, 381401, 256934, 182275, 210718, 293729, 317348, 256347, 225719, 308078, 409527, 393945, 290576, 232390, 235474, 194126, 81551, 3122, 33853, 129902, 217641, 258079, 222387, 125297, 78124, 170729, 302349]
9167C02349j5677j50558p0530J11846J49248L5279m7667n7697r6375j41993o6338
9156d8113R4940J57468Q0911k778n0845j30798j75522k4087K37868K91102M4964
9145D75110k00819j91067l9449L8549M9001P7975O7984l0419p9074L1682J44583
9134C44056N8246j36428j85191m3936J04176J35913Q5734J5207l1073j474O6904
9123D12134J9169j78322k90882j25028J32887J55688l1195j01906N2151J80927
9113B25623R9017n0052o4065K3105N3967j4801j05438j30758m4548J06841J62008
9102B60899J6897j77504j73213J1070J08186J6870o4851m802M7570l3532r5978
9091h8388J5923J52003Q8692q8023j18636J2259Q6028L0732K230P1555J00051
$$ y = [302349, 286672, 136114, 65584, 177430, 326678, 361957, 314290, 256593, 160218, 18225, -48113, 46827, 204295, 285206, 282428, 231583, 100785, -74737, -98824, 139044, 430146, 475110, 274291, 83224, 43775, 82324, 131325, 209300, 277284, 246865, 167791, 199473, 344056, 402302, 265874, 80683, 36747, 140923, 276836, 362570, 377777, 346704, 345230, 412134, 431303, 252981, -37901, -162929, -30042, 125646, 94451, -7455, 44696, 225623, 324640, 274588, 210523, 233628, 287595, 272794, 167356, 36598, -7950, 98891, 260899, 277796, 100292, -72921, -61851, 46335, 63205, -1646, -6448, 41122, 7590, -88388, -72465, 79538, 168230, 80207, -38429, -26170, 59858, 90590, 92820, 164375, 264426]
9080B64426j165j07898q4976J2280N0501J3233k3286k6469k2260k2997j7278o919
9068B7192m401p482k95L0485P6335Q7346P181j27185j69144l1238J61660J97065
9056B47519M5403j11842j35351p8061m0952j8403K2790K8771m5813j03059j4240
9045b03238J57807K01331M6967j17571r4395O1668J28226J3803j39249j54309
9035i8960l0389R1299J12582O4992K6601J6184j480l6531m7144m649M4669K4479
9023A61653n9170r5066N56J50936J82739L6027j50030j99538j00214J2614L6924
9012b2569l234l6513l7727j7373K2982P8653J12950Q5480Q363n4852n8074k7261
9000E0825k7919p7027j12754p4119J3029P0980P2690N0430J6296m0389p4304j5161
$$ y = [264426, 263261, 155363, 70387, 82667, 133168, 146401, 123115, 96646, 74386, 51389, 34111, 27192, 22791, 15309, 15014, 45499, 121834, 209180, 216361, 89176, -79968, -111206, 50454, 247519, 292922, 181080, 45729, -32332, -73284, -91687, -68897, -40126, -85939, -188998, -203238, -45431, 155900, 202867, 85296, -9099, 52569, 180795, 194598, 55349, -98960, -129349, -38050, 74532, 139524, 166125, 182309, 180829, 144298, 97154, 92505, 137174, 161653, 102483, 7417, 7973, 158909, 341648, 377675, 227645, 28107, -72107, -59493, -22569, -25803, -62316, -100043, -117416, -94434, -15781, 97169, 182649, 191012, 136160, 78086, 50825, 22906, -54121, -166875, -240994, -227965, -156985, -84295, -33865, -17569, -57958, -132262, -147423]
8988a47423R0342R6726j3391o2489N0345J55816O1399j29040j62653k8715M9756
8977c9327o883l3701O4751J55301J18758K7173k7929p9684j40914j13762J8036
8966e8181R2070J4438p1066k4034N7021K7213m4335k4236K3845k6370r0213o452
8954a30300J37265J05684q6850j70912l6658J15335J03685J0096p378M2950M9840
8943A32757j7769r0703r2965r339Q5070P2915n2025j26384k5254J31327J33434
8932A41064q461r3594m3066K0808R241j9417o747K4054N7185R1063N7475q6524
8920A43081k01229j09805J05186J83614P1397k9300j0276J8514m554N374M4538
8909B16540j2635j28654j00791N6029P0086j07882j63705M5640K07792P6528j01561
$$ y = [-147423, -57081, 39645, 26254, -36235, 14110, 169926, 231325, 102285, -60368, -89083, -39327, -46210, -79911, -15160, 140141, 258899, 286072, 258143, 178459, 37545, -76217, -58181, 33889, 48327, -22739, -46773, 10248, 37461, -6874, -31110, -7265, -33635, -123848, -130300, 6965, 112649, 25799, -145113, -181771, -66436, 37249, 47345, 39967, 82917, 132757, 114988, 24285, -68680, -78019, 7051, 79966, 27941, -98443, -123697, 7630, 141064, 132603, 39009, -4057, 16751, 25992, 6575, -172, 23882, 81067, 172130, 229605, 143081, -58148, -167953, -62767, 120847, 192244, 162944, 152668, 171182, 166628, 172002, 216540, 203905, 75251, -25540, 30489, 100575, -7307, -171012, -125372, 82420, 158948, 57387]
8898E7387k8445J21071L3509j65249j31714R2310J71358M3570n8021o2913r9569
8887b6706j36055k3008J38944J08342m0878j4966J55575J45693n6671q9998J21093
8876B81365J78314r9453l01465p0691K93443K83291o0919k66811j27975J08018
8866B17117J76636Q8694j6932p1146q5864r8254j17625q7113L7533J58100J24189
8855C25335j4340l3791J17580K10711P7634j43081k26613j35769L8920K07005
8845D23591K39113M3818j92164j26487K10774L39099J9239l22841k12275J46923
8835E68790K15716l3028j44661L2525J46185j9520k01538j28310O3527J10026
8825F09712K6840l926M4335N9893J6653n952K3932M6240O670o3636p2394K1077
$$ y = [57387, 28942, 150013, 183522, 18273, -113441, -21131, 150227, 193797, 135776, 72863, -26706, -162761, -185769, -46825, 61517, 20639, 5673, 161248, 306941, 250270, 160272, 281365, 459679, 360226, 58761, -11930, 281513, 564804, 503885, 237074, 109099, 217117, 393753, 482447, 465515, 394369, 308505, 210251, 92626, 5513, 43046, 201146, 325335, 310995, 277204, 394784, 605495, 683129, 540048, 313435, 177666, 216586, 423591, 662704, 706522, 514358, 387871, 598645, 937744, 956983, 634142, 421867, 568790, 784506, 751478, 606817, 639342, 785527, 766007, 564469, 436159, 499686, 609712, 636552, 632626, 676961, 736854, 753507, 747555, 771487, 817727, 824397, 760761, 688367, 709444]
8813G09444J16800P6415n2983n8945J01247J74848L081j65856m1194J94896J25047
8802A182800k13266l19906J3949L70161L13549j4427j79300p3941N2674M0264
8792A172557j5571r637Q048l2255p4212j7059J09135J38574j5822j93163j52729
8781I17866P4016J78734K0445j37602l1364J74182J58408k0358n0593O9614M5483
8770A398831j44212j68945O9208K41705J50041K6627N8578N6007j10026j65139
8760A412675R0046L28171J73910j54254j75604Q3672J75256k2851j65166m8186
8750A697669J15386J17144M7168M0487N3221L0171L7678R9676J08555R876r3219
8739B263812j03291n1496l627K1880J1996l5818n7489L639Q2824Q2849L3839J8457
$$ y = [709444, 826244, 902659, 849676, 790731, 891978, 1066826, 1069907, 904051, 862857, 1057753, 1182800, 969534, 649628, 663577, 1033738, 1347287, 1332860, 1153560, 1079619, 1132293, 1172557, 1156986, 1147349, 1155397, 1123142, 1048930, 1031871, 1141006, 1279580, 1263758, 1070595, 917866, 991882, 1170616, 1191061, 1053459, 1022095, 1196277, 1354685, 1334327, 1283734, 1353348, 1398831, 1254619, 1085674, 1154882, 1396587, 1546628, 1573255, 1631833, 1687840, 1577814, 1412675, 1502721, 1830892, 2004802, 1850548, 1674944, 1758616, 1933872, 1911021, 1745855, 1697669, 1813055, 1930199, 1977367, 2017854, 2071075, 2101246, 2138924, 2238600, 2347155, 2357031, 2263812, 2160521, 2109025, 2105398, 2127278, 2139274, 2103456, 2045967, 2049606, 2132430, 2215279, 2249118, 2267575]
8727B267575K036q6561j70383j21165J4201Q7931R0987J04568R0621k1760j17827
8716B140223m5844Q2715N1912n8589J2887K24585K56851N1518q5717n588P2213
8705B697166j415n3738M1505J18476N0954j5602K0814J3258r5306q2139J37012
8694B830985K55525O4460j44849m4447J70636J21672j04780j27929P5668J82288
8684C279229R2101J6648K8378k6006j44765j22898O0542J82735J64885J61697
8674C692546K01860J12215r6594j39988Q2931K74448J86355J363K9370K38715
8664D583221L42385K19883L2403j5654J25566L42545M49801L51006J67721J22145
8654F721022K53720L71008L27067J95392J01641L1092q9468k35650l26773l47557
$$ y = [2267575, 2269611, 2183050, 2012667, 1891502, 1905703, 1993634, 2084621, 2189189, 2279810, 2258050, 2140223, 2094379, 2177094, 2229006, 2170417, 2183304, 2407889, 2664740, 2716258, 2630541, 2624953, 2697166, 2695751, 2642013, 2683518, 2801994, 2852948, 2837346, 2858160, 2871418, 2776112, 2693973, 2830985, 3086510, 3150970, 3006121, 2961674, 3132310, 3253982, 3149202, 3021273, 3096941, 3279229, 3371330, 3387978, 3416356, 3390350, 3245585, 3122687, 3183229, 3365964, 3530849, 3692546, 3894406, 4006621, 3910027, 3770039, 3852970, 4127418, 4313773, 4315136, 4344506, 4583221, 4925606, 5145489, 5177892, 5162238, 5287804, 5630349, 6080150, 6431156, 6598877, 6721022, 6974742, 7345750, 7672817, 7868209, 7969850, 8000942, 7911474, 7675824, 7349051, 7001494]
8644G001494l37290l12388k63570j89843j09071p1528j33437k45248k35818m2223
8634E061078J20372J8584k20867k50965k3409J28647K315j79902j40873M6286
8624D561266J32311P0512n853m2347p6093q3427j7594N8244M4270l0904n3349
8613D557036R470R4906J49689J57297J19373Q6986J40452K72782L77640M06727
8603F372358M29699M82659M90140M06613K94141J86182K7430j75087l10776l55815
8593G847544m18855n17123n25203m35808m10234m54543l57223j13833n1272k78372
8583D285078l99539j35792J43370j4438l65923l45196N37J09680j41656k74148
8573B861973n2733J57297O2299j14185j09229m1209p0731p7103L6966J02524K0749
$$ y = [7001494, 6664204, 6351816, 6088246, 5898403, 5789332, 5717804, 5584367, 5339119, 5103301, 5061078, 5181450, 5200034, 4979167, 4728202, 4704793, 4833440, 4835755, 4655853, 4514980, 4561266, 4693577, 4764089, 4758236, 4715889, 4639796, 4556369, 4538775, 4597019, 4641289, 4610385, 4557036, 4566506, 4661412, 4811101, 4968398, 5087771, 5174757, 5315209, 5587991, 5965631, 6372358, 6802057, 7284716, 7774856, 8181469, 8475610, 8661792, 8689222, 8514135, 8203359, 7847544, 7428689, 6911566, 6386363, 5950555, 5540321, 5085778, 4728555, 4614722, 4563450, 4285078, 3885539, 3749747, 3893117, 3878679, 3512756, 3167560, 3168097, 3277777, 3136121, 2861973, 2809240, 2966537, 3028836, 2914651, 2805422, 2764213, 2693482, 2616379, 2653345, 2755869, 2776618]
8562B776618k3890N6885N0577j10124j21139J42972K94106O3437j58008O8499
8552C039933M48099M02723L2442o3674K09769L39582J09583q9446m556O0367j61054
8541D323768m13117l69959j68527j30372k46603k85129j98823j12675n5841J6675
8531B359397M5458m8996j79920j90737q2289N946j5404j23299k32625k30640o8582
8520A238309J16032J14255m7736j05647M0245J45980J0723j85111j63616J3844
8510A177278P2512l9875j36515j35824j28404j27378l6659J13021J54593N6458
8500I69207k4714j3641j6775q6526j06221j2400O6474K2018m9619j8316O0718
8489G90205N2669l1473p1515l8090j0514k3819k4201K3766Q0181R2413N5821L393
$$ y = [2776618, 2752728, 2809613, 2860190, 2750066, 2628927, 2771899, 3066005, 3129442, 2971434, 3039933, 3488032, 3890755, 3923197, 3859523, 4069292, 4408874, 4518457, 4429011, 4424455, 4484822, 4323768, 3910651, 3540692, 3372165, 3241793, 2995190, 2710061, 2511238, 2398563, 2342722, 2359397, 2404855, 2355859, 2175939, 1985202, 1902913, 1908859, 1893455, 1770156, 1537531, 1306891, 1238309, 1354341, 1468596, 1420860, 1315213, 1355458, 1501438, 1512161, 1327050, 1163434, 1177278, 1249790, 1209915, 1073400, 937576, 809172, 681794, 645135, 758156, 912749, 969207, 944493, 930852, 914077, 827551, 721330, 708930, 775404, 797422, 747803, 729487, 790205, 842874, 811401, 739886, 701796, 691282, 667463, 643262, 667028, 747209, 839622, 895443, 898836]
8477H98836l4832o2842j08136j53654j09963O1351K17299J66699m0032j24641
8467G10085K8990J77641P1580j49684j50393R2007K42218Q8946j77597k58400
8457F75393j19376M8887J00787L6271o9485j21821o1441N1514P9616l288o5367
8446E51690k6217J8816j4393l6960L3718P5932m3333j87301j20486R5034J59889
8435E06389k742j40741q4873K4014L1178J0958N1456N7041k7867l7426J24005
8424E11392K26721N2273j97694j80573L3085Q4893o0328p6072J24866K16594L3452
8413G68609j18113K6952K34001J54006j08142j83528k2273R0689J8208q2490q1638
8402F96281l9647k0520L392K0716l0422j08725r6951p180K6037k6340n6304l0067
$$ y = [898836, 864004, 801162, 693026, 539372, 429409, 490760, 708059, 874758, 834726, 710085, 739075, 916716, 988296, 838612, 688219, 780226, 1022444, 1111390, 933793, 675393, 556017, 604904, 705691, 741962, 672477, 550656, 489215, 540729, 620345, 617057, 551690, 525473, 544289, 529896, 492936, 526654, 602586, 559253, 371952, 251466, 346500, 506389, 503647, 362906, 278033, 302047, 333225, 344183, 395639, 452680, 424813, 387387, 511392, 738113, 790386, 592692, 412119, 445204, 530097, 469769, 393697, 518563, 735157, 768609, 650496, 677448, 911449, 1065455, 957313, 773785, 751512, 842201, 860409, 777919, 696281, 656634, 636114, 639506, 660222, 629800, 521075, 424124, 416944, 442981, 416641, 360337, 330270]
8390C30270k9727n9640k3593O2715N5477n6609r4040K3965J41477J19314K4331
8379D93940m2142r6050j29136m0188J36457J62343m8033k22912j25170O3388M4364
8368A96861r5923n1157J55973K00238R857j15711j3600J01945M8286k4575N0055
8357D62249J31182K4359j53897j51912R238Q1253k0540j21911p9094L9543Q8976
8346C09446K1883r7992j61989r7626M3886J14421N0872l7189m3172k4086n9899
8335A8555o8033N2116J76318R8580j12359j65208Q355J27454j0196k14775j93082
8324b82275K9515J84317J45233K9669l2780l9094k7019r302r600m4295o2151j0165
8312a27947M7715L908r5724p5800R9593K25349J22721r7058j70583l4493J03484
$$ y = [330270, 300543, 240903, 217310, 280025, 335502, 278893, 184853, 208818, 350295, 469609, 493940, 451798, 355748, 226612, 186424, 322881, 485224, 437191, 214279, 89109, 152497, 196861, 100938, 49781, 205754, 405992, 415849, 300138, 286538, 388483, 436769, 412194, 462249, 593431, 617790, 463893, 311981, 321219, 402472, 381932, 260021, 180927, 220470, 309446, 331329, 233337, 71348, -26278, 17608, 132029, 182901, 145712, 102540, 78454, 18555, -49478, 2638, 178956, 277536, 165177, -31, 8324, 135778, 125582, -89193, -282275, -252760, -68443, 76790, 106459, 73679, 34585, 7566, -1736, -11336, -55631, -117782, -127947, -80232, -76324, -172048, -247848, -148255, 77094, 199815, 102757, -67826, -102319, 1165]
8301A165N8403r3833j44213l6814Q1323Q2075J6204K460M2450M2654j7655n5869
8289b1650l0885o495l0153n0768k0180J6656J2237Q399L9918L3888o7677j59879
8277b76589j05888L6240R5091O2461Q0897J52232J00507j02760k18116q5904J10918
8266a50911J19973q330m3427M7224Q7854O246q2789r7859q1893n9413K749O8590
8254a91986N0721j7814j3009N1447K7479q9578j11284K9037J41253Q7933L936
8243c1865L2828O1453m9536j58563o0547J18892Q5007j25263j67006N5362K18148
8232b1090R3357j00568q1874L7089k1035j92691j57565J18907K84756J24501j17500
8221c3713j14809O0119Q6132q6577j63929J4453K01555J11218j31960j65517O2362
$$ y = [1165, 59568, -34265, -178478, -215292, -133969, -51894, -35690, -33230, 9220, 51874, 34219, -21650, -52535, -59030, -89183, -139951, -160131, -143475, -131238, -122839, -82921, -49033, -116710, -276589, -382477, -346237, -251146, -188685, -107788, 44444, 144951, 42191, -175925, -261829, -150911, -30938, -39268, -82695, -35471, 52383, 58629, -24160, -122019, -203912, -263325, -260576, -191986, -141265, -159079, -172088, -120641, -93162, -182740, -294024, -264987, -123734, -35801, -31865, 963, 62416, 12880, -145683, -206230, -87338, -2331, -127594, -294600, -239238, -21090, 72267, -28301, -110175, -73086, -94121, -286812, -444377, -325470, -40714, 83787, -33713, -148522, -88403, -2271, -88848, -252777, -238324, -36769, 74449, -57511, -223028, -160666]
8210a60666K09632N8267j62738j39683N9829J33853K3204n5750r930J0653o6568
8199i9897r4683R6N2407m5841j18085Q465J80311J45606l6598j05504k7551r49
8187a42223o1423k1605J42087J73884m4795k45546j52308J01021J81834M8792
8177b0282m0310M4712J37412O8621q1655j22764j6928R8393R5817p599q6850m7372
8165B1195P1768J36532O7901p1388j57644j35648m0606N7819R1009K8448o2509
8154F877n3039P8798J78697J07890n5022j21478n5942R517Q78j6508M891J6201
8142A01760l136J1256P3025Q6101M614o8071l6035L8896M6151q497n2522p0685
8130A22857o7427J697J30620J84178P3191o7833n3994N9145O1598o5192j18157
$$ y = [-160666, 48966, 107233, -55505, -195188, -135359, -1506, 21698, -34052, -43982, -33329, -99897, -194580, -194484, -142077, -187918, -306003, -297538, -117227, 28379, -8219, -113723, -141274, -142223, -203646, -225251, -83164, 90720, 45925, -199621, -351929, -250908, -69074, -20282, -60592, -15880, 121532, 190153, 108498, -14266, -31194, 67199, 163016, 155417, 68567, 21195, 92963, 229495, 297396, 226008, 68364, -67284, -107890, -50071, 40938, 69386, 6877, -46162, 32636, 211333, 319223, 264201, 142723, 86781, 96298, 97176, 80668, 85559, 101760, 98624, 109880, 182905, 269006, 273620, 205549, 169514, 208410, 254561, 246064, 193542, 122857, 55430, 57127, 187747, 371925, 445116, 377283, 323289, 382434, 444032, 378840, 260683]
8119B60683o595J15079J12519N2491K6024j982m7658j6546R2061R0350r5067k19016
8107C62343o7747J54214J06273j30239j60063P5561J79162n7194k90096j55166
8097A7048J64367K37922M3585o3209N2629J32912q646j87721j54079M5976J80407
8086D61191J48903L0907p9894j40799j18444j1278J02467J26039N1188l9427o0727
8075D70126M364R0282R7386L455q1919n1395K8062j74j21969j42444R348J45474
8063D50596R7741l6904p8175l6566k3017k1532K9733M6119o0578j38532O615K23582
8051D59082J71970j19625k34734j1967J84473M5742j92017j50786Q4963J52593
8041C89694J1334n9713K4590N9401l1037o6392K7223P2948k3740j01421m4048
$$ y = [260683, 254088, 369167, 481686, 534177, 560201, 558219, 510561, 494015, 586076, 676426, 581359, 362343, 294596, 448810, 555083, 424844, 264781, 340342, 519504, 462310, 172214, 17048, 181415, 419337, 462922, 399713, 452342, 585254, 576608, 388887, 234808, 280784, 461191, 610094, 641001, 561107, 420308, 301864, 290586, 393053, 519092, 570280, 530853, 470126, 474490, 564772, 662158, 665613, 583694, 532299, 560361, 560187, 438218, 295774, 305122, 450596, 548337, 511433, 433258, 396692, 373675, 352143, 381876, 427995, 367417, 228885, 235500, 459082, 631052, 511427, 276693, 264726, 449199, 494941, 302924, 152138, 237101, 389694, 401028, 341315, 365905, 425306, 394269, 327877, 355100, 428048, 404308, 302887, 258839]
8030B58839J5908l9134q9304q429R3061O4949j8798j0158M5707J8636n0995l8269
8018B42013J6545j5372q8260m5664P6518O5595j18408k41345j24109J09532K16416
8007I3461J34321k333n8979k1284L6796M1623j4836q3277j26938j42515j02395
7996b46356K8304J66402J34820p6794k14543r0080J23506J42890J416n2950L693
7985g9692k2190j24970q0181J05820J35471n8927j49146K2219J28369p3624k58629
7974d55480n3691K79192K21872j39186k35323O0017K53031O4511j56127q1807
7964b42991N9467m5569k19262j23183J30109J65014k4741r4640N8798J61537N4960
7953a20501o3677j2507Q3029M1864p2356r9418n5623n2297n9876K9918J59745
$$ y = [258839, 274747, 235613, 146309, 137880, 230941, 295890, 277092, 266934, 312641, 331277, 280282, 242013, 258558, 243186, 154926, 109262, 185780, 251375, 132967, -108378, -232487, -122955, 93461, 227782, 225449, 166470, 145186, 181982, 223605, 208769, 125492, -1446, -143961, -246356, -218052, -51650, 83170, 6376, -208167, -298247, -174741, -31851, -30435, -83385, -79692, -101882, -226852, -307033, -201213, -65742, -124669, -273815, -251596, -123227, -196851, -455480, -509171, -229979, -8107, -147293, -382616, -322599, -69568, -5057, -161184, -242991, -183524, -229093, -448355, -571538, -441429, -276415, -301156, -395796, -336998, -175461, -120501, -184178, -196685, -113656, -71792, -144148, -243566, -299189, -351486, -411362, -381444, -221699]
7942b21699J38861n8846k08815j28469O9169J29109m160j29084o9870J01891J83794
7931a98119J00127m0870j07629p4856o32M6448K6950l8392o8506j2173O4520N6917
7919b46215j6253l5814J6144J1486j03052j78464p9149Q2606R4558l0486o9320
7908e53959O3134J70038O2074j53982k13861n2762J24466J30466K1906k2376M1104
7897c83752R1583M4404l7755o4365m5103l0536j0243L4226M5586j7474o0669K0933
7885d13165J32384Q0715j07596j82318l8430J26959J28566M8562K8321J2804q7935
7874b71133j57021m8858J10847Q2549r5998j57837k3780J04264Q1936o632n7841
7863d39504q5073r0812l2034L0038k4206j23205n6642J49188J99091j95j41365
$$ y = [-221699, -82838, -141684, -350499, -478968, -409799, -280690, -284850, -413934, -483804, -381913, -198119, -97992, -138862, -246491, -321347, -321979, -275531, -248581, -286973, -355479, -367652, -303132, -246215, -262468, -298282, -282138, -270652, -373704, -552168, -631317, -548711, -454153, -484639, -553959, -490825, -320787, -258713, -412695, -626556, -679318, -554852, -424386, -402480, -424856, -383752, -292169, -247765, -285520, -349885, -394988, -425524, -435767, -401541, -355955, -373429, -434098, -413165, -280781, -200066, -307662, -489980, -528410, -401451, -272885, -224323, -196002, -183198, -271133, -428154, -477012, -366165, -283616, -379614, -537451, -561231, -456967, -375031, -381663, -439504, -524577, -615389, -647423, -617385, -641591, -764796, -821438, -672250, -473159, -473354, -614719]
7852f14719Q834K19904J59356q2245j57258p791R9107K5145p6118o5327r935q096
7840e09143l0013j0168M4893Q9975Q3840n61j14640j28466l518R7477K2687j22293
7828e79930j24486N900P2448K0341j0754M2283Q0203N1516K4087J2405m8737j23515
7816e78239r3045Q217J4694o4988l2453J36108K01047N5936q1838m4036J5726
7805d62871o2834j37024l5734J00337O2965m1049J0875J38021J00499n5489p9819
7794d62123K5247K9109p1669l9167J28048J31191r9333k24334m0476J70016R8831
7783c54660r7451r1323P0973Q7290p5733j47275r912J33166R3931m8034j07099
7772e46127l1352R0108J40982N7765j10978k14469j54863j7342M6509K4666J4361
$$ y = [-614719, -605885, -385981, -226625, -308870, -466128, -473919, -374812, -349667, -425785, -491112, -501047, -509143, -539156, -549324, -504431, -414456, -330616, -331177, -445817, -574283, -577801, -480324, -457637, -579930, -704416, -698516, -626068, -605727, -616481, -574198, -493995, -442479, -418392, -405987, -454724, -578239, -671284, -663067, -648373, -713361, -745814, -609706, -408659, -352723, -434561, -478597, -462871, -525705, -662729, -698463, -598126, -535161, -576210, -565335, -427314, -326815, -382304, -462123, -436876, -407767, -479436, -518603, -390555, -259364, -358697, -583031, -623507, -453491, -354660, -452111, -543434, -472461, -385171, -460904, -608179, -618091, -484925, -390994, -439028, -546127, -577479, -487371, -346389, -288624, -399602, -614071, -768934, -786276, -739767, -715101, -700740]
7761g00740L2218J3320k0569K6696J24617J08779o2577k02721j37578O6945K07846
7750e43764J80443L5255j10658j47859m6129Q2369P8941m6555j06526r370R4311
7739e39542M9555n7294n1845M0159N7005j3271k8875M3692Q1616L8860J4400L8115
7727c27425Q53j15354j46099j3921J03799M9002m5852J8290J46786R0243j20962
7716c60640j86965q267J52737Q7170n0506k8504Q2028N6751q8280j29793j8095
7705d92364M9213l2830j12734n6534K9941P960l5721N3850J89692J38653r0102
7694c50976k06331o0792J21412P9349r3390j15346L6055J12400J4580n6389M1406
7683d78022J33512J4797j90475j96551P132J41301M9198j10189j30859k2672Q1290
$$ y = [-700740, -668522, -655202, -675771, -649075, -524458, -415679, -478256, -680977, -818555, -751610, -543764, -363321, -328066, -438724, -586583, -632712, -550343, -471402, -517957, -624483, -633853, -539542, -489987, -547281, -599126, -558967, -501962, -515233, -544108, -500416, -418800, -379940, -365540, -327425, -326572, -441926, -588025, -601946, -498147, -449145, -494997, -476707, -329921, -239678, -360640, -547605, -555872, -403135, -315965, -366471, -394975, -312947, -256196, -344476, -474269, -492364, -443151, -475981, -588715, -645249, -615308, -607348, -643069, -589219, -399527, -260874, -350976, -557307, -618099, -496687, -417338, -510728, -626074, -590019, -477619, -463039, -519428, -478022, -344510, -329713, -520188, -716739, -709607, -568306, -519108, -629297, -760156, -782828, -701538]
7672g01538J19935J00985K7981n8332o2468L5406J11692O2486m0787o2967l187
7661d70794L3992J4028j605J9333L5150O825n4699j06410r3183M472R8942N6402
7649d57547j00870j62980j5514J61733J39532j9868p4301J5788O4139P66l1191
7638d80313L2902N3268m3706j04802j0026J03050N3934r2563j40774n6598L7007
7627f48621P3268P3365K8887p1165j35056n8622R4818J55483Q2499p6l169K4896
7615c83493J3226l1358o8228p8880n8048j7764k694l7303p1136m3302K5074P4502
7603f79404J01045J19083Q3739l2684j32141r9074R247L3934l3791m2260N9902
7592f12404J32428P4865j6025j8022K3480l646q0493r2121j2980N8662M4751j4653
$$ y = [-701538, -581603, -480618, -452637, -510969, -573437, -538031, -426339, -363853, -404640, -467607, -470794, -436802, -422774, -424379, -405046, -369896, -363071, -417770, -524180, -617363, -612891, -513949, -457547, -558417, -721397, -736911, -575178, -435646, -455514, -529815, -514027, -449888, -449122, -480313, -447411, -394143, -437849, -542651, -552677, -449627, -395693, -488256, -629030, -685628, -648621, -575353, -501988, -473101, -544266, -679322, -737944, -643126, -487643, -405144, -405220, -408389, -383493, -370267, -401625, -469853, -548733, -606781, -624545, -627239, -664542, -735678, -778980, -753906, -679404, -578359, -459276, -375537, -408221, -540362, -639436, -630189, -596255, -630046, -672306, -612404, -479976, -405111, -421136, -439158, -415678, -419324, -499817, -591938, -604918, -546256, -501505, -516158]
7580e16158k3982M1641R3952L5981q6720j08083K4096J24448J5413j73094j53534
7569g26040Q0524K11088O2509j34590r9291Q8294J47702K6612p7428n3321O472
7558d67469J6459J2882K6237J3308l3670m9247j5803k776l6262m0017L3937J08659
7546d33762Q4615k5150j21368j35547p5808Q441O9702Q9516Q0703N3608l064p8105
7534d86219j06471m1834N8980R3934N0320J0105K2243M3902K0004m3695j00643
7523d79374j05195l6311O4576R5500R464q6729m6433J03022J71796O0510j07161
7512c56335j55856o8356L8570O9866J7559o5652r6601k2235R7557J29748M0463
7501c71272m8914l7992J2341M743k4357J0470O1256J3605r5303j05727M936P3851
$$ y = [-516158, -540140, -498499, -404547, -368566, -455286, -563369, -539273, -414825, -399412, -572506, -726040, -645516, -434428, -371919, -506509, -605800, -517506, -369804, -343192, -420620, -473941, -467469, -451010, -438128, -411891, -398583, -432253, -481500, -497303, -500079, -536341, -576358, -542421, -433762, -349147, -374297, -495665, -631212, -707020, -698579, -628877, -539361, -458658, -405050, -408114, -486219, -592690, -634524, -575544, -481610, -431290, -421185, -398942, -355040, -335036, -378731, -479374, -584569, -620880, -556304, -460804, -451340, -538069, -584502, -481480, -309684, -249174, -356335, -512191, -580547, -541977, -472111, -454552, -520204, -616805, -639040, -541483, -411735, -371272, -420186, -458178, -445837, -441094, -465451, -454981, -393725, -380120, -475423, -581150, -576214, -502363]
7489e02363J7924l3941K5609Q8100K3607p3340l8869N7275J6986j14816p7579
7478f11407J53971K52839L1689k25325j76486M8763O9402j28995j88784J9956
7468g54377J97178J14208m7706m9213K7025l715p6727l1615O6744N6037j1854
7457e14015J8472R4570N9550k2799K7344J35115N8715j62718k17835k6325J30182
7446d19744P3715k8765k5178k9417j23192j34615M2968J93619J10020n8201o6428
7435d65218L0082L7308j5138J2608N9025q658r0979k2688P8028r425j74159j19089
7423f88303J11198J71990m365j07978J049P9332k4591r6517L1684J64564R3622
7412b68315m9518o6644l9158j01951j25480L8955K06389J20364q6912q6718R3716
$$ y = [-502363, -484439, -518380, -492771, -404671, -381064, -454404, -493273, -435998, -419012, -533828, -611407, -457436, -204597, -172908, -398233, -574719, -525956, -456554, -585549, -774333, -754377, -557199, -442991, -490697, -539910, -512885, -516600, -593327, -624942, -558198, -502161, -514015, -495543, -400973, -341423, -364222, -336878, -201763, -143048, -305766, -523601, -549926, -419744, -346029, -374794, -399972, -429389, -552581, -687196, -644228, -450609, -340589, -398790, -465218, -435136, -397828, -412966, -400358, -341333, -349991, -440970, -463658, -385630, -395055, -569214, -688303, -577105, -405115, -409480, -517458, -516409, -437077, -461668, -558185, -526501, -361937, -268315, -317833, -384477, -423635, -525586, -651066, -612111, -405722, -285358, -372270, -458988, -365272]
7401c65272J22399o3306j56159j2426J14780K2230j10748n1305R6911Q8019o6092
7390c80969j46796o9303N8193J44976J77229J15656n7110k02223j42609O2332
7380d40624J51133K2518j19443p5345O3233Q4737j1375m7416K5104N7604l5312
7369c25186j31273r5460J7043O3536K7922J2928O2354J01559N4665m9659j02224
7358c63795k5912J16284J40829m5255k57122k07235Q0276K27216J5330k58158
7348e77542j85772J42478K74203Q0203q5034K2166J63058L9960k12722k44290
7338e83292j3281J85901J39919o8371k23871j92181m904J53987J15048m1754n2336
7327e85135J33520K23416K8621j88722r8168J56891J71823o9146j82307k7588
$$ y = [-365272, -242873, -306179, -462338, -474764, -359984, -337754, -448502, -499807, -402896, -314877, -380969, -527765, -597068, -538875, -393899, -216670, -101014, -158124, -360347, -502956, -440624, -289491, -266973, -386416, -461761, -398528, -313791, -325166, -372582, -347478, -289874, -325186, -456459, -551919, -534876, -471340, -443418, -430490, -368136, -266577, -211912, -261571, -363795, -389707, -273423, -132594, -177849, -434971, -642206, -561930, -334714, -319384, -577542, -763314, -620836, -346633, -266430, -351464, -329298, -166240, -126280, -339002, -583292, -596573, -410672, -270753, -339124, -562995, -755176, -760080, -606093, -491045, -532799, -585135, -451615, -228199, -199578, -388300, -486468, -329577, -157754, -226900, -409207, -436795]
7317d36795Q0265o8738k13745n9323K29555K75499M6081j44139j06260K2190M8156
7306c27254k2004n9688j5396L8543K8329j3060Q689R3669J11893m195j13513n5526
7294c29513P5860N1627j16469j68644j3208J17935M8082o9813m1624L7944j1301
7283d19124j04976l8824J28522J44169k5512j40485o3818O8388J07651Q7190O8707
7272a88112O299j11908j55002l3999J17878J06307m4553j23145k7904J01079Q7784
7261b65276l9872j01752k2727O5505J8452j09199j42464l7867O8035O8843J6782
7250d81540j286J0270K2568N5745J00162P8128j8419o7564m843N4377J3000k5920
7238b65322M6375J03770k1436k00015j48365J14871K52831R8483j17766j29870
$$ y = [-436795, -356530, -425268, -639013, -698336, -468781, -193282, -147201, -291340, -397600, -375410, -327254, -349258, -408946, -424342, -385799, -357470, -370530, -361841, -268172, -156279, -160474, -273987, -329513, -253653, -202026, -318495, -487139, -500347, -382412, -334330, -404143, -445767, -407823, -419124, -524100, -562924, -434402, -290233, -315745, -456230, -520048, -451660, -344009, -256819, -188112, -181813, -293721, -448723, -482722, -364844, -258537, -303090, -426235, -454139, -353060, -265276, -305148, -406900, -429627, -364122, -345670, -454869, -597333, -635200, -567165, -498322, -481540, -482826, -472556, -449988, -394243, -294081, -215953, -234372, -301936, -306779, -252402, -239402, -265322, -218947, -115177, -136613, -336628, -484993, -370122, -117291, -18808, -136574, -266444]
7228b66444J4338J05627Q3089L0254l428k4294k3297Q05J2000J550K980J168n8238
7215a23890j25602o4394J15193K02433P5369j07945j40466m9757L914o309J2600
7204b08854P2015Q6448K1809p3755j47019j47515l4000J20343J34838k9960j49717
7193c55367l9875J37447J03172r1743j37301L9113J58908L7461j49094j71457
7183d68736o7907J6635R3231K06336K18332n885k80489k59230O7145L00347J59486
7172b0735j44003k21364l6642J04969L3832p5452k5433J01274J14573L6948L6123
7161i5910J08099P0297j08549k06669p9123J05388J12810j7038o9480L07L6004
7150a43864l0964p0496J9731J36848J13997m5907j65173j03515O9828J43335K2862
$$ y = [-266444, -252106, -146479, -63390, -33136, -36564, -60858, -84155, -83350, -71350, -69800, -66820, -65652, -123890, -249492, -313886, -198693, 3740, 79109, -28836, -169302, -219059, -215145, -221454, -208854, -136839, -50391, -28582, -102337, -249356, -396871, -430871, -310528, -175690, -205650, -355367, -395242, -257795, -154623, -246366, -383667, -344554, -185646, -148185, -297279, -468736, -536643, -520008, -426777, -220441, -2109, -7994, -288483, -547713, -480568, -180221, -20735, -164738, -386102, -422744, -317775, -283943, -359395, -384828, -283554, -168981, -132033, -95910, 12189, 82486, -26063, -232732, -311855, -206467, -93657, -110695, -180175, -179868, -143864, -174828, -245324, -225593, -88745, 25252, -20655, -185828, -289343, -219515, -76180, -53318]
7139e3318j18820n6619J37992J53129q9363k55144q3325J75381J17866j72076
7129b44297k48784j8286J33930Q239r0231P8128K32494N0375k32690j64981J75256
7118c20847K81347J6232j92240m6631J78986J13416j41544k16446l8790J23126
7108b43391R2526k0428n5311j1434L1977M9182M7517J1168o2191j18617r4884
7097c73886J0552J32485J85687J20617k7348j41408j24593j3488N4748R828o7501
7086b34307o2583K5441J08104J31160R5023q852j69302k70553j73711P1007K23496
7075b65077J48403n975l3657L6743L2447o4973j09585n1207n80j5625j6468L6487
7063c09067O0719J7913o911K6922L6290o993K654Q8221Q6348p6808j90088n6580
$$ y = [-53318, -172138, -228757, -90765, 62364, -26999, -282143, -365468, -190087, -72221, -244297, -493081, -511367, -377437, -369198, -459429, -381301, -148807, -98432, -331122, -496103, -320847, -39500, -23268, -215508, -262139, -83153, 30263, -111281, -327727, -366517, -243391, -150865, -171293, -226604, -238038, -206061, -156879, -109362, -98194, -160385, -279002, -373886, -363334, -230849, -45162, 75455, 48107, -93301, -217894, -231382, -176634, -166806, -234307, -296890, -271449, -163345, -32185, 62838, 53986, -115316, -385869, -559580, -488573, -265077, -116674, -122649, -156306, -119563, -87116, -152089, -261674, -312881, -313461, -329086, -345554, -309067, -248348, -230435, -237346, -210424, -174134, -181127, -178473, -90252, -3904, -80712, -270800, -327380]
7051c27380J60023J50831o7661j80632m6026J35751J53818M5533m4953o6504l8260
7040a25460J4728L5261k2089q1368k2894J04957J22741N011o6213K59N8564j3044
7028A0453j00855n8206M2392L8912n3755q7862k0034N7776P5855L8811l4852j04616
7016a95981q8305L2848J38829J13905J2998l0922r061j3881n6081m8931L2480
7005a12102J01089P9365j3946r7119q8072L0195J51956J27492l1218j25203m6181
6994b3744N1943P593o7503J5340J61440J18843q8189j74567n7386L2187k3812
6983d7855l7658R5269J52428k8584k09981j15139R6278Q1670j08598j20491R5588
6972a47073J97802K8697j31363m1612J24023J10498J373J5764R6678L2309j29936
$$ y = [-327380, -167357, -16526, -84187, -264819, -310845, -175094, -21276, 24257, -20696, -87200, -125460, -110732, -75471, -97560, -178928, -201822, -96865, 25876, 30887, -35326, -35067, 23497, 10453, -90402, -148608, -106216, -67304, -121059, -208921, -228955, -171179, -95324, -56513, -91365, -195981, -284286, -251438, -112609, 1296, 14294, -16628, -25689, -39570, -95651, -144582, -112102, -11013, 68352, 54406, -42713, -130785, -100590, 51366, 178858, 147640, 22437, -23744, 28199, 35792, -31711, -16371, 145069, 263912, 175723, 1156, -56230, -24043, -47855, -85513, 9756, 162184, 133600, -76381, -191520, -95242, -13572, -122170, -242661, -147073, 50729, 79426, -51937, -93549, 30474, 140972, 142345, 158109, 254787, 287096, 157160]
6961A57160j30932O4697J95412J07529m3125p9826m9787n4262m3986N1388J44875
6950C19143J15933N075o8236q7186r3436o1649K5963P7938L5240J0651R2887J30434
6938E02757l3358k14893j15864J52649J75119r3267k05200N4103K75020P4171
6928E71237k57961k06280J52417L03759J16031m5279L911K6899r7987j24971O5770
$$ y = [157160, 26228, 90925, 286337, 393866, 350741, 270915, 221128, 166866, 122880, 174268, 319143, 435076, 440151, 371915, 284729, 191293, 129644, 155607, 233545, 268785, 279436, 372323, 502757, 469399, 254506, 138642, 291291, 466410, 373143, 167943, 222046, 497066, 571237, 313276, 106996, 259413, 563172, 679203, 633924, 637835, 664734, 566747, 441776, 507546]
$$ [...]
##END NTUPLES=NMR SPECTRUM
##END=
