##TITLE=1H ikalashn
CG-1218-3
18.11.2024
##JCAMPDX= 6.0         $$ Bruker NMR JCAMP-DX V2.0
##DATA TYPE= NMR SPECTRUM
##DATA CLASS= NTUPLES
##ORIGIN= UXNMR, Bruker Analytische Messtechnik GmbH
##OWNER= root
$$ TOPSPIN		Version 1.3
$$ 2024-11-18 09:34:50.531 +0400  Irina@DPX200
$$ Compression mode = diff/dup
##.OBSERVE FREQUENCY= 200.131300845
##.OBSERVE NUCLEUS= ^1H
##.ACQUISITION MODE= SIMULTANEOUS
##.ACQUISITION SCHEME= undefined
##.AVERAGES= 16
##.DIGITISER RES= 18
##SPECTROMETER/DATA SYSTEM= spect
##.PULSE SEQUENCE= zg
##.SOLVENT NAME= CDCl3
##.SHIFT REFERENCE= INTERNAL, CDCl3, 1, 17.49637
##AUDIT TRAIL= $$ (NUMBER, WHEN, WHO, WHERE, WHAT)
$$ ##TITLE= Audit trail, TOPSPIN		Version 1.3
$$ ##JCAMPDX= 5.01
$$ ##ORIGIN= Bruker BioSpin GmbH
$$ ##OWNER= Irina
$$ $$ F:/spectra/data/iren/nmr/1H/4/pdata/1/auditp.txt
$$ ##AUDIT TRAIL=  $$ (NUMBER, WHEN, WHO, WHERE, VERSION, WHAT)
(   1,<2024-11-18 09:33:06.343 +0400>,<Irina>,<DPX200>,<TOPSPIN 1.3>,
      <acquisition in progress>)
(   2,<2024-11-18 09:34:14.125 +0400>,<Irina>,<DPX200>,<TOPSPIN 1.3>,
      <Start of raw data processing
       efp BC_mod = 2 LB = 0.02 FT_mod = 6 PKNL = 1 PHC0 = 214.6321 PHC1 = -23.64118 SI = 32K 
       data hash MD5: 32K
       C3 52 16 48 B1 2A 7F 52 2B CE 52 5B FD 07 2F EF>)
(   3,<2024-11-18 09:34:16.125 +0400>,<Irina>,<DPX200>,<TOPSPIN 1.3>,
      <apk 
       data hash MD5: 32K
       AF 73 50 6B F0 15 48 0C FB 5E 32 F0 18 3B 30 70>)
(   4,<2024-11-18 09:34:21.531 +0400>,<Irina>,<DPX200>,<TOPSPIN 1.3>,
      <abs n ABSG = 5 
       data hash MD5: 32K
       F5 FF FC CA 87 F1 2F EE C8 82 A0 5F B5 BF A0 C8>)
(   5,<2024-11-18 09:34:24.656 +0400>,<Irina>,<DPX200>,<TOPSPIN 1.3>,
      <apk 
       data hash MD5: 32K
       6A 17 5F E4 B9 84 02 E0 79 A4 C0 FC 6B 02 F6 13>)
(   6,<2024-11-18 09:34:38.796 +0400>,<Irina>,<DPX200>,<TOPSPIN 1.3>,
      <pk fgphup PHC0 = -9.088428 PHC1 = 15.2 
       data hash MD5: 32K
       F1 8D FB 17 38 69 73 DC F6 CA 14 44 3A 6B F7 8D>)
(   7,<2024-11-18 09:34:40.343 +0400>,<Irina>,<DPX200>,<TOPSPIN 1.3>,
      <abs n ABSG = 5 
       data hash MD5: 32K
       17 34 80 C3 AC 26 DD 87 63 FF E1 AB BC F6 57 DC>)
$$ ##END=
$$ 
$$ $$ hash MD5
$$ $$ A9 E0 42 76 2B 13 50 55 58 7C AB B5 22 57 43 7A
##$RELAX= 
##$RELAX= 
##$RELAX= 
##$RELAX= 
##$RELAX= 
##$RELAX= 
##$RELAX= 
##$RELAX= 
##$RELAX= 
$$ Bruker specific parameters
$$ --------------------------
##$DU= <F:/spectra>
##$EXPNO= 4
##$NAME= <1H>
##$PROCNO= 1
##$TYPE= <nmr>
##$USER= <iren>
##$AMP= (0..31)
100 100 100 100 100 100 100 100 100 100 100 100 100 100 100 100 100 100 
100 100 100 100 100 100 100 100 100 100 100 100 100 100 
##$ANAVPT= -1
##$AQSEQ= 0
##$AQ_mod= 1
##$AUNM= <au_zg>
##$AUTOPOS= <>
##$BF1= 200.13
##$BF2= 200.13
##$BF3= 200.13
##$BF4= 200.13
##$BF5= 200.13
##$BF6= 200.13
##$BF7= 200.13
##$BF8= 200.13
##$BYTORDA= 1
##$CFDGTYP= 0
##$CFRGTYP= 5
##$CHEMSTR= <none>
##$CNST= (0..63)
1 1 145 1 1 1 1 1 1 1 1 1 1 1 1 1 1 1 1 1 1 1 1 1 1 1 1 1 1 1 1 1 1 1 
$$ [...]
##$SW_h= 4401.40845070422
##$TD= 16384
##$TD0= 1
##$TE= 300
##$TE2= 300
##$TE3= 300
##$TEG= 300
##$TL= (0..7)
0 120 120 120 120 120 120 120 
##$TP= (0..7)
150 150 150 150 150 150 150 150 
##$TP07= 0
##$TPNAME0= <>
##$TPNAME1= <>
##$TPNAME2= <>
##$TPNAME3= <>
##$TPNAME4= <>
##$TPNAME5= <>
##$TPNAME6= <>
##$TPNAME7= <>
##$TPOAL= (0..7)
0.5 0.5 0.5 0.5 0.5 0.5 0.5 0.5 
##$TPOFFS= (0..7)
0 0 0 0 0 0 0 0 
##$TUNHIN= 0
##$TUNHOUT= 0
##$TUNXOUT= 0
##$USERA1= <user>
##$USERA2= <user>
##$USERA3= <user>
##$USERA4= <user>
##$USERA5= <user>
##$V9= 5
##$VALIST= <valist>
##$VCLIST= <CCCCCCCCCCCCCCC>
##$VD= 0
##$VDLIST= <DDDDDDDDDDDDDDD>
##$VPLIST= <PPPPPPPPPPPPPPP>
##$VTLIST= <TTTTTTTTTTTTTTT>
##$WBST= 1024
##$WBSW= 25
##$XGAIN= (0..3)
0 0 0 0 
##$XL= 0
##$YL= 0
##$YMAX_a= 239480
##$YMIN_a= -515139
##$ZGOPTNS= <>
##$ZL1= 120
##$ZL2= 120
##$ZL3= 120
##$ZL4= 120
##$ABSF1= 17.49637
##$ABSF2= -4.496376
##$ABSG= 5
##$ABSL= 3
##$ALPHA= 0
##$AQORDER= 0
##$ASSFAC= 0
##$ASSFACI= 0
##$ASSFACX= 0
##$ASSWID= 0
##$AUNMP= <proc_1d>
##$AXLEFT= 0
##$AXRIGHT= 0
##$AXTYPE= 0
##$AXUNIT= <>
##$AZFE= 0.1
##$AZFW= 0.1
##$BCFW= 0
##$BC_mod= 2
##$BYTORDP= 0
##$COROFFS= 0
##$CY= 7568.61572265625
##$DATMOD= 1
##$DC= 0
##$DFILT= <>
##$DTYPP= 0
##$F1P= 17.9538593292236
##$F2P= -4.03888763876832
##$FCOR= 0.5
##$FTSIZE= 32768
##$FT_mod= 6
##$GAMMA= 0
##$GB= 0
##$INTBC= 0
##$INTSCL= 1.367314e-010
##$ISEN= 128
##$LB= 0.02
##$LEV0= 0
##$LPBIN= 0
##$MAXI= 945.577
##$MC2= 0
##$MEAN= 0
##$ME_mod= 0
##$MI= -402.1523
##$NCOEF= 0
##$NC_proc= -7
##$NLEV= 6
##$NOISF1= 8.587773
##$NOISF2= 6.764455
##$NSP= 0
##$NTH_PI= 0
##$NZP= 0
##$OFFSET= 17.49637
##$PC= 1
##$PHC0= 328.0979
##$PHC1= -5.66965
##$PH_mod= 1
##$PKNL= yes
##$PPARMOD= 0
##$PPDIAG= 0
##$PPIPTYP= 0
##$PPMPNUM= 100
##$PPRESOL= 1
##$PSCAL= 0
##$PSIGN= 0
##$REVERSE= no
##$SF= 200.13
##$SI= 32768
##$SIGF1= 16.12182
##$SIGF2= -4.496377
##$SINO= 3.521527
##$SIOLD= 32768
##$SREGLST= <1H.CDCl3>
##$SSB= 0
##$STSI= 32768
##$STSR= 0
##$SW_p= 4401.40845070422
##$SYMM= 0
##$S_DEV= 0
##$TDeff= 16384
##$TDoff= 0
##$TI= <>
##$TILT= no
##$TM1= 0
##$TM2= 0
##$TOPLEV= 0
##$USERP1= <user>
##$USERP2= <user>
##$USERP3= <user>
##$USERP4= <user>
##$USERP5= <user>
##$WDW= 1
##$XDIM= 32768
##$YMAX_p= 602802266
##$YMIN_p= -544140
$$ End of Bruker specific parameters
$$ ---------------------------------
##NTUPLES= NMR SPECTRUM
##VAR_NAME=  FREQUENCY,     SPECTRUM/REAL,   SPECTRUM/IMAG
##SYMBOL=    X,             R,               I
##VAR_TYPE=  INDEPENDENT,   DEPENDENT,       DEPENDENT
##VAR_FORM=  AFFN,          ASDF,            ASDF
##VAR_DIM=   32768,         32768,           32768
##UNITS=     HZ,            ARBITRARY UNITS, ARBITRARY UNITS
##FACTOR=    0.134324425510551, 1,           1
##FIRST=     4401.40845070422, 259868,       -1867462
##LAST=      0,             -275061,         -1451345
##MIN=       0,             -544140,         0
##MAX=       4401.40845070422, 602802266,    0
$$ Real data points
##PAGE= N=1
##DATA TABLE= (X++(R..R)), XYDATA
$$ [...]
14481 3063429 3156479 3181631 3127386 3092287 3155520 3239525 3190974 2998311 2823999 2792070 2848109
14470 2848109 2877140 2853842 2805578 2728010 2632163 2590293 2626647 2633779 2520819 2391112 2430271
14459 2430271 2635343 2795272 2756236 2586340 2447438 2413053 2459670 2542267 2610917 2617753 2575447
14448 2575447 2565954 2628735 2672566 2570647 2342105 2171212 2208257 2386228 2491012 2411678
14438 2411678 2254677 2174723 2167375 2123896 2043165 2040426 2131039 2170113 2086388 2024840 2124579
14427 2124579 2278241 2288347 2183493 2173960 2314235 2416800 2337597 2168523 2077633 2101843
14417 2101843 2175677 2245892 2276458 2238992 2175583 2185267 2280299 2342213 2288341 2191718 2157636
14406 2157636 2169417 2151147 2109968 2109948 2152006 2179480 2174259 2161862 2142100 2089648 2010744 1940643
14394 1940643 1897180 1878136 1882100 1898418 1907249 1914598 1944283 1977442 1963998 1915641 1903621 1931536
14382 1931536 1912201 1822899 1769286 1817289 1878902 1867873 1851150 1911319 1965390 1889368 1747918
14371 1747918 1713911 1798416 1848198 1802722 1769492 1820895 1883903 1880046 1835997 1798904 1754884
14360 1754884 1687079 1629379 1622414 1678175 1789491 1903453 1916077 1797650 1687054 1728368 1848481
14349 1848481 1862283 1774858 1772897 1898791 1960964 1842673 1688234 1669501 1750513 1812478 1847361
14338 1847361 1884273 1870235 1779802 1720836 1777620 1858272 1847139 1796069 1802441 1810096 1722767 1626640
14326 1626640 1688767 1883450 2026079 2055665 2083369 2162634 2211577 2197733 2221032 2349547 2509447
14315 2509447 2601470 2622015 2618170 2609800 2597417 2581587 2556323 2537183 2579146 2699387 2821664
14304 2821664 2885058 2952169 3091663 3215391 3189666 3064629 3010830 3051926 3063738 3034238 3088200
14293 3088200 3210265 3191936 2957840 2720211 2668379 2703890 2651907 2557570 2567354 2649330 2653928
14282 2653928 2572216 2521032 2516568 2462298 2345361 2261940 2240011 2195795 2087177 1977542 1925426
14271 1925426 1920140 1935583 1948371 1912848 1825820 1792762 1899396 2038045 2018589 1852309 1749094
14260 1749094 1801106 1857568 1790016 1700642 1742206 1876058 1957916 1957367 1938304 1903469 1821414
14249 1821414 1755010 1799069 1915758 1987706 2019064 2118626 2276916 2337491 2238329 2118872 2110902
14238 2110902 2168104 2196703 2219652 2293031 2375275 2413074 2461009 2576869 2687630 2708765 2704733
14227 2704733 2758695 2782242 2676115 2590366 2733029 2961009 2917561 2621188 2521452 2813554
14217 2813554 3097682 2997491 2752761 2796859 3027741 3006301 2732490 2664168 2949723 3177573
14207 3177573 3033854 2740597 2611406 2573490 2430186 2280519 2329818 2488765 2493134 2300692
14197 2300692 2094386 1992560 1994604 2103022 2257987 2258794 2005582 1727997 1710980 1871945
14187 1871945 1892167 1712724 1589726 1657985 1754853 1743750 1727333 1814226 1896916 1815722 1603752
14176 1603752 1438373 1428075 1523345 1583190 1510343 1377463 1379896 1572734 1739164 1673072 1495985
14165 1495985 1469378 1568853 1539652 1359310 1306987 1501070 1697505 1689631 1611491 1656153 1755724
14154 1755724 1768492 1765144 1873553 2000968 1968237 1809625 1703400 1691158 1688178 1701570 1816172
14143 1816172 1998569 2108659 2090489 2003300 1903438 1834944 1873849 2024874 2133736 2064269
14133 2064269 1906346 1845182 1888709 1906983 1882482 1910435 1976665 1950745 1812077 1690824 1660241
14122 1660241 1661317 1655531 1680266 1718830 1679128 1548040 1426221 1371574 1340137 1307021 1304621
14111 1304621 1313850 1265516 1185205 1186523 1275915 1317224 1248642 1181045 1200100 1216395 1124509 1000151
14099 1000151 1009347 1173665 1329032 1307828 1113075 918796 900456 1044594 1163317 1142911
14089 1142911 1097849 1171942 1278763 1224852 1043642 977050 1106756 1235687 1205808 1116516
14079 1116516 1116384 1167550 1156546 1088964 1029620 967542 877951 823201 865917 956763 1009716 1014941
14067 1014941 998204 959094 925939 970783 1090254 1173417 1157410 1098838 1030067 897970 731505
14056 731505 695891 851146 1015873 1016780 925283 896013 926250 947993 1003613 1128888 1198774
14045 1198774 1102991 952261 897490 880251 801225 786215 982948 1211740 1171210 932410
14035 932410 852668 999609 1055108 865962 700624 796021 987243 1011689 916843 913887 1013699
14024 1013699 1059203 1005890 953536 962271 1000497 1029935 1031933 1004461 1000205 1077303 1165136 1119509
14012 1119509 972754 944637 1099007 1196198 1054885 862456 891110 1062542 1085670 942089
14002 942089 911000 1096273 1237524 1108834 866950 821282 1000180 1145699 1090152 950965
13992 950965 913455 963947 951883 852204 814140 918269 1025245 975401 842146 832144 981176
13981 981176 1125033 1165669 1175949 1203813 1167036 1028564 905372 890045 905935 856215 788380
13970 788380 789226 832994 853901 859716 863118 823876 773277 848959 1063031 1189646 1062969 846666
13958 846666 802927 919799 993661 970200 952107 953520 912009 883731 955934 1015808 897691
13947 897691 725747 782915 1029210 1102354 872859 652425 713380 918103 1007428 976174
13937 976174 951192 941842 940450 1052197 1277284 1359456 1127754 829022 818103 1032140 1097916
13926 1097916 906493 744431 830578 1035428 1152549 1182466 1204635 1175522 1032892 870530
13916 870530 832106 897062 924321 878660 872684 971885 1079887 1075361 983358 929243 962578 1021095
13904 1021095 1062076 1116694 1175915 1145457 1011033 938701 1057932 1219357 1163186 901482
13894 901482 715060 751918 863773 910452 977194 1146263 1276514 1216623 1074489 1051017
13884 1051017 1123594 1122180 1035224 1005716 1066980 1105798 1077208 1055955 1070040 1061857 1024792 1019146
13872 1019146 1047063 1058396 1072337 1143315 1222620 1213214 1143519 1118068 1116924 1033300 902020
13861 902020 888496 1035508 1209555 1307571 1327315 1245292 1053101 911222 1001189 1203130
13851 1203130 1214118 1034993 1004463 1247100 1454400 1401491 1319369 1476720 1708397 1705590
13841 1705590 1530464 1465850 1530761 1529478 1456738 1468371 1529973 1474120 1354298 1360607 1416987
13830 1416987 1271401 998575 977183 1278221 1503015 1389507 1181413 1175178 1264148 1215600
13820 1215600 1096133 1094463 1149396 1091499 991360 1035690 1171957 1200802 1149260 1230479 1453471
13809 1453471 1577557 1486019 1341922 1314811 1377100 1442217 1509798 1586254 1611876 1550738 1449773
13798 1449773 1365105 1323616 1361541 1481717 1576504 1534519 1424615 1416375 1511345 1535037 1426244
13787 1426244 1336726 1375751 1448422 1446148 1418627 1434946 1437210 1373547 1333295 1397199 1480469 1485032
13775 1485032 1485764 1583868 1685967 1643969 1537449 1576718 1752156 1826948 1707238 1586642 1642248
13764 1642248 1786399 1840535 1803757 1807153 1895402 1986892 2004682 1947915 1865552 1833698 1923087
13753 1923087 2115649 2278069 2285897 2165428 2062712 2078276 2174449 2248155 2261606 2277155 2360214
13742 2360214 2473144 2516039 2481304 2489664 2614967 2751357 2756022 2660976 2606028 2602957 2539700
13731 2539700 2415902 2376387 2461317 2522833 2485223 2492962 2652994 2802618 2733157 2524377 2436411
13720 2436411 2539312 2671818 2733895 2790608 2871550 2888832 2820960 2793119 2880248 2976032 2962667
13709 2962667 2898399 2926810 3078131 3262102 3404125 3495571 3539481 3527760 3472336 3415122 3404248
13698 3404248 3470668 3611665 3790619 3965377 4105452 4172828 4137646 4051492 4032586 4105303
13688 4105303 4140356 4067766 4050555 4263872 4574574 4691849 4630108 4731412 5144785 5572042
13678 5572042 5700761 5637691 5674650 5821897 5868437 5790074 5778906 5885844 5926368 5797727
13668 5797727 5650016 5642008 5707150 5684525 5568053 5507384 5609513 5816944 5972023 5979476 5909272
13657 5909272 5910886 6010357 6071829 6018510 5981845 6106731 6303624 6367029 6282001 6220922 6266423
13646 6266423 6344571 6428597 6583652 6772795 6844954 6794159 6823224 7046015 7311590 7436205
13636 7436205 7435325 7408419 7373901 7355678 7448107 7620922 7632254 7344595 6979321 6821647 6798761
13625 6798761 6623747 6271303 5998428 5908942 5818571 5614081 5447430 5443445 5467826 5362613
13615 5362613 5211891 5164330 5137935 4941145 4618583 4434811 4499332 4610121 4542698 4344760
13605 4344760 4232276 4280766 4350011 4301373 4177723 4120982 4174643 4238528 4204044 4069860 3912543
13594 3912543 3798170 3748531 3745268 3732129 3658987 3562813 3549575 3637241 3677868 3531896 3283120
13583 3283120 3160728 3244797 3367671 3343669 3191559 3067255 3058466 3124459 3186357 3197596 3150676
13572 3150676 3080280 3048025 3074928 3103389 3073020 3018603 3034311 3135083 3207646 3132970 2936896
13561 2936896 2786208 2825312 3025762 3211238 3236786 3129965 3039295 3057692 3132801 3157873
13551 3157873 3110160 3061105 3063812 3081110 3053859 3011993 3058872 3226213 3397418 3431999 3339487
13540 3339487 3257915 3268175 3317243 3339566 3351386 3374058 3364430 3306342 3287965 3381559 3510236
13529 3510236 3551119 3515536 3491122 3452713 3306571 3117816 3094553 3281187 3444356 3380682
13519 3380682 3206846 3198491 3415345 3633476 3632956 3436032 3241641 3199627 3286513 3380095 3421825
13508 3421825 3463987 3539971 3568124 3487530 3429657 3577054 3845073 3918551 3692491 3462903
13498 3462903 3513423 3697968 3677956 3454490 3365194 3569204 3833229 3903148 3827939 3777851
13488 3777851 3758246 3699012 3676218 3810785 4011755 4050785 3900515 3795181 3894465 4063194
13478 4063194 4094937 4014900 4000611 4079117 4092035 3964262 3831172 3832989 3924409 3989516 4031073
13467 4031073 4110042 4176647 4127364 4004364 3973156 4083456 4198650 4202656 4143831 4118356 4133582
13456 4133582 4157274 4195141 4243076 4254116 4222078 4208597 4227445 4205979 4125194 4075994 4096380
13445 4096380 4089343 4008382 3978633 4090538 4211552 4181668 4080407 4096924 4224838 4304909 4307999
13434 4307999 4346276 4434838 4467869 4424997 4393905 4396299 4395208 4451627 4642571 4840236 4834380
13423 4834380 4680604 4643929 4770054 4830479 4759826 4792182 5020299 5176760 5076269 4947509
13413 4947509 5036679 5168690 5056803 4828306 4839781 5095733 5257599 5188536 5102811 5145988
13403 5145988 5180735 5086727 4986643 5041808 5224070 5399166 5483885 5452483 5333623 5249013
13393 5249013 5310576 5446490 5478374 5389362 5345446 5425966 5520457 5540554 5547032 5597580 5642215
13382 5642215 5648337 5673049 5740160 5797934 5855638 5989284 6153015 6188469 6108342 6144954 6383914
13371 6383914 6581914 6541629 6451089 6587185 6844007 6877070 6650351 6509331 6673349 6945408
13361 6945408 7041226 6981110 6983995 7109782 7202214 7157235 7087498 7166546 7394674 7604633 7685209
13350 7685209 7711083 7805340 7950149 8040966 8094668 8257442 8572699 8876978 9004496 8992509
13340 8992509 8997340 9092965 9245132 9411909 9570672 9693693 9778173 9860983 9953124 10022908 10083704
13329 10083704 10200947 10360972 10456754 10472951 10534801 10677890 10753546 10713064 10782114 11118097
13319 11118097 11472261 11507239 11339821 11403744 11798097 12154194 12217158 12194244 12373331 12711732
13309 12711732 13015286 13273569 13571916 13852567 14016187 14148770 14421505 14834568 15246951
13300 15246951 15599537 15943400 16307619 16694046 17140138 17632668 18024451 18203186 18292279
13291 18292279 18515474 18897881 19262559 19488695 19606104 19665381 19699058 19802703 20063320 20387795
13281 20387795 20583292 20640460 20757572 21036972 21344276 21548143 21720003 21979071 22292938
13272 22292938 22576365 22870052 23262212 23712094 24112840 24484828 24947044 25505131 26018788
13263 26018788 26412415 26796091 27317070 27976285 28663691 29320238 29978400 30653689 31285214
13254 31285214 31830916 32366207 33002089 33712188 34344036 34844947 35367018 36043352 36750540
13245 36750540 37259905 37587644 37991789 38590208 39193419 39618872 39975737 40468167 41068425
13236 41068425 41607448 42102495 42745094 43570139 44370957 44999632 45560925 46226068 47013432
13227 47013432 47852676 48734774 49686687 50694242 51749564 52888541 54093203 55259124
13219 55259124 56369735 57600970 59108894 60790046 62416138 63959079 65606255 67468906
13211 67468906 69458594 71475239 73540834 75692861 77911926 80239502 82817180 85697908
13203 85697908 88745705 91849978 95124823 98738514 102632255 106595101 110579150 114739868
13195 114739868 119139342 123587331 127845451 131847913 135626846 139121754 142166844 144606012
13187 144606012 146334465 147284968 147482642 147107637 146421408 145608062 144719865 143773838 142861035
13178 142861035 142142878 141745248 141664351 141807161 142157470 142865364 144096161 145813369 147830802
13169 147830802 150097806 152788812 156040999 159758195 163813854 168317397 173472586 179233872
13161 179233872 185329075 191612107 198143531 204852431 211352203 217233410 222361217 226719441
13153 226719441 230118669 232278374 233112625 232718366 231132326 228330341 224464043 219862944
13145 219862944 214746790 209141982 203157586 197130582 191363401 185895058 180695029 175925752
13137 175925752 171802133 168298326 165230209 162577593 160484075 158946785 157763521 156850825
13129 156850825 156383893 156508278 157105244 157982631 159134904 160646430 162462709 164440077
13121 164440077 166530454 168719632 170825753 172541279 173660461 174113878 173813205 172646749
13113 172646749 170626934 167859578 164357162 160083355 155224276 150198170 145289240 140445356
13105 140445356 135548567 130706569 126122417 121830096 117748306 113883158 110275396 106829761
13097 106829761 103420484 100134545 97193524 94628610 92238886 89903761 87729471 85806672
13089 85806672 84011451 82180937 80358789 78719999 77323101 76068548 74865718 73720357
13081 73720357 72655261 71639091 70628897 69638417 68726649 67917239 67145281 66314079 65417133
13072 65417133 64557937 63804173 63072853 62239775 61323376 60451104 59660870 58862008 57998331
13063 57998331 57111170 56211711 55241480 54222783 53299579 52532582 51788208 50948495 50105129
13054 50105129 49399041 48777360 48088536 47343313 46682615 46121007 45528625 44877943 44307546
13045 44307546 43885913 43488897 42998148 42473499 42022154 41618904 41185341 40762909 40462119
13036 40462119 40270505 40043767 39703500 39341704 39081378 38895416 38631376 38206877 37717969
13027 37717969 37312256 36988842 36603249 36080371 35522439 35038701 34560629 33946892 33213611
13018 33213611 32509138 31880783 31236969 30560426 29975441 29532783 29102651 28595717 28131947
13009 28131947 27831150 27564087 27113568 26512409 26008767 25714258 25493117 25221986 24957017
13000 24957017 24771726 24606509 24392535 24192905 24092643 24041597 23935491 23787142 23686232
12991 23686232 23628847 23519463 23334129 23158850 23046105 22936690 22760414 22529485 22284002
12982 22284002 22012881 21689778 21345858 21045571 20804412 20575185 20310234 20005627 19688562
12973 19688562 19389388 19127629 18904216 18700716 18495600 18283545 18071817 17856135 17608504
12964 17608504 17303824 16968647 16687714 16525962 16439810 16314188 16113224 15936186 15868398 15837201
12954 15837201 15713285 15513903 15371593 15307629 15199499 15017105 14914731 14982061 15065623 14996486
12944 14996486 14861285 14845520 14909486 14865907 14728269 14703558 14823401 14867725 14734047 14608513
12934 14608513 14639957 14704751 14674304 14668577 14805451 14914160 14795694 14605413 14633076 14798915
12924 14798915 14747638 14435067 14236449 14382185 14629298 14651807 14474905 14329597 14305972 14362000
12914 14362000 14492724 14662900 14701325 14489541 14184004 14056272 14154414 14278239 14247207 14056620
12904 14056620 13816846 13669117 13715598 13908564 14049663 14004843 13866234 13807705 13865606 13972179
12894 13972179 14095175 14195518 14159035 13962956 13822015 13946948 14210659 14289611 14117535 13956050
12884 13956050 13996831 14134616 14196391 14178534 14163296 14176140 14222570 14326016 14451318 14513838
12874 14513838 14512490 14521744 14530101 14457422 14358258 14393395 14536421 14544684 14330909 14121848 14090367
12863 14090367 14071370 13867775 13629841 13636311 13823383 13845084 13569392 13233058 13077212 13066748
12853 13066748 13038569 12946013 12866004 12870110 12950223 13016709 12967711 12812957 12684267 12651059 12606453
12842 12606453 12449577 12284370 12265870 12319831 12227202 11968077 11764429 11753089 11813415 11775945
12832 11775945 11632802 11472952 11348785 11269747 11212667 11101793 10896277 10707259 10678700 10740902
12822 10740902 10666155 10406160 10171139 10102771 10079469 9956554 9792661 9684011 9560161 9338551
12812 9338551 9136826 9114245 9195079 9164135 8986888 8835257 8811086 8820158 8735334 8551877 8363049
12801 8363049 8271433 8315807 8411902 8399966 8221592 7993181 7837373 7735402 7634038 7570499
12791 7570499 7555744 7470018 7259264 7107286 7179010 7301309 7187729 6914092 6829604 6987815
12781 6987815 7036357 6779830 6501281 6524174 6741075 6829543 6723348 6598059 6535270 6472289
12771 6472289 6400746 6372435 6358161 6306349 6285876 6369392 6438288 6332565 6154336 6166819 6380225
12760 6380225 6496015 6337240 6108534 6104662 6327531 6533285 6555201 6451410 6381398 6423659
12750 6423659 6503537 6486763 6371919 6335992 6487529 6644225 6548147 6282277 6222017 6507065
12740 6507065 6820880 6842423 6680739 6639201 6731896 6716657 6518392 6335981 6334880 6466694
12730 6466694 6611369 6697916 6664698 6494722 6323510 6325893 6453861 6471342 6300872 6142120
12720 6142120 6167434 6291624 6355418 6361427 6389712 6429602 6446938 6490494 6576078 6582890 6434541
12709 6434541 6279216 6303530 6448296 6507272 6455113 6474308 6673684 6960525 7184294 7251819
12699 7251819 7134309 6932817 6888528 7116805 7369068 7308768 7008207 6874125 7046085 7207479
12689 7207479 7112101 6952893 6990071 7113372 7064836 6871946 6744026 6704887 6650959 6643383 6800830
12678 6800830 6990713 6979806 6839763 6836553 6939991 6850532 6557422 6435218 6641629 6835835
12668 6835835 6730553 6553350 6644037 6892658 6952585 6808792 6740552 6830301 6889455 6835713
12658 6835713 6798930 6839177 6862923 6852965 6905670 6996172 6973291 6848481 6826870 6962514 7036715
12647 7036715 6901998 6715620 6677876 6737194 6729875 6654381 6624012 6658846 6689207 6685015 6652622
12636 6652622 6584916 6517959 6534550 6614317 6609983 6482107 6401422 6477496 6559571 6493544 6397935
12625 6397935 6436912 6479814 6304754 6038675 6027616 6287042 6457558 6365320 6257611 6351519
12615 6351519 6496064 6485339 6406932 6423087 6448660 6338812 6216108 6297559 6508948 6579419
12605 6579419 6459831 6353087 6354289 6353917 6317069 6370693 6535682 6624213 6522342 6376527 6374806
12594 6374806 6505126 6649446 6765415 6841304 6804250 6629905 6455357 6434608 6535603 6604465
12584 6604465 6582799 6542658 6544790 6582561 6650000 6755505 6862628 6904677 6876127 6853259 6909401
12573 6909401 7035291 7137147 7109327 6952032 6823103 6893237 7120770 7274049 7237144 7170718
12563 7170718 7261691 7435901 7488470 7415729 7405515 7518422 7600854 7558113 7509394 7575472 7680283
12552 7680283 7693757 7650573 7683984 7817681 7956856 8038342 8068956 8051261 7993208 7973570 8074739
12541 8074739 8243126 8329762 8295472 8269440 8357055 8488407 8536915 8516505 8554934 8696623 8838423
12530 8838423 8878757 8843389 8820782 8841886 8886474 8960280 9087332 9243769 9369818 9437914 9444484
12519 9444484 9361064 9195169 9087919 9207897 9506817 9729907 9753527 9759077 9933746 10148436
12509 10148436 10152796 10000995 10009919 10288172 10576783 10642046 10586503 10628187 10772055 10890711
12499 10890711 10987302 11159163 11371588 11476043 11439347 11385385 11405003 11469520 11543253 11643891
12489 11643891 11761866 11839733 11872126 11926471 12025242 12102757 12128709 12186238 12353988 12569106
12479 12569106 12690982 12684587 12672117 12787107 13016979 13223624 13313937 13351856 13471806 13706754
12469 13706754 13958295 14135011 14253925 14384789 14556597 14748643 14918070 15016749 15051600 15142731
12459 15142731 15417132 15807445 16084407 16162561 16238443 16514750 16917872 17233673 17406086 17528359
12449 17528359 17639355 17728678 17868677 18127903 18408131 18584934 18752638 19079291 19466722
12440 19466722 19660846 19703542 19934129 20464740 20995640 21292750 21518127 21883568 22288316
12431 22288316 22575586 22885210 23415736 24020955 24402428 24597892 24924926 25481160 26039963
12422 26039963 26460368 26884915 27447271 28039613 28493078 28818484 29161515 29626201 30200097
12413 30200097 30772195 31219521 31561980 31990727 32628499 33332541 33894806 34358684 34924825
12404 34924825 35602502 36212544 36720363 37288226 37969279 38632023 39251863 39989955 40875451
12395 40875451 41688572 42309206 42927369 43732078 44625873 45447663 46263345 47208018 48224008
12386 48224008 49197609 50200606 51346760 52543572 53647780 54753548 56048938 57472777
12378 57472777 58810150 60084780 61555232 63314728 65176884 66999035 68860016 70856146
12370 70856146 72962881 75181092 77600527 80223890 82931133 85719428 88779162 92206947
12362 92206947 95828737 99462405 103204431 107284666 111744852 116428167 121212271 126091688
12354 126091688 131062448 136050168 140932536 145543433 149682591 153188232 155959739 157871818
12346 157871818 158772855 158664619 157790887 156426336 154653756 152487862 150148488 148016810
12338 148016810 146302592 144910345 143690814 142713116 142216626 142356881 143060934 144114846
12330 144114846 145377719 146933144 149025752 151817646 155225986 159046232 163212769 167872304
12322 167872304 173201657 179205151 185683441 192346509 198960426 205427110 211702763 217597778
12314 217597778 222710729 226647309 229266548 230607938 230622524 229144204 226146546 221858909
12306 221858909 216562369 210429396 203665692 196647751 189741011 183070014 176647438 170664682
12298 170664682 165434499 161035099 157220567 153759813 150701452 148209181 146280705 144761070
12290 144761070 143535327 142577794 141893447 141553810 141722059 142466613 143573111 144724775 145885862
12281 145885862 147314004 149119431 150991444 152493859 153491025 154101811 154314101 153862319
12273 153862319 152512753 150311513 147492583 144256744 140709825 136929758 133005848 129043502
12265 129043502 125176957 121537394 118163134 114978178 111905260 108971621 106267200 103835908
12257 103835908 101652049 99664763 97810097 96018004 94285958 92725269 91439125 90345154
12249 90345154 89219934 87964742 86733528 85717344 84880392 84028454 83092070 82186967 81389036
12240 81389036 80626525 79869155 79249262 78843824 78473831 77934835 77348380 77024920 76982619
12231 76982619 76887969 76556263 76226535 76165462 76248784 76193119 76019259 75971277 76073402 76098173
12221 76098173 75954599 75786026 75648851 75413177 75073835 74849177 74811088 74690472 74260829
12212 74260829 73688471 73258772 72938827 72490066 71890128 71345260 70934374 70519979 70017874
12203 70017874 69514130 69082022 68687093 68308628 67968714 67609892 67137190 66628865 66306691
12194 66306691 66216689 66126277 65850904 65518483 65365971 65399788 65422540 65322154 65170312 65054369
12184 65054369 64954185 64817445 64668661 64587634 64596371 64598937 64465111 64188550 63913911 63750847
12174 63750847 63616049 63365491 63041093 62824551 62736961 62573083 62212590 61819835 61597150
12165 61597150 61481156 61267794 60956230 60763563 60804589 60936349 60967378 60890745 60842316 60912706
12155 60912706 61070767 61232046 61349584 61448730 61598155 61845031 62174465 62529663 62853954
12146 62853954 63111007 63300451 63473562 63698470 63982933 64257885 64452311 64550293 64569925 64540784
12136 64540784 64506462 64468655 64312747 63898702 63276947 62695923 62308681 61988015 61555692 61085431
12126 61085431 60798648 60717000 60627118 60410153 60220847 60260987 60504529 60747253 60862534 60924997
12116 60924997 61102001 61468389 61932367 62351870 62727478 63221502 63937686 64757281 65491810
12107 65491810 66136035 66834724 67635867 68439923 69198311 69993733 70874215 71751738 72535490
12098 72535490 73251509 73965843 74692290 75433045 76204641 76963805 77613917 78148423 78683554
12089 78683554 79289797 79905474 80477275 81048755 81627699 82120702 82521042 83010945 83717503
12080 83717503 84497754 85153816 85751697 86508369 87438778 88359131 89214589 90155242 91262439
12071 91262439 92433195 93600058 94856872 96276312 97785141 99325635 100979101 102812111
12063 102812111 104745110 106704730 108779321 111075562 113524049 115992167 118525257 121312124
12055 121312124 124439388 127827624 131405989 135216320 139322195 143717117 148353088 153190926
12047 153190926 158201905 163361595 168628999 173879290 178879196 183386480 187246326 190340994
12039 190340994 192523941 193731801 194131009 194012824 193535180 192695485 191568005 190411888
12031 190411888 189480941 188859024 188566683 188704300 189364604 190488605 191952673 193771300 196098672
12022 196098672 199041698 202569861 206600142 211070945 215924081 221105584 226607904 232433711
12014 232433711 238481488 244518844 250296977 255652365 260482412 264670239 268063615 270510283
12006 270510283 271919463 272326699 271889717 270766167 268990409 266514345 263352475 259608489
11998 259608489 255355263 250584243 245318595 239710369 233981921 228323351 222875420 217742655
11990 217742655 212976297 208602474 204701561 201380782 198622034 196259367 194198492 192571923
11982 192571923 191557477 191107724 191002725 191143155 191640308 192599758 193945282 195491544 197073019
11973 197073019 198534985 199672559 200247112 200044462 198917619 196829761 193861109 190119477
11965 190119477 185657393 180547673 175008057 169330724 163685243 158111998 152713411 147689556
11957 147689556 143125401 138892841 134858730 131070050 127633594 124525865 121641672 118943619
11949 118943619 116448021 114138681 112000730 110057757 108270144 106499451 104703451 103050662
11941 103050662 101666812 100374759 98914432 97352672 96000246 94918392 93794331 92392737
11933 92392737 90874307 89517072 88323818 87093189 85746628 84395476 83153644 82035881
11925 82035881 80994792 79943963 78803666 77627267 76600138 75789257 74986425 73968852
11917 73968852 72847093 71943879 71338680 70757959 69976494 69116903 68419781 67878267 67289731
11908 67289731 66592511 65945783 65460039 65023121 64478430 63855896 63298175 62811419 62237077
11899 62237077 61495270 60729723 60127288 59672779 59190626 58588591 57936478 57305891 56667045
11890 56667045 55993458 55348354 54772581 54169382 53417605 52561373 51771931 51125384 50523160
11881 50523160 49853954 49140018 48470946 47859422 47237556 46575872 45936622 45386929 44898479
11872 44898479 44378141 43797197 43244319 42815918 42481377 42109680 41623442 41071557 40547186
11863 40547186 40097887 39729923 39424056 39108520 38690059 38169927 37668622 37275273 36936688
11854 36936688 36567153 36191583 35869014 35535755 35077453 34546361 34144602 33946544 33777785
11845 33777785 33450020 33004779 32619326 32349890 32095604 31791248 31515111 31376225 31363878
11836 31363878 31345316 31188351 30881285 30554329 30369712 30355839 30367827 30262203 30092361 30049688
11826 30049688 30198691 30368532 30370314 30239162 30153912 30167347 30162924 30087582 30065031 30192531 30355866
11815 30355866 30382617 30297484 30266493 30328333 30358921 30314288 30329101 30501971 30725798 30834747
11805 30834747 30825885 30839220 30985723 31272095 31629021 31942627 32121985 32193720 32255058 32292211
11795 32292211 32167571 31857363 31546007 31357092 31151094 30783734 30429250 30383551 30606717
11786 30606717 30745768 30629170 30471784 30517232 30718170 30890102 30983892 31059728 31138513 31224767
11776 31224767 31367000 31564979 31712573 31759108 31843338 32133545 32591378 33021151 33322481 33583838
11766 33583838 33938078 34417550 34962547 35517669 36101319 36781631 37567651 38346324 38984966
11757 38984966 39479670 39924609 40353827 40718261 41005405 41246734 41395890 41340748 41058912
11748 41058912 40620522 40027994 39227280 38292315 37379204 36452618 35316608 34013108 32901630
11739 32901630 32167641 31525052 30646265 29646555 28851711 28282859 27702078 27033926 26407829
11730 26407829 25870469 25373598 24974289 24735161 24501240 24108401 23738504 23686537 23816540
11721 23816540 23679129 23197202 22786329 22693706 22666985 22455848 22206476 22092155 21932733 21518261
11711 21518261 21023471 20746434 20639419 20435166 20088517 19779933 19591990 19464422 19379043
11702 19379043 19337411 19245440 19055215 18923632 18998705 19151535 19151914 18993216 18796025 18523795
11692 18523795 18091217 17643240 17389857 17229231 16881166 16360178 15951410 15710952 15375093
11683 15375093 14840467 14363615 14143793 14029308 13806829 13505694 13238759 12987651 12725149
11674 12725149 12526396 12383897 12134349 11752831 11491767 11511597 11589208 11442712 11151113 10966542
11664 10966542 10875330 10676295 10392065 10249677 10277491 10257987 10112230 10014906 10046308 10024218
11654 10024218 9820757 9600020 9560725 9626936 9588226 9416859 9251044 9148397 9050221 8953927
11644 8953927 8938217 9002171 9024234 8922729 8754461 8613765 8519564 8449667 8414045 8428310 8454480
11633 8454480 8433075 8363555 8302400 8276255 8237517 8131977 7994120 7936130 8014619 8125169 8088921
11622 8088921 7876982 7690811 7734507 7932070 7993845 7793380 7538792 7471186 7522369 7451219
11612 7451219 7248109 7165053 7315672 7482207 7438157 7270122 7206363 7265902 7284753 7209291
11602 7209291 7145719 7143834 7139840 7129324 7202280 7352108 7418272 7301963 7111093 7006706 7006695
11591 7006695 7022140 7004487 6975937 6968130 6988433 7007977 6964341 6836412 6719763 6737742 6864775
11580 6864775 6941096 6886098 6786742 6742246 6738261 6721578 6688743 6651512 6616593 6629286 6716041
11569 6716041 6766571 6637967 6414672 6364940 6556290 6725747 6657535 6477622 6405656 6421074
11559 6421074 6392441 6357976 6420408 6500617 6467738 6407978 6481420 6594809 6520394 6294255 6183717
11548 6183717 6266620 6352840 6340750 6333703 6353778 6268890 6101650 6088023 6283200 6411739 6296135
11537 6296135 6154211 6239371 6430249 6454167 6332717 6304853 6420504 6503442 6468445 6413302
11527 6413302 6401127 6374231 6310465 6292811 6386859 6560360 6728945 6801988 6729459 6594940 6585933
11516 6585933 6755664 6905845 6852193 6707487 6709570 6847020 6888195 6751187 6598307 6542568
11506 6542568 6500934 6407712 6354415 6403390 6436100 6324189 6135979 6047926 6125501 6285912 6414232
11495 6414232 6441010 6363358 6254565 6210724 6255116 6342167 6448235 6565815 6620834 6541043 6424912
11484 6424912 6464049 6635543 6673621 6475009 6330224 6536947 6929911 7070914 6849390 6604301
11474 6604301 6618663 6767737 6783752 6644049 6518047 6479036 6471460 6488343 6581948 6709576 6738113
11463 6738113 6630232 6499303 6453353 6501703 6635978 6856174 7055259 7036813 6777207 6550536
11453 6550536 6622329 6889444 7013226 6882132 6733843 6790500 6983397 7129157 7191103 7225549
11443 7225549 7218072 7148625 7118696 7223933 7354496 7310904 7104851 6968729 7048993 7244902
11433 7244902 7383111 7410233 7365685 7291359 7232406 7232546 7274609 7298847 7302505 7334414 7384903 7396638
11421 7396638 7395621 7469296 7587531 7613893 7550750 7579174 7749302 7836255 7680801 7492244 7567424
11410 7567424 7830018 7937183 7797886 7680310 7768345 7907411 7911787 7871198 7958260 8105094
11400 8105094 8098160 7913712 7753857 7770058 7914669 8067029 8166872 8207751 8218327 8272542 8413621
11389 8413621 8550192 8541344 8416090 8382151 8547467 8749404 8770675 8640897 8584447 8704741
11379 8704741 8868725 8923627 8897012 8915031 9009484 9093293 9093092 9034110 8994008 9014556 9069303
11368 9069303 9105166 9109237 9123880 9187509 9283965 9373519 9440533 9474860 9459821 9446237 9571112
11357 9571112 9880806 10183422 10244633 10122334 10114670 10348223 10634748 10804712 10935687 11114791
11347 11114791 11230235 11212502 11252029 11503203 11770923 11816321 11801262 12037530 12419724 12570748
11337 12570748 12505730 12633009 13034257 13289702 13203820 13169022 13496588 13871435 13898104 13792356
11327 13792356 14016818 14503668 14788908 14770036 14797697 15069497 15424796 15743532 16093035 16438652
11317 16438652 16633367 16759039 17076577 17564699 17913444 18069439 18362110 18938298 19493585
11308 19493585 19780759 19996029 20396383 20882824 21264752 21628888 22108462 22544564 22739331
11299 22739331 22847457 23151105 23596987 23922749 24134651 24487479 25035830 25554757 25914027
11290 25914027 26230306 26619457 27056833 27514943 28013068 28506016 28927516 29351431 29912255
11281 29912255 30573456 31178505 31713077 32295270 32925542 33496040 34049037 34756414 35605535
11272 35605535 36374168 36983343 37614861 38393243 39210916 39981005 40807203 41754439 42687607
11263 42687607 43513970 44372990 45386315 46408414 47254624 48030338 48987207 50144022 51289018
11254 51289018 52313129 53321846 54422117 55585130 56743534 57883097 59011100 60136847
11246 60136847 61299944 62543052 63856575 65202447 66564843 67932885 69292275 70690413
11238 70690413 72232137 73938826 75700480 77454540 79309616 81376690 83583528 85810713
11230 85810713 88129945 90729939 93651597 96770946 100019932 103456340 107131394 111060559
11222 111060559 115324112 120019614 125092065 130377485 135851308 141681818 148005926 154813472
11214 154813472 162097773 169950555 178439303 187560498 197413194 208263747 220312146 233515811
11206 233515811 247764372 263095476 279559893 296923942 314624771 331931266 347982161
11199 347982161 361722573 372027012 377993511 379110322 375234066 366593305 353850281
11192 353850281 338017327 320207557 301450534 282651182 264523427 247465340 231581721
11185 231581721 216898794 203500081 191421790 180528830 170606240 161532388 153275286
11178 153275286 145753502 138798945 132255429 126041247 120125336 114526401 109331552 104605906
11170 104605906 100246343 96030451 91884224 88008350 84623323 81648615 78784995 75911343
11162 75911343 73234581 70974549 69034506 67112637 65067530 63024369 61128421 59339317
11154 59339317 57533201 55715247 54025988 52545084 51170567 49745736 48280887 46969175
11146 46969175 45934109 45024865 43974738 42752930 41615675 40755440 40046968 39254474 38357342
11137 38357342 37497415 36700865 35878626 35071458 34447779 34016157 33565352 32970240 32347227
11128 32347227 31801467 31238129 30584706 29998588 29632257 29344121 28898764 28355721 27981079
11119 27981079 27812609 27598317 27191634 26739591 26402640 26127007 25809714 25485323 25207547
11110 25207547 24909663 24531763 24151494 23836870 23490210 23008843 22507835 22191900 22045983
11101 22045983 21833194 21406989 20881644 20464663 20224771 20057517 19813601 19445203 19061481
11092 19061481 18817309 18715499 18584680 18311867 18005808 17826864 17744936 17609770 17391011
11083 17391011 17177286 16986315 16772986 16601584 16581923 16615196 16454215 16098136 15876300 15986551
11073 15986551 16170838 16066343 15717639 15484970 15533127 15677452 15721117 15691247 15681685 15665179
11063 15665179 15568871 15410816 15263201 15153713 15069475 14999300 14922291 14802003 14625731 14413287
11053 14413287 14181654 13949257 13763772 13653966 13560979 13400806 13191610 13024455 12908650
11044 12908650 12763344 12583838 12486035 12527389 12597937 12566310 12438903 12293581 12147460 11989393
11034 11989393 11867476 11827363 11806711 11703049 11529756 11408698 11409290 11470755 11487046 11411713 11279707
11023 11279707 11167945 11123304 11098065 10988862 10778663 10592509 10552016 10616931 10643695 10565966
11013 10565966 10433681 10299282 10167174 10063138 10053622 10144220 10216710 10133831 9903169 9690823
11003 9690823 9640197 9695431 9667543 9496441 9352697 9388047 9480970 9408628 9221656 9196872 9380455
10992 9380455 9461628 9238618 8940526 8864168 8927482 8877617 8753189 8777197 8903462 8871035
10982 8871035 8682992 8623659 8753677 8790554 8603690 8436914 8458763 8459382 8244786 8012055
10972 8012055 8025029 8166924 8146826 7968526 7864292 7892865 7918230 7892473 7865850 7800567 7660381
10961 7660381 7598302 7753594 7942346 7880597 7658160 7626862 7833484 7957173 7857346 7776566
10951 7776566 7872014 7935845 7791376 7634241 7715498 7941203 8060579 8053128 8057995 8078978 8033740
10940 8033740 7980562 8032221 8122213 8098110 7986494 7935936 7946874 7888368 7755679 7686600 7726282
10929 7726282 7785626 7836975 7940550 8055328 8040441 7904577 7854820 8004808 8202062 8256163
10919 8256163 8199663 8193670 8276594 8349821 8365420 8394070 8492671 8588861 8546360 8337283 8119959
10908 8119959 8098110 8281599 8449398 8415165 8267319 8235768 8365817 8480605 8471595 8449322
10898 8449322 8533426 8647035 8643635 8536809 8466407 8490979 8543523 8572409 8611256 8701965 8833362
10887 8833362 8965838 9053843 9050088 8957717 8874065 8903337 9015698 9071154 9003518 8900115 8862814
10876 8862814 8872984 8857815 8819505 8808991 8818407 8805352 8801536 8875414 8976443 8951214 8773289
10865 8773289 8632192 8690534 8852228 8909824 8853025 8859332 8997848 9129289 9139995 9103004 9124215
10854 9124215 9177210 9203138 9249179 9366820 9465376 9427243 9318129 9321649 9479710 9647716 9716724
10843 9716724 9738346 9794039 9870245 9931535 10021789 10202870 10433262 10582995 10578682 10509287 10563801
10832 10563801 10827382 11136489 11214731 11008160 10798574 10873307 11152426 11304692 11204942 11073166
10822 11073166 11111264 11209413 11158983 11011602 11013998 11218741 11367476 11237245 10965124 10890711
10812 10890711 11119807 11394876 11443669 11325124 11302785 11456501 11611882 11655371 11699465 11843667
10802 11843667 11975131 11967933 11913697 11953357 12019290 11980312 11922184 12000455 12104046 12004083 11802629
10791 11802629 11845254 12140203 12278823 12078370 11893834 12043223 12294358 12265020 12034155 11943687
10781 11943687 11998993 11920308 11693185 11610584 11754409 11849438 11725008 11569528 11586302 11686310
10771 11686310 11691818 11620999 11593625 11613917 11607080 11563079 11520733 11490347 11473941 11484863 11500514
10760 11500514 11485287 11480684 11555021 11651043 11636144 11535989 11545204 11738997 11940231 11964287 11849515
10749 11849515 11747763 11722792 11761509 11858589 11974043 12008560 11929456 11840530 11845835 11930780 12039418
10738 12039418 12157470 12250724 12248080 12170098 12151966 12257044 12397311 12512651 12663609 12845495
10728 12845495 12901941 12779430 12690939 12831120 13075551 13177488 13142052 13176781 13365237 13621077
10718 13621077 13888253 14149475 14301343 14273871 14233315 14408192 14734571 14937698 14958483 15011997
10708 15011997 15195132 15344546 15373696 15451230 15689173 15909211 15916178 15808691 15811061 15941555
10698 15941555 16048373 16068296 16060160 16056337 16051111 16083369 16183083 16277959 16278328 16211455 16163601 16144613
10686 16144613 16118178 16103381 16130494 16157714 16152437 16192012 16350706 16544680 16638031 16659372 16751794
10675 16751794 16930881 17064607 17102887 17159310 17322168 17529597 17692683 17820433 17954540 18083665
10665 18083665 18197431 18344897 18566362 18825469 19064533 19272398 19456254 19615610 19794787
10656 19794787 20087296 20517775 20976050 21338061 21602989 21844671 22087090 22317094 22569617
10647 22569617 22885370 23203819 23418328 23544828 23717847 23992435 24273491 24497717 24757917
10638 24757917 25142996 25563078 25884040 26168700 26599161 27168875 27653895 27952212 28262303
10629 28262303 28793316 29444222 29952848 30281280 30650924 31210345 31863290 32465792 33018461
10620 33018461 33571721 34073931 34444016 34733075 35095826 35609039 36190685 36701403 37084072
10611 37084072 37400999 37751991 38157467 38539040 38841740 39138497 39538907 40012847 40409030
10602 40409030 40665458 40895910 41228662 41661032 42126696 42603757 43079474 43499577 43848467
10593 43848467 44215651 44692721 45254220 45814567 46345111 46861921 47365601 47876626 48460162
10584 48460162 49121504 49745579 50244257 50697112 51231844 51829141 52371672 52823801 53217419
10575 53217419 53511835 53637385 53661101 53744780 53930295 54106191 54187442 54190252 54137207 54040449
10565 54040449 53975334 54008841 54055306 53980386 53851696 53879069 54074942 54203892 54146758 54087987
10555 54087987 54222694 54486487 54723023 54929658 55164247 55373481 55506683 55670650 55982543
10546 55982543 56378610 56747378 57139095 57651497 58213414 58683914 59067711 59420633 59647003
10537 59647003 59643653 59564723 59655858 59857005 59863620 59589723 59275737 59093449 58936356 58681553
10527 58681553 58376029 58052724 57636782 57172103 56865836 56730541 56454631 55862834 55256253
10518 55256253 54998462 54966581 54770252 54389151 54190547 54325768 54503385 54464730 54353726 54432884
10508 54432884 54673980 54851117 54897126 54954274 55129336 55366918 55555769 55647457 55667608 55681763
10498 55681763 55749692 55874327 56013648 56163937 56382814 56692618 57016371 57270632 57487568
10489 57487568 57778838 58182989 58594698 58859607 58935145 58961997 59157550 59600996 60139147 60561622
10479 60561622 60854062 61191018 61678321 62228271 62746328 63315414 64072455 64973839 65826902
10470 65826902 66543128 67237831 68058652 69013616 70009507 70991645 71996250 73094407 74313297
10461 74313297 75604835 76900238 78212453 79647920 81270927 83005193 84757965 86605098
10453 86605098 88719626 91107279 93568990 96000858 98587360 101558026 104851821 108209971
10445 108209971 111577235 115215797 119366676 123956240 128734595 133579509 138527062 143572489
10437 143572489 148585986 153397644 157822503 161599573 164457569 166297759 167202950 167226673
10429 167226673 166323200 164584267 162391616 160148231 157936536 155642769 153371196 151480174
10421 151480174 150164829 149259043 148582072 148263549 148528859 149332588 150463968 151932455 153973059
10412 153973059 156665122 159795368 163162379 166807525 170844047 175216487 179731666 184198182
10404 184198182 188437566 192272249 195603818 198422734 200687330 202307373 203287305 203708854
10396 203708854 203483737 202334490 200186406 197377216 194234524 190600781 186084951 180713268
10388 180713268 175007415 169416794 163993580 158693389 153674085 149124523 145031293 141316459
10380 141316459 138053409 135360910 133190117 131383814 129880078 128733807 128008330 127752810
10372 127752810 128003159 128688751 129608802 130609026 131713860 132980951 134288410 135357549
10364 135357549 135919358 135785356 134854249 133148695 130759628 127678912 123815099 119265971
10356 119265971 114399754 109509665 104558343 99462637 94452922 89870556 85733207 81818420
10348 81818420 78103649 74772239 71794411 68878105 65919869 63169351 60813173 58691683
10340 58691683 56590836 54547792 52673783 50903993 49140114 47460998 45979574 44634675
10332 44634675 43317006 42066029 40955877 39916794 38855448 37826234 36898989 35988802
10324 35988802 35012665 34079615 33310650 32604639 31822507 31071508 30526699 30078468 29474765
10315 29474765 28748432 28165980 27773533 27344533 26802360 26332501 25994574 25585727 25036176
10306 25036176 24598622 24430900 24284551 23872409 23316746 22943034 22788850 22607801 22262341
10297 22262341 21839934 21430162 21032374 20671026 20396458 20168739 19902934 19614812 19376164
10288 19376164 19165407 18920584 18690061 18544741 18382465 18041796 17610160 17380345 17437876
10279 17437876 17504991 17301603 16891715 16547377 16401783 16372845 16338113 16246726 16097088 15909716
10269 15909716 15715530 15522776 15321907 15142514 15041309 15004617 14943673 14829034 14738334 14709335
10259 14709335 14641122 14432098 14141697 13916430 13813013 13790415 13817804 13876457 13895977 13810864
10249 13810864 13663274 13539976 13427145 13249276 13042965 12953037 13030159 13156014 13205966 13171605
10239 13171605 13089888 12986693 12948183 13097104 13390126 13569409 13460174 13222450 13151112 13298046
10229 13298046 13464978 13521349 13531609 13572201 13624511 13689575 13820980 13974644 14002624 13890936
10219 13890936 13835038 13952720 14077634 14003404 13806890 13725981 13785997 13759655 13491663 13082986
10209 13082986 12729826 12524451 12443693 12412861 12350830 12242655 12167714 12165811 12113136 11867067
10199 11867067 11507013 11264436 11213423 11207205 11137166 11057683 11006309 10907116 10742659 10630845
10189 10630845 10619801 10586270 10461306 10373028 10414119 10450744 10351686 10239614 10287295 10402754
10179 10402754 10375765 10237206 10192468 10255580 10246998 10150097 10168229 10367527 10535599 10501155 10367284
10168 10367284 10307261 10327120 10364812 10450139 10609129 10738561 10731311 10642631 10606227 10656263 10738180
10157 10738180 10826543 10931135 11042136 11155046 11303115 11502987 11718827 11917470 12087719
10148 12087719 12183258 12153881 12066339 12062142 12143306 12148225 12012627 11888836 11901354 11956599 11936734
10137 11936734 11912510 11982817 12059717 12035193 12031321 12222814 12495061 12564755 12413542 12317229 12425348
10126 12425348 12590112 12673401 12751967 12904491 13038012 13084404 13173012 13424228 13715329 13841654
10116 13841654 13819064 13852757 14060519 14371326 14655327 14829584 14875960 14870579 14958686 15194699
10106 15194699 15450261 15585199 15649603 15781698 15956103 16007697 15905122 15822697 15889876 16024425
10096 16024425 16098248 16137363 16239932 16388706 16485341 16532187 16644513 16873508 17126162 17295105
10086 17295105 17387821 17483772 17622373 17780513 17921075 18022722 18093533 18188999 18380948 18673142
10076 18673142 18987653 19272302 19565547 19898159 20203161 20427271 20674282 21089146 21615661
10067 21615661 22042087 22319502 22653244 23196602 23834347 24406831 24983198 25711605 26515555
10058 26515555 27186895 27739078 28412780 29299479 30189266 30870986 31384046 31859392 32280032
10049 32280032 32549664 32684275 32776812 32829719 32757800 32532811 32226039 31929271 31710306 31611821
10039 31611821 31610357 31599996 31495841 31341521 31250636 31261499 31320135 31396120 31535163 31769949
10029 31769949 32029737 32190928 32228115 32285561 32540894 32972614 33332401 33431205 33402152 33552484
10019 33552484 33968840 34421484 34688009 34809239 34949698 35159670 35395295 35650343 35924399
10010 35924399 36147725 36281963 36432089 36720829 37106424 37463682 37795706 38208164 38695734
10001 38695734 39116564 39401722 39664119 40064221 40650412 41343426 42010519 42569367 43086580
9992 43086580 43733295 44563981 45408577 46101207 46738684 47545120 48532641 49500356 50362259
9983 50362259 51258286 52295939 53386226 54422594 55454794 56585255 57826305 59149252
9975 59149252 60555392 62023132 63509016 65070912 66848287 68835952 70832639 72730293
9967 72730293 74702507 76950628 79385140 81739259 83921789 86076087 88318905 90575156
9959 90575156 92671856 94487571 96011289 97320855 98472888 99374795 99851463 99887705 99660613
9950 99660613 99232798 98399014 97027976 95385128 93832063 92308455 90457979 88262307
9942 88262307 86174277 84496244 82957077 81140120 79101511 77279735 75905324 74777074
9934 74777074 73609589 72373193 71233489 70309760 69578863 68945620 68343916 67785191 67321358
9925 67321358 66952762 66598959 66186264 65724156 65249016 64730399 64097883 63346226 62558342
9916 62558342 61828193 61196311 60640351 60085360 59445728 58711283 57982697 57375441 56898527
9907 56898527 56470617 56036265 55608148 55207948 54842844 54558463 54442963 54525881 54706752 54838346
9897 54838346 54883412 54961373 55231119 55737541 56380888 57036605 57693745 58453745 59385918 60408916
9887 60408916 61337852 62032586 62474466 62713594 62776279 62618114 62135411 61235068 59942701
9878 59942701 58443021 56957859 55567989 54204867 52825931 51514304 50356353 49304624
9870 49304624 48254467 47201891 46219493 45320405 44482279 43783070 43333383 43035673 42601669
9861 42601669 41916637 41218915 40765429 40470046 40083269 39613763 39295522 39172462 39018560
9852 39018560 38729355 38509719 38540074 38694561 38766896 38781410 38877881 39047496 39209597 39426111
9842 39426111 39790258 40184588 40415677 40554044 40865701 41388675 41851430 42091369 42302891
9833 42302891 42725871 43281992 43704458 43916690 44105266 44457375 44957373 45439847 45768206
9824 45768206 45962772 46185399 46579724 47121414 47666093 48132714 48570630 49059476 49635452
9815 49635452 50309734 51051210 51749633 52315072 52823089 53439766 54202163 55011516 55832218
9806 55832218 56715528 57623667 58454703 59276135 60275341 61405737 62380624 63155254 64088982
9797 64088982 65400783 66783590 67883700 68879073 70160049 71649784 72953059 74081140
9789 74081140 75462361 77181467 78769105 79950693 81115912 82726615 84636368 86376246
9781 86376246 87851221 89349975 91015071 92694710 94276959 95843606 97478605 99178780
9773 99178780 100976169 102938734 105032618 107164221 109356916 111706257 114174634 116635593
9765 116635593 119126354 121834442 124798673 127857285 130973495 134380368 138264347 142506961
9757 142506961 146920922 151573544 156650634 162121846 167818017 173809412 180423093 187819485
9749 187819485 195797478 204152429 213028442 222726237 233302573 244604667 256662176 269804770
9741 269804770 284347863 300372673 317927565 337280559 358793535 382600494 408542422
9734 408542422 436365908 465784457 496211812 526418372 554454898 577949911 594631966
9727 594631966 602802266 601558522 590838843 571491172 545311603 514735091 482166321
9720 482166321 449449998 417839211 388178738 360912048 336062224 313478543 293104756
9713 293104756 274880085 258517461 243653535 230165580 218059946 207082039 196774834
9706 196774834 186967491 177865331 169556350 161772532 154297412 147266638 140833071 134844718
9698 134844718 129140354 123888513 119290511 115159949 111159921 107292552 103779204 100590843
9690 100590843 97499928 94505095 91776564 89225135 86579228 83907116 81591259 79689962
9682 79689962 77793157 75683870 73689395 72116340 70745879 69227194 67633697 66236980
9674 66236980 64989593 63666990 62357479 61358498 60640732 59835688 58784062 57728737 56885624
9665 56885624 56151170 55365972 54592044 53947610 53360798 52679250 51912223 51201251 50615241
9656 50615241 50107117 49636428 49218462 48850532 48475069 48052549 47637647 47333765 47144655
9647 47144655 46901612 46414258 45706924 45010006 44462692 43928656 43210168 42354359 41591783
9638 41591783 41005702 40424287 39661377 38737542 37828169 37089191 36559653 36148028 35690352
9629 35690352 35100623 34480640 34005515 33693086 33371842 32891122 32280865 31688019 31232326
9620 31232326 30933944 30702252 30387545 29923614 29418090 29015879 28693478 28311527 27861728
9611 27861728 27500153 27298586 27125941 26851671 26517279 26206938 25890330 25527656 25210241
9602 25210241 25027226 24866140 24528044 24018863 23555483 23265808 23039374 22730542 22373683
9593 22373683 22091419 21868503 21549564 21069427 20586252 20317705 20275896 20238590 19999800 19586277
9583 19586277 19182049 18899104 18705061 18536491 18365053 18149490 17851369 17543699 17384325
9574 17384325 17402339 17409317 17222855 16902313 16647140 16513737 16367045 16106434 15815483 15648559
9564 15648559 15645912 15703053 15679527 15507976 15222933 14909284 14626492 14385782 14183825 14013907
9554 14013907 13841371 13629591 13409583 13253814 13154196 13017283 12828602 12707238 12704180 12664537
9544 12664537 12441250 12157707 12059165 12134186 12103796 11824896 11494578 11351309 11344994 11255374
9534 11255374 11028668 10825898 10772910 10807448 10786597 10647286 10434744 10231710 10080584 9949105
9524 9949105 9779183 9588522 9483592 9520140 9586295 9505361 9255328 9008196 8920127 8942422
9514 8942422 8895243 8699856 8471762 8369167 8398985 8419926 8321920 8145000 8000818 7925393
9504 7925393 7857677 7741611 7595945 7480556 7430800 7429716 7419965 7349292 7230039 7138285 7121981
9493 7121981 7135516 7113238 7076462 7089717 7122388 7051866 6835242 6601185 6521283 6628464 6788124
9482 6788124 6816841 6634857 6359396 6234033 6375123 6591504 6578510 6311963 6093881 6135092
9472 6135092 6264571 6202956 5983700 5882819 5992523 6105765 6047910 5906811 5848610 5877247
9462 5877247 5898693 5900614 5925466 5933922 5839291 5666458 5561894 5621900 5782652 5906141 5924447
9451 5924447 5870068 5800040 5736038 5681629 5658722 5682817 5704095 5630178 5446292 5269543 5222878
9440 5222878 5280941 5310268 5245328 5144169 5076620 5052241 5069811 5132799 5179743 5105004 4912034
9429 4912034 4755937 4758038 4853059 4895406 4841059 4740812 4633070 4544870 4522937 4545288 4476801
9418 4476801 4256291 4058993 4092134 4271367 4312817 4142446 3977086 3956640 3955198 3867331 3820227
9407 3820227 3909490 3952114 3765622 3526186 3538872 3749089 3821855 3681893 3614676 3765394
9397 3765394 3890071 3766141 3549787 3499794 3582659 3610959 3590157 3639327 3694730 3601949 3439078
9386 3439078 3436939 3586038 3626735 3466951 3309604 3281919 3239788 3090497 3027586 3216026 3461618
9375 3461618 3465817 3263795 3124603 3110599 3045006 2892615 2851679 2998066 3123520 3068138 2981717
9364 2981717 3061930 3202968 3141299 2869188 2661662 2687761 2808273 2830420 2788883 2838918 2973226
9353 2973226 3014689 2882632 2720853 2703446 2808881 2871184 2803681 2680777 2614635 2635000 2693732
9342 2693732 2713355 2625739 2445154 2317603 2401850 2662244 2871754 2871739 2733835 2605135 2512805
9331 2512805 2426656 2397176 2472237 2553801 2515970 2422090 2437881 2550917 2582017 2485666 2417448
9320 2417448 2448001 2435688 2291111 2160347 2193229 2304882 2344405 2347991 2416225 2462667 2332961
9309 2332961 2114588 2070820 2256924 2431551 2403096 2268465 2223949 2294963 2356578 2320060 2212917
9298 2212917 2140420 2212059 2429307 2619964 2585560 2352587 2167593 2190071 2306016 2323434
9288 2323434 2240201 2202073 2267583 2342907 2332119 2255225 2208629 2259641 2379525 2459969 2420704
9277 2420704 2312093 2263530 2318850 2391640 2404119 2384551 2389205 2419426 2465640 2535510 2579577
9266 2579577 2504508 2345079 2296428 2449215 2609479 2547316 2334759 2241568 2349105 2482014
9256 2482014 2513045 2514592 2566372 2614681 2602551 2576417 2579634 2582211 2592015 2687276 2852001 2936784
9244 2936784 2898719 2924785 3161523 3454592 3549008 3461270 3445504 3627067 3871804 4026072
9234 4026072 4102753 4183046 4278978 4353475 4372970 4300495 4135190 3986597 3993172 4115707 4125313
9223 4125313 3879636 3526941 3337845 3378895 3445805 3313183 2979560 2642962 2469519 2428613
9213 2428613 2377111 2272912 2219488 2270950 2301080 2170972 1952603 1843065 1891013 1961426 1959256
9202 1959256 1919466 1865193 1764490 1671261 1708924 1831912 1808481 1566420 1355588 1394817 1542401
9191 1542401 1537538 1411749 1389587 1484715 1497147 1376399 1287290 1298351 1292860 1242994 1288859
9180 1288859 1447293 1511889 1385364 1269590 1347285 1482920 1444486 1254558 1106005 1063779
9170 1063779 1068289 1122045 1244927 1328544 1264776 1157862 1181343 1276229 1235755 1060861 966072
9159 966072 1019989 1052761 980757 955721 1079227 1210099 1207420 1158527 1189051 1225465 1154112
9148 1154112 1075047 1158692 1332451 1360046 1216482 1144130 1283465 1450052 1391134 1133303
9138 1133303 939542 971930 1116745 1159575 1056346 968172 1037676 1202307 1286393 1233730 1146393
9127 1146393 1096464 1031735 923885 880724 997664 1183759 1261849 1187022 1048129 909600
9117 909600 788853 743038 812473 891701 831021 683745 675181 875395 1076879 1083710 962916
9106 962916 891914 897967 899750 899807 960703 1048770 1070690 1036279 1024941 1008260 882299 693735
9094 693735 648781 822883 1019677 1031941 921020 896999 1002411 1076552 1011006 886861 829189
9083 829189 847491 877963 896384 917872 936884 935167 923689 925387 934102 930664 919883 912822 894058
9070 894058 850621 814377 824603 859829 862438 829074 819475 867818 940398 993836 1017789 1000610
9058 1000610 917652 793208 717005 744575 822184 865993 878895 922642 996876 1020032 935872
9047 935872 785513 664061 641010 719663 836477 903262 884358 826479 788686 773599 766231
9036 766231 791289 857595 889448 820915 736457 782148 922357 938491 739176 528171 542666
9025 542666 733168 858012 829012 782967 820516 861172 817257 758612 796449 899219 941238
9014 941238 884062 802296 754924 732984 729660 762417 805457 788294 701490 634157 660386 747704
9002 747704 824886 874368 892323 828672 672739 552053 608629 778107 836137 705783 579397
8991 579397 650786 845586 939881 866635 765241 761314 827493 862554 807455 676392 547980
8980 547980 517044 588926 652848 633581 612230 690611 801741 804903 719623 681489 691088 624172
8968 624172 504725 525830 730155 908144 922198 895536 932414 895255 675591 471262 515641
8957 515641 684758 681424 516655 484137 681316 870447 856147 731807 682670 764927 937614
8946 937614 1112290 1135156 933676 709323 743728 977993 1064895 902749 787035 895058
8936 895058 977059 806280 612522 719818 990507 1034424 832370 727847 843487 925998
8926 925998 820492 711940 765869 856491 830462 776327 827091 902800 867901 788909 813820
8915 813820 905601 914739 845389 833430 894653 908141 856159 874020 1007271 1105731 1060679 994536
8903 994536 1067377 1195428 1145203 885496 665898 695854 891915 1034842 1056938 1037287 996858
8892 996858 883805 749155 742373 876212 966437 898671 800375 819305 875467 813377 693580
8881 693580 709263 857187 925762 827398 723978 761771 877893 959009 1014058 1070452 1052473
8870 1052473 911516 766994 765157 871895 945960 956959 986307 1049404 1062875 989392 898942
8859 898942 868950 899224 927876 881081 740950 619131 692145 967469 1187996 1109172 825353
8848 825353 662296 767015 977372 1100129 1121649 1094055 1012509 911573 914823 1052529 1165369
8837 1165369 1135733 1092807 1216464 1436654 1526715 1435362 1317121 1260490 1204496 1133614 1131156
8826 1131156 1189875 1186241 1119512 1157022 1331492 1420845 1292768 1148802 1202360 1312901 1232070
8815 1232070 1062090 1113261 1376217 1522452 1440602 1376089 1452452 1459580 1293664 1215052 1394253
8804 1394253 1546174 1372881 1094467 1118690 1374748 1440817 1238457 1118008 1248844 1392072
8794 1392072 1373181 1354068 1474317 1590550 1567607 1516149 1545583 1570518 1557178 1665625 1922574
8783 1922574 2048166 1876388 1671134 1717459 1857148 1786694 1591025 1570432 1702354 1719754
8773 1719754 1626322 1670456 1834341 1818157 1583151 1460518 1603554 1750057 1698783 1634726
8763 1634726 1755241 1911411 1893113 1800338 1841538 1968240 1996552 1939899 1947882 2022239 2045801
8752 2045801 2021873 2060950 2174870 2268174 2291429 2254188 2149248 2007085 1949644 2043419 2174593
8741 2174593 2209575 2191706 2235408 2326748 2389593 2446953 2541095 2594548 2538810 2480323 2535636
8730 2535636 2607834 2557560 2488775 2585852 2748109 2711713 2509028 2458096 2653561 2810450 2716083
8719 2716083 2520906 2435999 2430734 2412617 2452035 2613919 2771480 2803612 2804507 2889224 2961477
8708 2961477 2903576 2840458 2952051 3139600 3160230 3024709 2976691 3099310 3220391 3228273 3216960
8697 3216960 3256515 3261352 3185584 3144925 3225999 3339383 3376861 3366442 3357045 3298948 3177992
8686 3177992 3131644 3260161 3425734 3430545 3329476 3362509 3597208 3840976 3929377 3909629 3884445
8675 3884445 3860453 3847174 3937172 4148911 4322908 4335434 4310359 4433782 4637513 4687955 4560821
8664 4560821 4487525 4600902 4777147 4908963 5087524 5360094 5530490 5430074 5234982 5256660
8654 5256660 5504662 5715428 5764925 5778987 5834510 5836954 5765453 5778503 5945884 6082310 5998795
8643 5998795 5761067 5553192 5422264 5306244 5193577 5096766 4960841 4751217 4559786 4484168
8633 4484168 4469220 4400991 4288207 4213386 4170996 4098612 4008741 3941693 3846468 3670325 3516987
8622 3516987 3536558 3684191 3770900 3746997 3746527 3831365 3881184 3797851 3661066 3602569 3640248
8611 3640248 3697585 3692575 3572905 3364066 3205200 3227327 3379479 3491592 3508497 3514023 3526111
8600 3526111 3466533 3373507 3422428 3639409 3806583 3787023 3742752 3856077 4017822 4010283 3855597
8589 3855597 3738718 3687830 3589275 3452704 3388189 3345112 3157310 2870470 2738528 2818809
8579 2818809 2849507 2662402 2457133 2468835 2583079 2537670 2355214 2281443 2365874 2409955 2340068
8568 2340068 2331423 2469292 2556011 2422366 2220312 2189780 2283966 2277237 2157095 2125662 2221067
8557 2221067 2233858 2082055 1992208 2136863 2315838 2233904 1946084 1762614 1795886 1882549
8547 1882549 1929688 2037746 2221473 2293481 2164785 2034776 2105452 2280503 2341259 2283296
8537 2283296 2261638 2293096 2246503 2100970 1996400 2004536 2030187 1983949 1900019 1824645 1720033
8526 1720033 1556848 1404976 1350308 1379671 1410935 1397792 1362498 1356748 1412971 1500181 1521646
8515 1521646 1407100 1218950 1111063 1159509 1279227 1328304 1255573 1130857 1067204 1123878
8505 1123878 1249918 1317161 1244618 1092775 1001114 1037865 1148289 1238051 1258418 1214515 1138832
8494 1138832 1063720 996435 933467 907442 963762 1062366 1088839 1026079 1011328 1117924 1194949
8483 1194949 1089591 931568 966060 1147330 1170797 941107 728293 752892 879542 895370
8473 895370 861190 945906 1077663 1044382 868595 803160 945422 1095621 1060953 909399 825589
8462 825589 851481 884913 862980 839984 891027 998750 1061296 1012714 917252 900884 981963
8451 981963 1035425 962712 827828 761330 788730 831367 831619 797474 757186 741647 778951 846297
8439 846297 873137 848117 851707 910511 913253 784207 652299 698472 891665 1033073 1023925
8428 1023925 929237 809402 671971 585963 649495 805853 864226 758327 633687 624775 693083
8417 693083 746024 769763 770327 717761 627792 578154 575717 535674 457820 471441 613964 725715
8405 725715 694130 653618 774614 969675 1005736 847879 698074 700816 775486 769297 654991
8394 654991 530943 492039 533863 566292 527799 478659 522250 638396 700716 677231 671726
8383 671726 717045 702388 603547 591796 752484 880484 777178 591633 588048 692017 605920
8372 605920 335238 228737 428943 631378 547995 323705 278202 443441 593995 603297
8362 603297 541125 487627 450865 444153 487097 533946 515590 444908 395041 397699 438820 514515
8350 514515 606332 639904 561487 433363 369924 395427 438872 453132 464409 506457 567401
8339 567401 609871 608562 566694 510662 458807 403531 359129 399647 563419 728622 705191
8328 705191 482135 260853 193903 224210 251792 303016 413433 488570 446279 383586 418674
8317 418674 465168 378949 257251 331707 569305 651930 427814 143665 96374 245700 342151
8306 342151 301438 252893 278243 300060 251680 209222 276772 413604 466118 369703 246295
8295 246295 249205 352832 394041 326442 300918 420593 551794 524347 414716 428740 559744
8284 559744 604911 527973 540698 734588 881187 767281 535621 478517 616982 713004 641332
8273 641332 527052 506523 537808 506520 399241 304001 293059 343690 363839 308299 266077
8262 266077 357583 522906 538080 328465 133228 204891 445349 537875 390864 233314
8252 233314 263054 412010 517525 541752 531699 510821 509814 583113 696996 713939 594670
8241 594670 508694 610618 786519 780460 545813 317816 312320 474988 589514 551851 452771
8230 452771 418882 460738 507393 528762 550930 568672 535289 465414 453527 528235 578971 520866
8218 520866 444619 472676 545086 521518 442122 470699 589539 600314 475720 443573 605679
8207 605679 736699 649171 519000 589352 741001 679195 439603 355751 535944 714025
8197 714025 688597 601992 644715 736028 688851 522053 414164 445063 547006 647790 723938
8186 723938 751814 719314 666542 641911 647654 676948 748465 847958 897188 845587 742456 666434
8174 666434 640089 659555 736468 851033 927110 912004 831460 740180 690769 753904 940778
8163 940778 1085960 985064 713628 602134 775911 949108 867551 722359 829899 1084472
8153 1084472 1112414 888589 779134 942821 1103381 1041238 931122 986866 1099216 1089240
8143 1089240 1052929 1151783 1271454 1220677 1116454 1211352 1424394 1426706 1193472 1089563 1309569
8132 1309569 1572401 1549779 1327435 1211714 1271530 1331493 1311587 1308913 1360664 1361406 1271813
8121 1271813 1228418 1340050 1489152 1465469 1256008 1078639 1109320 1277938 1399315 1427348
8111 1427348 1459551 1517907 1489376 1344473 1259942 1384583 1589825 1638418 1548407 1573544 1807803
8100 1807803 2029833 2023887 1863146 1746833 1718253 1709514 1739193 1863191 1996932 1995951 1899873
8089 1899873 1896883 2017000 2051544 1861543 1611953 1569391 1753248 1920955 1873849 1668210
8079 1668210 1507534 1502165 1584072 1636503 1652449 1720113 1860769 1955937 1892339 1728945 1631369
8068 1631369 1658519 1712502 1705575 1670377 1667466 1681905 1675269 1663367 1668626 1654304 1584474 1508531
8056 1508531 1511626 1606965 1733478 1823856 1822289 1695596 1510414 1440289 1576909 1765099 1762164
8045 1762164 1562947 1422029 1514055 1713608 1793214 1719863 1637247 1631432 1647507 1612497 1525555
8034 1525555 1423519 1345422 1338088 1419689 1525181 1555290 1496998 1439401 1454861 1516519 1550917
8023 1550917 1526394 1470086 1431146 1436352 1455012 1420086 1325144 1272875 1353198 1488499 1499362
8012 1499362 1338766 1160177 1117596 1194821 1279319 1303257 1245584 1099594 933061 887716 1003990
8001 1003990 1123176 1089738 977538 962728 1032005 1007901 847782 710638 692054 695478 646170
7990 646170 643005 769613 907752 896612 773441 697444 708286 717372 689606 674817 675707 630151
7978 630151 533275 459301 450433 480654 527550 582764 601168 549089 497826 548497 657244 666206
7966 666206 537366 424223 455447 562927 596396 515555 396961 331101 380022 555703 762253
7955 762253 830198 694538 490750 401606 454214 531641 531069 440263 310657 230571 276896
7944 276896 417014 506976 463787 380212 374109 390784 293526 117551 67918 232862 440377
7933 440377 473029 329786 192895 192790 283459 328058 251041 105243 12318 37876 128921
7922 128921 184717 166265 106095 45697 21657 80977 221629 328073 271008 92229 -12289
7911 -12289 63742 207708 263749 239280 237593 259163 205588 66332 -28494 19530 141827
7900 141827 196851 145725 73948 62957 98039 109397 63750 -10114 -70282 -105104 -119782 -103390
7888 -103390 -36060 72640 174444 218410 186083 96263 -1024 -33419 54642 239310 404121
7877 404121 425546 293039 134446 96657 189968 273107 220668 85445 37433 135776 235904
7866 235904 172517 -25417 -179725 -187493 -109666 -45239 -15839 -611 633 -7457 16909 102220
7854 102220 206744 256094 224866 152506 89184 49470 19366 -744 26550 128961 251079
7843 251079 278420 171801 29925 -32339 -13657 29633 92626 166884 152708 -9428 -162530
7832 -162530 -90687 143374 241816 102505 -33403 29554 151397 133209 57060 100719 188604
7821 188604 130679 3065 54668 258799 296772 47442 -214582 -227325 -80937 7574 26327
7810 26327 73385 107961 29791 -97245 -123738 -63531 -61379 -137345 -161030 -91947 -53914 -110088
7798 -110088 -133356 -12958 133036 105918 -65238 -131434 32193 238771 244743 87819 16115
7787 16115 120449 224202 176760 69378 48872 77346 42014 -17704 5926 57536 -6803
7776 -6803 -152665 -205683 -147133 -128949 -176223 -137490 8145 67144 -36568 -111948 -29869
7765 -29869 61620 39005 53851 226799 332566 119556 -227244 -306037 -82224 114398 129907
7754 129907 143584 261045 320027 204190 38577 -56411 -138894 -241730 -244016 -95755 46349
7743 46349 54531 1688 -33855 -114854 -243883 -251213 -83501 18390 -126434 -304394 -212063
7732 -212063 62467 181578 73303 -38165 -63646 -145459 -299379 -321223 -158821 -58501
7722 -58501 -173328 -291105 -161888 109533 231177 139969 14307 -39199 -79649 -148452 -199497
7711 -199497 -215949 -230303 -223297 -152449 -77206 -95039 -152510 -105527 9651 -13658 -193567
7700 -193567 -253232 -41691 160416 20226 -312828 -385876 -108936 119825 19923 -191139
7690 -191139 -194322 -43923 8316 -62694 -107170 -123222 -206673 -270017 -148992 39667 -8178
7679 -8178 -297019 -472086 -337147 -115877 -60326 -102090 -85585 -74401 -176206 -276717 -218919
7668 -218919 -89220 -61174 -88705 -25951 63900 14596 -109217 -96984 22659 1820 -200744
7657 -200744 -323461 -207262 -20664 31203 -18341 -49232 -77055 -162619 -243499 -208937 -57696
7646 -57696 117457 223121 189664 14480 -167056 -183300 -57921 -1975 -112213 -234532
7636 -234532 -216222 -132494 -136974 -222173 -269807 -239433 -176393 -110667 -57628 -46559 -62134 -42315
7624 -42315 -3566 -51361 -185782 -237920 -111578 50452 70968 -26036 -123596 -210359 -299709
7613 -299709 -287261 -96236 132364 198413 111527 12106 -75941 -193638 -246490 -121660 50564
7602 50564 34643 -128790 -170488 -42061 -14207 -238236 -485732 -472374 -233539 -21777 20191
7591 20191 -52683 -116130 -85859 20503 76215 -13676 -160127 -204034 -159810 -164663 -208629 -158823
7579 -158823 -58632 -102685 -251278 -209418 69705 213651 -8071 -284472 -237232 -8223
7569 -8223 11877 -172955 -229896 -84917 6355 -58562 -109821 -97156 -183008 -359619 -371131
7558 -371131 -156338 -1008 -72450 -153453 -61288 9436 -142451 -309773 -203628 20968
7548 20968 -16215 -294691 -421348 -265397 -133376 -226167 -325301 -210295 -49471 -97288 -244187
7537 -244187 -198374 15090 83873 -83978 -213356 -107639 43816 -18880 -206761 -219573
7527 -219573 -9103 146813 44423 -185561 -296423 -242022 -158165 -139899 -176846 -250117 -348609
7516 -348609 -399421 -312962 -125711 2240 -27133 -144275 -230265 -258895 -259385 -210645 -74530
7505 -74530 86677 130742 8296 -152583 -191355 -110045 -56398 -116751 -203542 -190437 -94229
7494 -94229 -38531 -67424 -103473 -102229 -131147 -236478 -334719 -330708 -267614 -248014 -260540 -212361
7482 -212361 -106188 -51570 -100134 -192127 -271479 -326975 -312011 -176521 -15536 -17497 -184923
7471 -184923 -273340 -131321 57310 46673 -88877 -85238 65461 85843 -129175 -303779 -181445
7460 -181445 76133 114542 -102121 -257300 -147629 55871 91308 -39187 -140821 -130365
7450 -130365 -94593 -96144 -96795 -80809 -96384 -133376 -105110 -17103 -8816 -127775 -206097 -110536
7438 -110536 13216 -47453 -204082 -174603 53171 158367 -25396 -234157 -162857 88566
7428 88566 197074 96913 2380 16686 6529 -107405 -195371 -153876 -92575 -145126 -239431
7417 -239431 -221978 -124132 -125575 -269426 -377370 -295764 -105342 248 -28905 -73864 -54059
7406 -54059 -32732 -74316 -111866 -60059 13868 -27649 -165842 -237036 -185817 -141204 -182410 -199784
7394 -199784 -100343 3329 -30609 -126527 -109168 8945 57695 -13161 -86990 -100330 -114416
7383 -114416 -153484 -157561 -123052 -112392 -98702 6389 135438 95478 -113730 -241081 -152615
7372 -152615 -25825 -27341 -38394 81704 180795 56196 -147313 -124761 82490 132700 -57655
7361 -57655 -169600 2363 225702 210065 43690 2960 110609 158087 73064 -1997 20652
7350 20652 57701 36637 699 -23058 -92876 -208012 -240171 -123624 -4932 -60076 -222919
7339 -222919 -254826 -82259 90709 65074 -85501 -138023 -32760 74357 51934 -54447
7329 -54447 -144269 -211457 -288460 -328461 -255629 -97853 33260 84773 93261 76204 -4683 -142299
7317 -142299 -238464 -216197 -116241 -28603 16727 33691 13542 -42910 -66077 6863 105446 85156
7305 85156 -60513 -157221 -85990 33182 4794 -153203 -226253 -107424 60403 98735 22365
7294 22365 -40719 -60295 -106268 -191895 -249064 -247540 -219363 -166121 -63112 32760 10482 -120149
7282 -120149 -205687 -160614 -83948 -88564 -132201 -126844 -114187 -187202 -292979 -268088 -71504 137515
7270 137515 179427 37957 -147350 -217949 -132434 -12617 -29913 -201187 -345495 -304153 -140458
7259 -140458 -33227 -37085 -68334 -81463 -114477 -168304 -183127 -154501 -150039 -178942 -151994 -14101
7247 -14101 161230 242894 160134 -41200 -205878 -178058 12374 132002 24649 -165043
7237 -165043 -201033 -103221 -68102 -104433 -33632 140429 181596 28858 -62029 57652 160365
7226 160365 22185 -184496 -163193 31019 103165 -8428 -84430 -5102 106222 126742 88080
7215 88080 61218 64787 95879 114777 38722 -113144 -161749 -31130 55843 -109666 -334149
7204 -334149 -269122 24532 140362 -40996 -193423 -112213 -24461 -138681 -260975 -146892
7194 -146892 57959 62802 -86550 -113127 29408 130228 95971 48143 54845 33781 -44904
7183 -44904 -80895 -22733 44753 41589 -6680 -37263 -14445 71680 167102 146166 -28944 -178281
7171 -178281 -95638 144378 250311 103374 -99924 -150199 -92756 -85510 -127526 -80527 93109
7160 93109 249227 234941 68532 -89944 -123856 -74200 -46799 -46629 10878 124408 167036
7149 167036 81054 -15016 -19803 -24989 -143609 -269731 -214160 -16594 105717 95696 96693 144301
7137 144301 91776 -78754 -142144 23164 207701 185008 61483 81513 226140 266557 142416
7126 142416 27730 34643 85786 105529 130618 177815 178458 111788 54349 31524 -37273 -171367
7114 -171367 -248755 -191429 -103746 -105501 -133258 -49885 123199 235918 229456 176372 123211 49239
7102 49239 -14267 13733 104383 118020 27579 -12429 83112 167982 102961 15765 110178 301509
7090 301509 299859 51438 -165497 -151296 -44487 -43338 -90079 -27531 92504 92344 -25195
7079 -25195 -81950 -8783 75431 72115 17591 -27546 -55268 -57611 -25718 -8202 -48981 -80492
7067 -80492 -15461 81089 78996 19125 57197 171317 168510 32078 -1744 169695 303913
7056 303913 166727 -111651 -247720 -207087 -158842 -146092 -58490 113171 225966 195183 86413
7045 86413 -6975 -46349 -21927 37952 59512 29001 49812 185443 328248 358294 335606
7034 335606 367946 388612 275915 112839 84055 161860 155463 54640 44267 154748 188068
7023 188068 64196 -37231 6914 65053 15016 -29337 63467 192180 189427 92257 55671
7012 55671 107360 159774 174878 168818 139230 111503 154669 237090 199656 7758 -120669 -11754
7000 -11754 184117 217168 118703 113182 234638 297020 222332 143903 157248 186337 150365 89702
6988 89702 70815 98777 158110 229407 261116 233432 225218 295157 347096 270851 162273 206025
6976 206025 372752 453502 387624 322684 333576 329315 282709 298740 380760 382109 288556 290926
6964 290926 447413 535114 409574 259056 283539 354700 265260 124900 192317 432516 563526
6953 563526 490447 389638 369857 335308 224799 141247 173260 272022 355799 383501 313491
6942 313491 158068 76522 219308 473540 577186 502561 481738 604654 671991 563644
6932 563644 474962 590478 753791 712942 531865 483232 622544 740222 709925 634260 620396
6921 620396 628783 608743 610088 673262 734459 728352 699207 730587 817802 872135 826327 708014
6909 708014 629882 700974 903078 1067915 1042823 876520 767815 826042 964998 1052416 1072161
6898 1072161 1086435 1112090 1113318 1085229 1072615 1104455 1157118 1197001 1232681 1299453 1393488 1451890
6886 1451890 1432004 1393220 1433961 1534951 1552696 1424327 1289058 1304501 1417100 1460995 1442640
6875 1442640 1537675 1781410 1962124 1922682 1802661 1827546 1973006 2025939 1925829 1846289
6865 1846289 1918710 2052203 2107485 2118871 2221670 2420772 2561052 2539131 2448503 2456904 2587697
6854 2587697 2702042 2702391 2674861 2771733 2998818 3202571 3259630 3198817 3128781 3128860 3229530 3405175
6842 3405175 3546324 3540367 3444256 3472900 3718844 3980746 4008777 3855092 3812072 4016877 4291002
6831 4291002 4412927 4396749 4411158 4526821 4657291 4712949 4722290 4788841 4964229 5179030 5307617
6820 5307617 5312135 5301003 5416021 5685005 6020979 6331899 6578736 6761280 6917673 7120292
6810 7120292 7412313 7766907 8147879 8555292 8960908 9286633 9528429 9798983 10144783 10454210
6800 10454210 10692076 11059907 11704346 12436249 13036334 13675816 14643031 15797482 16814765
6791 16814765 17899896 19599398 21847023 23994913 26077987 29144566 33649213 38241468
6783 38241468 41074497 41830335 41422186 40072117 37046695 32418816 27745122 24369370
6775 24369370 22011661 19738048 17510603 15901744 14858616 13758805 12464042 11430436
6767 11430436 10819697 10270018 9606448 9101688 8886904 8677459 8277052 7874600 7630297
6758 7630297 7378997 6971695 6562962 6319640 6122123 5782684 5340201 4940134 4611474 4337348
6748 4337348 4174904 4139353 4110534 3993090 3844583 3741432 3652600 3535638 3415058 3283473
6738 3283473 3076055 2823300 2673520 2682225 2729828 2712559 2648613 2542960 2352642 2161703
6728 2161703 2162893 2352858 2467705 2353256 2177297 2124323 2110434 1991093 1837069 1781214
6718 1781214 1771270 1702273 1634407 1651836 1659140 1554377 1455495 1502379 1574582 1478098 1286006
6707 1286006 1201484 1196117 1106254 999358 1084252 1292701 1327022 1150287 1057898 1179267 1267721
6696 1267721 1132688 957456 980811 1119598 1141668 1028184 931517 900861 869251 835556 861253
6685 861253 917379 896487 780346 682440 705680 822538 912109 891424 801461 747402 749615
6674 749615 721217 638520 623110 735423 802887 653896 443746 483415 754597 889052 699798
6663 699798 447854 442182 624600 741334 726577 693262 677948 620978 534322 499817 524920
6652 524920 535645 496050 445768 444676 525425 646073 679441 555286 412412 444203 580238
6641 580238 550463 325065 211432 375429 556181 476644 269924 210308 250445 173839 38423
6630 38423 79520 261571 318362 215952 200000 357192 485884 468656 438719 473632 433242
6619 433242 242413 71152 78359 189335 263907 292282 305570 282436 254431 311854 406407
6608 406407 362023 187208 130580 281810 379984 223206 19773 64429 267339 317391 179171
6597 179171 98269 176040 259724 255652 259078 319033 321854 197840 55634 19008 69915 127116
6585 127116 163755 186185 194637 208008 238282 222220 88097 -87904 -120140 38552 201652
6574 201652 176041 -2457 -139574 -125764 -25956 45804 68833 115199 227620 328748 300568
6563 300568 164832 99991 206680 337726 286864 92124 -13634 58657 155564 158336 154273
6552 154273 225202 253754 118292 -53171 -43090 110924 167231 66314 18949 146666 273335
6541 273335 216238 84525 82345 159935 117483 -19015 -19292 143955 213840 75711 -27044
6530 -27044 104152 257721 132426 -151820 -209912 11416 157829 25923 -148252 -93536
6520 -93536 92437 148327 54113 -531 60813 123033 83446 -21387 -83296 -31248 101071
6509 101071 181350 123298 35788 94561 245787 237568 19792 -126860 -11040 158041 101851
6498 101851 -90240 -131953 4771 109011 102824 85070 69750 -8803 -69312 21637 146120
6487 146120 56452 -188181 -253915 -54872 114404 74666 26998 143245 228911 55568 -224377
6476 -224377 -285549 -93143 99894 112992 -19222 -176258 -242986 -155016 -3769 2498 -178677
6465 -178677 -304707 -168640 92027 193912 101381 11371 20483 23399 -74968 -219406 -287092
6454 -287092 -209553 -32783 87671 29823 -106415 -89306 97354 187585 34936 -140030
6444 -140030 -94355 60831 79326 -14258 -34586 3708 -33248 -75751 31054 164003 63979
6433 63979 -187853 -241811 -55100 23674 -155329 -280976 -94344 196523 259651 111770
6423 111770 -12757 -39782 -38310 -1386 93658 129812 -482 -173455 -176970 -18353 98741
6412 98741 65005 -31004 -66472 -18839 48566 42949 -85893 -260345 -310169 -155186 95760
6401 95760 261906 239691 34335 -239094 -381287 -291447 -139220 -167066 -310616 -274288 -37703
6390 -37703 45672 -186596 -387940 -222735 95299 144391 -51131 -125155 7482 76839 -29687
6379 -29687 -111868 -61890 -33882 -102765 -101722 49581 153789 52459 -113158 -147345 -96498
6368 -96498 -99730 -119207 -43806 59278 28709 -110212 -162556 -65342 8610 -92759 -267587
6357 -267587 -286797 -106745 59575 23276 -119522 -125781 31773 119921 13576 -91807 15153
6346 15153 216464 246785 109231 50133 164748 288649 286610 210270 142300 103059 134770
6335 134770 257192 324606 174423 -58471 -61730 162131 243371 7835 -233387 -157419 96790
6324 96790 186142 66071 -46752 -49168 -11389 26584 74203 92585 74311 108791 187405 109999
6312 109999 -183291 -369850 -142053 291444 453304 264898 91657 143313 221736 133667
6302 133667 -8237 -37727 2667 12776 19926 62780 82024 57080 71410 125808 78374 -100587
6290 -100587 -210387 -115531 21334 -12019 -150578 -183013 -90242 -26377 -35205 -19984 24131
6279 24131 -24552 -175336 -245155 -110265 96666 154724 41017 -69633 -60464 -6047 -22196
6268 -22196 -89684 -114965 -100654 -129421 -196316 -205160 -158047 -183243 -300423 -334215 -188885 -32774
6256 -32774 -27790 -49147 76188 206375 91510 -148925 -149849 98363 192473 -41963 -265592
6245 -265592 -175336 36735 48197 -82437 -97215 -174 7944 -96732 -176381 -210817 -265074
6234 -265074 -272466 -140488 1673 -55971 -271478 -418646 -420027 -351940 -207314 41148 213198
6223 213198 101961 -142922 -168497 34123 101731 -126011 -371896 -372119 -218918 -105737 -42938
6212 -42938 1013 -45743 -181763 -253853 -212571 -200602 -249737 -180980 26708 95448 -95052
6201 -95052 -243207 -114393 28861 -136842 -410086 -373904 -95563 -12189 -209113 -324849
6191 -324849 -184383 -38758 -78295 -145113 -87874 -29719 -93105 -166337 -137605 -101490 -150703
6180 -150703 -196058 -164168 -151400 -216463 -242568 -173353 -153309 -245939 -254784 -56281 119530
6169 119530 20882 -205358 -239616 -92837 -46723 -175172 -267371 -208557 -120150 -98239 -96486
6158 -96486 -107902 -197561 -304107 -266219 -111195 -62759 -180613 -252894 -160182 -82242 -177870
6147 -177870 -301333 -250666 -99596 -40281 -50885 15496 118870 93632 -24655 -17186 154245
6136 154245 258524 140806 -59701 -139679 -103904 -83922 -115759 -132054 -95789 -28068 44696
6125 44696 83600 30170 -109879 -223217 -212134 -122737 -72534 -90486 -115787 -120574 -128550 -121863
6113 -121863 -43153 82629 127378 18201 -148810 -217122 -153423 -61882 -35117 -53040 -40273
6102 -40273 18026 50459 -10058 -128718 -193052 -152234 -94501 -125771 -191442 -123055 101806
6091 101806 260257 149550 -125055 -273273 -200531 -96062 -118984 -184388 -160574 -112491 -178590
6080 -178590 -308360 -320361 -182075 -41054 17241 52497 89616 55915 -38067 -50254 57217
6069 57217 116675 26063 -53017 48997 205374 172798 -26497 -154222 -133501 -114134 -171299
6058 -171299 -206986 -185374 -202506 -252616 -187405 -12800 37807 -122661 -244971 -129403 36098
6047 36098 -18953 -204261 -235971 -101344 -21207 -38889 -1627 82457 37420 -106769 -107520 39335
6035 39335 19666 -267536 -461028 -267145 67601 124730 -78858 -199060 -118665 -20867 10976
6024 10976 88981 206095 172526 -49038 -228489 -202804 -95088 -80032 -131365 -134360 -81047
6013 -81047 -18599 55195 116491 66962 -105224 -233526 -182385 -47188 -4557 -60340 -103444
6002 -103444 -123963 -190668 -258252 -196846 -20819 91884 52545 -17016 18957 115933 137741
5991 137741 56426 -26558 -22618 43987 67438 -30945 -205822 -302282 -211788 -12042 108851
5980 108851 73240 -12955 -26865 13394 6881 -76951 -168229 -191239 -142358 -89855 -115255 -222015
5968 -222015 -292838 -198170 25500 177493 124563 -37038 -119951 -82416 -34450 -54490 -112058
5957 -112058 -158180 -181252 -162392 -75435 43286 110760 108683 99392 110629 95857 37324 -13717
5945 -13717 -40264 -87136 -126192 -33240 190596 311769 149694 -128728 -208155 -63509 38982
5934 38982 -25587 -78658 12373 91704 -3454 -133734 -70343 117971 158106 -1610 -123288
5923 -123288 -54532 67526 63159 -33823 -80811 -48923 -16011 -20202 -29813 -19483 -5603 -29710
5911 -29710 -127900 -267716 -320418 -191152 15696 86536 -16132 -106778 -72990 -40544 -123071
5900 -123071 -186065 -59536 141170 156005 -11369 -88241 42458 163199 62885 -150537
5890 -150537 -227755 -127212 -15811 4662 -43 36741 57414 -19033 -147416 -189743 -95305
5879 -95305 17616 10209 -82045 -97574 -1423 40110 -81792 -217907 -176621 -41572 -53610
5868 -53610 -214012 -266477 -115251 10311 -66287 -175763 -92345 76288 49247 -183387 -345726
5857 -345726 -277035 -106780 -11488 -6661 -30217 -58571 -72882 -42921 689 -8639 -44185 -5831
5845 -5831 99504 137083 53404 -36663 -41785 -32977 -95828 -171619 -165844 -115843 -120462 -173464 -195377
5832 -195377 -183982 -209440 -281364 -326636 -295610 -215437 -145885 -131223 -165765 -169465 -59019 110730
5820 110730 167478 56331 -55797 -22150 53980 -5829 -148385 -169697 -50084 32346 22789
5809 22789 68747 216784 279125 130510 -67811 -103066 -11194 28319 -30181 -103430 -160548
5798 -160548 -217637 -223925 -130110 -18986 -5493 -57109 -72847 -77274 -151174 -228050 -179142 -68996
5786 -68996 -82826 -199262 -201437 -55490 7807 -111617 -196042 -84049 40037 -37251 -185340
5775 -185340 -162226 -43685 -86433 -266012 -305080 -137538 1024 -17611 -44757 16752 27483
5764 27483 -96950 -182463 -76148 91857 130110 79563 70407 59565 -42232 -126004 -48516
5753 -48516 57283 -57840 -328876 -422970 -240804 -61483 -100029 -210879 -181616 -69711
5743 -69711 -43322 -79526 -52932 5726 -23900 -107642 -110561 -50684 -68289 -150594 -123282 43008
5731 43008 147202 73090 -15297 60861 199104 173733 -14998 -157389 -156456 -127382 -164617
5720 -164617 -204534 -181442 -150379 -154421 -112337 26076 122200 17672 -193695 -249363 -80854
5709 -80854 78821 6938 -229412 -387612 -333980 -122437 117148 258533 215818 25675
5699 25675 -137566 -137729 -47324 -42459 -154419 -246931 -231843 -169678 -131271 -98219 -59455 -76942
5687 -76942 -160084 -179347 -30009 180194 238953 102820 -59830 -104508 -72259 -75308 -119224
5676 -119224 -118172 -40336 44215 60256 13597 -38898 -66019 -74379 -63720 -18223 46613 70984
5664 70984 18692 -67802 -119591 -128860 -136779 -149979 -135210 -102991 -123133 -218058 -295154 -244180
5652 -244180 -83658 39037 2354 -155251 -268956 -220509 -68198 26743 2950 -40594 -23573
5641 -23573 -25754 -139730 -261155 -202080 2844 103173 -9320 -146891 -125315 -28271 -23211
5630 -23211 -73378 -30361 91989 147967 106996 65328 39788 -43931 -153132 -142679 4490
5619 4490 107909 36460 -112018 -158461 -67205 50395 84379 24882 -39443 -8361 96935
5608 96935 121495 -20450 -189256 -198717 -91840 -54151 -90379 -24804 158746 236947 91034
5597 91034 -107868 -176199 -161261 -169743 -167215 -113714 -97888 -149952 -115183 76606 207773 86387
5585 86387 -113410 -110180 38728 75075 1983 34843 153561 112209 -87321 -143083 33022
5574 33022 144096 9416 -134647 -59172 68200 11910 -92489 16443 232279 221281
5564 221281 -28908 -181032 -76660 50683 -23878 -190295 -223669 -121191 -46140 -62446
5554 -62446 -90878 -70992 -31836 -15794 -25517 -49835 -83091 -113681 -130880 -143292 -161222 -163310
5542 -163310 -114823 -31210 8541 -50955 -150339 -160974 -41333 96958 117596 16958 -94011
5531 -94011 -128877 -88640 -21962 7109 -53770 -171655 -221915 -146250 -60938 -86033 -137607 -71324
5519 -71324 24507 -67169 -292955 -334976 -105975 71910 -37941 -203691 -102530 155222
5509 155222 213211 29289 -109395 -63691 14287 11439 2592 27530 11835 -25207 43609 178103
5497 178103 146017 -113615 -344790 -327677 -162103 -52610 -12851 42282 78892 13638 -107138
5486 -107138 -166691 -144017 -99153 -70674 -81271 -148075 -205563 -138075 29266 115224 46112
5475 46112 -36476 -38964 -78550 -219907 -267798 -61208 202638 218851 22616 -108060 -101253
5464 -101253 -120636 -194529 -160310 -5096 64651 -22918 -70423 54810 207700 223901 167339
5453 167339 162611 169743 96212 -14927 -72494 -92138 -113327 -72950 80969 236813 238334 102600
5441 102600 -16307 -42283 -38161 -78556 -160416 -228323 -227422 -151344 -62563 -14016 49971 208961
5429 208961 374241 345642 119652 -48579 -7917 58290 -56868 -223254 -177026 37878
5419 37878 131471 28243 -45219 31645 80042 -44069 -180487 -119276 53961 88450 -50977
5408 -50977 -154157 -98385 -9324 -31644 -94233 -30602 137281 193811 41106 -124650 -74877
5397 -74877 97430 85684 -163345 -331074 -193257 26905 -15 -194516 -217415 -47295
5387 -47295 -17898 -233173 -344963 -100476 230644 263589 75194 20490 137479 138573 -50324
5376 -50324 -154794 -33641 75340 -31650 -170164 -80197 123223 115117 -133737 -322331
5366 -322331 -273134 -138357 -99639 -112536 -68853 -12572 -28558 -55227 7398 89608 44991
5355 44991 -88370 -116457 10763 114392 56612 -66246 -85286 19254 152802 244511 245417
5344 245417 102883 -134136 -280536 -226339 -96678 -53355 -41395 63392 146140 -21766
5334 -21766 -353773 -458606 -180661 148837 168517 -40964 -156991 -94055 -14609 17458 97271
5323 97271 220894 239013 110428 -13722 -21712 18979 20171 12878 45945 76115 52242 11976
5311 11976 9385 19602 -12912 -87696 -160687 -191041 -148056 -36838 64608 74839 31487 46633
5299 46633 122908 139693 60753 8287 53475 83492 -3940 -108373 -83563 20837 55335
5288 55335 32572 87789 207666 218445 77237 -26213 56081 213645 247360 140604 36973
5277 36973 19697 35478 8571 -69573 -160195 -215216 -195445 -105269 -11740 10696 -43716 -116511
5265 -116511 -155568 -152929 -121638 -67796 6255 83046 122959 92652 19606 -4365 75210 179002
5253 179002 172703 56784 -12693 58736 162036 151313 67602 55976 106753 60070 -113165
5242 -113165 -223162 -140088 4495 29954 -21299 -9477 14031 -107853 -302005 -303609 -88315
5231 -88315 25532 -140586 -310967 -175680 91252 84912 -169333 -221757 97258 383919
5221 383919 250117 -123332 -289084 -156791 -6626 -17995 -103078 -162712 -214770 -247678 -189050
5210 -189050 -67334 -8513 -33839 -42620 -19739 -57709 -134219 -92405 78304 164205 45359
5199 45359 -117308 -153032 -132948 -170791 -167527 5982 214677 216751 35339 -89988 -78652
5188 -78652 -71568 -128843 -136562 -55650 -7375 -31210 6718 153197 232284 112702 -74716 -148866
5176 -148866 -146687 -197638 -266646 -233898 -139301 -123445 -169043 -123708 20364 85239 -8228 -106867
5164 -106867 -63132 47842 62140 -32407 -111786 -104483 -48393 6595 47873 57952 12124 -62482
5152 -62482 -89066 -36010 26513 5383 -86851 -124143 -21353 124218 116409 -83942 -263960
5141 -263960 -208430 5951 99978 -26579 -164723 -113637 30486 44904 -73931 -130555 -54344
5130 -54344 9958 -33105 -77572 -26878 14097 -86330 -232990 -211333 -4452 177541 188315
5119 188315 98506 21333 -50697 -144775 -178211 -69536 90207 124002 16783 -49073 62597
5108 62597 256454 321668 182924 -23433 -110336 -31368 100366 156848 122690 70703 51276
5097 51276 55019 67517 90792 100449 57901 -3507 13370 119690 182615 103921 -16754 -15534
5085 -15534 87472 115568 -121 -131572 -155486 -106227 -73050 -65762 -57347 -60939 -80751 -65361
5073 -65361 8644 75362 79145 64650 82336 76748 -22241 -148260 -159317 -32772 104115 134265
5061 134265 58110 -47072 -92867 -19037 145473 266399 228695 70156 -78778 -156665 -180983
5050 -180983 -141066 -19866 90517 56371 -86971 -152881 -86357 -59049 -181779 -289914 -182286
5039 -182286 45402 116824 -21127 -126817 -21936 171172 234458 149422 66173 66957 92591
5028 92591 72128 11553 -49716 -83724 -62410 26062 130708 172394 145590 118445 109593 54167
5016 54167 -57613 -112893 -46881 14641 -64966 -179713 -112965 91946 142436 -53748 -209854
5005 -209854 -91715 108052 76818 -113611 -128320 89293 244405 173259 66666 115883
4995 115883 224190 218699 113866 255 -125587 -245518 -221542 -14647 152605 70391
4985 70391 -136635 -178458 -2372 185851 234905 170764 55467 -67857 -114258 -35335 56030
4974 56030 14266 -110032 -144906 -66001 390 11147 35169 70122 50278 23305 84269 143864
4962 143864 30767 -165212 -160560 56044 160796 14871 -102030 25030 164811 27441
4952 27441 -240207 -289569 -109688 23377 8757 -20253 -18123 -55602 -64985 91222 293116
4941 293116 255467 -5184 -142957 -16447 96970 -20751 -169931 -97503 58108 8990
4931 8990 -171696 -139297 174448 435017 374500 120007 -51232 -77180 -81883 -118409 -120827
4920 -120827 -69744 -46706 -97961 -158227 -166054 -168182 -221851 -252914 -139462 68232 158265 46288
4908 46288 -83943 -43748 73535 40322 -138266 -218094 -86448 69114 39915 -124623 -230485
4897 -230485 -206149 -127040 -57859 -3283 24369 1228 -53717 -93412 -100887 -89631 -78961 -103599
4885 -103599 -191213 -287703 -279709 -154165 -52209 -73927 -108990 13012 253997 394650 324594
4874 324594 168723 95613 117889 138415 103726 35485 -39049 -108757 -140164 -80950 67361
4863 67361 204031 204349 64748 -63897 -45446 58668 62737 -78944 -193607 -133973 7658
4852 7658 35583 -74530 -168523 -147352 -73588 -38822 -41414 -30937 5766 36785 14915 -90342
4840 -90342 -240565 -320435 -248659 -90003 10224 -4861 -66786 -95593 -72389 -15070 35217
4829 35217 25721 -19021 39590 274394 512375 509040 302035 184396 275163 342408 175889
4818 175889 -76548 -140387 -22550 53209 27341 57846 207344 327995 310505 234373 183106
4807 183106 97805 -59883 -155496 -60787 112262 140069 9617 -73075 -8477 49624 -42368
4796 -42368 -164861 -104421 107197 218661 126728 22546 85103 197573 132512 -85460 -209282
4785 -209282 -133351 -14051 10470 15800 107077 213050 210751 132131 85286 57230 -36317 -162489
4773 -162489 -206119 -165430 -145068 -161933 -124501 -17418 57461 55207 45541 54442 8679 -97791
4761 -97791 -140585 -57867 36074 33002 -6493 13072 53751 43082 23137 50737 57055 -25761
4749 -25761 -98340 -45685 35330 -16082 -120845 -71982 79814 63639 -145536 -226755 -12130
4738 -12130 220323 165197 -56500 -131351 -41056 -2695 -53541 -35063 62509 75229 -6427
4727 -6427 -1451 118462 153642 33312 -47612 23593 82727 16366 -499 163151 278911
4716 278911 92347 -212553 -243511 6357 169954 86488 -6652 81439 214097 222143 173000
4705 173000 165413 113450 -49464 -158666 -51627 136928 159117 27370 -43513 1998 17283
4694 17283 -42153 -32276 103998 197282 100175 -82644 -143344 -50625 48438 56257 34703 82491
4682 82491 183658 218725 108825 -76951 -175982 -100667 64689 154856 97044 -30801 -101846
4671 -101846 -69287 5908 32200 -18672 -94640 -133631 -124718 -84812 -22728 23141 -30099 -188234
4659 -188234 -290536 -188577 1559 12334 -179454 -286326 -135473 62121 38201 -132336
4649 -132336 -189391 -102094 -54331 -95869 -90231 3483 56620 5147 -64868 -97616 -128648 -136645
4637 -136645 -38496 128803 214574 176878 112159 55451 -28919 -55595 106393 326869 295475
4626 295475 4122 -177803 -58714 82420 -22643 -187372 -115214 84442 95634 -73916
4616 -73916 -146142 -46246 48370 74116 137904 219815 158035 -34494 -136945 -59930 39751
4605 39751 36309 -10097 -25851 -27914 -7692 77518 158478 110193 -16152 -37521 58125 91337
4593 91337 7821 -44686 -14503 -46024 -186208 -260683 -169901 -56519 -35393 -4048 112706
4582 112706 169776 53609 -80681 -39314 112708 189646 166039 119057 37951 -99655 -186536
4571 -186536 -123550 4970 64267 59828 42884 -19615 -113883 -103259 20128 19710 -202906 -339535
4559 -339535 -116500 203620 171060 -144236 -264175 -64054 82286 -30399 -130932 -366
4549 -366 141830 43806 -143942 -148921 -28814 -23005 -128133 -129776 35831 211976 269567 226262
4537 226262 147434 77257 38199 -598 -93826 -186413 -123397 109198 288471 233759 57114
4526 57114 -18162 26205 45202 -4482 -37878 -31359 -51030 -102034 -106523 -39841 31587 53251
4514 53251 33088 -511 -20823 -11994 -7263 -55187 -105067 -42925 85618 49917 -228146 -471810
4502 -471810 -388339 -84695 94493 51157 -16522 2052 2393 -53573 -25561 138392 269538
4491 269538 239549 154470 153479 181594 107820 -54284 -176462 -179388 -76809 53788 86027
4480 86027 -50637 -226073 -218076 -32987 63952 -55924 -161766 -6748 286653 409508
4470 409508 299857 141185 19322 -137761 -302972 -317467 -165462 -42375 -65883 -120215
4460 -120215 -82209 -15390 -17208 -34448 19748 86388 59826 -15148 -10892 59313 46976 -96658
4448 -96658 -229595 -205477 -53890 79439 108658 65983 18117 -13008 -34996 -29964 36843
4437 36843 141679 185041 107565 -4065 -12935 68320 85457 -14090 -79842 1104 87808 -18074
4425 -18074 -230683 -254887 -15260 213366 195081 53643 44306 158058 176370 50509 -22127
4414 -22127 73000 186840 158771 75614 120310 265646 304810 165809 21019 33262 128167
4403 128167 124737 20081 7824 196901 423416 429494 187358 -58542 -91479 29634 91028
4392 91028 24440 -30235 42568 161166 167707 44626 -75436 -86966 -20524 29666 26394 6908
4380 6908 6392 3088 -43643 -116145 -138798 -72161 34472 120741 194264 262722 243154 68532
4368 68532 -129463 -112773 131279 312210 203379 -50056 -145293 -34922 76328 90252
4358 90252 128419 254208 313468 176441 -25623 -70955 38189 106152 57670 41963 175864
4347 175864 330494 296214 89957 -53314 -5716 87749 52769 -38118 -104 128163 113467
4336 113467 -88997 -225228 -122691 41535 30044 -86401 -87506 7911 -2023 -124931 -156351
$$ [...]
##END NTUPLES=NMR SPECTRUM
##END=
