##TITLE=1H ikalashn
CG-1218-2
15.11.2024
##JCAMPDX= 6.0         $$ Bruker NMR JCAMP-DX V2.0
##DATA TYPE= NMR SPECTRUM
##DATA CLASS= NTUPLES
##ORIGIN= UXNMR, Bruker Analytische Messtechnik GmbH
##OWNER= root
$$ TOPSPIN		Version 1.3
$$ 2024-11-15 13:39:49.312 +0400  Irina@DPX200
$$ Compression mode = diff/dup
##.OBSERVE FREQUENCY= 200.131300845
##.OBSERVE NUCLEUS= ^1H
##.ACQUISITION MODE= SIMULTANEOUS
##.ACQUISITION SCHEME= undefined
##.AVERAGES= 32
##.DIGITISER RES= 18
##SPECTROMETER/DATA SYSTEM= spect
##.PULSE SEQUENCE= zg
##.SOLVENT NAME= CDCl3
##.SHIFT REFERENCE= INTERNAL, CDCl3, 1, 17.49637
##AUDIT TRAIL= $$ (NUMBER, WHEN, WHO, WHERE, WHAT)
$$ ##TITLE= Audit trail, TOPSPIN		Version 1.3
$$ ##JCAMPDX= 5.01
$$ ##ORIGIN= Bruker BioSpin GmbH
$$ ##OWNER= Irina
$$ $$ F:/spectra/data/iren/nmr/1H/4/pdata/1/auditp.txt
$$ ##AUDIT TRAIL=  $$ (NUMBER, WHEN, WHO, WHERE, VERSION, WHAT)
(   1,<2024-11-15 13:39:16.328 +0400>,<Irina>,<DPX200>,<TOPSPIN 1.3>,
      <created by zg
	started at 2024-11-15 13:37:05.546 +0400,
	POWCHK disabled, PULCHK disabled
       terminated by command 'halt'
       configuration hash MD5:
       BE 6D 3F 07 2A EA 11 49 91 17 2B D3 AF B3 58 0D
       data hash MD5: 16K
       78 7F 0F 43 9C 16 13 AC 46 78 53 6E 3E 07 74 C0>)
(   2,<2024-11-15 13:39:17.640 +0400>,<Irina>,<DPX200>,<TOPSPIN 1.3>,
      <Start of raw data processing
       efp BC_mod = 2 LB = 0.02 FT_mod = 6 PKNL = 1 PHC0 = 122.3195 PHC1 = 0.9126797 SI = 32K 
       data hash MD5: 32K
       BD 32 A6 70 8B 51 D3 58 12 AF 7B D2 A4 E2 86 6D>)
(   3,<2024-11-15 13:39:20.328 +0400>,<Irina>,<DPX200>,<TOPSPIN 1.3>,
      <apk 
       data hash MD5: 32K
       60 51 8D CD 79 95 18 36 65 C8 D8 27 64 AA 6A 1C>)
(   4,<2024-11-15 13:39:39.234 +0400>,<Irina>,<DPX200>,<TOPSPIN 1.3>,
      <pk fgphup PHC0 = 25.42378 PHC1 = -55.2 
       data hash MD5: 32K
       43 76 59 EA 22 59 23 5D 14 D8 59 AA 2C 7F 39 F0>)
(   5,<2024-11-15 13:39:40.875 +0400>,<Irina>,<DPX200>,<TOPSPIN 1.3>,
      <abs n ABSG = 5 
       data hash MD5: 32K
       F0 8E E5 5D 5A 07 00 56 BC B3 75 92 0E 8D 62 3F>)
$$ ##END=
$$ 
$$ $$ hash MD5
$$ $$ 70 15 91 72 CB E3 CD B2 A6 88 91 25 38 6B 31 3C
##$RELAX= 
##$RELAX= 
##$RELAX= 
##$RELAX= 
##$RELAX= 
##$RELAX= 
##$RELAX= 
##$RELAX= 
##$RELAX= 
$$ Bruker specific parameters
$$ --------------------------
##$DU= <F:/spectra>
##$EXPNO= 4
##$NAME= <1H>
##$PROCNO= 1
##$TYPE= <nmr>
##$USER= <iren>
##$AMP= (0..31)
100 100 100 100 100 100 100 100 100 100 100 100 100 100 100 100 100 100 
100 100 100 100 100 100 100 100 100 100 100 100 100 100 
##$ANAVPT= -1
##$AQSEQ= 0
##$AQ_mod= 1
##$AUNM= <au_zg>
##$AUTOPOS= <>
##$BF1= 200.13
##$BF2= 200.13
##$BF3= 200.13
##$BF4= 200.13
##$BF5= 200.13
##$BF6= 200.13
##$BF7= 200.13
##$BF8= 200.13
##$BYTORDA= 1
##$CFDGTYP= 0
##$CFRGTYP= 5
##$CHEMSTR= <none>
##$CNST= (0..63)
1 1 145 1 1 1 1 1 1 1 1 1 1 1 1 1 1 1 1 1 1 1 1 1 1 1 1 1 1 1 1 1 1 1 
1 1 1 1 1 1 1 1 1 1 1 1 1 1 1 1 1 1 1 1 1 1 1 1 1 1 1 1 1 1 
##$CPDPRG= <>
##$CPDPRG1= <>
$$ [...]
##$SW_h= 4401.40845070422
##$TD= 16384
##$TD0= 1
##$TE= 300
##$TE2= 300
##$TE3= 300
##$TEG= 300
##$TL= (0..7)
0 120 120 120 120 120 120 120 
##$TP= (0..7)
150 150 150 150 150 150 150 150 
##$TP07= 0
##$TPNAME0= <>
##$TPNAME1= <>
##$TPNAME2= <>
##$TPNAME3= <>
##$TPNAME4= <>
##$TPNAME5= <>
##$TPNAME6= <>
##$TPNAME7= <>
##$TPOAL= (0..7)
0.5 0.5 0.5 0.5 0.5 0.5 0.5 0.5 
##$TPOFFS= (0..7)
0 0 0 0 0 0 0 0 
##$TUNHIN= 0
##$TUNHOUT= 0
##$TUNXOUT= 0
##$USERA1= <user>
##$USERA2= <user>
##$USERA3= <user>
##$USERA4= <user>
##$USERA5= <user>
##$V9= 5
##$VALIST= <valist>
##$VCLIST= <CCCCCCCCCCCCCCC>
##$VD= 0
##$VDLIST= <DDDDDDDDDDDDDDD>
##$VPLIST= <PPPPPPPPPPPPPPP>
##$VTLIST= <TTTTTTTTTTTTTTT>
##$WBST= 1024
##$WBSW= 25
##$XGAIN= (0..3)
0 0 0 0 
##$XL= 0
##$YL= 0
##$YMAX_a= 891871
##$YMIN_a= -647803
##$ZGOPTNS= <>
##$ZL1= 120
##$ZL2= 120
##$ZL3= 120
##$ZL4= 120
##$ABSF1= 17.49637
##$ABSF2= -4.496376
##$ABSG= 5
##$ABSL= 3
##$ALPHA= 0
##$AQORDER= 0
##$ASSFAC= 0
##$ASSFACI= 0
##$ASSFACX= 0
##$ASSWID= 0
##$AUNMP= <proc_1d>
##$AXLEFT= 0
##$AXRIGHT= 0
##$AXTYPE= 0
##$AXUNIT= <>
##$AZFE= 0.1
##$AZFW= 0.1
##$BCFW= 0
##$BC_mod= 2
##$BYTORDP= 0
##$COROFFS= 0
##$CY= 7568.61572265625
##$DATMOD= 1
##$DC= 0
##$DFILT= <>
##$DTYPP= 0
##$F1P= 17.9538593292236
##$F2P= -4.03888763876832
##$FCOR= 0.5
##$FTSIZE= 32768
##$FT_mod= 6
##$GAMMA= 0
##$GB= 0
##$INTBC= 0
##$INTSCL= 1.367314e-010
##$ISEN= 128
##$LB= 0.02
##$LEV0= 0
##$LPBIN= 0
##$MAXI= 945.577
##$MC2= 0
##$MEAN= 0
##$ME_mod= 0
##$MI= -402.1523
##$NCOEF= 0
##$NC_proc= -5
##$NLEV= 6
##$NOISF1= 8.587773
##$NOISF2= 6.764455
##$NSP= 0
##$NTH_PI= 0
##$NZP= 0
##$OFFSET= 17.49637
##$PC= 1
##$PHC0= 126.2075
##$PHC1= -7.57399
##$PH_mod= 1
##$PKNL= yes
##$PPARMOD= 0
##$PPDIAG= 0
##$PPIPTYP= 0
##$PPMPNUM= 100
##$PPRESOL= 1
##$PSCAL= 0
##$PSIGN= 0
##$REVERSE= no
##$SF= 200.13
##$SI= 32768
##$SIGF1= 16.12182
##$SIGF2= -4.496377
##$SINO= 3.521527
##$SIOLD= 32768
##$SREGLST= <1H.CDCl3>
##$SSB= 0
##$STSI= 32768
##$STSR= 0
##$SW_p= 4401.40845070422
##$SYMM= 0
##$S_DEV= 0
##$TDeff= 16384
##$TDoff= 0
##$TI= <>
##$TILT= no
##$TM1= 0
##$TM2= 0
##$TOPLEV= 0
##$USERP1= <user>
##$USERP2= <user>
##$USERP3= <user>
##$USERP4= <user>
##$USERP5= <user>
##$WDW= 1
##$XDIM= 32768
##$YMAX_p= 476740499
##$YMIN_p= -656825
$$ End of Bruker specific parameters
$$ ---------------------------------
##NTUPLES= NMR SPECTRUM
##VAR_NAME=  FREQUENCY,     SPECTRUM/REAL,   SPECTRUM/IMAG
##SYMBOL=    X,             R,               I
##VAR_TYPE=  INDEPENDENT,   DEPENDENT,       DEPENDENT
##VAR_FORM=  AFFN,          ASDF,            ASDF
##VAR_DIM=   32768,         32768,           32768
##UNITS=     HZ,            ARBITRARY UNITS, ARBITRARY UNITS
##FACTOR=    0.134324425510551, 1,           1
##FIRST=     4401.40845070422, 151360,       -528563
##LAST=      0,             -323660,         -501708
##MIN=       0,             -656825,         0
##MAX=       4401.40845070422, 476740499,    0
$$ Real data points
##PAGE= N=1
##DATA TABLE= (X++(R..R)), XYDATA
$$ [...]
14077A285444p7573k01636p2365O2681J2023n9945L3720J82469K00348J28695
14067A493861J04569J06777L6293p3767j03083k3154Q3910J21725M4496q4892
14057A706735j01310N7186J81732M8789j84289j50225J35330K37851j4949k35915
14047A680935j02421J30115R0306r0214o4476R9410Q4023o5046l6833J28273Q4738
14036A938810j55183j78128J09050K72679P0050j46146l9381J56602Q5457j02646
14026B011164l4064K23752K72217M2347j18401j3820J52677J64711Q7601O0277
14016B848461O4416M5389O0853J60565K62969K84004K76726L21796L75465L56690
14006E057334L15789L69546M88252M93022L04033P3132j7835j1664j01725l27824
$$ plain form
14077 1285444 1207871 1006235 933870 996551 1008574 948629 982349 1164818 1365166 1493861
14067 1493861 1598430 1705207 1741500 1667733 1564650 1541496 1625406 1747131 1791627 1706735
14057 1706735 1605425 1662611 1844343 1893132 1708843 1558618 1693948 1931799 1916850 1680935
14047 1680935 1578514 1708629 1798935 1708721 1644245 1743655 1827678 1762632 1725799 1854072 1938810
14036 1938810 1783627 1605499 1714549 1987228 2057278 1911132 1871751 2028353 2113810 2011164
14026 2011164 1977100 2200852 2473069 2515416 2397015 2383195 2535872 2700583 2788184 2848461
14016 2848461 2912877 2958266 3019119 3179684 3442653 3726657 4003383 4325179 4700644 5057334
14006 5057334 5373123 5742669 6230921 6723943 7027976 7101108 7083273 7071609 6969884 6642060
13996F642060n02397m90134m08023m25062m87776m27294k63401j78237k03896
13987C255840j80303o7038m3637j87095k87607j64583K7477L0788j17989j67953
13977B097900n2642M0676j5284j26436j59104j09443m6689j2748j2647j9320J0832
13966A595095N8317K9269q4592j24904J0918J58765R4616j15058k00630r5059
13956A326737L422j5806l1939L2566N6819m0396j33850j04271k5853j890M795
13945A070334L3318L464j00549j12186M8855J64740K3292k07717j98598L6544
13935G61497J66136N4453p1275k5383O3839K2455p0837m4430P0789J08575L9280
13924A075099j5143q54L483m8733q3140k6992P4168J19927P7539r776r3064j39695
$$ plain form
13996 6642060 6139663 5649529 5241506 4816444 4328668 3901374 3637973 3459736 3255840
13987 3255840 3075537 3008499 2964862 2777767 2490160 2325577 2353054 2383842 2265853 2097900
13977 2097900 2045258 2085934 2070650 1944214 1785110 1675667 1628978 1616230 1603583 1584263 1595095
13966 1595095 1653412 1682681 1598089 1473185 1484103 1642868 1737484 1622426 1421796 1326737
13956 1326737 1330159 1314353 1282414 1314980 1371799 1331403 1197553 1093282 1067429 1065539 1070334
13945 1070334 1103652 1107116 1006567 894381 943236 1107976 1131268 923551 724953 761497
13935 761497 927633 982086 910811 885428 949267 971722 900885 856455 927244 1035819 1075099
13924 1075099 1059956 1059102 1062585 1013852 930712 903720 977888 1097815 1175354 1165578 1072514 932819
13912I32819j15905j8787P6751P5545j2374p2252m4190m381k8848o4281l3977
13901F90120R810j8080n1869K6426J37640Q5207r8390j49330p39P1292r9999k51044
13889C51044q8816K08166K36534j2855j61274l3549J31149J09477o974n4357m8564
13878F29981n4046m0330o887l5780r6414k6604J56380J80619n8631k56307j26838
13867B65143J46539J96552L2148l9315N2143O6058q9272j93126r2943O0607Q6555
13856D91089K8272n781l5865q8622p1736N4939J41963O8516l7237K677J09217
13845F57432P2916q0170j13872K2010R3392k9273j33451J431K18901J93231o2798
13834H39749j91943k4854J68119J00406r6985j07519O3922J27966L471o6698M5809
$$ plain form
13912 932819 816914 798127 874878 950423 938049 865797 821607 817226 788378 724097 690120
13901 690120 699930 681850 629981 656407 794047 879254 780864 631534 630795 702087 602088 351044
13889 351044 262228 470394 706928 694073 532799 499250 630399 739876 732902 678545 629981
13878 629981 575935 535605 528718 492938 396524 369920 526300 706919 648288 391981 265143
13867 265143 411682 608234 640382 601067 653210 719268 629996 436870 343927 404534 491089
13856 491089 519361 513580 477715 389093 317357 372296 514259 582775 545538 548215 657432
13845 657432 730348 650178 536306 558316 651708 622435 488984 490415 709316 902547 839749
13834 839749 647806 622952 791071 891477 794492 686973 750895 878861 882332 815634 861443
13823H61443J29509J1400j24772m6369J22200J06910m9476p1523O5751R9877n3827
13812A051123j52888m2923R4682O7404k8893l0613M514m4167j00110l8079M6733
13801H26783j9322j68349j74971j2716J22767J26271P7734K6217p1837j65164
13791E67413j08720O9506J37487J0891q4112L8186K03454J30857j21817k25154
13781F17991n6836J33277R0877j04021j79620l8068J52273J93181P7039m8129
13771H37964o9609j7520Q813k2358m9044j7809L7870N1328K0318J367J7389K7129
13759H25838L095j0870L3339Q9847N7234o6721j37173l6156J43315J87744M7044
13748A136536q5078l7723R5588J02656k6755r0644J3781J37507J07170l0400j00048
$$ plain form
13823 861443 990952 1002352 877580 831211 953411 1060321 1010845 939322 1005073 1104950 1051123
13812 1051123 898235 855312 949994 1017398 988505 957892 962406 918239 818129 780050 826783
13801 826783 807461 639112 464141 451425 574192 700463 778197 804414 732577 567413
13791 567413 458693 528199 665686 676577 592465 630651 834105 964962 843145 617991
13781 617991 561155 694432 785309 681288 501668 463600 615873 809054 886093 837964
13771 837964 768355 750835 759648 737290 688246 670437 708307 759635 779953 781320 798709 825838
13759 825838 828933 818063 851402 941249 998483 931762 794589 758433 901748 1089492 1136536
13748 1136536 1051458 1013735 1109323 1211979 1185224 1094580 1108361 1245868 1353038 1322638 1222590
13737A222590m4701M1384P4316N5771Q379n3024q5953n3518j363j0875o5074o0352
13725A027580K1383O1569j4254j07585r5826k8720m2727j20587r8314O5663J88893
13714H57075J18840m0692q8450j8416J7134j0101K9673J48763J56882l0745j96630
13703I43333j24184N0308M2035j11666r8107J38121K49795K1290k53364j87886
13693F69675J12020K14333J2419j49118k6231J81102J72268k4894j61723j34630
13683H65221l8858L9335Q7367P6988j0836r0707n6691M4189O5136j2216n1274
13672I17654J2811P1602L0732l7598k6263K9249K5823k3952j7585N4026Q1269
13661A117768J1662o2097m2236K8531L6714l1230p1646j5938P2294Q7369K4540
$$ plain form
13737 1222590 1177889 1219273 1293589 1349360 1357739 1304715 1218762 1165244 1163881 1153006 1087932 1027580
13725 1027580 1048963 1110532 1096278 988693 892867 864147 821420 700833 602519 668182 857075
13714 857075 975915 935223 846773 828357 845491 835390 865063 1013826 1170708 1139963 943333
13703 943333 819149 869457 911492 799826 701719 839840 1089635 1110925 857561 669675
13693 669675 781695 996028 1008447 859329 833098 1014200 1186468 1161574 999851 865221
13683 865221 826363 865698 953065 1030053 1019217 928510 871819 916008 981144 968928 917654
13672 917654 930465 1002067 1032799 995201 968938 998187 1024010 1000058 982473 1036499 1117768
13661 1117768 1129430 1067333 1025097 1053628 1090342 1059112 987466 971528 1043822 1131191 1155731
13650A155731k3132j476L3343P764n5064p2471k8480J1206J1641J3255L4724J8688
13638A105729n9479j05364l1237Q0028O6145o7219j30814k1467J25883J35257
13628A097462K7615m8489m1937k0854j3458K9286J10323J50824J05098J6247o1849
13617A350268j06217p9694M0207J59943J29953l2472j14343L6J32465N2197j76107
13606A356236k65798j01226J19854J62818K8892j05669j17507l6696K1374j8231
13596A044047j01937r3201M7307J73701J40026J7208k1980R812m7768j74338j41391
13585H51486R3358K32996O7111j82824j93260k2503M2432j8225J5947J40687R9771
13574A126976j26653k12054j2954J62088M5379j52154j03266R4438J09584o1089
$$ plain form
13650 1155731 1132599 1131123 1164466 1172230 1117166 1044695 1016215 1027421 1039062 1052317 1087041 1105729
13638 1105729 1046250 940886 909649 989677 1055822 988603 857789 836322 962205 1097462
13628 1097462 1125077 1076588 1034651 1013797 1000339 1029625 1139948 1290772 1395870 1412117 1350268
13617 1350268 1244051 1164357 1204564 1364507 1494460 1461988 1347645 1347681 1480146 1532343 1356236
13606 1356236 1090438 989212 1109066 1271884 1300776 1195107 1077600 1040904 1062278 1044047
13596 1044047 942110 848909 896216 1069917 1209943 1227151 1205171 1214983 1167215 992877 851486
13585 851486 944844 1177840 1244951 1062127 868867 846364 888796 870571 886518 1027205 1126976
13574 1126976 1000323 788269 775315 937403 982782 830628 727362 821800 931384 870295
13564H70295j24666j0461M9368l1623n5486O1860J14275j5550j17093n818J46656
13553H81757R4007p4255r3453L4923O7554o4244j53862o2244Q4751J18589N9036
13542H92559K3451L7387L9663J881l8726l6052R120L4280k3419j14131q6521R9844
13530H39336K44685J38050j19103k13455m7286J36518J19271r195n4278k3490
13520A011053m5194j00155n0603R9581J73319P7885n6866n9445O0925J42039P5635
13509A328174o5193j07043K1755J85051J79196j2535j78439j35644M5794J51598
13499A412714R5351j4873m7970J1388Q8336J02840L0112o7138q3529J981Q2303
13488A611515O5407M872L002M5564N0101L0190O6139J30213J00339k9273r9173
$$ plain form
13564 870295 745629 735168 784536 752913 697427 759287 873562 858012 740919 735101 881757
13553 881757 975764 901509 808056 842979 910533 846289 692427 630183 714934 833523 892559
13542 892559 916010 953397 993060 994941 956215 920163 929283 963563 940144 826013 739492 839336
13530 839336 1084021 1222071 1102968 889513 842227 978745 1098016 1088821 1034543 1011053
13520 1011053 965859 865704 815101 914682 1088001 1165886 1109020 1049575 1110500 1252539 1328174
13509 1328174 1262981 1155938 1177693 1362744 1541940 1529405 1350966 1215322 1261116 1412714
13499 1412714 1508065 1493192 1445222 1456610 1544946 1647786 1677898 1610760 1527231 1529212 1611515
13488 1611515 1676922 1681794 1684796 1730360 1780461 1810651 1876790 2007003 2107342 2078069 1978896
13477A978896k410J62655K19687J14282n8144j59601j22405j2873K6863l5367
13467B111583n1604P6739J84959O2011j73507j90332M4829J87482M7636j21918
13457B177878o0541Q1486L9142j01658q0482O6467Q7880k5887m9288N1268P7915
13446B264180L483L0220J77768J93550M786j05554L6417J93651J23294k1940R391
13435B909246J32237J24859M9499R4174J53280j1603k76993k75854j5622Q3532
13425B966755j30483k76558o8234K03471J38202j39848k13746l8736N3809o4202
13415B430430j57312p5214J8463k0015p0089m211O4303r367j33382j28378j0475
13404A904753O9571O4115K4124m1793j15361p5645J26369K84438J76554o7051
$$ plain form
13477 1978896 1976486 2139141 2358828 2473110 2414966 2255365 2132960 2120087 2146950 2111583
13467 2111583 2059979 2136718 2321677 2383688 2210181 2019849 2064678 2252160 2299796 2177878
13457 2177878 2117337 2198823 2237965 2136307 2055825 2122292 2210172 2184285 2134997 2186265 2264180
13446 2264180 2267663 2297883 2475651 2669201 2673987 2568433 2604850 2798501 2921795 2899855 2909246
13435 2909246 3041483 3166342 3215841 3310015 3463295 3451692 3174699 2898845 2883223 2966755
13425 2966755 2836272 2559714 2491480 2694951 2833153 2693305 2479559 2440823 2494632 2430430
13415 2430430 2273118 2197904 2216367 2196352 2126263 2122052 2186355 2176988 2043606 1915228 1904753
13404 1904753 1974324 2038439 2062563 2020770 1905409 1829764 1956133 2240571 2417125 2350074
13394B350074j15717N6759J34950j9486j47292l1057J54997J50806Q619p3173
13384B469480j03846j96010k70154j80773k7075j2647p2613J2587J73555J10930
13374A903434j66888k69626k4531K21785J21628j60227k29646l6743J34617J14236
13364A608039l435q8223j07905o0395K9782O4355j9251j18056q6103M8166J23995
13353A390969P2076l1390r5708q4261l16Q7893P2422m1447j00587l2912K1443
13342A258182m3222q2407M9670J89452R3055j31651j61895J6744R3042l9965j18649
13331A122356K2217J74847J31091J5826K0923O6384j1489j31526j03326L8829
13321A346132R6948K3357n3805o1644l6985N142P1833R3799l572j48317j84090
$$ plain form
13394 2350074 2234357 2291116 2426066 2406580 2259288 2228231 2383228 2534034 2542653 2469480
13384 2469480 2365634 2169624 1899470 1718697 1691622 1678975 1606362 1618949 1792504 1903434
13374 1903434 1736546 1466920 1442389 1664174 1785802 1625575 1395929 1359186 1493803 1608039
13364 1608039 1604604 1516381 1408476 1348081 1377863 1442218 1422967 1304911 1218808 1266974 1390969
13353 1390969 1463045 1431655 1335947 1251686 1251370 1339263 1411685 1370238 1269651 1236739 1258182
13342 1258182 1214960 1132553 1182223 1371675 1464730 1333079 1171184 1187928 1280970 1241005 1122356
13331 1122356 1144573 1319420 1450511 1466337 1487260 1553644 1542155 1410629 1307303 1346132
13321 1346132 1443080 1466437 1412632 1350988 1314003 1319145 1390978 1484777 1481205 1332888 1148798
13310A148798o9010R8252K11429K13847Q9983q2559j44544m2748P1607N6665j1076
13299A540644N665N6954J7437n5527j7992P5611N3624m0996L640J76346K11325
13288B026731K7804j10120k0781R6855J0686j39477p0921J61177K32415N3387
13278B267756j01201k0927J39089J18865n8569j41001j8486J36870J25052k3546
13268B423902j27169j06974m1242N860O1925J17390P2644q1391j60491k5012J69924
13257B309366J59395m0782j51545m7097Q2144N4956l8066l2363L6112L4219j7903
13246B348436N099J01572J39127O2544l9485p1509k3824O0968J16377P0142o4549
13235B704898j41815m1643J38068J72428L726j75619j71397j4783J14997J12680
$$ plain form
13310 1148798 1079788 1178040 1389469 1603316 1693299 1610740 1466196 1423448 1495055 1551720 1540644
13299 1540644 1546309 1603263 1620700 1565173 1547181 1622792 1676416 1635420 1639060 1815406 2026731
13288 2026731 2054535 1944415 1923634 2020489 2031175 1891698 1820777 1981954 2214369 2267756
13278 2267756 2166555 2145628 2284717 2403582 2345013 2204012 2185526 2322396 2447448 2423902
13268 2423902 2296733 2189759 2148517 2154377 2216302 2333692 2406336 2324945 2164454 2139442 2309366
13257 2309366 2468761 2427979 2276434 2229337 2311481 2366437 2328371 2296008 2332120 2366339 2348436
13246 2348436 2353535 2455107 2594234 2656778 2617293 2545784 2521960 2582928 2699305 2769447 2704898
13235 2704898 2563083 2521440 2659508 2831936 2835662 2660043 2488646 2473863 2588860 2701540
13225B701540J9316p5181j20676j07352m4339L3820O8270K4363n2948o7655R609
13214B388767P9812L1186r2436j20900J7716J81220J81493J5201j41802j43471
13204B396786j7348R1203P7637j9334o5371N081R2998O1491o0918j07361j7187
13193B437677P3305M2367m1213n1599p732j4057p3820r7152n4252J366L5122N1980
13181B301992M4851J7504J8446N8149N1750m5783j19850n2061P3486R0585K0041
13170B459110J4467O8819K8225j00382j08617N8961J64826M0003j33306r8903
13160B393203P9575J35977J5989o9640J2462J38149J32257n3j15893j14779j9405
13149B587842P1663P8392J1548m8284n8436o0018q1483o6352K2539R1261L0228
$$ plain form
13225 2701540 2720856 2645675 2524999 2417647 2373308 2407128 2475398 2499761 2446813 2379158 2388767
13214 2388767 2468579 2499765 2407329 2286429 2304145 2485365 2666858 2682059 2540257 2396786
13204 2396786 2379438 2470641 2548278 2528944 2463573 2468654 2561652 2623143 2562225 2454864 2437677
13193 2437677 2510982 2553349 2512136 2460537 2452805 2438748 2364928 2267776 2213524 2214890 2250012 2301992
13181 2301992 2346843 2364347 2382793 2440942 2492692 2446909 2327059 2274998 2348484 2439069 2459110
13170 2459110 2473577 2542396 2570621 2470239 2361622 2420583 2585409 2625412 2492106 2393203
13160 2393203 2472778 2608755 2624744 2555104 2567566 2705715 2837972 2837919 2722026 2607247 2587842
13149 2587842 2659505 2737897 2749445 2701161 2642725 2582707 2501224 2434872 2457411 2548672 2578900
13138B578900r0337q8115N4768J37882L2433j15655r5573N3759J04473j6985j27335
13127B428215p0699N3758N6432n9795j23944n1924O8196J32377J24004N5132n4878
13116B556874j17342l8207J10926J40760K6463l3918N8465J21627k453j51934
13106B671261r0413R5410J24333l7724j60768j36881p9746m0067O2142J78046
13096B585593J24739o8358j21138N4961J79106M3447j52855j39027P003L9471
13086B552942m8953q1621k1483K4672K9240L9696L5216j3410l5197J1084K3029
13075B515215m9483n8244Q0004J63790J9511j54771q5733J02255R3082p2398q8367
13064B464861M8896M2630j31428j48385P6314K00347K9928j58173j00836L8726
$$ plain form
13138 2578900 2488563 2400448 2455216 2593098 2625531 2509876 2414303 2468062 2572535 2555550 2428215
13127 2428215 2357516 2411274 2467706 2407911 2283967 2232043 2300239 2432616 2556620 2611752 2556874
13116 2556874 2439532 2401325 2512251 2653011 2679474 2645556 2704021 2825648 2823195 2671261
13106 2671261 2580848 2676258 2800591 2762867 2602099 2465218 2385472 2345405 2407547 2585593
13096 2585593 2710332 2641974 2520836 2575797 2754903 2798350 2645495 2506468 2513471 2552942
13086 2552942 2503989 2422368 2400885 2425557 2454797 2494493 2529709 2516299 2481102 2492186 2515215
13075 2515215 2465732 2407488 2487492 2651282 2670793 2516022 2430289 2532544 2625626 2553228 2464861
13064 2464861 2513757 2556387 2424959 2276574 2352888 2553235 2583163 2424990 2324154 2362880
13054B362880J7384p1704l8177L5450j1922q4305j2930J05416P3045m9148n6839
13043B269150L1860K5929r4212j60792j08481l6590o495J3674K6704R270K144
13032A972161M0723N4750j1939o7199j9339M1499n216q3030m8803M8476O1776
13021A983859Q627L295J1655o7070j43460m8538J34663J47883k9656j38913n2147
13010A810198N5705K5675m9068j7985R4994J65201J28612J710j33436j45799j934
12999A933873J18748L5820j35259j29381M2542R7597n7183j74020p2536R2901
12989A753102J18648M7584J0624m731m7905n6048J3537O3293K2778k0174N300
12978A906008J5394m8218p7128Q274R2245N5118l0864n2856l6535k3564M0013
$$ plain form
13054 2362880 2380264 2308560 2270383 2305833 2293911 2209606 2196676 2302092 2375137 2325989 2269150
13043 2269150 2301010 2326939 2232727 2071935 1963454 1926864 1920369 1934043 1960747 1970017 1972161
13032 1972161 2012884 2067634 2055695 1988496 1969157 2010656 2005440 1922410 1873607 1922083 1983859
13021 1983859 1992486 1995781 2007436 1940366 1796906 1748368 1883031 2030914 2001258 1862345 1810198
13010 1810198 1865903 1891578 1842510 1824525 1919519 2084720 2213332 2215042 2081606 1935807 1933873
12999 1933873 2052621 2088441 1953182 1823801 1866343 1963940 1906757 1732737 1660201 1753102
12989 1753102 1871750 1919334 1929958 1925227 1877322 1821274 1834811 1898104 1920882 1900708 1906008
12978 1906008 1921402 1873184 1796056 1804330 1896575 1951693 1920829 1867973 1831438 1807874 1847887
12967A847887J32363R0164r6342j62882J9914J71840L5700j66222q7719J40004
12957A924707J21234j18805j70416O1305K10915Q7905l5589N4004J50853M4009
12947B330122r0294k6749Q3658j1870j84860j10933J68350K60157R407k64746
12937B162242k27849K8161J67725P7980m5439l0612M3328J5393q9535j01905K0567
12926B020056J20675P9400k2955o7819p5969r4514m6569J19091K39615J32798
12916B403809q5415j33994R873R5914K1808k7865O3174J41058O8774m2338n2964
12905B461834k2715l8182k2234Q4826J41782K7838j11560p7374N7068Q1366L76
12894B583025j5538M2176K6199n8829m0246R8445J44259n962j58171j04856P0349
$$ plain form
12967 1847887 1980250 2070414 1974072 1811190 1831104 2002944 2038644 1872422 1784703 1924707
12957 1924707 2045941 1927136 1756720 1818025 2028940 2116845 2081256 2135260 2286113 2330122
12947 2330122 2239828 2213079 2296737 2284867 2100007 1989074 2157424 2417581 2426988 2162242
12937 2162242 1934393 1962554 2130279 2208259 2162820 2132208 2175536 2190929 2101394 1999489 2020056
12926 2020056 2140731 2220131 2197176 2129357 2053388 1958874 1912305 2031396 2271011 2403809
12916 2403809 2318394 2184400 2194273 2290187 2311995 2284130 2347304 2488362 2557136 2514798 2461834
12905 2461834 2439119 2400937 2378703 2463529 2605311 2633149 2521589 2444215 2501283 2582649 2583025
12894 2583025 2567487 2609663 2635862 2577033 2536787 2635232 2779491 2773529 2615358 2510502 2580851
12883B580851J26455M877j19103r5345K1699Q8352Q2101J03544J73418J50656
12873C117505m5705k28226j49029J06578J81868l1842k07697p3961J67221J65671
12863C002383l8611j26839k2919N2822M467k3149K6930J8425p5691p7937O3642
12852B803523J31945j1504j76661j32460M6838J23121M3325m6200m4276J2177
12842B749828M7875K4268m3505q0833k9344M6001L3939k9526q388P2255L4942
12831B817512j16124j35324N6013J79195K7676j72851j18080P8852R2516o4670
12821B644715r0764O7339J28164l2605j74380r2965P5385J08884K1425m0674m3356
12810B571168m0984l5702m236K2673J1862j3907l0859m3155k5026N2814J15706
$$ plain form
12883 2580851 2707306 2712183 2593080 2497735 2519434 2607786 2689887 2793431 2966849 3117505
12873 3117505 3071800 2843574 2694545 2801123 2982991 2951149 2743452 2669491 2836712 3002383
12863 3002383 2963772 2836933 2814014 2866836 2871303 2848154 2875084 2893509 2817818 2739881 2803523
12852 2803523 2935468 2923964 2747303 2614843 2661681 2784802 2828127 2781927 2737651 2749828
12842 2749828 2797703 2821971 2778466 2697633 2668289 2714290 2748229 2718703 2710315 2782570 2817512
12831 2817512 2701388 2566064 2622077 2801272 2828948 2656097 2538017 2616869 2709385 2644715
12821 2644715 2553951 2621290 2749454 2716849 2542469 2449504 2524889 2633773 2655198 2614524 2571168
12810 2571168 2530184 2494482 2490246 2512919 2524781 2510874 2480015 2436860 2411834 2464648 2580354
12799B580354M9339r6200j37322m1337J5795m6516p1950M1890J34320N0116q1657
12788B396832p0205J811n9241j81958j31566O5913J32898l722r0060K4775J35897
12777B221374L4162j33267r3530J13029J88807K3882j56421j23937N6782J53185
12767B284066P2045o4152j05741m5834J4592J3127j4277j1549J2416P318m0521
12756B121490r2211j02049m9885M5106J11469P4800k6593m2017Q0044J51246k5486
12745B245914l15034l54312m7375K62763K44609O085j18592n3393L538l4987l7682
12734A801534N1054Q5824j5214j07325n5897M7287N9390K1905M1129O3179j9070
12723A973796j21915p1895Q2099J05596m7851j42452k3097J47213J46556Q272
$$ plain form
12799 2580354 2629693 2533493 2396171 2354834 2370629 2324113 2252163 2294053 2428373 2478489 2396832
12788 2396832 2326627 2328438 2269197 2087239 1955673 2021586 2154484 2150762 2060702 2085477 2221374
12777 2221374 2255536 2122269 2028739 2141768 2330575 2354457 2198036 2074099 2130881 2284066
12767 2284066 2356111 2291959 2186218 2140384 2154976 2168103 2153826 2142277 2154693 2162011 2121490
12756 2121490 2029279 1927230 1877345 1922451 2033920 2108720 2082127 2040110 2120154 2271400 2245914
12745 2245914 1930880 1576568 1529193 1791956 2036565 2042650 1924058 1870665 1874203 1839216 1801534
12734 1801534 1852588 1938412 1923198 1815873 1759976 1807263 1866653 1888558 1929687 1992866 1973796
12723 1973796 1851881 1779986 1862085 1967681 1919830 1777378 1754281 1901494 2048050 2056322
12713B056322r1503j14190j29673j12539Q892J50128J45090K1286k0920O3066
12703A975959Q1461o1384j74856p8931R0490Q2352p7462j28589K9399K09705K25453
12692B173597J09432p944p2221p6196j566J06166J16381j6681j45286j09901L2132
12681B107913Q9053J0102o1773j8104O8678P9656K6484O314L4002K1427o9374
12670B294378j39361q1962M1158N3018q4983j78131n7318J44424J43581p4588
12660B060216j97338k9880K02571J76100n8437j69874m8453O3356k5691j77031
12650A795539j63192K777J28613J12106P935r4732j38903r6877L415Q7814J23734
12639A768229J33357R4299m5109j97791j59831Q1082K38073J05428j17664j19858
$$ plain form
12713 2056322 1964819 1850629 1720956 1608417 1617309 1767437 1912527 1933813 1912893 1975959
12703 1975959 2057420 1996036 1821180 1742249 1832739 1915091 1837629 1709040 1738439 1948144 2173597
12692 2173597 2283029 2275085 2202864 2126668 2125102 2231268 2347649 2330968 2185682 2075781 2107913
12681 2107913 2196966 2207068 2145295 2127191 2195869 2275525 2302009 2308323 2342325 2363752 2294378
12670 2294378 2155017 2073055 2114213 2167231 2082248 1904117 1846799 1991223 2134804 2060216
12660 2060216 1862878 1832998 2035569 2211669 2153232 1983358 1934905 1998261 1972570 1795539
12650 1795539 1632347 1635124 1763737 1875843 1883778 1789046 1650143 1553266 1556681 1644495 1768229
12639 1768229 1901586 1995885 1950776 1752985 1593154 1674236 1912309 2017737 1900073 1780215
12629A780215M4088P1385o8881r2076R7796K18797N9623j83105k10588l6185J16301
12618A797370J50912J19988M3572p2161j28659m8695O9841Q5444K3792r140l0403
12607B001861j00342j29623j856J67196J52018j6719p9054L7009J08226P393p7861
12596B068248L0581J96886J92981M6408n1093n1408m2140k6559N1581J16434L9192
12585B571111r5298m8561J92699L34222J85351n0949p0712J00681J87723R0230
12575C396497j7258j2269j810p9642j19703J3503J90982J73891k2267j44725q0942
12564C296257Q709j1896m9664Q543P9022M3816k1699J7247J02681Q0983j9384
12553C534615l2665N7354J03528O3317N1920J05473J18227O1525L8902O1373R037
$$ plain form
12629 1780215 1824303 1895688 1826807 1734731 1832527 2051324 2110947 1927842 1717254 1681069 1797370
12618 1797370 1948282 2068270 2111842 2039681 1911022 1862327 1932168 2017612 2041404 2032264 2001861
12607 2001861 1901519 1771896 1770040 1937236 2089254 2072535 1993481 2030490 2138716 2146109 2068248
12596 2068248 2098829 2295715 2488696 2535104 2484011 2432603 2390463 2363904 2415485 2531919 2571111
12585 2571111 2475813 2427252 2619951 2954173 3139524 3088575 3017863 3118544 3306267 3396497
12575 3396497 3379239 3366970 3365160 3285518 3165815 3179318 3370300 3544191 3521924 3377199 3296257
12564 3296257 3304966 3293070 3243406 3251949 3330971 3374787 3353088 3370335 3473016 3553999 3534615
12553 3534615 3501950 3559304 3662832 3726149 3778069 3883542 4001769 4063294 4102196 4163569 4172606
12542D172606r3255k7569K37802L85880J97851o3129j2378K67720L43990Q0371
12532E489889j78715j22813J21367K24515Q4315j22841j94919r0557O7069J02540
12522E379850l9275k07221k06343n4187L3654o0271j97511j85828l4495Q3196
12512D511569N9894m4088j07950q9348m1735k0891o488N1707J21180R9881j8090
12501D515641q0103L1133K11528K61573J53402M2489L6684R0050J27705J44534
12491E534636J52627J34808Q1244M332p9872j26833p2479M3880M7502j40881l23985
12480E254979k65107m1895O1924k3080j03285q8438j08398k08461k30663j11144
12470D136432j5275l7864m0222N3796P6530o8840j81336q8790N0069L7251j7379
$$ plain form
12542 4172606 4079351 4051782 4289584 4675464 4873315 4810186 4797808 5065528 5409518 5489889
12532 5489889 5311174 5188361 5309728 5534243 5618558 5495717 5300798 5210241 5277310 5379850
12522 5379850 5340575 5133354 4927011 4872824 4906478 4846207 4648696 4462868 4428373 4511569
12512 4511569 4571463 4527375 4419425 4330077 4288342 4267451 4260963 4312670 4433850 4533731 4515641
12501 4515641 4435538 4466671 4678199 4939772 5093174 5135663 5172347 5262397 5390102 5534636
12491 5534636 5687263 5822071 5903315 5907647 5827775 5700942 5628463 5672343 5719845 5578964 5254979
12480 5254979 4989872 4947977 5009901 4986821 4883536 4795098 4686700 4478239 4247576 4136432
12470 4136432 4121157 4083293 4043071 4096867 4173397 4104557 3923221 3834431 3884500 3921751 3904372
12459C904372N0157R7625n3961j95158j8155L00562L00691k0779j82121J3843
12449D197076J94453O2879j46220j21170J5515j1864j38742j21870q24k1367j88171
12438C719695k40454p3373J01310P7724o5096j00197M1935J90170J36764j00166
12428C688312k56589j32243J16063J42589j11851l14880k01701P1214J93589J36349
12418C330852R3341J18545Q7159k8714r7740n6683P578L4613O6097J03244O2346
12407C720638n8539j17420k4695J09198J20852J4872n7835o453R7705J27013N2957
12396C978293l3143m6413j7346l1728q3729p6393J2322P1121K7339k8029R352
12385C781646P4657M2215m9223n0253M1788O1749n6027j58670j00842M4309J06229
$$ plain form
12459 3904372 3954529 4052154 3998193 3803035 3784880 4085442 4386133 4365354 4183233 4197076
12449 4197076 4391529 4454408 4308188 4187018 4202533 4190669 4051927 3930057 3929233 3907866 3719695
12438 3719695 3479241 3405868 3507178 3584902 3519806 3419609 3461544 3651714 3788478 3688312
12428 3688312 3431723 3299480 3415543 3558132 3446281 3131401 2929700 3000914 3194503 3330852
12418 3330852 3424193 3542738 3629897 3601183 3503443 3446760 3454338 3488951 3555048 3658292 3720638
12407 3720638 3662099 3544679 3519984 3629182 3750034 3764906 3707071 3700618 3798323 3925336 3978293
12396 3978293 3945150 3898737 3881391 3849663 3765934 3689541 3701863 3772984 3800323 3772294 3781646
12385 3781646 3856303 3898518 3849295 3799042 3840830 3902579 3846552 3687882 3587040 3631349 3737578
12374C737578N6404O784J7710L2751R491M500O9614J33953Q5960m1552q2286K3297
12362D054204J14652M5820o9271k3733J30348J35936n0832j66500n6364Q8289
12352D202549P3101J5434P7991J30879j706j47934k6775K34291K44813j5050j47053
12341D640540K5403K08192J63335O7300J25431K00078J07093k0223J9207J18731
12331E655087O4305p7027r5543j5688q240m9457j778O5533j0696j23871k7440
12320E375185J92077J78180j05863k61664p2743J50023P5168j25971q6207J50575
12310E468760K05712l1322k33758j24184J44740K32712P0175r4705n7568Q7524
12300E668086J13232p861o6871O3216K13965J54849m7355r9295R0737K67873J98683
$$ plain form
12374 3737578 3793982 3800766 3818476 3851227 3860718 3865218 3934832 4068785 4154745 4113193 4030907 4054204
12362 4054204 4168856 4214676 4145405 4121672 4252020 4387956 4337124 4170624 4114260 4202549
12352 4202549 4275650 4291084 4369075 4499954 4498248 4350314 4323539 4557830 4802643 4787593 4640540
12341 4640540 4665943 4874135 5037470 5104770 5230201 5430279 5537372 5517149 5536356 5655087
12331 5655087 5719392 5642365 5546822 5531134 5522894 5473437 5471659 5537192 5526496 5402625 5375185
12320 5375185 5567262 5745442 5639579 5377915 5305172 5455195 5530363 5404392 5318185 5468760
12310 5468760 5674472 5643150 5409392 5285208 5429948 5662660 5732835 5638130 5580562 5668086
12300 5668086 5781318 5773457 5706586 5769802 5983767 6138616 6091261 5991966 6082703 6350576 6549259
12289F549259K640l4152J39537K97429K51363N9928q3459o7036N4542J34444Q6096
12278G390591j7471l1313N7228R4616j1838j32379r2302O2611J25075K1549j06598
12267G359769j28668q0360m3231n880O0807R1012J0798j07993j04348N5732K17622
12256G325260K25913J02498j0876l3028M368N9481J42670K44859K79360J74042
12246H514547l815r8121n0873L3189L8400j4798l2547k579K670l7198m9450M378
12234H303803M3476j7249j16030j07481K1738J05221K1301j19443j17408K5822
12224H043750R8905j5523j68458j61179k3341N6663J3988l6090j2467J9387p226
12213G808409l5967R162Q6756R9289M3864J6320P7683J75080K01011J10547j9212
$$ plain form
12289 6549259 6551899 6517747 6657284 6954713 7206076 7266004 7182545 7115509 7170051 7304495 7390591
12278 7390591 7373120 7341807 7399035 7493651 7481813 7349434 7257132 7319743 7444818 7466367 7359769
12267 7359769 7231101 7150741 7107510 7101630 7162437 7253449 7264247 7156254 7051906 7107638 7325260
12256 7325260 7551173 7653671 7642795 7609767 7614135 7673616 7816286 8061145 8340505 8514547
12246 8514547 8510732 8412611 8361738 8394927 8433327 8418529 8385982 8383403 8386073 8348875 8299425 8303803
12234 8303803 8347279 8330030 8214000 8106519 8128257 8233478 8254779 8135336 8017928 8043750
12224 8043750 8142655 8127132 7958674 7797495 7774154 7830817 7844805 7808715 7796248 7815635 7808409
12213 7808409 7772442 7781604 7868360 7967649 8011513 8027833 8105516 8280596 8481607 8592154 8572942
12202H572942n7995K2982R5578L7141q5416j04213j3954M576j28366k41625j62686
12191G938964J1706N0273q3207k00613j64271m0915K8504p018r7125j53688j10849
12180G171761Q292Q6959M2586o0675j01327o6938l4518k1021K2040Q1440Q6676
12169G215275M6830M6869R1589R3834M3382L4534Q1918P4221j5705m4383O9369
12158G737733J84243J49743L7367p025j2281q2423j53412r1026K4666k2265k18729
12147G546591l03755j70113k4174l9266j00400n5974N860m6662j05789j1161J11955
12136F807112J6840k21701k68391n4878R5407k1591j75454r0497J20343J70514
12126F377704N0826k8222j7684m5585j11262o8917Q1386J62275J11695N6252N2330
$$ plain form
12202 8572942 8514947 8537929 8633507 8670648 8585232 8481019 8467065 8471641 8343275 8101650 7938964
12191 7938964 7950670 8000943 7917736 7717123 7552852 7511937 7540441 7533423 7436298 7282610 7171761
12180 7171761 7180053 7267012 7309598 7248923 7147596 7080658 7046140 7025119 7047159 7128599 7215275
12169 7215275 7262105 7308974 7400563 7494397 7537779 7572313 7654231 7728452 7712747 7668364 7737733
12158 7737733 7921976 8071719 8109086 8102061 8089780 8007357 7853945 7762919 7787585 7765320 7546591
12147 7546591 7242836 7072723 7048549 7009283 6908883 6852909 6858769 6812107 6706318 6695157 6807112
12136 6807112 6823952 6602251 6333860 6278982 6374389 6352798 6177344 6086847 6207190 6377704
12126 6377704 6428530 6400308 6382624 6337039 6225777 6156860 6238246 6400521 6512216 6568468 6620798
12115F620798P269q4804r2043j2805k2991j43891j50663K9532J27477l4929k06687
12104F036263r7176J40430J61870k2814j34710j12733j10266j07125L7974J95821
12094E987534R1663j67662j76316Q9345J84316n6544k16042r507K12717P2841
12084F012345j71649p6825K14938K27081l4795j22882P3249J80479K1683j07522
12074F216102R054J54905R9856j8849P755R4712O5214k2205j6500M0120K4050
12063F654214j6741L4445J19305R9965J7396K4577J09893J10509q605r7194o7951
12052F979813j6068k7740k8896O6002J63791J00439q7285j53202K5411K22722
12042G244987J28055j99840l49896j05366K34177K58923J3382j14505J3549J28452
$$ plain form
12115 6620798 6628067 6543263 6451220 6438415 6415424 6271533 6120870 6150402 6277879 6242950 6036263
12104 6036263 5939087 6079517 6241387 6218573 6083863 5971130 5860864 5753739 5791713 5987534
12094 5987534 6079197 5911535 5735219 5824564 6008880 5952336 5736294 5726787 5939504 6012345
12084 6012345 5840696 5763871 5978809 6205890 6171095 6048213 6121462 6301941 6323624 6216102
12074 6216102 6225156 6380061 6479917 6461068 6468823 6563535 6628749 6606544 6590044 6630164 6654214
12063 6654214 6637473 6671918 6791223 6891188 6908584 6933161 7043054 7153563 7144958 7047764 6979813
12052 6979813 6963745 6936005 6907109 6973111 7136902 7237341 7150056 6996854 7022265 7244987
12042 7244987 7373042 7173202 6823306 6717940 6952117 7211040 7224422 7109917 7123466 7251918
12032G251918J9868j54170j51829Q208J50917K00243J66125M2094j17010j58798
12022G257566l8598P0827L1968l8244J9138J16482O4255r8974j58496n4338N7316
12011G228902N4968j9752p4489n8476L3331J25941R5093m5867r4954M9065J82538
12000G476300R1923q7848q4957N4177N6647r0514j22105K1889Q0198o9534j94974
11989G131202j05116N4749Q5363L2960J3296j1547p6493o4780P2343J60068P6113
11978G368158k7745R88M1848m9349j41015p0584J9655o4748j63565r262K47096
11967G151477K11268r5583k29884k8735J51076M3706j19170n6529Q6342L4807
11957G148775j25311j21246K2450M5031q8858j42629k3064P3676L323r9061n7965
$$ plain form
12032 7251918 7271786 7117616 6965787 6973995 7124912 7325155 7491280 7533374 7416364 7257566
12022 7257566 7218968 7289795 7321763 7283519 7302657 7419139 7483394 7384420 7225924 7171586 7228902
12011 7228902 7283870 7264118 7189629 7131153 7164484 7290425 7385518 7339651 7244697 7293762 7476300
12000 7476300 7568223 7480375 7395418 7449595 7506242 7415728 7293623 7315512 7395710 7326176 7131202
11989 7131202 7026086 7080835 7166198 7199158 7212454 7200907 7124414 7059634 7131977 7292045 7368158
11978 7368158 7340413 7341401 7383249 7333900 7192885 7122301 7141956 7077208 6913643 6904381 7151477
11967 7151477 7362745 7267162 7037278 7008543 7159619 7203325 7084155 7027626 7113968 7148775
11957 7148775 7023464 6902218 6924668 6969699 6880841 6738212 6715148 6788824 6792147 6693086 6635121
11946F635121O5751R0302q281q5294m7727M4518R5997R0141N3776j2242r7142
11935F824920j18551O52J77992K02442K71k11849j68150Q8052K42989J26604p4848
11924G090524r6904N5715J68142J24968P039p7058j01916o5005M5078J78694K30237
11913G559514J68805Q3663M6366R597q0479j46923p7452P3115J17588J463j04024
11902G651233n4895M0860j0996j81492k55683j57845m2775k8861m0726m461k494
11891F911865q9303j27031O93J47350J04347n3534p8427M7289R2705l4257j55647
11880F766050j35118o8575p3203j07669j06529r7007q2703k821R8653O8489r0015
11869F169552j70116r6875n7154j41270j38841P6243K33559N8461k39785k46014
$$ plain form
11946 6635121 6700872 6791174 6782893 6697599 6649872 6694390 6790387 6880528 6934304 6922062 6824920
11935 6824920 6706369 6707021 6885013 7087455 7087726 6875877 6707727 6795779 7038768 7165372 7090524
11924 7090524 6993620 7049335 7217477 7342445 7349484 7272426 7170510 7105505 7150583 7329277 7559514
11913 7559514 7728319 7811982 7858348 7867945 7787466 7640543 7563091 7636206 7753794 7755257 7651233
11902 7651233 7596338 7637198 7626202 7444710 7189027 7031182 6988407 6959546 6918820 6914359 6911865
11891 6911865 6822562 6695531 6696224 6843574 6947921 6894387 6815960 6863249 6955954 6921697 6766050
11880 6766050 6630932 6562357 6489154 6381485 6274956 6177949 6095246 6092425 6191078 6259567 6169552
11869 6169552 5999436 5902561 5845407 5704137 5565296 5641539 5875098 5933559 5693774 5447760
11859E447760L2586K07131J08563m2571o7972n8920j04527j18149m3056K5320
11849E386165K0716l196k5596r0463j43567o5369Q8848J18560l300q5358m3043
11838E154397q827n1645n7528K2077P0124M4010M5380O6174l3102j95705j61871
11827D893484P8330J96011N8843m7692M1235N6324j60407k56783L6627L32329
11817E228301J63017k07543j99541J02273J15744k02168k72622Q6166L24128P8191
11807E215946k50121j88140R1645J61995J6133p4805n7054m6029k9262K9497M401
11796D874206j59228k40161p4580J23118Q7632o2744n7142N8941N3495n1549n3763
11785D498225K7406L541r8843p8378N5308Q9579j1904p1751l5108k0089l5595
$$ plain form
11859 5447760 5480346 5687477 5796040 5753469 5685497 5626577 5522050 5403901 5360845 5386165
11849 5386165 5406881 5403685 5378089 5287626 5144059 5078690 5167538 5286098 5282798 5197440 5154397
11838 5154397 5145570 5093925 5036397 5058474 5128598 5172608 5217988 5284162 5251060 5055355 4893484
11827 4893484 4971814 5167825 5226668 5178976 5220211 5276535 5116128 4859345 4895972 5228301
11817 5228301 5391318 5183775 4984234 5086507 5202251 5000083 4727461 4813627 5137755 5215946
11807 5215946 4965825 4777685 4869330 5031325 5047458 4972653 4915599 4869570 4840308 4869805 4874206
11796 4874206 4714978 4474817 4400237 4523355 4610987 4548243 4491101 4550042 4603537 4551988 4498225
11785 4498225 4525631 4529172 4430329 4351951 4407259 4496838 4484934 4413183 4378075 4357986 4322391
11774D322391K3581R5618Q599j57624j26849R6768J78581j2563j86281j05316
11764D136905O6016R1885L1977L5838L7583p3104j84788j39284r730M3588M3542
11753D080428Q0544Q0597m4487j48888m9027J27007R7054j16430k03533m8781
11743C854484J15662J01660K0180K5021M9895k7610j37648j20922K3091J50903
11733D054716J74898J20014L3527m3107n1577K1849Q6918N4549j9504o582Q7377
11722D513078J15605K2621m9583K7992J60303J54807j5j28863j27339p2464n1180
11711D564962l4577Q801J9414l0865n0615J3027M9036l3946j13755l2750J24446
11700D483178J50883M5553k3656l4933j04630j78251n9925J94384K58963M1217
$$ plain form
11774 4322391 4345972 4441590 4450189 4292565 4165716 4262484 4441065 4428502 4242221 4136905
11764 4136905 4202921 4294806 4326783 4362621 4400204 4327100 4142312 4003028 3993298 4036886 4080428
11753 4080428 4160972 4241569 4197082 4048194 3999167 4126174 4223228 4106798 3903265 3854484
11743 3854484 3970146 4071806 4091986 4117007 4166902 4139292 4001644 3880722 3903813 4054716
11733 4054716 4229614 4349628 4383155 4340048 4288471 4310320 4397238 4451787 4432283 4425701 4513078
11722 4513078 4628683 4651304 4601721 4629713 4790016 4944823 4944808 4815945 4688606 4616142 4564962
11711 4564962 4530385 4539186 4558600 4527735 4477120 4490147 4539183 4505237 4391482 4358732 4483178
11700 4483178 4634061 4679614 4655958 4621025 4516395 4338144 4278219 4472603 4731566 4772783
11690D772783j33204k4620J54661J28116Q957M6012J61223J16266k5596O85J88108
11679E393391K64894J46984L2231L7966P0097P9954J46543K58078K89016K39598
11669F958752K41410K97606K77998J84858J44494J32639K3624q4196L5665K77532
11659H490382K59787n6137k48620j09379K6416j21927l07714k32651q5330j74544
11649G440283l62581l38959j89765j94664k72398j57158L2526l8787k76795k55834
11639E385868M7146J94167K5650j09136K26R3471k7485j34700k3513J10949N8382
11628E621025k7244M2301J26475O3654K0243J65084K90907J64401o043J03047
11618F563850L44732L23342O2937m5120R7819J86144P2944k9241R174K7271o4755
$$ plain form
11690 4772783 4639579 4614959 4769620 4897736 4906693 4952705 5113928 5230194 5204598 5205283 5393391
11679 5393391 5658285 5805269 5837500 5875466 5945563 6025517 6172060 6430138 6719154 6958752
11669 6958752 7200162 7497768 7775766 7960624 8105118 8237757 8261381 8177185 8212850 8490382
11659 8490382 8750169 8694032 8445412 8336033 8362449 8240522 7932808 7700157 7614827 7440283
11649 7440283 7077702 6738743 6548978 6354314 6081916 5924758 5957284 5918497 5641702 5385868
11639 5385868 5433014 5627181 5652831 5543695 5543921 5637392 5609907 5475207 5451694 5562643 5621025
11628 5621025 5593781 5636082 5762557 5826211 5846454 6011538 6302445 6466846 6460803 6563850
11618 6563850 6908582 7231924 7294861 7249741 7347560 7533704 7606648 7577407 7586581 7613852 7549097
11607G549097j11023n2542p9904k60326l50306j95462j2673l4568j45567j31356
11597F175370m5811m5465p0611J371N9167n8158k11770j42749Q1165J51618K0455
11586E914582m4992O5953J38133L3946o3048K1919J50589J10330m1506r6618k1132
11575F168156N6586R0122J36781J90695J92477J80257K43382L26516K67947P0956
11565G923875m4050N2482J90072J33504p3916j77543r2305k1312j27159k57802
11555G505846j69633O7872J24728j07141l22566k30544K6730J08350q468m6936
11545F948238P7187J28682o933r9059K3793J44743J5898j85124j14118J57855
11535G091162K23465k0273k14602j11791O5841K8022j26437j17951N1863J36261
$$ plain form
11607 7549097 7438074 7385532 7305628 7045302 6694996 6499534 6486861 6452293 6306726 6175370
11597 6175370 6129559 6084094 6013483 6014854 6074021 6015863 5804093 5661344 5742509 5894127 5914582
11586 5914582 5869590 5935543 6073676 6107622 6044574 6066493 6217082 6327412 6285906 6189288 6168156
11575 6168156 6224742 6314864 6451645 6642340 6834817 7015074 7258456 7584972 7852919 7923875
11565 7923875 7879825 7932307 8122379 8255883 8181967 8004424 7912119 7890807 7763648 7505846
11555 7505846 7336213 7404085 7528813 7421672 7099106 6868562 6895292 7003642 6995174 6948238
11545 6948238 7025425 7154107 7147174 7048115 7071908 7216651 7232549 7047425 6933307 7091162
11535 7091162 7314627 7294354 7079752 6967961 7033802 7061824 6935387 6817436 6869299 7005560
11525G005560M2905o6865n6008K2755N8204K5952k2763k0106O9245J85106J95971
11514G439956O8282m6484L089J55907K30993J75797Q3200O501q1391j58556j46462
11503G730832n2124J5992j429n5388q2739n4186M8359J75545J73584k5634k13490
11492G659322j26156J45077K33057L9432j03628M0187K30215J47854p6949q5738
11482H102673J15007J77876j903j27837j0863J27907N0767r4943l9321J39981
11472H439344J28731j14737k75880j50718P1144J14317O451k4793P6411J39601
11462H409871N8783o1359r1706m8892k771M8877J08379R8186j2203r0944j5416
11451H400805J07644Q1836n3331n7366J27540K59556J55589m1060r2275O662J00200
$$ plain form
11525 7005560 7048465 6981600 6925592 6948347 7006551 7032503 7009740 6989634 7058879 7243985 7439956
11514 7439956 7508238 7461754 7464843 7620750 7851743 8027540 8110740 8117241 8035850 7877294 7730832
11503 7730832 7678708 7694700 7693271 7637883 7555144 7500958 7549317 7724862 7898446 7872812 7659322
11492 7659322 7533166 7678243 7911300 7950732 7847104 7887291 8117506 8265360 8188411 8102673
11482 8102673 8217680 8395556 8393653 8265816 8254953 8382860 8433627 8338684 8299363 8439344
11472 8439344 8568075 8453338 8177458 8026740 8097884 8212201 8218652 8193859 8270270 8409871
11462 8409871 8468654 8407295 8315589 8266697 8263926 8312803 8421182 8519368 8507165 8416221 8400805
11451 8400805 8508449 8590285 8536954 8479588 8607128 8866684 9022273 8981213 8888938 8895600 8995800
11440H995800J36011J61490J57609Q5434L7994J31957K73495K48755N9929m3285
11430A0245189P5875K47673K62316J63001J33445K07428K52314J97797J33127
11421A1918165J57140K32868K47855J79087J34835K10867L44347L79469K84098
11412A4088731K10208K81409M11606M44580M05787M59437O31819P51436P11846
11403A8396859O40397P09681Q89202R96858R31890P44359N05451K23705r0870
11394B3947532l66967n39378o45563p82030r41911r69204p64049m93465m46387
11385A7998578o44786p70202n88936k88992k09211l57893m47406l45617k11622
11376A4133913j72131j51231j02236j34996k69842l04414j15516R8336R0009o8119
$$ plain form
11440 8995800 9131811 9293301 9450910 9536344 9574338 9706295 9979790 10228545 10288474 10245189
11430 10245189 10321064 10568737 10831053 10994054 11127499 11334927 11587241 11785038 11918165
11421 11918165 12075305 12308173 12556028 12735115 12869950 13080817 13425164 13804633 14088731
11412 14088731 14298939 14580348 14991954 15436534 15842321 16301758 16933577 17685013 18396859
11403 18396859 19037256 19746937 20636139 21632997 22564887 23309246 23814697 24038402 23947532
11394 23947532 23580565 23041187 22395624 21613594 20671683 19702479 18938430 18444965 17998578
11385 17998578 17353792 16583590 15994654 15705662 15496451 15138558 14691152 14345535 14133913
11376 14133913 13961782 13810551 13708315 13573319 13303477 12999063 12883547 12981883 13071892 13003773
11366A3003773j15855J713J08285J03025O3069N4661M6676K6565L0974M0117j0803
11355A3352200r9002j29459r2330o9022p5522m6849Q291k234p2836p3299L4395
11344A2734333J11555O3304p747J5842P1648N8149N0237J76283L51511L63333
11334A3988448K14857J41573K27616K54467P7252p9965M3121K72330J98135j87321
11324A5150513m15100j99368J58474K25124K3232j08213m2976O0188R8943J19226
11314A5070043J17629N3903L2476J73316L23855K26318k5483o1776J77666L25379
11304A6413326J75368o242M3166J71680J42009M2517O2175J30112J00501O0314
11294A7334926J31539J86627Q9373N017J21956K72291K08399O2266J12183K62009
$$ plain form
11366 13003773 12887918 12889631 12997916 13100941 13164010 13218671 13265347 13291912 13322886 13363003 13352200
11355 13352200 13253198 13123739 13031409 12962387 12886865 12840016 12848307 12846073 12773237 12699938 12734333
11344 12734333 12845888 12909192 12901445 12917287 12988935 13047084 13097321 13273604 13625115 13988448
11334 13988448 14203305 14344878 14572494 14826961 14904213 14824248 14867369 15139699 15337834 15150513
11324 15150513 14735413 14536045 14694519 14919643 14942875 14834662 14791686 14851874 14950817 15070043
11314 15070043 15187672 15241575 15274051 15447367 15771222 15997540 15972057 15910281 16087947 16413326
11304 16413326 16588694 16582452 16625618 16797298 16939307 16981824 17043999 17174111 17274612 17334926
11294 17334926 17466465 17653092 17742465 17747482 17869438 18141729 18350128 18412394 18524577 18786586
11284A8786586K11530K0792J9587K25183L38582K90055K99664L94828L62757K15223
11274B1164787K02553L09905K54851P0874J42606N08613O93399M72065K63133
11265B4082786M44262P63442Q05966O33902N56658N95306N68896M56426L32262
11256B9239906J71243l299k9551R4685J24110M091K6362K84707M12121K07234
11246C0531609N7731K91172N59753M26454J54628K59416N94695O10417L09463
11237C3795338J98141L83020M60829L07397K63669M56113N93340N65733O26203
11228C7649783Q16591Q17109N72705M93924P72331J022375R10161O71528O66206
11219D4392713Q12671Q20949O76631N61098N28576N39733O12672P20816P38153
$$ plain form
11284 18786586 18998116 19018908 19038495 19263678 19602260 19892315 20191979 20586807 20949564 21164787
11274 21164787 21367340 21677245 21932096 22002970 22145576 22654189 23347588 23819653 24082786
11265 24082786 24527048 25290490 26096456 26730358 27287016 27882322 28451218 28907644 29239906
11256 29239906 29411149 29407850 29378299 29472984 29597094 29601185 29627547 29912254 30324375 30531609
11246 30531609 30589340 30880512 31440265 31866719 32021347 32280763 32875458 33485875 33795338
11237 33795338 33993479 34376499 34837328 35144725 35408394 35864507 36457847 37023580 37649783
11228 37649783 38466374 39283483 39856188 40350112 41122443 42144818 43054979 43726507 44392713
11219 44392713 45205384 46026333 46702964 47264062 47792638 48332371 48945043 49665859 50404012
11210E0404012O57705O53112P85218Q86786Q65657Q56995R41265R90011R34476
11201E7975237R05335R59501R55632Q51704Q33364R85988J127745J130598J121929
11192F6847033J211408J306981J350896J437124J551234J519484J369709J394476
11184G7988345J676327J904620J870312J795921J944440K220941K397894K457867
11176I4256667K514584K649839K955928L459333L944720M195399M403177M899008
11168A23278655N523461N845344N970143O406821P116584P552737P735526Q312634
11160A77741905R402310J0502087J1756768J3955030J6919595J9569339K2165692
11153B82012726K6345104L1627849L4239777L1660419K6311249K1685443J6438154
$$ plain form
11210 50404012 51061717 51714829 52500047 53386833 54252490 55109485 56050750 57040761 57975237
11201 57975237 58880572 59840073 60795705 61647409 62480773 63466761 64594506 65725104 66847033
11192 66847033 68058441 69365422 70716318 72153442 73704676 75224160 76593869 77988345
11184 77988345 79664672 81569292 83439604 85235525 87179965 89400906 91798800 94256667
11176 94256667 96771251 99421090 102377018 105836351 109781071 113976470 118379647 123278655
11168 123278655 128802116 134647460 140617603 147024424 154141008 161693745 169429271 177741905
11160 177741905 187144215 197646302 209403070 223358100 240277695 259847034 282012726
11153 282012726 308357830 339985679 374225456 405885875 432197124 453882567 470320721
11146D70320721O419778p816446k0082215k6270230k8941647l2056231l4694047
11139C26879683l3343820k8087420k2661679j9253140j6690813j3761035j1231955
11132A81849821r874302q886921p410046n963950n327846n176919m787770m225757
11124A30196310l979451m026864l978888l739269l479529l251020k999614k734124
11116A02007551k454003k127000j830246j663350j523258j266019j028460j028856
11108H9086359j140817j076098q81498p97143p46930m95986k06663k45573m88658
11099H3006993m41244n9536J77712Q2926K0183K23600M46143M72574M59616N65788
11089H4954755O94060P75695R06030J071579J128675J133909J308488J634915
$$ plain form
11146 470320721 476740499 468924053 448841838 422571608 393629961 361573730 326879683
11139 326879683 293535863 265448443 242786764 223533624 206842811 193081776 181849821
11132 181849821 171975519 163088598 155678552 149714602 144386756 139209837 134422067 130196310
11124 130196310 126216859 122189995 118211107 114471838 110992309 107741289 104741675 102007551
11116 102007551 99553548 97426548 95596302 93932952 92409694 91143675 90115215 89086359
11108 89086359 87945542 86869444 85987946 85190803 84443873 83947887 83741224 83495651 83006993
11099 83006993 82565749 82506213 82683925 82766851 82787034 83010634 83456777 83929351 84388967 84954755
11089 84954755 85648815 86424510 87330540 88402119 89530794 90664703 91973191 93608106
11081I3608106J886989K057086K329660K669881K898782L110418L517821L981392
11073A16060135M230304M422594M891866N504493N928469O337630P125669Q195135
11065A62696295R337043J0895097J3058746J5120712J6814094J9531730K3982450
11058B71436167K7226773K5299753J9240300J4755436J4068451J1836572K606020
11051C86469472j0501429j9195905k0845764k0854185k3890986k7692325k7670008
11044B35818870k3794530j9681971j7164409j5127823j2708474j0625756r392412
11037A27323495q458114p451166o699950o259722n670355m892993m430179m337158
11029G9123858m054187l395210k847558k691860k590266k267723j926582j756214
$$ plain form
11081 93608106 95495095 97552181 99881841 102551722 105450504 108560922 112078743 116060135
11073 116060135 120290439 124713033 129604899 135109392 141037861 147375491 154501160 162696295
11065 162696295 172033338 182928435 195987181 211107893 227921987 247453717 271436167
11058 271436167 298662940 323962693 343202993 357958429 372026880 383863452 386469472
11051 386469472 375968043 356772138 335926374 315072189 291181203 263488878 235818870
11044 235818870 212024340 192342369 175177960 160050137 147341663 136715907 127323495
11037 127323495 118865381 111414215 104714265 98454543 92784188 87891195 83461016 79123858
11029 79123858 75069671 71674461 68826903 66135043 63544777 61277054 59350472 57594258
11021E7594258j619659j445482j407559j510599j470999j206123j013422j079295
11013D6841120j203829j185599j109055j079335j017784q92056q34732q75081
11005C8643649q50179p26014p05268q60793r56711q11155n71594m51655m39874
10996C2270406m42648m73292n15535m36043k33327j46810k97451m38089l17775
10987B8969436r8373j05704l12223m08149l13220k56271l28856l14213q2581J41659
10977B6891505J12853m2102p193K55567M71296M59085L40509K89532K69422J37356
10967B9177830j14854l65015n42057o72350p72131q16347q19507q42386q90372
10958B3342811q84009p65899n85711m52546m31663m89977n20782m47325l28024
$$ plain form
11021 57594258 55974599 54529117 53121558 51610959 50139960 48933837 47920415 46841120
11013 46841120 45637291 44451692 43342637 42263302 41245518 40353462 39518730 38643649
11005 38643649 37793470 37067456 36362188 35501395 34544684 33733529 33161935 32710280 32270406
10996 32270406 31827758 31354466 30838931 30402888 30169561 30022751 29725300 29287211 28969436
10987 28969436 28871063 28765359 28453136 28044987 27731767 27475496 27146640 26832427 26749846 26891505
10977 26891505 27004358 26962256 26955063 27210630 27681926 28141011 28481520 28771052 29040474 29177830
10967 29177830 29062976 28697961 28155904 27483554 26711423 25895076 25075569 24233183 23342811
10958 23342811 22458802 21692903 21107192 20654646 20222983 19733006 19212224 18764899 18436875
10949A8436875l00691l77112l89914k41478r7165j65607l66521m30144k94884
10940A5773359j71272j96585k68187k76744k65915k66315j99469p2704n5071k04254
10930A3796843l12376k03779j9428o126j54468k50974j98204r2733m5453q2648
10920A2430654j76699k55096k38645j55277j21459j47511j15010k5767n9367k46879
10910A0888944l26743j32000J06280J00551n4431q5539k423n659p0992j2585J11442
10899A0516845N5391j60920k40937r4699K9096k6705j05355o0331M367l3870r7320
10888I785562p3751l20M3847N3159J2151j21899k74468k81230j38332l6835p3691
10877H894193j23239p6039r466k7096j02246j64458j86039j34088l557Q1702k845
$$ plain form
10949 18436875 18136184 17759072 17369158 17127680 17030515 16864908 16498387 16068243 15773359
10940 15773359 15602087 15405502 15137315 14860571 14594656 14328341 14128872 14056168 14001097 13796843
10930 13796843 13484467 13280688 13261260 13255134 13100666 12849692 12651488 12558755 12513302 12430654
10920 12430654 12253955 11998859 11760214 11604937 11483478 11335967 11220957 11195190 11135823 10888944
10910 10888944 10562201 10430201 10536481 10637032 10582601 10497062 10494639 10488980 10417988 10405403 10516845
10899 10516845 10572236 10411316 10170379 10075680 10104776 10078071 9972716 9912385 9916752 9882882 9785562
10888 9785562 9711811 9711491 9755338 9808497 9820648 9698749 9424281 9143051 9004719 8967884 8894193
10877 8894193 8770954 8694915 8685449 8658353 8556107 8391649 8205610 8071522 8067965 8149667 8146822
10866H146822j48155j36138O496N7828J741L4010J32871L5236k42379l01340M717
10855G591709K57688R7963k20895k64030p4799J1317m9216n8207k5933j14892
10845G150705k40285j62202O9737J59827L5939q7350j02815j09881j15226J343
10835F599792J74803J59241o5467k08399j05959M1141J2355j04329j05046J833
10825F399965M8677k6879j29570j58714j05861l3429j0120m1618o2204l4129j5845
10814E830273n8280r1135k5333P7110O9134o4883j82447j68576n2987M5752K8383
10803E407011q9799j51520k4849J61983J27888j33180k67991p7228J47412O9048
10793E168775j53082j36814Q1676J19081j06992k48085q6044J64755K14265M7386
$$ plain form
10866 8146822 7998667 7862529 7869025 7926853 7928594 7962604 8095475 8130711 7888332 7586992 7591709
10855 7591709 7849397 7947360 7726465 7462435 7387636 7398953 7349737 7291530 7265597 7150705
10845 7150705 6910420 6748218 6817955 6977782 7013721 6926371 6823556 6713675 6598449 6599792
10835 6599792 6774595 6933836 6868369 6659970 6554011 6595152 6607507 6503178 6398132 6399965
10825 6399965 6448642 6421763 6292193 6133479 6027618 5994189 5984069 5942451 5880247 5846118 5830273
10814 5830273 5771993 5680858 5655525 5732635 5801769 5736886 5554439 5385863 5332876 5378628 5407011
10803 5407011 5317212 5165692 5140843 5302826 5430714 5297534 5029543 4952315 5099727 5168775
10793 5168775 5015693 4878879 4960555 5079636 4972644 4724559 4638515 4803270 5017535 5064921
10783E064921j69959k78518j73909Q6485K22789M4917k09430j64587J14960K22470
10773D760139N8774o8487k4735k8117j44363j20599R1213J55146n4177j75182
10763D449612J2398J69036q565k28263j08507J45092J04001j39007j59135N9999
10753D296661J42786j4566j26448m9025L8477J3259k8082k6029l8457m0123N3558
10742D222011J59806J14794k9823p9664k9590l0017p1594j9502P9801N6470m7547
10731D325145l6625O9436P0029l1171l8886M2496J4343j06606r0012N5086N8027
10720D331262j00195j01738J33891K41160j486k83636k48085j3593J00478P7222
10710D135280R2685J32777O5875m9628m3819O6342J11308L7567n5296q1473k5409
$$ plain form
10783 5064921 4894962 4616444 4442535 4529020 4751809 4796726 4587296 4422709 4537669 4760139
10773 4760139 4818913 4750426 4725691 4697574 4553211 4432612 4523825 4678971 4624794 4449612
10763 4449612 4462010 4631046 4622481 4394218 4285711 4430803 4534804 4395797 4236662 4296661
10753 4296661 4439447 4424881 4298433 4249408 4287885 4301144 4273062 4247033 4208576 4168453 4222011
10742 4222011 4381817 4496611 4466788 4387124 4357534 4327517 4255923 4236421 4316222 4372692 4325145
10731 4325145 4288520 4357956 4427985 4396814 4357928 4400424 4414767 4308161 4218149 4273235 4331262
10720 4331262 4231067 4129329 4263220 4504380 4502894 4219258 3971173 3957580 4058058 4135280
10710 4135280 4227965 4360742 4426617 4376989 4333170 4399512 4510820 4548387 4493091 4411618 4386209
10699D386209Q4032J49484Q0118k6656L5341K26411K37514k6601k26251q2548
10689D837053J80198J95766K3704j7147Q7744P2404r4793j43828K1437J56634
10679E319172Q1408o0002p2710J114J5888l4766m9033K1721J37922K16237J68129
10668E745080q881j58869j06135J05930K38919J61500O079l1440N9810J33161
10658F145154R1149j0056m4078L2391J17347Q0488n0812r7650K7052J74632J62569
10647F628186L9060J746R9028J79808J43779P9727J02930J79867J91968J01675
10637G747774j0946m2325M0896J76990K56957K12938O9473q9161j83653j78267
10627H000676j01185l4387l6505p7425j04139j38455k08008k24230r8576L8625
$$ plain form
10699 4386209 4470241 4619725 4699843 4673187 4708528 4934939 5172453 5145852 4919601 4837053
10689 4837053 5017251 5213017 5236721 5219574 5307318 5379722 5284929 5141101 5162538 5319172
10679 5319172 5400580 5340578 5267868 5268982 5284870 5250104 5201071 5222792 5360714 5576951 5745080
10668 5745080 5736199 5577330 5471195 5577125 5816044 5977544 5983623 5952183 6011993 6145154
10658 6145154 6236303 6226247 6182169 6214560 6331907 6412395 6361583 6263933 6290985 6465617 6628186
10647 6628186 6667246 6668992 6768020 6947828 7091607 7171334 7274264 7454131 7646099 7747774
10637 7747774 7736828 7694503 7735399 7912389 8169346 8382284 8451757 8362596 8178943 8000676
10627 8000676 7899491 7865104 7828599 7751174 7647035 7508580 7300572 7076342 6977766 7016391
10617G016391l0513k26580k08113Q7130K53597J0220l07672k04455K25187M27972
10607G043164J98544q5257p8216Q7449J24954L6176J0692Q7509J38402Q8855n884
10596G646388n5342r887J11691K18413K22610J44263Q3281Q7857J20780J43561
10586H713615J52113J43937J24769J17833J05539L4765m9472j632J77714K50001
10576I769182P0135j50154j40380J9412O7172k327k431M9367j5290j26389n5213
10565I483084J29812J25430n7150p0419J55232K62305Q9317m5812Q1135K15692
10555A0368626J17984M341J25601K86704K04755K7427N2093J91016J75302Q1290
10545A1635139J77656L94153M19113K49887J97120L63367N23324N30917M83515
$$ plain form
10617 7016391 6985878 6759298 6551185 6638315 6891912 6902132 6594460 6390005 6615192 7043164
10607 7043164 7241708 7156451 7078235 7165684 7290638 7326814 7337506 7425015 7563417 7652272 7646388
10596 7646388 7591046 7581159 7692850 7911263 8133873 8278136 8361417 8449274 8570054 8713615
10586 8713615 8865728 9009665 9134434 9252267 9357806 9392571 9343099 9341467 9519181 9769182
10576 9769182 9839317 9689163 9548783 9568195 9635367 9633040 9630609 9679976 9664686 9538297 9483084
10565 9483084 9612896 9738326 9681176 9610757 9765989 10028294 10117611 10071799 10152934 10368626
10555 10368626 10486610 10490951 10616552 10903256 11108011 11135438 11187531 11378547 11553849 11635139
10545 11635139 11812795 12206948 12626061 12875948 13073068 13436435 13959759 14490676 14974191
10536A4974191M60459M21061L85167M30428N02579M83111M18498M33144M81296
10527A8989934M58299M66512O55382Q89275R31361Q83305J050338J417004J676045
10518B7417455J757243J870635J993358J796820J197249N25914r10n49720j226178
10509C4781866j788697k042963k144206k246298k195100j855564j441375j222705
10501A9844958j155420j066942r63914q93006p46867m91704l54352m87564o62815
10492A3022374n96985l83803k88977l07239k59889j71389j93029k68388k25385
10483A0327290j18072j36697k38219k04135l6192L4131o6146j59596j40117j06282
10473I155965j30885j49233j29573j36230j77233j82374j58646j79631k11263
$$ plain form
10536 14974191 15434650 15855711 16240878 16671306 17173885 17656996 18075494 18508638 18989934
10527 18989934 19448233 19914745 20570127 21459402 22390763 23274068 24324406 25741410 27417455
10518 27417455 29174698 31045333 33038691 34835511 36032760 36558674 36557764 36008044 34781866
10509 34781866 32993169 30950206 28806000 26559702 24364602 22509038 21067663 19844958
10501 19844958 18689538 17622596 16658682 15765676 15018809 14527105 14172753 13685189 13022374
10492 13022374 12425389 12041586 11752609 11445370 11185481 11014092 10821063 10552675 10327290
10483 10327290 10209218 10072521 9834302 9630167 9593975 9628106 9561960 9402364 9262247 9155965
10473 9155965 9025080 8875847 8746274 8610044 8432811 8250437 8091791 7912160 7700897
10464G700897j47631l0022j9305j23964j65085n8301O2116N6686m9437j57823
10454G068131k06060j54812j7303P8127J1780j29907j51221m9498k1337j32831
10444F295069k02551j02550K1662k7300j92340k34872o1630J46331J48110o3249
10434E726680k29002j30365J08112J56617n3492k07440p5644J23766O9594j45171
10424E343655j69444L9743J74005P8611n5294n0888J9588L8220O904n9526j56782
10413E208792j72164q505J61508Q0252j40055j24783J44295K49231Q172k23064
10403E183679j38762O2559R5219M7713Q8558R2378n1960j09951Q9096K36511K6832
10392E621872k38413r4407K69158K73962q7129k39981J5062K21451P8115j09179
$$ plain form
10464 7700897 7553266 7523244 7503939 7379975 7214890 7156589 7218705 7275391 7225954 7068131
10454 7068131 6862071 6707259 6689956 6768083 6779863 6649956 6498735 6449237 6427900 6295069
10444 6295069 6092518 5989968 6011630 5984330 5791990 5557118 5495488 5641819 5789929 5726680
10434 5726680 5497678 5367313 5475425 5632042 5578550 5371110 5295466 5419232 5488826 5343655
10424 5343655 5174211 5213954 5387959 5466570 5411276 5360388 5379976 5418196 5425100 5365574 5208792
10413 5208792 5036628 5028123 5189631 5269883 5129828 5005045 5149340 5398571 5406743 5183679
10403 5183679 5044917 5107476 5202695 5250408 5338966 5431344 5379384 5269433 5358529 5595040 5621872
10392 5621872 5383459 5289052 5558210 5832172 5745043 5505062 5520124 5741575 5819690 5710511
10382E710511m1089P8140j758r4683M7217K43183J89806r395l6772J00863J26177
10371F312200k3270j30503p8891J8002O5191J02856J50946J46587P2351n73j2003
10360F622893M7694J65870K75051K58427J06838p394N1096J73729J77249R3751
10350G965204R7522K02167K51143J97912J76048K57079L35700L21445K78386K90100
10340A0372706L17657K84279K04923J44508J11950O7369n015p7033j03291n6001
10330A1262052L2102P1363J5640o1284n9123N848L8697J7364m122k0033o6887
10319A1231617j04130n6592J7842j6205j15364o6215J67595L29739K47281J09203
10309A1744771J63304L25044L58614K99239L58736M89037M31192K22191K37879
$$ plain form
10382 5710511 5669422 5747562 5745804 5651121 5698338 5941521 6131327 6121932 6085160 6186023 6312200
10371 6312200 6288930 6158427 6079536 6097538 6162729 6265585 6416531 6563118 6635469 6634896 6622893
10360 6622893 6670587 6836457 7111508 7369935 7476773 7469379 7520475 7694204 7871453 7965204
10350 7965204 8062726 8264893 8516036 8713948 8889996 9147075 9482775 9804220 10082606 10372706
10340 10372706 10690363 10974642 11179565 11324073 11436023 11503392 11498377 11421344 11318053 11262052
10330 11262052 11294154 11365517 11381157 11319873 11260750 11266598 11305295 11322659 11318537 11298504 11231617
10319 11231617 11127487 11070895 11088737 11072532 10957168 10890953 11058548 11388287 11635568 11744771
10309 11744771 11908075 12233119 12591733 12890972 13249708 13738745 14169937 14392128 14630007
10300A4630007N87497Q60524P36690N11366O52971J084187J340104J308379J328596
10291B3040321J548773J660344J418303J016662P16111M31854k1307n33933q76534
10282B8400594j084749j331909j541760j486370j218871j050471j074348j048121
10274A8563995q26874n97848n45499n54775m33914k25955j02384j01243j51706
10265A5023797k22506k68212j62029J16966L44342L21983K02491K95245O00589
10256A6252666Q14674Q05392P83602R01127R58298P13665K87462m323j26682l62392
10246B1023489q51513j330921j452186j214706r33015q36446q49745p76958n76112
10237A2201887l82107l20160l74610m31307l99827k94327k21438k73302m03080
$$ plain form
10300 14630007 15217504 16078028 16814718 17326084 17979055 19063242 20403346 21711725 23040321
10291 23040321 24589094 26249438 27667741 28684403 29400514 29832368 29811061 29277128 28400594
10282 28400594 27315845 25983936 24442176 22955806 21736935 20686464 19612116 18563995
10274 18563995 17737121 17139273 16593774 16038999 15605085 15379130 15276746 15175503 15023797
10265 15023797 14801291 14533079 14371050 14488016 14832358 15154341 15356832 15652077 16252666
10256 16252666 17067340 17872732 18656334 19557461 20515759 21229424 21516886 21512563 21385881 21023489
10246 21023489 20171976 18841055 17388869 16174163 15241148 14404702 13554957 12777999 12201887
10237 12201887 11819780 11499620 11125010 10693703 10293876 9999549 9778111 9504809 9101729
10228I101729m40207k87871p6861l0601j74921k94369k24661p4879n4106j60110
10218G283143j97197r0273q444j02341k55292k39691n9100L9577p7562k24724
10208F068096j57579O6999J61498J0695j78959j82589m5151M2077K2160k2319
10198E784928n6724j07164j25175l0154J05731J02588m9927j38390l3248J11801
10188E564266R0944n4906j23872n2723L2415L0064k1643n0505n1580n1741n2812
10177E257907m5400l5353l2172k9880p282N2669J29842J63106J16588M0288J3810
10166E624123M3266P7666J00302J13607P2923l0836o1449J00309L00146K62687
10156F602744L2478l4800J75989L33764K08993P7942K51613N05393M27125J31958
$$ plain form
10228 9101729 8661522 8373651 8296790 8266189 8091268 7796899 7572238 7497359 7443253 7283143
10218 7283143 7085946 6995673 6987229 6884888 6629596 6389905 6330805 6370382 6292820 6068096
10208 6068096 5910517 5977516 6139014 6149709 5970750 5788161 5743010 5785087 5807247 5784928
10198 5784928 5728204 5621040 5495865 5465711 5571442 5674030 5624103 5485713 5452465 5564266
10188 5564266 5655210 5600304 5476432 5423709 5456124 5486188 5464545 5414040 5362460 5310719 5257907
10177 5257907 5212507 5177154 5144982 5115102 5107820 5160489 5290331 5453437 5570025 5610313 5624123
10166 5624123 5667389 5745055 5845357 5958964 6031887 6001051 5939602 6039911 6340057 6602744
10156 6602744 6635222 6600422 6776411 7110175 7319168 7397110 7648723 8154116 8581241 8713199
10146H713199J06851M17300O16958M95513L74631M89827N80585L81589J03845
10137A2280298N9874J18250o5064m64306p23334o79022n03395l72546k98348k76904
10127I075503l31384l84223l11670j56482r7325j82082k67004k49737j96118j89389
10117F710089j99144j62269q4827n928N7150Q2385L2473p9285j56316j02102O3016
10106F155242J90426J43740k6867j03180L6427K29879K39697J00850O1968J80930
10096G209112K32040R2589m5357l774Q5426K1442j37684k24426k54980l17746
10086F656642l38382k36308j59488k55683l56187k33610m0547q6394k74055k29395
10076D446593L1185Q1559j85443l39770j20108J37975P4488j29914j33281j6233
$$ plain form
10146 8713199 8820050 9237350 9854308 10349821 10724452 11214279 11794864 12176453 12280298
10137 12280298 12340172 12458422 12393358 11929052 11205718 10526696 10023301 9650755 9352407 9075503
10127 9075503 8744119 8359896 8048226 7891744 7794419 7612337 7345333 7095596 6899478 6710089
10117 6710089 6510945 6348676 6263849 6257921 6315071 6397456 6429929 6350644 6194328 6092226 6155242
10106 6155242 6345668 6489408 6462541 6359361 6395788 6625667 6865364 6966214 7028182 7209112
10096 7209112 7441152 7533741 7488384 7484610 7570036 7591478 7453794 7229368 6974388 6656642
10086 6656642 6318260 6081952 5922464 5666781 5310594 5076984 5036437 4950043 4675988 4446593
10076 4446593 4477778 4559337 4373894 4034124 3914016 4051991 4126479 3996565 3863284 3847051
10066C847051n3113j68257r3760R1981O2060j79855k69187o1354J57467J37815
10056C470848J43m8457m3807j10276j81221j05539O3543J00954o9012k40941j83054
10045B653181N8769K11971J26824l9647o6892P322k1191j58370j78944l739J42381
10034B731665P9582n1227m8895J9703q308o7391k450R4708J8832j42728r4302
10023B529189J64091K75052O5029j77537j36336Q5898J75474P1866k3754r57L9163
10012C067178J991n1212k0645P4453J19977N5390m5731o3030J1753N6999m270
10001C202853q3073n8863L0228N1998j0033n6227n6234p0697q6224r296J35131
9990B989563J77333N3466p2958m2326P3608Q9609l5106j63932j59772k2552J19704
$$ plain form
10066 3847051 3793938 3625681 3531921 3623902 3685962 3506107 3236920 3175566 3333033 3470848
10056 3470848 3470991 3422534 3378727 3268451 3087230 2981691 3045234 3146188 3077176 2836235 2653181
10045 2653181 2711950 2923921 3050745 3011098 2944206 2951528 2930337 2771967 2593023 2589284 2731665
10034 2731665 2811247 2760020 2711125 2730828 2722520 2655129 2652679 2747387 2766219 2623491 2529189
10023 2529189 2693280 2968332 3033361 2855824 2719488 2805386 2980860 3052726 3028972 3028015 3067178
10012 3067178 3069169 3017957 2997312 3071765 3191742 3247132 3201401 3138371 3150124 3207123 3202853
10001 3202853 3119780 3060917 3091145 3143143 3133110 3076883 3020649 2949952 2863728 2854432 2989563
9990 2989563 3166896 3220362 3147404 3105078 3178686 3268295 3233189 3069257 2909485 2886933 3006637
9979C006637J32494K7194l1629N1319J33655L9777j25884j03799Q8569J42341
9969C360674m4689j68078L478K32211J68642j02948k01901k4067J49222R5128
9959C467672q2116j64431q2313Q5378K08492J71615j6773j73156j30873L1072
9949C314567R7768L0418j0455N2620J08373P0617J1314J1393L3673K2002Q21M358
9937C747469J2880J6035L9521O6610M1088j3095M360R6691J25485J0759j34751
9926D013052j54607m5623P0741J02618M7990l5721o9366j7334N3563M9710k236
9915D012787J2875R7671J08957j2390j17304o1012P2443R1586k7794j27148r3661
9904C957010K0023J06234J30067J15348O9319k3167j34518j69472o5786P5705
$$ plain form
9979 3006637 3139131 3166325 3134696 3186015 3319670 3359447 3233563 3129764 3218333 3360674
9969 3360674 3315985 3147907 3151385 3383596 3552238 3449290 3247389 3223322 3372544 3467672
9959 3467672 3385556 3221125 3138812 3224190 3432682 3604297 3587524 3414368 3283495 3314567
9949 3314567 3412335 3442753 3432298 3484918 3593291 3663908 3675222 3686615 3720288 3742290 3743111 3747469
9937 3747469 3760349 3776384 3815905 3882515 3923603 3910508 3914868 4011559 4137044 4147803 4013052
9926 4013052 3858445 3812822 3883563 3986181 4034171 3998450 3929084 3911750 3965313 4015023 4012787
9915 4012787 4025662 4123333 4232290 4219900 4102596 4041584 4114027 4205613 4177819 4050671 3957010
9904 3957010 3977033 4083267 4213334 4328682 4398001 4374834 4240316 4070844 4005058 4080763
9894D080763N9460j34746k55758r8595J66897J97379k6662j68546m7002J03268
9884C876458K5404j58786j67791k812Q9765O356j10671j29408p9404l7879k2884
9873C288348j7813P4M5566P3793Q873j05048j01928M6778J24650q647j50604m8764
9861C155278J75622J97587K090j09638j6178O8297o683r9470o1875L1156P3479
9850C409665R7756J15355L0422j35041j71666j3097R8249k2680j95528j69303
9840C044132k3224K136q5728r1380L884L9627j4755l2656O506j1742r6748j19926
9828B620126m2872K8738L4500J2648l3057j22217j64420n5066R7882Q0771p5420
9817B381613j07456O8036K16307J48058k3815j05583p7256l946R2427J45041M1723
$$ plain form
9894 4080763 4140223 4005477 3749719 3651124 3818021 4015400 3988738 3820192 3773190 3876458
9884 3876458 3901862 3743076 3575285 3572473 3662238 3668594 3557923 3428515 3349111 3311232 3288348
9873 3288348 3270535 3270609 3316175 3389968 3398841 3293793 3191865 3238643 3363293 3354646 3204042 3155278
9861 3155278 3330900 3528487 3530577 3420939 3404761 3473058 3466375 3366905 3305030 3336186 3409665
9850 3409665 3507421 3622776 3653198 3518157 3346491 3333394 3431643 3408963 3213435 3044132
9840 3044132 3020908 3023044 2937316 2845936 2849820 2889447 2874692 2842036 2848542 2836800 2740052 2620126
9828 2620126 2577254 2605992 2640492 2653140 2620083 2497866 2333446 2278380 2376262 2457033 2381613
9817 2381613 2274157 2342193 2558500 2706558 2682743 2577160 2499904 2495958 2588385 2733426 2775149
9806B775149j49296j77176J3859J47633M5071p7549J755R2649p3910l06657k03847
9795B087681J55760K66538k6357k84337j61723R8995J13348n7061r7369K2655
9785B118130P3325J184j9173N9647P3720l6724j02712j5106Q6619N2021k7588
9774B263343J9396J38992J12219r6726k46210j40280R2757J67709J6970j47925
9764B180245j43013l0954K6741R129J0729N4396O9839L3466k506k0722n3454p5151
9752B058745j1963J07227J42625M6191n3692m9976j6788o2257j28724q3437N6591
9741B004542J41178J04670L0399l129j6707m5449n9887j8612N7098R7853N4755
9730B346711m7098j10396n4632P1998J26571N6404l0446m2409m4007j04822j23763
$$ plain form
9806 2775149 2625853 2448677 2462536 2610169 2655240 2577691 2579446 2672095 2598185 2291528 2087681
9795 2087681 2243441 2509979 2483622 2199285 2037562 2136557 2249905 2192844 2095475 2118130
9785 2118130 2191455 2192639 2173466 2233113 2306833 2270109 2167397 2152291 2238910 2290931 2263343
9774 2263343 2282739 2421731 2533950 2437224 2191014 2050734 2143491 2311200 2328170 2180245
9764 2180245 2037232 2006278 2033019 2042148 2052877 2107273 2177112 2210578 2208072 2187350 2133896 2058745
9752 2058745 2046782 2154009 2296634 2342825 2289133 2239157 2222369 2160112 2031388 1947951 2004542
9741 2004542 2145720 2250390 2280789 2277660 2260953 2215504 2155617 2137005 2194103 2291956 2346711
9730 2346711 2299613 2189217 2134585 2206583 2333154 2389558 2359112 2316703 2272696 2167874 2044111
9719B044111J1663J67581J04482j32179k20486k7595J81956J37501n5720j18371
9709B092943j4714O6555N1738M9183R6127P6334n6607j60817j01813N7511J50219
9698B306659J04083k3107j34350j52700n1667J03510J86907J42714M7206q438
9688B520817m0131r7144j18477P187K26657L04576J08754j77391k55444q8119
9678B391285P0655L6037p6591o6122M7404Q3195j1476j10132j22539q5953k9062
9667B126701P6134J78259J41896l1738j44279p8088K1198j1114q3491k0669J05262
9656B280071P2508j05870j65898M202J90279J72318J4953q3159o8380k2870J935
9645B290089L358l3664q8999p1506M7874J33849M9034j27447j80373m2391J27291
$$ plain form
9719 2044111 2055774 2223355 2327837 2195658 1975172 1947577 2129533 2267034 2211314 2092943
9709 2092943 2078229 2144784 2196522 2245705 2341832 2418166 2361559 2200742 2098929 2156440 2306659
9698 2306659 2410742 2387635 2253285 2100585 2048918 2152428 2339335 2482049 2529255 2520817
9688 2520817 2480686 2383542 2265065 2272252 2498909 2803485 2912239 2734848 2479404 2391285
9678 2391285 2461940 2497977 2421386 2355264 2402668 2485863 2474387 2364255 2241716 2155763 2126701
9667 2126701 2202835 2381094 2522990 2491252 2346973 2268885 2290083 2278969 2195478 2174809 2280071
9656 2280071 2352579 2246709 2080811 2085013 2275292 2447610 2462563 2379404 2311024 2288154 2290089
9645 2290089 2293447 2259783 2170784 2099278 2147152 2281001 2330035 2202588 2022215 1979824 2107115
9634B107115J57422N4838m3276l2439O6463J32584O5104q6583j49667m2877R1586
9623B320270P1266n8295q3525N2900J56331O9733r2456j15315J6760J29245J07936
9612B574850J797r7444j40154q5081P4496K16496J64709o5145k18029j09265J17619
9601B434849J82732M6984p4300m4664M0987O3432M5420L3220j2107q9054p7165
9590B550334O9644J87086J28249L588p707L0179n6824j88533j17966J22252K07522
9579B927824L7126q3187N9844K31380J43107p3087j07696J5094L4921o3624n8526
9568C063176O8210R1123k8926n7487Q0063J44912J6685p0852N3021J63409K2873
9557C546207j66884o9075K05295K38639k8324j99160m3883J76829J63133J3742
$$ plain form
9634 2107115 2264537 2319375 2276099 2243660 2310123 2442707 2507811 2421228 2271561 2228684 2320270
9623 2320270 2391536 2333241 2249716 2302616 2458947 2528680 2436224 2320909 2337669 2466914 2574850
9612 2574850 2576647 2479203 2339049 2253968 2328464 2544960 2709669 2644524 2426495 2317230 2434849
9601 2434849 2617581 2664565 2590265 2545601 2586588 2650020 2695440 2728660 2716553 2627499 2550334
9590 2550334 2619978 2807064 2935313 2938901 2931194 2961373 2904549 2716016 2598050 2720302 2927824
9579 2927824 2964950 2881763 2941607 3172987 3316094 3243007 3135311 3150405 3185326 3121702 3063176
9568 3063176 3131386 3222509 3193583 3136096 3216159 3361071 3377756 3306904 3359925 3523334 3546207
9557 3546207 3379323 3310248 3515543 3754182 3725858 3526698 3482815 3659644 3822777 3836519
9547C836519j9230M8994M4556j3041K2342J02293M8614q5535m3319J93117L02875
9536D438185J08578j23594q3695J12039J39031m723l2284J21646J92391M6950
9526D914524q9247j7985J14224J00375L1271R5674K01887J22552p4734q4788J42553
9515E456306K91239J50071q0051j01150O7766J78256J23405K9402K6319Q6564
9505F228127J06849N9534K2680P2374J64273J71453P1991J6081J10402K24202
9495G247966J73486L1889L2845J79420K21070P1987l2289P6275K22463J92539
9485H417651Q0024Q8571J80017J87466J34052J55559K12882J74842J09074J80379
9475I920517L04257K35440R219n1271J57175L35114K43782N4243M3046J85412
$$ plain form
9547 3836519 3817289 3866283 3910839 3897798 3920140 4022433 4071047 3985512 3942193 4135310 4438185
9536 4438185 4546763 4423169 4339474 4451513 4590544 4585821 4553537 4675183 4867574 4914524
9526 4914524 4825277 4807292 4921516 5021891 5053162 5148836 5350723 5473275 5398541 5313753 5456306
9515 5456306 5747545 5897616 5817565 5716415 5784181 5962437 6085842 6115244 6141563 6228127
9505 6228127 6334976 6394510 6417190 6489564 6653837 6825290 6897281 6913362 7023764 7247966
9495 7247966 7421452 7453341 7486186 7665606 7886676 7958663 7926374 8002649 8225112 8417651
9485 8417651 8497675 8586246 8766263 8953729 9087781 9243340 9456222 9631064 9740138 9920517
9475 9920517 10224774 10460214 10469433 10418162 10575337 10910451 11154233 11208476 11251522 11436934
9465A1436934K76601K69323K50511K18678J28315P0810J74732L62813M21720L09805
9455A3920242K05566K31345L02275K96522K25607J63069J22803J00404J49027
9446A5716860K99115M37732L91308J61799j4908O7477L11205M20755K85111J09732
9436A8186186R8995J62040R3604o8612j00986K8133R9416N918q2966l4407J1670
9425A8398991j00279k48358k31170j17477j32775k73289l12527j88070j12079
9416A6682967k29753l95901m06975k84415j92802j96118k33158k60933k92202
9407A4190710l22071l21376k95194k74804k59807k28910j99197k13497k65570
9398A1810284k93808k66178k25182k20407k34311k19613j89146k07475k83622
$$ plain form
9465 11436934 11713535 11982858 12233369 12452047 12580362 12651172 12825904 13188717 13610437 13920242
9455 13920242 14125808 14357153 14659428 14955950 15181557 15344626 15467429 15567833 15716860
9446 15716860 16015975 16453707 16845015 17006814 16991906 17059383 17370588 17791343 18076454 18186186
9436 18186186 18285181 18447221 18540825 18472213 18371227 18399360 18498776 18504694 18421728 18387321 18398991
9425 18398991 18298712 18050354 17819184 17701707 17568932 17295643 16983116 16795046 16682967
9416 16682967 16453214 16057313 15650338 15365923 15173121 14977003 14743845 14482912 14190710
9407 14190710 13868639 13547263 13252069 12977265 12717458 12488548 12289351 12075854 11810284
9398 11810284 11516476 11250298 11025116 10804709 10570398 10350785 10161639 9954164 9670542
9389I670542l30797k69443j30905j9716n974q8539k16556l01588k67741j52972
9379G886311r3524j33711j47125n8349j5587j52224k96047j95061L5798M3538
9369F874019j83095k66250o8514O8264p7866k15014p3324Q0354q4101l21647k05600
9358E527226R5636P6931k11023k32445Q0283J86336j06980k85003k4400K34346
9348E340907N5069k49257j92501M8845R939k12127j69015R9355J34669j19023
9338D746861k36303o8884M9152m4519p4969R6216J72150m0280k52466j67828M0485
9327D219615N6740p2729r9976j0617L0525L827N448J5378m1824j04021p0412n8
9315C931896l963l8233o465L5376j6252j01384j00647n6604p4522r3877M327J35054
$$ plain form
9389 9670542 9339745 9070302 8939397 8919681 8913707 8825168 8608612 8307024 8039283 7886311
9379 7886311 7792787 7659076 7511951 7453602 7438015 7285791 6989744 6794683 6830481 6874019
9369 6874019 6690924 6424674 6356160 6424424 6346558 6131544 6058220 6138574 6054473 5732826 5527226
9358 5527226 5622862 5699793 5488770 5256325 5336608 5522944 5415964 5130961 5106561 5340907
9348 5340907 5395976 5146719 4954218 5003063 5013002 4800875 4631860 4731215 4865884 4746861
9338 4746861 4510558 4441674 4490826 4446307 4371338 4467554 4639704 4599424 4346958 4179130 4219615
9327 4219615 4276355 4203626 4103650 4093033 4123558 4127385 4132833 4148211 4106387 4002366 3931954 3931896
9315 3931896 3927933 3889700 3883235 3918611 3902359 3800975 3700328 3643724 3569202 3475325 3479652 3614706
9303C614706J08129m8554j16485k9608M9170R664o9166r6138q2898m7917J6462
9292C307365N7241J0068n8769l5323L0410O90p9544l7305R6201R5611o2294j21081
9280C203270K5157J36905L8060p9913q06J32561P2063j02069j27699j810N8339
9269C354058R669N446O0463K4930r1787q6510Q1874J81498N4849j54670k33263
9258C206557j59750l7337O1677Q8067J3771p8462n7767M2098M9537n1111p1435
9247C005845N1340J24118L1861n2949J6471Q5470j7319j39499n2636J29999J26336
9236C309037l5764p9386L2260M8963j01918j77336l9882J18014J13522M4784N3186
9225C285480P1987P595m6918J0190P7692K9062n2223k8964L3431p126r5461o7236
$$ plain form
9303 3614706 3722835 3674281 3557796 3528188 3577358 3587022 3517856 3421718 3338820 3290903 3307365
9292 3307365 3364606 3374674 3315905 3280582 3310992 3311682 3232138 3194833 3291034 3386645 3324351 3203270
9280 3203270 3228427 3365332 3403392 3323479 3322673 3455234 3527297 3425228 3297529 3295719 3354058
9269 3354058 3363727 3369173 3429636 3454566 3362779 3276269 3358143 3539641 3594490 3439820 3206557
9258 3206557 3046807 3009470 3071147 3159214 3172985 3094523 3036756 3078854 3128391 3077280 3005845
9247 3005845 3057185 3181303 3213164 3160215 3176686 3262156 3244837 3105338 3052702 3182701 3309037
9236 3309037 3273273 3193887 3226147 3275110 3173192 2995856 2955974 3073988 3187510 3232294 3285480
9225 3285480 3357467 3365062 3318144 3328334 3406026 3435088 3382865 3353901 3387332 3380206 3284745 3217509
9213C217509O0303J16093N3943j1450k4359l8308n3677m078Q1506Q6466K321m9467
9201C436802j8118J4187J684O206N2662O3831J111n8516m7648K97L5450O1313
9189C549261P8402O3925M2059O4689R7634N4232l2308k5062Q1040J14041J009
9178D088922q7673l098J28013R1570p4817j27287L5318K38491K59719P2458j52879
9167D468737k16245n8886J75519K68382J57619R15l1596M3317R2858O1235N108
9156D966963l553P2401K20854L38423K82665O3148j02013l6722J62451K72721
9146F237338K41621J84949J62460J43364J55995K68457M17425M49821L63963L31685
9136H957078M40397N80261O29513N80481M34899J66976j29359k54750j89126j81551
$$ plain form
9213 3217509 3277812 3393905 3447848 3436398 3412039 3373731 3320054 3315976 3397482 3483948 3486269 3436802
9201 3436802 3418684 3432871 3434555 3440761 3493423 3557254 3558365 3499849 3452201 3452498 3487948 3549261
9189 3549261 3627663 3691588 3733647 3798336 3895970 3950202 3917894 3892832 3973872 4087913 4088922
9178 4088922 4001249 3998151 4126164 4217734 4142917 4015630 4050948 4289439 4549158 4621616 4468737
9167 4468737 4252492 4193606 4369125 4637507 4795126 4796041 4764445 4807762 4900620 4961855 4966963
9156 4966963 4963410 5035811 5256665 5595088 5877753 5940901 5838888 5802166 5964617 6237338
9146 6237338 6478959 6663908 6826368 6969732 7125727 7394184 7811609 8261430 8625393 8957078
9136 8957078 9397475 9977736 10607249 11187730 11622629 11789605 11660246 11405496 11216370 11034819
9126A1034819m00746o57933o70760m75743l51028m01100m58998l93758k87656
9117F937097k53517k59382k25503j69335j59011j97632k26165j96783j09911k6020
9107E113838m2634j80767k95650k17192l366Q9421m3959j91793j35665J6964P106
9096D116303j58735k14545n3117J16814J05165j945m9876o9130j35059j53654
9086C502221k8344R0292K345j74259j48972N5859J17163m6443j28149K9692J42197
9075C413602j7267j80612k2210K46194J82880j46041k52785j4356J54775N662
9065C369842j71891q5486R0373P8027k4663J6872J20324N4872j10542j13136M3271
9054C267863J02345j466o0209K4023Q9766K0972p3242q0836n4545n0829j2161
$$ plain form
9126 11034819 10634073 9976140 9305380 8829637 8478609 8077509 7618511 7224753 6937097
9117 6937097 6683580 6424198 6198695 6029360 5870349 5672717 5446552 5249769 5139858 5113838
9107 5113838 5071204 4890437 4594787 4377595 4374229 4463650 4419691 4227898 4092233 4109197 4116303
9096 4116303 3957568 3743023 3689906 3806720 3911885 3909940 3860064 3790934 3655875 3502221
9086 3502221 3473877 3564169 3566514 3392255 3243283 3299142 3416305 3369862 3241713 3271405 3413602
9075 3413602 3396335 3215723 3193513 3439707 3622587 3476546 3223761 3209405 3364180 3369842
9065 3369842 3197951 3112465 3202838 3280865 3256202 3273074 3393398 3448270 3337728 3224592 3267863
9054 3267863 3370208 3368742 3308533 3332556 3422322 3443294 3370052 3289216 3234671 3183842 3171681
9043C171681P1193P7155l1830q7904J9549J17676l852k28765k40877J4944K42868
9032C121838K14145N2625j5534r498q9792k15274j67742O3584J82077L814k24261
9021B915982j44754J89826L76629K12808p4787j90535j16321l224O6304P6889
9011C308817J8756l9352K1376J47628J12643j15849k32331l4493K14218J55307
9001C556720j14114k14736q4194j988o5566p0584M4972O1395r0867j49614L3417
8990B904841K04435J09573r5994j16084K9012J01693M3730j1551j8337m2469o8713
8979C040136k1246N8442N9054j034l497O1661Q1679J502j19211k06025k06430
8968B745031p5993J36638K41931J01247j59028k69014j39198O1224J35354N2598
$$ plain form
9043 3171681 3242874 3320029 3288199 3200295 3219844 3337520 3333668 3104903 2864026 2878970 3121838
9032 3121838 3335983 3388608 3373074 3363576 3273784 3058510 2890768 2954352 3136429 3140243 2915982
9021 2915982 2771228 2961054 3337683 3550491 3475704 3285169 3168848 3165624 3231928 3308817
9011 3308817 3327573 3288221 3309597 3457225 3569868 3454019 3221688 3187195 3401413 3556720
9001 3556720 3442606 3227870 3143676 3141688 3076122 3005538 3050510 3111905 3021038 2871424 2904841
8990 2904841 3109276 3218849 3122855 3006771 3035783 3137476 3181206 3169655 3151318 3108849 3040136
8979 3040136 3018890 3077332 3136386 3135352 3131855 3193516 3275195 3276697 3157486 2951461 2745031
8968 2745031 2669038 2805676 3047607 3148854 2989826 2720812 2581614 2642838 2778192 2830790
8958B830790p6744j20850l1155J00963J25431K1694o9602n5642j0546m646K7645
8947B737338J19459J39303Q015j09578m7653P1276M2085o1297k6869R5779P3316
8936C041174q7680j49144o4172k7780p5072o121K02973K87550J31485l1427k1408
8925C200378J7984m6124o6319O7411J47459j0265k05713j67920r068m675r8611
8914B824537k7848J66730J75164n0699j96515p9426R6879R3835l0607q1716j6839
8903B873495O1358O9655R488m4684K156J31688J68671J4041j44530o8589J35702
8892C208451J40143q2748j87964q36K01377J35999n2698p0412M7305M9995p3633
8881C314979r6037L7562J17072K6037p8017l4383Q0939J06452L3552l1982m4427
$$ plain form
8958 2830790 2754046 2633196 2602041 2703004 2828435 2850129 2780527 2724885 2714339 2709693 2737338
8947 2737338 2856797 2996100 3004115 2894537 2846884 2918160 2960245 2898948 2872079 2967858 3041174
8936 3041174 2953494 2804350 2740178 2712398 2637326 2631205 2834178 3121728 3253213 3221786 3200378
8925 3200378 3218362 3172238 3105919 3173330 3320789 3310524 3104811 2936891 2927823 2923148 2824537
8914 2824537 2796689 2963419 3138583 3087884 2891369 2811943 2908822 3002657 2972050 2890334 2873495
8903 2873495 2934853 3004508 3013996 2969312 2971468 3103156 3271827 3285868 3141338 3072749 3208451
8892 3208451 3348594 3265846 3077882 3077046 3278423 3414422 3361724 3291312 3338617 3388612 3314979
8881 3314979 3218942 3256504 3373576 3399613 3321596 3287213 3368152 3474604 3508156 3476174 3431747
8870C431747l7980l4771k6485j0725J3453M6820N3960o161p8126l7824J09436
8859C423344J72774L7265j21605o2548J44009J88765j5711j92240j11313Q3431
8849C546171J32144N0549L0441P9836M3733o8962p3926N3262J12762K3920l5969
8838C893961M6751J20168N2661j9938M8333J19803R163j48363q3239J42998J96914
8827D379212r315j84788j09713O8493J07882R911o0841k6635P1558J68777J92696
8816D607237R3273n6608r7986L009R6847P0905n516l4774m1016o0952l1710P5274
8804D617983J36917N3645o1102l7096Q4903J22070L8224k1582K4750R2405R6072
8793E147189P0762P4936Q8531O9777L2861J1746L050q094r049J0240K1782O34
$$ plain form
8870 3431747 3393767 3358996 3332511 3321786 3335239 3382059 3436019 3429858 3351732 3313908 3423344
8859 3423344 3596118 3633383 3511778 3449230 3593239 3782004 3766293 3574053 3462740 3546171
8849 3546171 3678315 3728864 3759305 3839141 3882874 3813912 3739986 3793248 3906010 3929930 3893961
8838 3893961 3940712 4060880 4113541 4093603 4141936 4261739 4270902 4122539 4039300 4182298 4379212
8827 4379212 4369897 4185109 4075396 4143889 4251771 4261682 4200841 4174206 4245764 4414541 4607237
8816 4607237 4700510 4643902 4545916 4548925 4645772 4716677 4711161 4676387 4635371 4574419 4542709 4617983
8804 4617983 4754900 4808545 4747443 4710347 4795250 4917320 4955544 4933962 4958712 5051117 5147189
8793 5147189 5217951 5292887 5381418 5451195 5484056 5495802 5498852 5490758 5481709 5491949 5513731 5514365
8781E514365j5436L7670J38504J58478J7411j62272j63185L3013J83608J09836
8771E851992m2383l0139J00826R6307p6883j61333j9575J57316J65562O8739J3313
8760F123742r480l8937N905J44090J95619O1486m4668Q3736K66115J97578l7749
8749F947437q4910J12180K43864J47251J2059M943L5175J0497J6075R4564J19654
8738G658789M0566O828R7960J64785R8071K4086O1497J10512P2389N5111J46254
8727H536848J96555P7008m3409M3863K14195K00788L5529k5139O1059R1437M091
8716I392825l2848N0940J13013Q1434Q1308J78026K33380J43057K1138J6045R8735
8705A0377053J54220J50935J14761N9013L3148J13036K50735K70714J21362r839
$$ plain form
8781 5514365 5498929 5536599 5675103 5833581 5850992 5688720 5525535 5558548 5742156 5851992
8771 5851992 5809609 5779470 5880296 5976603 5899720 5738387 5718812 5876128 6041690 6110429 6123742
8760 6123742 6114262 6075325 6081230 6225320 6420939 6482425 6437757 6521493 6787608 6985186 6947437
8749 6947437 6862527 6974707 7218571 7365822 7377881 7382824 7417999 7428496 7444571 7539135 7658789
8738 7658789 7699355 7706183 7804143 7968928 8066999 8091085 8152582 8263094 8335483 8390594 8536848
8727 8536848 8733403 8810411 8767002 8810865 9025060 9225848 9261377 9236238 9297297 9388734 9392825
8716 9392825 9359977 9410917 9523930 9605364 9686672 9864698 10098078 10241135 10262273 10278318 10377053
8705 10377053 10531273 10682208 10796969 10855982 10889130 11002166 11252901 11523615 11644977 11635138
8695A1635138L9775J66206J80802J13402J32956K41578K75080J96344J61739K44232
8685A3387252K97123K06452J11775K02733L90991L92854J41640p6822O111K74766
8675A5334875L85587K31276O8411J50734L98449N44182N00719M22199M27931M36619
8665A8900982L35236J86190J47656K35174K86835J91644O0112Q9437K94008M67717
8655B1194991M42215L00156K57153L82348N37873N84135N35762M88451M88682
8646B5211766N24706N72569O02562N96521N84176N96349N79932M65354L22774
8637C0056709K96428L47656K57182k8898k70815l00671k94126m57548o53281o36767
8627B8315869n05180n41417o98317o50202l63180j91036l02417m10229k51331
$$ plain form
8695 11635138 11674913 11841119 12021921 12135323 12268279 12509857 12784937 12981281 13143020 13387252
8685 13387252 13684375 13890827 14002602 14205335 14596326 14989180 15130820 15053998 15060109 15334875
8675 15334875 15720462 15951738 16020149 16170883 16569332 17113514 17614233 18036432 18464363 18900982
8665 18900982 19236218 19422408 19570064 19805238 20092073 20283717 20343829 20433266 20727274 21194991
8655 21194991 21637206 21937362 22194515 22576863 23114736 23698871 24234633 24723084 25211766
8646 25211766 25736472 26309041 26911603 27508124 28092300 28688649 29268581 29733935 30056709
8637 30056709 30353137 30700793 30957975 30929077 30658262 30357591 30063465 29605917 28952636 28315869
8627 28315869 27810689 27269272 26570955 25920753 25557573 25366537 25064120 24653891 24402560
8618B4402560J2327J01216L2071l2369r8328k28722l20863k84128k75417m66932
8608B2841415p12085p38143n70900m71215n21269n73534n69834o04837o64512
8599A7415086n91829l70932k03961k29183l50583m06969l50799k22716r6347o5696
8589A4526071j49235k18373j62167p0807q1314j22383m7503N7186k299j41676
8579A3587500r0822J20625J64236k4502j03413R5857K64244J46383j2304J08010
8569A4255814L50089L61761J94752J82897L63168M52361L40170K03454J41300
8560A6845766O4867l6082o4414q1821k62834n34352o04294m31222l24650m59009
8550A4111955o22466o10290n42353n72991n80780m19457k40048k60633l88864
$$ plain form
8618 24402560 24414887 24516103 24548174 24515805 24417477 24188755 23867892 23583764 23308347 22841415
8608 22841415 22129330 21391187 20820287 20349072 19827803 19254269 18684435 18079598 17415086
8599 17415086 16823257 16452325 16248364 16019181 15668598 15261629 14910830 14688114 14591767 14526071
8589 14526071 14376836 14158463 13996296 13925489 13844175 13721792 13674289 13731475 13729176 13587500
8579 13587500 13496678 13617303 13781539 13757037 13653624 13749481 14013725 14160108 14147804 14255814
8569 14255814 14605903 14967664 15162416 15345313 15708481 16160842 16501012 16704466 16845766
8560 16845766 16910633 16874551 16810137 16728316 16465482 15931130 15326836 14895614 14570964 14111955
8550 14111955 13489489 12879199 12336846 11763855 11183075 10763618 10523570 10262937 9874073
8541I874073l81240k51959k10141k69126k39421r3641l0885j32910k24527j61391
8531G878832l5653O937k7618o5970j01323j29370q2041N1767J41204P4601o4754
8520G646612j00519M696J21280J27389K7066q3867j00218J8597J91452K59158
8510H111646J50989j7203p6488q650N7222K6769p0300j64780k25361k36750j92705
8499G354389j43378j65775k44208k62736j75454j00838j56382k65268k50007r4785
8489E495558J7167m7303j97938k54920j74082o3967k5331m8507o0140k0786L2264
8478D652015K6696n5307j39943j45455q6287l7591j4419K3777N2852n471j19437
8467D151430j36540j3157Q8378M4110l4672m725M6949m1403j89704j74179k6R6074
$$ plain form
8541 9874073 9492833 9240874 9030733 8761607 8522186 8428545 8397660 8264750 8040223 7878832
8531 7878832 7843179 7850116 7822498 7756528 7655205 7525835 7443794 7495561 7636765 7711366 7646612
8520 7646612 7546093 7550789 7672069 7799458 7826524 7742657 7642439 7661036 7852488 8111646
8510 8111646 8262635 8245432 8168944 8160294 8217516 8244285 8173985 8009205 7783844 7547094 7354389
8499 7354389 7211011 7045236 6801028 6538292 6362838 6262000 6105618 5840350 5590343 5495558
8489 5495558 5512725 5465422 5267484 5012564 4838482 4774515 4749184 4700677 4640537 4619751 4652015
8478 4652015 4678711 4623404 4483461 4338006 4251719 4214128 4199709 4223486 4276338 4270867 4151430
8467 4151430 4014890 4001733 4090111 4134221 4099549 4094824 4141773 4100370 3910666 3736487 3736461 3832535
8455C832535K2072o3529o0834o2114j00221n4695O9541O4815j09332j76428J0214
8444C372024J64949J5580k13553j47121J12965J50102q4832k24930j05011L7500
8434C077673L9192L8613J03538O0429j17745j55248N5610J97883L1674j87757
8424C143862j34476M7871L2661j04790m8889J58589J68704o8104k11882r5422
8414B888124M6205J4548o0731k3403L9052J0169l6535j9841k2628r5292r9370
8403B640298M9872J71789P5494j21320j62102l1368P0965O2537M3934N4055l530
8392B850624j48746k33533j46102K4669J16846R8470N6819M3395K5090k0661m9230
8381B617641k4236J0088j339k0891J5590M6115n2324k11177j80135Q8332K71039
$$ plain form
8455 3832535 3854607 3791078 3730244 3668130 3567909 3513214 3582755 3647570 3538238 3361810 3372024
8444 3372024 3536973 3552553 3339000 3191879 3304844 3454946 3370114 3145184 3040173 3077673
8434 3077673 3116865 3155478 3259016 3319445 3201700 3046452 3102062 3299945 3331619 3143862
8424 3143862 3009386 3057257 3089918 2985128 2936239 3094828 3263532 3195428 2983546 2888124
8414 2888124 2934329 2948877 2888146 2864743 2903795 2913964 2877429 2857588 2834960 2739668 2640298
8403 2640298 2690170 2861959 2937453 2816133 2654031 2622663 2693628 2756165 2800099 2854154 2850624
8392 2850624 2701878 2468345 2322243 2346912 2463758 2562228 2619047 2662442 2687532 2666871 2617641
8381 2617641 2593405 2603493 2602154 2581263 2596853 2642968 2590644 2379467 2199332 2287664 2558703
8370B558703J08067j77281j95089J3192P9521n6852q2556Q6201J37957l6748r3010
8359B342105J42310K78686j617l43461k61766O0041J02562j07996j09449J33243
8349B234658J76604p2607j71085O6104K27906K5292k23129j60231M3631P6012
8339B223155J7209P3677J24529k2403j93042j13483R0343R7494n7116o9765R2856
8328B263454J60042K4025j33451j73697j36413n1969Q4918J67961Q3188o3672
8318B224386q4109j7301k9334q0459j0510J12831Q5696l8697k8934P9286L4590
8307B247445j25412q2070J76526K56227J286k28204j46113L3286L7277j2613O9163
8296B226798J23503l0079j71588k3554K22510J84187p7205j70711k1244P1817
$$ plain form
8370 2558703 2666770 2489489 2294400 2307592 2387113 2330261 2247705 2333906 2471863 2435115 2342105
8359 2342105 2484415 2763101 2761484 2418023 2156257 2216298 2318860 2210864 2101415 2234658
8349 2234658 2411262 2338655 2167570 2233674 2461580 2486872 2263743 2103512 2147143 2223155
8339 2223155 2240364 2314041 2438570 2416167 2223125 2109642 2199985 2297479 2240363 2170598 2263454
8328 2263454 2423496 2447521 2314070 2140373 2003960 1951991 2036909 2204870 2288058 2224386
8318 2224386 2140277 2122976 2093642 2013183 2002673 2115504 2201200 2162503 2133569 2212855 2247445
8307 2247445 2122033 2039963 2216489 2472716 2474002 2245798 2099685 2132971 2170248 2157635 2226798
8296 2226798 2350301 2320222 2148634 2125080 2347590 2531777 2454572 2283861 2262617 2334434
8286B334434r998n0996N0966J04774K586q3474k1966N7914J6775p0143q2564m4426
8274B203882j4587L1659R6834R9648K1137l4859q847L3479M9398Q2255J13892
$$ plain form
8286 2334434 2324436 2273440 2324406 2429180 2431766 2348292 2326326 2384240 2401015 2330872 2248308 2203882
8274 2203882 2189295 2220954 2317788 2417436 2438573 2403714 2394867 2428346 2477744 2559999 2673891
$$ [...]
##END NTUPLES=NMR SPECTRUM
##END=
