##TITLE=1H ikalashn
CG-1218-1
15.11.2024
##JCAMPDX= 6.0         $$ Bruker NMR JCAMP-DX V2.0
##DATA TYPE= NMR SPECTRUM
##DATA CLASS= NTUPLES
##ORIGIN= UXNMR, Bruker Analytische Messtechnik GmbH
##OWNER= root
$$ TOPSPIN		Version 1.3
$$ 2024-11-15 09:41:52.765 +0400  Irina@DPX200
$$ Compression mode = diff/dup
##.OBSERVE FREQUENCY= 200.131300845
##.OBSERVE NUCLEUS= ^1H
##.ACQUISITION MODE= SIMULTANEOUS
##.ACQUISITION SCHEME= undefined
##.AVERAGES= 64
##.DIGITISER RES= 18
##SPECTROMETER/DATA SYSTEM= spect
##.PULSE SEQUENCE= zg
##.SOLVENT NAME= CDCl3
##.SHIFT REFERENCE= INTERNAL, CDCl3, 1, 17.49637
##AUDIT TRAIL= $$ (NUMBER, WHEN, WHO, WHERE, WHAT)
$$ ##TITLE= Audit trail, TOPSPIN		Version 1.3
$$ ##JCAMPDX= 5.01
$$ ##ORIGIN= Bruker BioSpin GmbH
$$ ##OWNER= Irina
$$ $$ F:/spectra/data/iren/nmr/1H/4/pdata/1/auditp.txt
$$ ##AUDIT TRAIL=  $$ (NUMBER, WHEN, WHO, WHERE, VERSION, WHAT)
(   1,<2024-11-15 09:41:07.578 +0400>,<Irina>,<DPX200>,<TOPSPIN 1.3>,
      <created by zg
	started at 2024-11-15 09:36:54.437 +0400,
	POWCHK disabled, PULCHK disabled
       configuration hash MD5:
       BE 6D 3F 07 2A EA 11 49 91 17 2B D3 AF B3 58 0D
       data hash MD5: 16K
       08 6F AE 76 F5 38 A7 BD 5E 96 75 63 5A 28 35 33>)
(   2,<2024-11-15 09:41:25.546 +0400>,<Irina>,<DPX200>,<TOPSPIN 1.3>,
      <Start of raw data processing
       efp BC_mod = 2 LB = 0.02 FT_mod = 6 PKNL = 1 PHC0 = 324.4483 PHC1 = -0.247241 SI = 32K 
       data hash MD5: 32K
       23 8D EE 20 85 5D 9B 5B 9A 74 3B 62 15 30 22 79>)
(   3,<2024-11-15 09:41:27.640 +0400>,<Irina>,<DPX200>,<TOPSPIN 1.3>,
      <apk 
       data hash MD5: 32K
       15 04 78 E0 8C 30 A3 8F C9 9F 18 EE 45 FC AB 20>)
(   4,<2024-11-15 09:41:38.468 +0400>,<Irina>,<DPX200>,<TOPSPIN 1.3>,
      <pk fgphup PHC0 = 11.00383 PHC1 = -23.2 
       data hash MD5: 32K
       F7 62 5D 48 30 F7 A5 6E 48 89 6C 50 A7 46 D1 6E>)
(   5,<2024-11-15 09:41:40.015 +0400>,<Irina>,<DPX200>,<TOPSPIN 1.3>,
      <abs n ABSG = 5 
       data hash MD5: 32K
       67 98 FB 35 E0 DA D1 F1 1E 2F 76 DA BE 49 E0 59>)
$$ ##END=
$$ 
$$ $$ hash MD5
$$ $$ 34 E3 C2 39 47 3A BC E9 58 BD 19 C0 7E A2 C5 3B
##$RELAX= 
##$RELAX= 
##$RELAX= 
##$RELAX= 
##$RELAX= 
##$RELAX= 
##$RELAX= 
##$RELAX= 
##$RELAX= 
$$ Bruker specific parameters
$$ --------------------------
##$DU= <F:/spectra>
##$EXPNO= 4
##$NAME= <1H>
##$PROCNO= 1
##$TYPE= <nmr>
##$USER= <iren>
##$AMP= (0..31)
100 100 100 100 100 100 100 100 100 100 100 100 100 100 100 100 100 100 
100 100 100 100 100 100 100 100 100 100 100 100 100 100 
##$ANAVPT= -1
##$AQSEQ= 0
##$AQ_mod= 1
##$AUNM= <au_zg>
##$AUTOPOS= <>
##$BF1= 200.13
##$BF2= 200.13
##$BF3= 200.13
##$BF4= 200.13
##$BF5= 200.13
##$BF6= 200.13
##$BF7= 200.13
##$BF8= 200.13
##$BYTORDA= 1
##$CFDGTYP= 0
##$CFRGTYP= 5
##$CHEMSTR= <none>
##$CNST= (0..63)
1 1 145 1 1 1 1 1 1 1 1 1 1 1 1 1 1 1 1 1 1 1 1 1 1 1 1 1 1 1 1 1 1 1 
1 1 1 1 1 1 1 1 1 1 1 1 1 1 1 1 1 1 1 1 1 1 1 1 1 1 1 1 1 1 
##$CPDPRG= <>
##$CPDPRG1= <>
##$CPDPRG2= <>
##$CPDPRG3= <>
$$ [...]
##$SW_h= 4401.40845070422
##$TD= 16384
##$TD0= 1
##$TE= 300
##$TE2= 300
##$TE3= 300
##$TEG= 300
##$TL= (0..7)
0 120 120 120 120 120 120 120 
##$TP= (0..7)
150 150 150 150 150 150 150 150 
##$TP07= 0
##$TPNAME0= <>
##$TPNAME1= <>
##$TPNAME2= <>
##$TPNAME3= <>
##$TPNAME4= <>
##$TPNAME5= <>
##$TPNAME6= <>
##$TPNAME7= <>
##$TPOAL= (0..7)
0.5 0.5 0.5 0.5 0.5 0.5 0.5 0.5 
##$TPOFFS= (0..7)
0 0 0 0 0 0 0 0 
##$TUNHIN= 0
##$TUNHOUT= 0
##$TUNXOUT= 0
##$USERA1= <user>
##$USERA2= <user>
##$USERA3= <user>
##$USERA4= <user>
##$USERA5= <user>
##$V9= 5
##$VALIST= <valist>
##$VCLIST= <CCCCCCCCCCCCCCC>
##$VD= 0
##$VDLIST= <DDDDDDDDDDDDDDD>
##$VPLIST= <PPPPPPPPPPPPPPP>
##$VTLIST= <TTTTTTTTTTTTTTT>
##$WBST= 1024
##$WBSW= 25
##$XGAIN= (0..3)
0 0 0 0 
##$XL= 0
##$YL= 0
##$YMAX_a= 2995271
##$YMIN_a= -1660236
##$ZGOPTNS= <>
##$ZL1= 120
##$ZL2= 120
##$ZL3= 120
##$ZL4= 120
##$ABSF1= 17.49637
##$ABSF2= -4.496376
##$ABSG= 5
##$ABSL= 3
##$ALPHA= 0
##$AQORDER= 0
##$ASSFAC= 0
##$ASSFACI= 0
##$ASSFACX= 0
##$ASSWID= 0
##$AUNMP= <proc_1d>
##$AXLEFT= 0
##$AXRIGHT= 0
##$AXTYPE= 0
##$AXUNIT= <>
##$AZFE= 0.1
##$AZFW= 0.1
##$BCFW= 0
##$BC_mod= 2
##$BYTORDP= 0
##$COROFFS= 0
##$CY= 7568.61572265625
##$DATMOD= 1
##$DC= 0
##$DFILT= <>
##$DTYPP= 0
##$F1P= 17.9538593292236
##$F2P= -4.03888763876832
##$FCOR= 0.5
##$FTSIZE= 32768
##$FT_mod= 6
##$GAMMA= 0
##$GB= 0
##$INTBC= 0
##$INTSCL= 1.367314e-010
##$ISEN= 128
##$LB= 0.02
##$LEV0= 0
##$LPBIN= 0
##$MAXI= 945.577
##$MC2= 0
##$MEAN= 0
##$ME_mod= 0
##$MI= -402.1523
##$NCOEF= 0
##$NC_proc= -5
##$NLEV= 6
##$NOISF1= 8.587773
##$NOISF2= 6.764455
##$NSP= 0
##$NTH_PI= 0
##$NZP= 0
##$OFFSET= 17.49637
##$PC= 1
##$PHC0= 122.3195
##$PHC1= 0.9126797
##$PH_mod= 1
##$PKNL= yes
##$PPARMOD= 0
##$PPDIAG= 0
##$PPIPTYP= 0
##$PPMPNUM= 100
##$PPRESOL= 1
##$PSCAL= 0
##$PSIGN= 0
##$REVERSE= no
##$SF= 200.13
##$SI= 32768
##$SIGF1= 16.12182
##$SIGF2= -4.496377
##$SINO= 3.521527
##$SIOLD= 32768
##$SREGLST= <1H.CDCl3>
##$SSB= 0
##$STSI= 32768
##$STSR= 0
##$SW_p= 4401.40845070422
##$SYMM= 0
##$S_DEV= 0
##$TDeff= 16384
##$TDoff= 0
##$TI= <>
##$TILT= no
##$TM1= 0
##$TM2= 0
##$TOPLEV= 0
##$USERP1= <user>
##$USERP2= <user>
##$USERP3= <user>
##$USERP4= <user>
##$USERP5= <user>
##$WDW= 1
##$XDIM= 32768
##$YMAX_p= 357621864
##$YMIN_p= -742499
$$ End of Bruker specific parameters
$$ ---------------------------------
##NTUPLES= NMR SPECTRUM
##VAR_NAME=  FREQUENCY,     SPECTRUM/REAL,   SPECTRUM/IMAG
##SYMBOL=    X,             R,               I
##VAR_TYPE=  INDEPENDENT,   DEPENDENT,       DEPENDENT
##VAR_FORM=  AFFN,          ASDF,            ASDF
##VAR_DIM=   32768,         32768,           32768
##UNITS=     HZ,            ARBITRARY UNITS, ARBITRARY UNITS
##FACTOR=    0.134324425510551, 1,           1
##FIRST=     4401.40845070422, -5588,        -1741809
##LAST=      0,             -182819,         -1845148
##MIN=       0,             -742499,         0
##MAX=       4401.40845070422, 357621864,    0
$$ Real data points
##PAGE= N=1
##DATA TABLE= (X++(R..R)), XYDATA
$$ [...]
$$ plain form
12929 28895483 28968426 29341768 29827474 30201981 30330718 30187136 29926722 29858772 30154833 30619552
12919 30619552 30907893 30929006 30871348 30867258 30835731 30684479 30484469 30355019 30283379 30150617
12909 30150617 29901156 29633179 29507090 29550622 29577588 29380196 29000880 28682962 28522610 28352339
12899 28352339 28056561 27784511 27679772 27607546 27386871 27108850 26940917 26789862 26511859
12890 26511859 26311258 26488814 26852440 26866441 26428070 26006183 25898538 25860268 25670509 25550246
12880 25550246 25689299 25814713 25644193 25393791 25379099 25432383 25222176 24892338 24822416 24927089
12870 24927089 24787911 24400071 24181314 24226895 24160730 23835795 23598826 23648535 23655571 23311585
12860 23311585 22822236 22535520 22437446 22332247 22208012 22102936 21886524 21497006 21155134
$$ packed form
12929B8895483P2943L73342M85706L74507J28737j43582k60414o7950K96061M64719
12919C0619552K88341K1113n7658m090l1527j51252k00010j29450p1640j32762
12909C0150617k49461k67977j26089M3532K6966j97392l79316l17918j60352j70271
12899B8352339k95778k72050j04739p2226k20675k78021j67933j51055k78003
12890B6511859k00601J77556L63626J4001m38371m21887j07645l8270j89759j20263
12880B5550246J39053J25414j70520k50402j4692N3284k10207l29838o9922J04673
12870B4927089j39178l87840k18757M5581o6165l24935k36969M9709P036l43986
12860B3311585m89349k86716r8074j05199j24235j05076k16412l89518l41872
$$ plain form
12851 21155134 21034556 20954756 20705416 20420135 20279739 20099099 19633824 19105160 18948871
12842 18948871 19141357 19231328 18996965 18632833 18296257 17918378 17523596 17315857 17330988 17351277
12832 17351277 17263429 17169514 17066527 16789261 16391375 16196441 16284687 16289213 15938477 15484288
12822 15484288 15319403 15429477 15502561 15374321 15104415 14792576 14560470 14548993 14714950 14798037
12812 14798037 14673984 14523504 14462204 14298741 13935964 13689852 13814368 13985048 13743347
12803 13743347 13260209 13107711 13367854 13551411 13410293 13237347 13240101 13191027 12932482 12716642
12793 12716642 12728801 12707932 12408811 12080296 12072617 12244284 12193343 11894365 11677436 11675947
12783 11675947 11696916 11606939 11491388 11418505 11345353 11280910 11280715 11259839 11059568 10730218 10517164
$$ packed form
12851B1155134j20578p9800k49340k85281j40396j80640m65275n28664j56289
12842A8948871J92486Q9971k34363l64132l36576l77879l94782k07739J5131K0289
12832A7351277q7848r3915j02987k77266l97886j94934Q8246M526l50736m54189
12822A5484288j64885J10074P3084j28240k69906l11839k32106j1477J65957Q3087
12812A4798037j24053j50480o1300j63463l62777k46112J24516J70680k41701
12803A3743347m83138j52498K60143J83557j41118j72946K754m9074k58545k15840
12793A2716642J2159k0869k99121l28515p679J71667n0941k98978k16929j489
12783A1675947K0969q9977j15551p2883p3152o4443j95k0876k00271l29350k13054
$$ plain form
12772 10517164 10525573 10604597 10596514 10501633 10367674 10218073 10127688 10174680 10279766 10282846 10198096
12761 10198096 10172914 10173350 9989536 9637533 9453730 9616107 9841524 9799605 9606325 9605203
12751 9605203 9803841 9872187 9665703 9420548 9365146 9412795 9373239 9268105 9258226 9362395
12741 9362395 9421372 9324475 9150946 9060813 9109761 9206249 9229832 9159633 9067644 8998331 8907863
12730 8907863 8758372 8623871 8620014 8730528 8790157 8683796 8505092 8452714 8588450 8758909
12720 8758909 8767583 8582893 8355883 8264483 8370393 8600344 8809197 8856040 8682297 8365424
12710 8365424 8074265 7934130 7947455 8059598 8246027 8474229 8629153 8588801 8389737 8221750
12700 8221750 8207051 8252428 8189856 8024884 7954718 8113481 8360841 8405051 8152888 7856781
$$ packed form
12772A0517164Q409P9024q083r4881j33959j49601r0385M6992J05086L080q4750
12761A0198096k5182M36j83814l52003j83803J62377K25417m1919j93280j122
12751I605203J98638O8346k06484k45155n5402M7649l9556j05134r879J04169
12741I362395N8977r6897j73529r0133M8948R6488K3583p0199r1989o9313r0468
12730H907863j49491j34501l857J10514N9629j06361j78704n2378J35736J70459
12720H758909Q674j84690k27010r1400J05910K29951K08853M6843j73743l16873
12710H365424k91159j40135J3325J12143J86429K28202J54924m0352j99064j67987
12700H221750j4699M5377o2572j64972p0166J58763K47360M4210k52163k96107
$$ plain form
12690 7856781 7823970 8025346 8144956 8033492 7910600 7996638 8143510 8067945 7822760 7727234
12680 7727234 7860433 7957919 7874605 7818114 7964683 8134942 8081578 7875256 7746678 7717612
12670 7717612 7662374 7602604 7647207 7723156 7663950 7526115 7525864 7668500 7732437 7650917 7620640
12659 7620640 7753815 7885290 7839283 7671626 7534187 7487075 7541520 7697166 7840138 7803851
12649 7803851 7636816 7598993 7768190 7877843 7713436 7448645 7374219 7485450 7581818 7612704
12639 7612704 7654221 7670567 7590282 7536464 7680994 7908320 7922066 7690479 7502565 7545601
12629 7545601 7694824 7782330 7814112 7826800 7769962 7654499 7610577 7667498 7666808 7534396 7451505
12618 7451505 7577895 7760950 7730902 7492944 7321163 7399054 7632867 7809506 7807806 7658138
$$ packed form
12690G856781l2811K01376J19610j11464j22892Q6038J46872p5565k45185r5526
12680G727234J33199R7486q3314n6491J46569J70259n3364k06322j28578k9066
12670G717612n5238n9770M4603P5949n9206j37835k51J42636O3937q1520l0277
12659G620640J33175J31475m6007j67657j37439m7112N4445J55646J42972l6287
12649G803851j67035l7823J69197J09653j64407k64791p4426J11231R6368L0886
12639G612704M1517J6346q0285n3818J44530K27326J3746k31587j87914M3036
12629G545601J49223Q7506L1782J2688n6838j15463m3922N6921o90j32412q2891
12618G451505J26390J83055l0048k37958j71781P7891K33813J76639j700j49668
$$ plain form
12608 7658138 7496743 7460638 7560745 7678822 7726100 7732419 7728614 7661688 7536202 7517720 7724122
12597 7724122 7992233 8048576 7879476 7731758 7748954 7820647 7833682 7848469 7914870 7912164 7751462
12586 7751462 7600001 7682265 7916819 7988407 7807714 7669723 7832637 8122166 8167422 7944203
12576 7944203 7819491 8014878 8282271 8278062 8065369 7983405 8109866 8167467 8000384 7839042
12566 7839042 7938969 8192458 8313127 8247167 8170749 8185236 8253697 8375742 8577461 8745017
12556 8745017 8711856 8536809 8470925 8600343 8739197 8745813 8722199 8783978 8838783 8762880 8647264
12545 8647264 8676748 8847209 8974616 8950956 8862287 8865619 9025002 9244668 9333501 9205224
12535 9205224 9029880 9060725 9279385 9390729 9244877 9050056 9031000 9111646 9151522 9261557
$$ packed form
12608G658138j61395l6105J00107J18077M7278O319l805o6926j25486j8482K06402
12597G724122K68111N6343j69100j47718J7196P1693J3035J4787O6401k706j60702
12586G751462j51461Q2264K34554P1588j80693j37991J62914K89529M5256k23219
12576G944203j24712J95387K67393m209k12693q1964J26461N7601j67083j61342
12566G839042R9927K53489J20669o5960p6418J4487O8461J22045K01719J67556
12556H745017l3161j75047o5884J29418J38854O616k3614O1779N4805p5903j15616
12545H647264K9484J70461J27407k3660q8669L332J59383K19666Q8833j28277
12535I205224j75344L0845K18660J11344j45852j94821j9056Q0646L9876J10035
$$ plain form
12525 9261557 9565100 9821647 9694409 9324997 9211292 9480391 9710881 9603482 9417060
12516 9417060 9509075 9792239 9954991 9961508 9986450 10023338 9920660 9738013 9732698 9980285 10274120
12505 10274120 10437031 10511598 10592784 10660085 10644196 10532968 10371957 10255878 10307544 10545763
12495 10545763 10795727 10864540 10782310 10730901 10777162 10848103 10923889 11036960 11099319 10985731
12485 10985731 10812274 10855497 11121785 11286648 11190326 11094469 11239812 11432839 11375512 11191925
12475 11191925 11249351 11552468 11706527 11505938 11218524 11187372 11423046 11716174 11928314 12023119
12465 12023119 11990015 11900362 11912378 12075350 12236306 12274549 12314132 12535095 12856888 13008627
12455 13008627 12900042 12741552 12758566 12930473 13079769 13114348 13093484 13108110 13179782 13273300
$$ packed form
12525I261557L03543K56547j27238l69412j13705K69099K30490j07399j86422
12516I417060R2015K83164J62752O517K4942L6888j02678j82647n315K47587K93835
12505A0274120J62911P4567Q1186O7301j5889j11228j61011j16079N1666K38219
12495A0545763K49964O8813q2230n1409M6261P0941P5786J13071O2359j13588
12485A0985731j73457M3223K66288J64863r6322r5857J45343J93027n7327j83587
12475A1191925N7426L03117J54059k00589k87414l1152K35674K93128K12140R4805
12465A2023119l3104q9653J2016J62972J60956L8243L9583K20963L21793J51739
12455A3008627j08585j58490J7014J71907J49296L4579k0864J4626P1672R3518
$$ plain form
12445 13273300 13361012 13461091 13618152 13839529 14055316 14171906 14182336 14200024 14348720 14615456
12435 14615456 14843523 14903333 14860477 14919068 15168338 15447456 15547080 15507826 15577945 15845650
12425 15845650 16079363 16055854 15911107 15961456 16242049 16478312 16541372 16651222 16982370 17318421
12415 17318421 17363417 17245008 17379400 17865144 18340878 18514095 18520758 18606193 18732326 18755539
12405 18755539 18790419 19074074 19553261 19921436 20067303 20204443 20503515 20850768 21072400
12396 21072400 21191000 21339435 21580898 21918657 22334769 22725053 22954160 23075965 23328861
12387 23328861 23793144 24236438 24454417 24583718 24879776 25343165 25790809 26160907 26500109
12378 26500109 26766956 26927352 27161695 27678960 28369774 28942750 29373895 29896617 30552158
$$ packed form
12445A3273300Q7712J00079J57061K21377K15787J16590J0430J7688J48696K66736
12435A4615456K28067N9810m2856N8591K49270K79118R9624l9254P0119K67705
12425A5845650K33713k3509j44747N0349K80593K36263O3060J09850L31148L36051
12415A7318421M4996j18409J34392M85744M75734J73217O663Q5435J26133K3213
12405A8755539L4880K83655M79187L68175J45867J37140K99072L47253K21632
12396B1072400J18600J48435K41463L37759M16112L90284K29107J21805K52896
12387B3328861M64283M43294K17979J29301K96058M63389M47644L70098L39202
12378B6500109K66847J60396K34343N17265O90814N72976M31145N22722O55541
$$ plain form
12369 30552158 31118232 31544426 32074340 32794932 33434070 33824704 34245758 35019354 36020290
12360 36020290 36892735 37572636 38286594 39150649 40058879 40905509 41681140 42405674 43158513
12351 43158513 44086514 45188198 46201401 46923206 47528931 48331557 49329192 50257581 51001079
12342 51001079 51656504 52248786 52698838 53064051 53512163 54041692 54501559 54889185 55340305
12333 55340305 55819363 56140567 56333517 56657651 57188875 57730339 58219537 58854477 59672640
12324 59672640 60385043 60847865 61349529 62159472 63112000 63958247 64841730 66030725 67383302
12315 67383302 68506976 69351227 70236914 71325369 72433117 73407809 74353964 75386689 76408462
12306 76408462 77239655 77811415 78171124 78427213 78703457 79021253 79244209 79270654 79228418 79315021
$$ packed form
12369C0552158N66074M26194N29914P20592O39138L90634M21054P73596J000936
12360C6020290Q72445O79901P13958Q64055R08230Q46630P75631P24534P52839
12351D3158513R28001J101684J013203P21805O05725Q02626R97635R28389P43498
12342E1001079O55425N92282M50052L65213M48112N29529M59867L87626M51120
12333E5340305M79058L21204J92950L24134N31224N41464M89198O34940Q18163
12324E9672640P12403M62822N01664Q09943R52528Q46247Q83483J188995J352577
12315F7383302J123674Q44251Q85687J088455J107748R74692R46155J032725J021773
12306G6408462Q31193N71760L59709K56089K76244L17796K22956K6445m2236Q6603
$$ plain form
12296 79315021 79508894 79642806 79712774 79875816 80154020 80388547 80517518 80673201 80953759
12287 80953759 81299611 81647791 82030818 82489054 83055330 83821461 84808561 85782500 86469332
12278 86469332 86986312 87755799 88900416 90037971 90838807 91491347 92377535 93515132 94595435
12269 94595435 95430362 96105936 96775796 97513142 98306150 99037389 99544484 99840173 100162702
12260 100162702 100660000 101162039 101453401 101627314 101922002 102310057 102543009 102579201 102679260
12251 102679260 103020811 103453017 103734292 103851171 103995792 104321060 104794848 105252828 105571695
12242 105571695 105812655 106154594 106652200 107161904 107589622 108070832 108742169 109462497 109994652
12233 109994652 110391993 110942648 111748867 112627651 113446336 114279726 115168391 115996772 116732009
$$ packed form
12296G9315021J93873J33912O9968J63042K78204K34527J28971J55683K80558
12287H0953759L45852L48180L83027M58236N66276P66131R87100R73939O86832
12278H6469332N16980P69487J144617J137555Q00836O52540Q86188J137597J080303
12269I4595435Q34927O75574O69860P37346P93008P31239N07095K95689L22529
12260A00162702M97298N02039K91362J73913K94688L88055K32952L6192J00059
12251A02679260L41551M32206K81275J16879J44621L25268M73788M57980L18867
12242A05571695K40960L41939M97606N09704M27718M81210O71337P20328N32155
12233A09994652L97341N50655Q06219Q78784Q18685Q33390Q88665Q28381P35237
$$ plain form
12224 116732009 117534090 118471700 119353238 120028326 120651743 121411454 122158182 122594915 122760081
12215 122760081 123027303 123601867 124256816 124637159 124640347 124411529 124118640 123849260 123628583
12206 123628583 123412063 123095296 122621514 122064706 121543352 121070527 120557470 119961311 119353590
12197 119353590 118816012 118339097 117885992 117501942 117254988 117075177 116779089 116309326 115840662
12188 115840662 115554508 115398556 115199338 114947663 114804891 114838545 114923267 114935315 114885817 114805346
12178 114805346 114656990 114462512 114374424 114481402 114627952 114568892 114259639 113877212 113591352
12169 113591352 113427492 113325089 113207206 112989522 112625813 112166237 111697826 111222819 110674357
12160 110674357 110061595 109509933 109112290 108797918 108402442 107847144 107211853 106636738 106181299
$$ packed form
12224A16732009Q02081R37610Q81538O75088O23417P59711P46728M36733J65166
12215A22760081K67222N74564O54949L80343L188k28818k92889k69380k20677
12206A23628583k16520l16767m73782n56808n21354m72825n13057n96159o07721
12197A19353590n37578m76915m53105l84050k46954j79811k96088m69763m68664
12188A15840662k86154j55952j99218k51675j42772L3654Q4722J2048m9498q0471
12178A14805346j48356j94478q8088J06978J46550n9060l09253l82427k85860
12169A13591352j63860j02403j17883k17684l63709m59576m68411m75007n48462
12160A10674357o12762n51662l97643l14372l95476n55298o35291n75115m55439
$$ plain form
12151 106181299 105794983 105412263 105034537 104691469 104366486 104033182 103743656 103575298 103476900
12142 103476900 103298547 103042138 102947603 103188538 103569097 103713408 103550177 103420599 103638205
12133 103638205 104098459 104452024 104564759 104636551 104881516 105263756 105621570 105919633 106237439
12124 106237439 106572910 106833612 107032116 107304296 107655974 107880384 107888547 107954981 108378695 108992765
12114 108992765 109333730 109309235 109346839 109750736 110247376 110424458 110361214 110475968 110882848 111269666
12104 111269666 111404661 111434874 111603564 111927174 112267110 112538958 112740379 112904443 113109981
12095 113109981 113425282 113782286 114025820 114142314 114312489 114673062 115151226 115605574 116002260
12086 116002260 116363478 116666731 116910732 117182851 117539300 117898493 118183521 118506329 119053411
$$ packed form
12151A06181299l86316l82720l77726l43068l24983l33304k89526j68358r8398
12142A03476900j78353k56409r4535K40935L80559J44311j63231j29578K17606
12133A03638205M60254L53565J12735P1792K44965L82240L57814K98063L17806
12124A06237439L35471K60702J98504K72180L51678K24410Q163O6434M23714O14070
12114A08992765L40965k4495L7604M03897M96640J77082o3244J14754M06880L86818
12104A11269666J34995L0213J68690L23610L39936K71848K01421J64064K05538
12095A13109981L15301L57004K43534J16494J70175L60573M78164M54348L96686
12086A16002260L61218L03253K44001K72119L56449L59193K85028L22808N47082
$$ plain form
12077 119053411 119796982 120469394 120880156 121162383 121621559 122378024 123250737 124019104 124715944
12068 124715944 125557992 126613301 127697568 128669774 129667768 130882884 132217315 133410051
12060 133410051 134475725 135748391 137421215 139285428 141056654 142752819 144564327 146501892
12052 146501892 148395829 150180401 151981055 153925569 156009754 158147815 160248007 162255238
12044 162255238 164219333 166293723 168554179 170837667 172887764 174678387 176485311 178589499
12036 178589499 180973802 183352945 185460467 187268445 188945692 190644411 192359604 193991205
12028 193991205 195480737 196831396 198042416 199114414 200090412 200982171 201676777 202053680
12020 202053680 202193743 202313921 202471633 202505860 202311963 201979569 201583079 201042862 200308677
$$ packed form
12077A19053411P43571O72412M10762K82227M59176P56465Q72713P68367O96840
12068A24715944Q42048J055309J084267R72206R97994J215116J334431J192736
12060A33410051J065674J272666J672824J864213J771226J696165J811508J937565
12052A46501892J893937J784572J800654J944514K084185K138061K100192K007231
12044A62255238J964095K074390K260456K283488K050097J790623J806924K104188
12036A78589499K384303K379143K107522J807978J677247J698719J715193J631601
12028A93991205J489532J350659J211020J071998R75998Q91759O94606L76903
12020B02053680J40063J20178J57712L4227j93897l32394l96490n40217p34185
$$ plain form
12011 200308677 199478921 198598825 197543546 196264767 194941568 193688959 192337411 190747637
12003 190747637 189119823 187675065 186232374 184497490 182634035 181094568 179929111 178730624
11995 178730624 177307187 175938484 174834894 173788764 172587297 171397000 170462271 169712380
11987 169712380 168943992 168153698 167418480 166659512 165806600 165017252 164442033 163916351 163178513
11978 163178513 162282291 161494886 160861653 160177697 159363392 158562283 157826083 156974218 155871481
11969 155871481 154653720 153561466 152670895 151885168 151107843 150332878 149592233 148879954 148157226
11960 148157226 147436171 146817267 146377031 146044142 145692378 145339773 145103799 144955776 144725616
11951 144725616 144404411 144204951 144206596 144186459 143975374 143734443 143642993 143542554 143189928 142675113
$$ packed form
12011B00308677q29756q80096j055279j278779j323199j252609j351548j589774
12003A90747637j627814j444758j442691j734884j863455j539467j165457j198487
11995A78730624j423437j368703j103590j046130j201467j190297r34729p49891
11987A69712380p68388p90294p35218p58968q52912p89348n75219n25682p37838
11978A63178513q96222p87405o33233o83956q14305q01109p36200q51865j102737
11969A55871481j217761j092254q90571p85727p77325p74965p40645p12279p22728
11960A48157226p21055o18904m40236l32889l51764l52605k35974j48023k30160
11951A44725616l21205j99460J645k0137k11085k40931r1450j00439l52626n14815
$$ plain form
11941 142675113 142245967 141863835 141309158 140620459 140005810 139365398 138369176 137060010 135908418
11932 135908418 135112567 134280065 133051553 131663885 130563025 129728591 128752668 127447516
11924 127447516 126039494 124807739 123791222 122844304 121797222 120581653 119336720 118336104
11916 118336104 117674046 117100436 116321132 115376968 114531710 113843037 113082437 112107793 111097861
11907 111097861 110307891 109732019 109144260 108409297 107611012 106861872 106113453 105255042 104330718
11898 104330718 103494005 102723234 101767851 100502537 99176519 98110487 97255340 96301217 95160178
11889 95160178 94035719 92995031 91799897 90293100 88690091 87308852 86189234 85129949
11881 85129949 83953333 82617265 81211868 79924576 78836974 77720454 76290349 74712938
$$ packed form
11941A42675113m29146l82132n54677o88699o14649o40412r96222j309166j151592
11932A35908418p95851q32502j228512j387668j100860q34434r75923j305152
11924A27447516j408022j231755j016517r46918j047082j215569j244933j000616
11916A18336104o62058n73610p79304r44164q45258o88673p60600r74644j009932
11907A11097861p89970n75872n87759p34963p98285p49140p48419q58411r24324
11898A04330718q36713p70771r55383j265314j326018j066032q55147r54123j141039
11889I5160178j124459j040688j195134j506797j603009j381239j119618j059285
11881H5129949j176616j336068j405397j287292j087602j116520j430105j577411
$$ plain form
11873 74712938 73501218 72766724 71990854 70800989 69543532 68679147 67991108 66946043 65592293
11864 65592293 64480212 63786530 63127478 62256370 61369341 60617499 59848443 58999517 58274491
11855 58274491 57732591 57129480 56368825 55692944 55199672 54594919 53708049 52848259 52304573
11846 52304573 51852751 51152894 50330621 49727513 49310511 48786381 48139000 47591545 47129188
11837 47129188 46514211 45755349 45139717 44756696 44357776 43763099 43094695 42523691 42051787
11828 42051787 41619592 41206099 40771903 40307203 39934008 39728446 39475764 38905000 38161081
11819 38161081 37683040 37553348 37355591 36816997 36201282 35832955 35593698 35218617 34805139
11810 34805139 34622097 34579168 34311876 33759395 33277870 33119548 33101735 32902350 32463815 31983304
$$ packed form
11873G4712938j211720p34494p75870j189865j257457q64385o88039j045065j353750
11864F5592293j112081o93682o59052q71108q87029p51842p69056q48926p25026
11855E8274491n41900o03111p60655o75881m93272o04753q86870q59790n43686
11846E2304573m51822o99857q22273o03108m17002n24130o47381n47455m62357
11837D7129188o14977p58862o15632l83021l98920n94677o68404n71004m71904
11828D2051787m32195m13493m34196m64700l73195k05562k52682n70764p43919
11819C8161081m78041j29692j97757n38594o15715l68327k39257l75081m13478
11810C4805139j83042m2929k67292n52481m81525j58322j7813j99385m38535m80511
$$ plain form
11800 31983304 31650997 31498845 31407572 31198295 30802483 30375545 30148185 30140497 30128488 29923678
11790 29923678 29575770 29258678 29067554 28983208 28931201 28807259 28539909 28206969 28005118 28016683
11780 28016683 28082667 28004849 27805692 27669924 27674330 27709939 27664192 27551356 27439287 27358624
11770 27358624 27325941 27361544 27426236 27408716 27233072 26939378 26634455 26414030 26329937 26333284
11760 26333284 26235616 25869863 25350783 25010672 24959539 24885813 24487223 23935784 23626049 23562436
11750 23562436 23369345 22922764 22560048 22507244 22483820 22162386 21715952 21529565 21564624 21440061
11740 21440061 21070035 20781386 20751736 20736641 20502889 20195201 20054455 20023300 19885234 19636542
11730 19636542 19467665 19446197 19428893 19277091 19019282 18801988 18756103 18874744 18970006 18830558
$$ packed form
11800C1983304l32307j52152r1273k09277l95812m26938k27360p688j2009k04810
11790B9923678l47908l17092j91124q4346n2007j23942k67350l32940k01851J1565
11780B8016683O5984p7818j99157j35768M406L5609m5747j12836j12069q0663
11770B7358624l2683L5603O4692j7520j75644k93694l04923k20425q4093L347
11760B6333284r7668l65753n19080l40111n1133p3726l98590n51439l09735o3613
11750B3562436j93091m46581l62716n2804k3424l21434m46434j86387L5059j24563
11740B1440061l70026k88649k9650j5095k33752l07688j40746l1155j38066k48692
11730A9636542j68877k1468j7304j51802k57809k17294m5885J18641R5262j39448
$$ plain form
11720 18830558 18489529 18233870 18255374 18400239 18384429 18155752 17893868 17729037 17626620 17507961
11710 17507961 17327478 17052435 16714637 16467876 16445392 16559671 16587805 16466363 16352269 16353804
11700 16353804 16346687 16141903 15746349 15371028 15214589 15281717 15393566 15364937 15186761 15010938
11690 15010938 14937409 14893518 14790393 14694831 14706404 14744850 14654836 14489147 14460668 14587840
11680 14587840 14625839 14437193 14203867 14127704 14120797 13988418 13763835 13630539 13610609 13573094
11670 13573094 13500461 13495067 13522383 13404297 13129397 12934273 12961976 13041686 12961822 12793638
11660 12793638 12747652 12827036 12849507 12758431 12678844 12659515 12587065 12421267 12311773 12363758 12446833
11649 12446833 12379340 12185622 12025261 11961794 11949211 11959750 11963320 11864511 11646076 11492950
$$ packed form
11720A8830558l41029k55659K1504J44865j5810k28677k61884j64831j02417j18659
11710A7507961j80483k75043l37798k46761k2484J14279K8134j21442j14094J535
11700A6353804p117k04784l95554l75321j56439O7128J11849k8629j78176j75823
11690A5010938p3529m3891j03125r5562J1573L8446r0014j65689k8479J27172
11680A4587840L7999j88646k33326p6163o907j32379k24583j33296j9930l7515
11670A3573094p2633n394K7316j18086k74900j95124K7703P9710p9864j68184
11660A2793638m5986P9384K2471r1076p9587j9329p2450j65798j09494N1985Q3075
11649A2446833o7493j93718j60361o3467j2583J0539L570r8809k18435j53126
$$ plain form
11639 11492950 11547723 11619743 11436259 11150517 11213992 11658770 11926998 11645182 11185926 11105663
11629 11105663 11333252 11379039 11155246 11050369 11221648 11347145 11195400 10980656 10951657 11006505
11619 11006505 10956750 10860749 10832209 10778488 10606021 10470410 10537030 10667962 10635156 10502474
11609 10502474 10501435 10633064 10687393 10591393 10460657 10353612 10237720 10158630 10182271 10207253
11599 10207253 10103933 10001300 10130579 10390414 10406273 10084743 9783267 9812505 10061945 10261402
11589 10261402 10340805 10356218 10303367 10205931 10187773 10261247 10229836 9998090 9789498 9831982 10003032
11578 10003032 10043575 9970580 9982235 10062946 10009140 9808360 9673752 9686359 9700052 9649671 9662938
11567 9662938 9773542 9799398 9653248 9537485 9644234 9850296 9917939 9852664 9829654 9859529
$$ packed form
11639A1492950N4773P2020j83484k85742O3475M44778K68228k81816m59256q0263
11629A1105663K27589M5787k23793j04877J71279J25497j51745k14744k8999N4848
11619A1006505m9755r6001k8540n3721j72467j35611O6620J30932l2806j32682
11609A0502474j039J31629N4329r6000j30736j07045j15892p9090K3641K4982
11599A0207253j03320j02633J29279K59835J5859l21530l01476K9238K49440J99457
11589A0261402P9403J5413n2851r7436j8158P3474l1411k31746k08592M2484J71050
11578A0003032M0543p2995J1655Q0711n3806k00780j34608J2607J3693n0381J3267
11567I662938J10604K5856j46150j15763J06749K06062O7643o5275k3010K9875
$$ plain form
11557 9859529 9781994 9576326 9438636 9491495 9605514 9609263 9538245 9546444 9648136 9685602 9548098
11546 9548098 9324339 9208941 9304213 9528214 9687995 9648214 9465870 9346174 9409571 9519164
11536 9519164 9436229 9161499 8987538 9125178 9403130 9493946 9354371 9236736 9291638 9399553
11526 9399553 9440250 9475601 9539687 9487124 9259343 9112054 9301733 9653239 9738733 9458651
11516 9458651 9153889 9111827 9243431 9337919 9373447 9419218 9435041 9360606 9275916 9298196 9401539
11505 9401539 9476470 9488927 9458255 9369209 9241438 9200187 9324035 9482890 9478768 9304881 9125837
11494 9125837 9047321 9052419 9120082 9236087 9306940 9240594 9119866 9125214 9265632 9361128 9329105
11483 9329105 9297321 9350899 9353643 9164364 8897067 8794160 8906074 9050811 9066799 8977235
$$ packed form
11557I859529p7535k05668j37690N2859J14019L749p1018Q199J01692L7466j37504
11546I548098k23759j15398R5272K24001J59781l9781j82344j19696O3397J09593
11536I519164q2935k74730j73961J37640K77952R0816j39575j17635N4902J07915
11526I399553M0697L5351O4086n2563k27781j47289J89679L51506Q5494k80082
11516I458651l04762m2062J31604R4488L5528M5771J5823p4435q4690K2280J03343
11505I401539P4931J2457l0672q9046j27771m1251J23848J58855m122j73887j79044
11494I125837p8516N098O7663J16005P0853o6346j20728N348J40418R5496l2023
11483I329105l1784N3578K744j89279k67297j02907J11914J44737J5988q9564
$$ plain form
11473 8977235 8906011 8935742 9059639 9192266 9217017 9093800 8934569 8908666 9049383 9208466
11463 9208466 9240191 9190851 9242602 9462551 9672076 9636446 9370396 9155326 9205394 9414818
11453 9414818 9536845 9523121 9517158 9557753 9518453 9383663 9344238 9487222 9604137 9509440 9375343
11442 9375343 9479172 9726428 9757413 9527519 9431500 9720731 10095655 10112034 9795288 9568983
11432 9568983 9662313 9877172 9958639 9937089 9988557 10134742 10249510 10287555 10346748 10498745
11422 10498745 10675228 10771005 10790892 10829719 10936013 11062382 11153271 11218914 11291904 11359664
11412 11359664 11388033 11380312 11362763 11340132 11321767 11355876 11455180 11517548 11437532 11297877 11308497
11401 11308497 11506220 11659425 11570892 11349303 11235028 11249678 11208329 11052550 10968939 11116230
$$ packed form
11473H977235p1224K9731J23897J32627K4751j23217j59231k5903J40717J59083
11463I208466L1725m9340N1751K19949K09525l5630k66050k15070N0068K09424
11453I414818J22027j3724n963M0595l9300j34790l9425J42984J16915r4697j34097
11442I375343J03829K47256L0985k29894r6019K89231L74924J6379l16746k26305
11432I568983R3330K14859Q1467k1550N1468J46185J14768L8045N9193J51997
11422A0498745J76483R5777J9887L8827J06294J26369R0889O5643P2990O7760
11412A1359664K8369p721j7549k2631j8365L4109R9304O2368q0016j39655J0620
11401A1308497J97723J53205q8533k21589j14275J4650m1349j55779q3611J47291
$$ plain form
11391 11116230 11379409 11490310 11321831 10998484 10763577 10773174 10970947 11140989 11131248 11025577
11381 11025577 11023524 11156569 11237192 11120817 10900915 10778597 10835098 11004222 11178582 11262469
11371 11262469 11205556 11076726 11034547 11142389 11289118 11366803 11414818 11482272 11483502 11356838
11361 11356838 11248305 11325418 11500173 11583765 11639952 11870748 12172183 12187154 11895556 11759015
11351 11759015 12060499 12452197 12481904 12284530 12334567 12684157 12915569 12814157 12631338 12604317
11341 12604317 12633413 12603259 12663080 12939983 13237008 13288042 13142157 13051989 13112913 13238425
11331 13238425 13380527 13548418 13691676 13776000 13902179 14147469 14367985 14381268 14278300 14309689
11321 14309689 14504432 14661551 14702744 14753291 14854204 14892458 14888685 15055016 15437706 15780210
$$ packed form
11391A1116230K63179J10901j68479l23347k34907R597J97773J70042r741j05671
11381A1025577k053J33045Q0623j16375k19902j22318N6501J69124J74360Q3887
11371A1262469n6913j28830m2179J07842J46729P7685M8015O7454J230j26664
11361A1356838j08533P7113J74755Q3592N6187K30796L01435J4971k91598j36541
11351A1759015L01484L91698K9707j97374N0037L49590K31412j01412j82819k7021
11341A2604317K9096l0154N9821K76903K97025N1034j45885r0168O0924J25512
11331A3238425J42102J67891J43258Q4324J26179K45290K20516J3283j02968L1389
11321A4309689J94743J57119M1193N0547J00913L8254l773J66331L82690L42504
$$ plain form
11311 15780210 15913525 16023226 16308194 16607499 16652397 16529805 16582222 16916791 17297996 17509137
11301 17509137 17573926 17617260 17724971 17954511 18292070 18595607 18763470 18937284 19319716 19807813
11291 19807813 20075351 20057395 20070905 20356453 20772470 21094855 21364396 21721932 22099700 22332729
11281 22332729 22459491 22676251 23064364 23560796 24123071 24721881 25241911 25613213 25998234
11272 25998234 26616509 27393652 28016868 28363431 28650935 29110263 29725769 30384877 31080216
11263 31080216 31830771 32560687 33208868 33859554 34636220 35542819 36512817 37532451 38611983
11254 38611983 39717548 40839295 42042168 43327397 44533992 45544000 46529825 47794698
11246 47794698 49350496 50850471 52035473 53100971 54469986 56257861 58115698 59633761
$$ packed form
11311A5780210J33315J09701K84968K99305M4898j22592N2417L34569L81205K11141
11301A7509137O4789M3334J07711K29540L37559L03537J67863J73814L82432M88097
11291A9807813K67538j7956J3510K85548M16017L22385K69541L57536L77768K33029
11281B2332729J26762K16760L88113M96432N62275N98810N20030L71302L85021
11272B5998234O18275P77143O23216L46563K87504M59328O15506O59108O95339
11263C1080216P50555P29916O48181O50686P76666R06599R69998J019634J079532
11254C8611983J105565J121747J202873J285229J206595J010008R85825J264873
11246D7794698J555798J499975J185002J065498J369015J787875J857837J518063
$$ plain form
11238 59633761 60786649 61889764 63168038 64497262 65609022 66431305 67099837 67684388
11230 67684388 68070269 68144781 67956273 67608515 67113032 66446467 65651896 64755687 63667663
11221 63667663 62324049 60883606 59602398 58510205 57383041 56072428 54692230 53406514
11213 53406514 52200175 50993171 49853198 48908810 48099488 47200704 46128548 45075484
11205 45075484 44274186 43724532 43238106 42687398 42108981 41578905 41090579 40596491 40107305
11196 40107305 39685325 39357380 39090218 38858183 38685634 38591444 38520701 38378950 38144800 37923788
11186 37923788 37863328 38002506 38215200 38329888 38322224 38362386 38632843 39112166 39591712 39915452
11176 39915452 40154692 40520330 41134220 41911440 42655634 43271296 43894232 44772052 45967252
$$ packed form
11238E9633761J152888J103115J278274J329224J111760Q22283O68532N84551
11230F7684388L85881P4512j88508l47758m95483o66565p94571q96209j088024
11221F3667663j343614j440443j281208j092193j127164j310613j380198j285716
11213E3406514j206339j207004j139973r44388q09322q98784j072156j053064
11205D5075484q01298n49654m86426n50708n78417n30076m88326m94088m89186
11196D0107305m21980l27945k67162k32035j72549r4190p0743j41751k34150k21012
11186C7923788o0460J39178K12694J14688p664M0162K70457M79323M79546L23740
11176C9915452K39240L65638O13890P77220P44194O15662O22936Q77820J195200
$$ plain form
11167 45967252 47244519 48366695 49445752 50807138 52502318 54203361 55679725 57122635
11159 57122635 58798895 60609145 62268635 63746254 65165969 66376782 67042714 67166510
11151 67166510 67090735 66885714 66193755 64898369 63499174 62439880 61404063 59771514 57591448
11142 57591448 55570376 54108621 52847057 51294178 49485972 47799528 46413014 45220651
11134 45220651 44110831 43076555 42115559 41198589 40317846 39477833 38683805 37992019 37487405
11125 37487405 37148135 36819697 36390558 35914176 35504359 35199050 34972253 34773860 34513597
11116 34513597 34138850 33789195 33713518 33929405 34122622 34028683 33774751 33669471 33771996 33877935
11106 33877935 33860822 33806481 33823565 33916343 34062428 34259949 34481775 34711902 35015267 35432890
$$ packed form
11167D5967252J277267J122176J079057J361386J695180J701043J476364J442910
11159E7122635J676260J810250J659490J477619J419715J210813O65932J23796
11151F7166510p5775k05021o91959j295386j399195j059294j035817j632549k180066
11142E7591448k021072j461755j261564j552879j808206j686444j386514j192363
11134D5220651j109820j034276r60996r16970q80743q40013p94028o91786n04614
11125C7487405l39270l28438m29139m76382m09817l05309k26797j98393k60263
11116C4513597l74747l49655p5677K15887J93217r3939k53932j05280J02525J05939
11106C3877935j7113n4341J7084R2778J46085J97521K21826K30127L03365M17623
$$ plain form
11096 35432890 35840534 36093177 36298902 36737015 37471598 38265450 38949811 39654070 40538624
11087 40538624 41510845 42409931 43329433 44510018 45956570 47389155 48613625 49777634
11079 49777634 51175595 52878970 54634964 56121834 57272123 58307824 59420001 60459569
11071 60459569 61069968 61137036 60929370 60686068 60240266 59265136 57799496 56264946 54946065
11062 54946065 53697280 52258186 50659217 49161366 47918396 46861216 45853139 44815107
11054 44815107 43730639 42660815 41746373 41071948 40517913 39865729 39082553 38383247 37943432
11045 37943432 37658739 37299828 36831392 36425365 36173323 35956513 35662371 35379566 35250589
11036 35250589 35229878 35153138 35004826 34934736 34991476 35022382 34921777 34826217 34925008 35164197
$$ packed form
11096C5432890M07644K52643K05725M38113P34583P93852O84361P04259Q84554
11087D0538624R72221Q99086R19502J180585J446552J432585J224470J164009
11079D9777634J397961J703375J755994J486870J150289J035701J112177J039568
11071F0459569O10399O7068k07666k43302m45802r75130j465640j534550j318881
11062E4946065j248785j439094j598969j497851j242970j057180j008077j038032
11054D4815107j084468j069824r14442o74425n54035o52184p83176o99306m39815
11045C7943432k84693l58911m68436m06027k52042k16810k94142k82805j28977
11036C5250589k0711p6740j48312p0090N6740L0906j00605r5560R8791K39189
$$ plain form
11026 35164197 35286110 35140897 34852972 34683804 34793551 35109165 35371548 35363771 35155203 35049379
11016 35049379 35214439 35465364 35534357 35450963 35465560 35656907 35840765 35875473 35846302 35893801
11006 35893801 36034118 36208015 36358090 36418729 36386159 36418975 36677336 37037603 37205282 37166817
10996 37166817 37242678 37572376 37863683 37868714 37810749 38030078 38435198 38659412 38607344 38491550
10986 38491550 38445241 38459754 38603786 38907489 39093854 38858716 38409727 38276090 38540440 38733654
10976 38733654 38591948 38406919 38423330 38406529 38138096 37885564 37949930 38101486 37940362 37553502
10966 37553502 37318667 37246101 37032156 36663597 36446169 36434602 36316037 35932461 35500381 35203643
10956 35203643 34934753 34573579 34212042 33959461 33766140 33542172 33246334 32828931 32325176
$$ packed form
11026C5164197J21913j45213k87925j69168J09747L15614K62383p777k08568j05824
11016C5049379J65060K50925O8993q3394J4597J91347J83858L4708k9171M7499
11006C5893801J40317J73897J50075O0639l2570L2816K58361L60267J67679l8465
10996C7166817P5861L29698K91307N031n7965K19329M05120K24214n2068j15794
10986C8491550m6309J4513J44032L03703J86365k35138m48989j33637K64350J93214
10976C8733654j41706j85029J6411j6801k68433k52532O4366J51556j61124l86860
10966C7553502k34835p2566k13945l68559k17428j1567j18565l83576m32080k96738
10956C5203643k68890l61174l61537k52581j93321k23968k95838m17403n03755
$$ plain form
10947 32325176 31988206 32013314 32134433 31882345 31290310 30899058 30933919 30957769 30585268 30077266
10937 30077266 29857012 29816883 29558647 29066192 28671517 28492316 28330162 28058768 27741497
10928 27741497 27397547 26975784 26546156 26247238 26072648 25938606 25879569 25920044 25855275 25469090
10918 25469090 24911011 24550382 24490463 24514238 24463683 24364355 24209642 23947599 23678213 23555042
10908 23555042 23498956 23318133 23083323 23033399 23124084 23062978 22812527 22637477 22594881 22431785
10898 22431785 22110888 21966880 22136966 22283488 22148491 21969374 22024117 22136424 22001171
10889 22001171 21692997 21469779 21330607 21152449 21034879 21109284 21195671 21053019 20817560 20791926
10879 20791926 20927550 20923084 20738159 20598195 20556273 20465997 20359649 20435617 20647602 20697030
$$ packed form
10947C2325176l36970K5108J21119k52088n92035l91252L4861K3850l72501n08002
10937C0077266k20254m0129k58236m92455l94675j79201j62154k71394l17271
10928B7741497l43950m21763m29628k98918j74590j34042n9037M0475o4769l86185
10918B5469090n58079l60629n9919K3775n0555r9328j54713k62043k69386j23171
10908B3555042n6086j80823k34810m9924R0685o1106k50451j75050m2596j63096
10898B2431785l20897j44008J70086J46522j34997j79117N4743J12307j35253
10889B2001171l08174k23218j39172j78158j17570P4405Q6387j42652k35459k5634
10879B0791926J35624m466j84925j39964m1922r0276j06348P5968K11985M9428
$$ plain form
10869 20697030 20493897 20279595 20229728 20255155 20255458 20260715 20262833 20200480 20155023 20262997 20410000
10858 20410000 20346195 20139169 20133230 20381289 20521566 20360897 20180638 20255179 20432333 20449260
10848 20449260 20351574 20317067 20321636 20261888 20198267 20216976 20237705 20186263 20159418 20200832 20143311
10837 20143311 19923405 19813882 20042228 20386611 20481062 20348440 20285015 20363524 20420222 20426865
10827 20426865 20487387 20523374 20357002 20104951 20107676 20415276 20694942 20732333 20692001 20758853
10817 20758853 20837971 20797440 20755068 20892694 21143760 21286789 21270667 21260891 21380602 21546773
10807 21546773 21603325 21551771 21581069 21835005 22190272 22369034 22281729 22114987 22026916 21946710
10797 21946710 21807302 21767593 21968070 22217913 22211644 21974385 21804816 21823971 21876136 21864557
$$ packed form
10869B0697030k03133k14302m9867K5427L03N257K118o2353m5457J07974J47003
10858B0410000o3805k07026n939K48059J40277j60669j80259P4541J77154J6927
10848B0449260r7686l4507M569n9748o3621J8709K0729n1442k6845M1414n7521
10837B0143311k19906j09523K28346L44383R4451j32622o3425P8509N6698O643
10827B0426865O0522L5987j66372k52051K725L07600K79666L7391m0332O6852
10817B0758853P9118m0531m2372J37626K51066J43029j6122r776J19711J66171
10807B1546773N6552n1554K9298K53936L55267J78762q7305j66742q8071q0206
10797B1946710j39408l9709K00477K49843o269k37259j69569J9155N2165j1579
$$ plain form
10787 21864557 21882220 21970158 22019675 21980400 21938877 21945354 21970232 22036287 22162011 22197537 22005384
10776 22005384 21789371 21896624 22265692 22459681 22329178 22222570 22385688 22589999 22603676
10767 22603676 22616198 22854082 23123690 23135934 23018208 23081166 23275923 23321090 23240289 23326441
10757 23326441 23612268 23795720 23733520 23656660 23807383 24130660 24414599 24537196 24513849 24458891
10747 24458891 24526747 24762004 25026075 25189720 25319589 25525579 25739996 25850312 25932932 26107398
10737 26107398 26262893 26220481 26099653 26209070 26591447 26980764 27215345 27395037 27608909
10728 27608909 27807498 27988331 28217965 28419436 28433126 28354868 28505781 28958916 29387512 29523388
10718 29523388 29506734 29625448 29930103 30262979 30487078 30560472 30544448 30613486 30877543 31163474
$$ packed form
10787B1864557J7663Q7938M9517l9275m1523O477K4878O6055J25724L5526j92153
10776B2005384k16013J07253L69068J93989j30503j06608J63118K04311J3677
10767B2603676J2522K37884K69608J2244j17726O2958J94757M5167q0801Q6152
10757B3326441K85827J83452o2200p6860J50723L23277K83939J22597k3347n4958
10747B4458891O7856K35257K64071J63645J29869K05990K14417J10316Q2620J74466
10737B6107398J55495m2412j20828J09417L82377L89317K34581J79692K13872
10728B7608909J98589J80833K29634K01471J3690p8258J50913M53135M28596J35876
10718B9523388j6654J18714L04655L32876K24099P3394j6024O9038K64057K85931
$$ plain form
10708 31163474 31214231 31133711 31317671 31857621 32361486 32518412 32499224 32598665 32817281 33045742
10698 33045742 33348152 33769794 34134236 34330175 34552380 34963537 35374300 35578261 35742095
10689 35742095 36104710 36546045 36855715 37176710 37715569 38239772 38411186 38458181 38902465
10680 38902465 39682582 40203067 40303154 40510010 41154277 41875427 42304902 42659499 43244979
10671 43244979 43858831 44192721 44472076 45136278 46083079 46781902 47082905 47418749 48142720
10662 48142720 49076959 49864763 50468246 51113486 51911618 52738574 53456288 54113820 54871767
10653 54871767 55770679 56672887 57487107 58341826 59378907 60450755 61275624 61907067 62752562
10644 62752562 64007083 65350656 66409065 67270670 68278132 69487485 70645990 71619689
$$ packed form
10708C1163474N0757q0520J83960N39950N03865J56926j9188R9441K18616K28461
10698C3045742L02410M21642L64442J95939K22205M11157M10763K03961J63834
10689C5742095L62615M41335L09670L20995N38859N24203J71414M6995M44284
10680C8902465P80117N20485J00087K06856O44267P21150M29475L54597N85480
10671D3244979O13852L33890K79355O64202R46801O98823L01003L35844P23971
10662D8142720R34239P87804O03483O45240P98132Q26956P17714O57532P57947
10653E4871767Q98912R02208Q14220Q54719J037081J071848Q24869O31443Q45495
10644F2752562J254521J343573J058409Q61605J007462J209353J158505R73699
$$ plain form
10636 71619689 72544568 73566189 74673372 75802522 76911112 77939060 78862845 79781449
10628 79781449 80796179 81831082 82732888 83518282 84349820 85288490 86242966 87146839 88012993
10619 88012993 88830214 89587428 90386967 91340437 92353873 93221119 93949647 94782428 95845415
10610 95845415 96971794 97953612 98800289 99667182 100668500 101826518 103076369 104274411
10602 104274411 105332502 106365916 107553105 108843677 110013719 111038010 112146039 113417966
10594 113417966 114608433 115543453 116421270 117462800 118489159 119187044 119662787 120340959 121309942
10585 121309942 122145592 122515628 122651471 122991989 123563219 124004300 124138479 124209807 124471853
10576 124471853 124795580 124895002 124801330 124833371 125105894 125360640 125399693 125418887 125689463 126117888
$$ packed form
10636G1619689R24879J021621J107183J129150J108590J027948R23785R18604
10628G9781449J014730J034903R01806P85394Q31538R38670R54476R03873Q66154
10619H8012993Q17221P57214P99539R53470J013436Q67246P28528Q32781J062987
10610I5845415J126379R81818Q46677Q66893J001318J158018J249851J198042
10602A04274411J058091J033414J187189J290572J170042J024291J108029J271927
10594A13417966J190467R35020Q77817J041530J026359O97885M75743O78172R68983
10585A21309942Q35650L70036J35843L40518N71230M41081J34179P1328K62046
10576A24471853L23727R9422r3672L2041K72523K54746L9053J9194K70576M28425
$$ plain form
10566 126117888 126421711 126605214 126905417 127327792 127636326 127834944 128234237 128901872 129455226
10557 129455226 129634985 129720851 130066827 130528850 130722149 130611548 130443960 130260864 129897533
10548 129897533 129367531 128828743 128209581 127277251 126078923 124920966 123878860 122715768
10540 122715768 121340988 119948180 118604421 117113943 115442870 113878034 112556207 111214303
10532 111214303 109658455 108117416 106823985 105587612 104159391 102727813 101604178 100626034
10524 100626034 99370950 97863757 96566095 95648466 94744804 93542057 92204163 91029894
10516 91029894 90023946 89031122 88037918 87089562 86081542 84890734 83631657 82558614
10508 82558614 81725509 80914137 79928487 78834197 77838008 77000017 76173214 75248098 74345981
$$ packed form
10566A26117888L03823J83503L00203M22375L08534J98618L99293O67635N53354
10557A29455226J79759Q5866L45976M62023J93299j10601j67588j83096l63331
10548A29897533n30002n38788o19162r32330j198328j157957j042106j163092
10540A22715768j374780j392808j343759j490478j671073j564836j321827j341904
10532A11214303j555848j541039j293431j236373j428221j431578j123635r78144
10524A00626034j255084j507193j297662r17629r03662j202747j337894j174269
10516I1029894j005948r92824r93204r48356j008020j190808j259077j073043
10508H2558614q33105q11372r85650j094290r96189q37991q26803r25116r02117
$$ plain form
10499 74345981 73643087 73056950 72310487 71349026 70474030 69940520 69626462 69269046 68820957
10490 68820957 68351899 67815204 67217191 66824296 66813074 66852546 66487066 65859703 65544977 65663973
10480 65663973 65738293 65529377 65404135 65613716 65823647 65770770 65830113 66371932 67001084 67103300
10470 67103300 66851764 66951402 67532646 68038777 68208006 68430900 68968053 69475794 69613353
10461 69613353 69596199 69785420 70119393 70306723 70286635 70184486 70064245 70001795 70148292 70440537
10451 70440537 70506647 70172286 69818171 69876655 70180170 70226854 69968606 69882152 70255266 70815130
10441 70815130 71168366 71282888 71380306 71589989 71885522 72221327 72576729 72924311 73248933
10432 73248933 73575683 73945790 74379366 74843257 75230625 75432703 75483204 75551988 75721140 75861458
$$ packed form
10499G4345981p02894n86137p46463r61461q74996n33510l14058l57416m48089
10490F8820957m69058n36695n98013l92895j1222L9472l65480o27363l14726J18996
10480F5663973P4320k08916j25242K09581K09931n2877N9343N41819O29152J02216
10470F7103300k51536R9638N81244N06131J69229K22894N37153N07741J37559
10461F9613353j7154J89221L33973J87330k0088j02149j20241o2450J46497K92245
10451G0440537O6110l34361l54115N8484L03515M6684k58248q6454L73114N59864
10441G0815130L53236J14522R7418K09683K95533L35805L55402L47582L24622
10432G3248933L26750L70107M33576M63891L87368K02078N0501O8784J69152J40318
$$ plain form
10422 75861458 75828598 75674300 75530811 75388754 75155164 74853497 74588096 74364056 74112568
10413 74112568 73843791 73603013 73331147 72958908 72595120 72416843 72392612 72312223 72080087 71791102
10403 71791102 71537674 71346432 71290989 71442238 71688702 71812859 71771157 71718850 71765737 71900714
10393 71900714 72121039 72397669 72548706 72433221 72259877 72385139 72785337 73068188 73049735
10384 73049735 72946641 72921137 72854213 72716544 72730110 72936454 73021321 72850147 72777646 73090468
10374 73090468 73526579 73740275 73877172 74223165 74616079 74758443 74863028 75377943 76217144
10365 76217144 76880754 77270232 77763752 78485679 79136982 79637800 80316063 81288770 82246167
10356 82246167 83077256 84127947 85524924 86799655 87612488 88382979 89691686 91405459
$$ packed form
10422G5861458l2860j54298j43489j42057k33590l01667k65401k24040k51488
10413G4112568k68777k40778k71866l72239l63788j78277k4231q0389k32136k88985
10403G1791102k53428j91242n5443J51249K46464J24157m1702n2307M6887J34977
10393G1900714K20325K76630J51037j15485j73344J25262M00198K82851j8453
10384G3049735j03094k5504o6924j37669J3566K06344Q4867j71174p2501L12822
10374G3090468M36111K13696J36897L45993L92914J42364J04585N14915Q39201
10365G6217144O63610L89478M93520P21927O51303N00818O78263R72707R57397
10356H2246167Q31089J050691J396977J274731Q12833P70491J308707J713773
$$ plain form
10348 91405459 92946192 94201442 95603632 97385446 99274796 100984904 102611315 104426399
10340 104426399 106536647 108840314 111173372 113468280 115867019 118622587 121785667 125104698
10332 125104698 128372224 131722506 135413684 139480895 143819670 148444757 153410233 158632050
10324 158632050 164082042 170006288 176606930 183630032 190667737 197803974 205524675 213985164
10316 213985164 222838582 231901106 241520011 252033557 263229326 274642731 286126598
10309 286126598 297788175 309509257 320835905 331283676 340503392 348155964 353820646
10302 353820646 357077827 357621864 355338491 350361529 343030792 333748773 322917895 311005397
10294 311005397 298521638 285852423 273208184 260786580 248848431 237548410 226825066
$$ packed form
10348I1405459J540733J255250J402190J781814J889350J710108J626411J815084
10340A04426399K110248K303667K333058K294908K398739K755568L163080L319031
10332A25104698L267526L350282L691178M067211M338775M625087M965476N221817
10324A58632050N449992N924246O600642P023102P037705P136237P720701Q460489
10316B13985164Q853418R062524R618905J0513546J1195769J1413405J1483867
10309B86126598J1661577J1721082J1326648J0447771R219716P652572N664682
10302C53820646L257181N44037k283373m976962p330737r282019j0830878j1912498
10294C11005397j2483759j2669215j2644239j2421604j1938149j1300021j0723344
$$ plain form
10287 226825066 216573790 206825327 197650152 189003214 180800180 173065323 165871837 159196554
10279 159196554 152950060 147091506 141602228 136407574 131447630 126780969 122498018 118560003
10271 118560003 114834439 111270388 107930392 104846659 101935352 99077998 96245088 93530318
10263 93530318 91072890 88919607 86952656 84990403 82957188 80900788 78872021 76896665
10255 76896665 75055000 73438597 71997027 70577053 69153813 67853745 66694890 65511990
10247 65511990 64242839 63069948 62120489 61235988 60242278 59246352 58406458 57583871 56550111
10238 56550111 55434764 54604953 54113500 53613198 52869710 52038593 51331798 50704605 50033620
10229 50033620 49362915 48771102 48162791 47406306 46589009 45943321 45538453 45182942 44652905
$$ packed form
10287B26825066j0251276r748463r175175q646938q203034p734857p193486o675283
10279A59196554o246494n858554n489278n194654m959944m666661m282951l938015
10271A18560003l725564l564051l339996l083733k911307k857354k832910k714770
10263I3530318k457428k153283j966951j962253k033215k056400k028767j975356
10255G6896665j841665j616403j441570j419974j423240j300068j158855j182900
10247F5511990j269151j172891r49459q84501r93710r95926q39894q22587j033760
10238E6550111j115347q29811m91453n00302p43488q31117p06795o27193o70985
10229E0033620o70705n91813o08311p56485q17297o45688m04868l55511n30037
$$ plain form
10220 44652905 43944918 43272095 42818795 42524195 42168292 41679858 41228985 40926689 40598122
10211 40598122 40053597 39451731 39105674 38990995 38781618 38382403 38048522 37872248 37547103
10202 37547103 36879021 36197327 35921557 35944529 35814744 35404236 35017018 34861667 34775506 34552708
10192 34552708 34263519 34096658 34050518 33932870 33611865 33181743 32882046 32855175 32976667 32978019
10182 32978019 32763309 32505844 32371762 32289392 32126426 31962298 31977669 32142580 32238153 32178306
10172 32178306 32103594 32132305 32206883 32238962 32245386 32270374 32297448 32306492 32325330 32373908 32430626
10161 32430626 32480189 32528042 32567952 32609482 32712509 32896385 33047720 33041824 32929605 32867184
10151 32867184 32885352 32884779 32838248 32813480 32796459 32697037 32557282 32536552 32628659 32616075 32405850
$$ packed form
10220D4652905p07987o72823m53300k94600l55903m88434m50873l02296l28567
10211D0598122n44525o01866l46057j14679k09377l99215l33881j76274l25145
10202C7547103o68082o81694k75770K2972j29785m10508l87218j55351q6161k22798
10192C4552708k89189j66861m6140j17648l21005m30122k99697k6871J21492J352
10182C2978019k14710k57465j34082q2370j62966j64128J5371J64911R5573n9847
10172C2178306p4712K8711P4578L2079O424K4988K7074R044J8838M8578N6718
10161C2430626M9563M7853L9910M1530J03027J83876J51335n896j12219o2421
10151C2867184J8168n73m6531k4768j7021r9422j39755k0730R2107j2584k10225
$$ plain form
10140 32405850 32200311 32197233 32304532 32311195 32189789 32068494 32033518 32115167 32343331 32651775
10130 32651775 32843528 32824670 32770161 32885422 33109020 33244825 33292652 33424214 33686540 33951346
10120 33951346 34135529 34270576 34373191 34443546 34569550 34826040 35089703 35180957 35181688 35353965
10110 35353965 35718386 35999832 36072799 36162993 36456219 36792546 36976128 37145283 37533868 38026555
10100 38026555 38293668 38310057 38406288 38775162 39226612 39527115 39726326 39996634 40344774 40666725
10090 40666725 40959836 41290232 41623697 41875714 42104538 42480141 43040239 43620945 44073306
10081 44073306 44429252 44798625 45211732 45640624 46086856 46558404 47027215 47498070 48053989
10072 48053989 48735103 49441687 50079321 50726443 51486206 52226559 52706909 52984291 53425129
$$ packed form
10140C2405850k05539l078J07299O663j21406j21295l4976Q1649K28164L08444
10130C2651775J91753j8858n4509J15261K23598J35805M7827J31562K62326K64806
10120C3951346J84183J35047J02615P0355J26004K56490K63663R1254P31J72277
10110C5353965L64421K81446P2967R0194K93226L36327J83582J69155L88585M92687
10100C8026555K67113J6389R6231L68874M51450L00503J99211K70308L48140L21951
10090D0666725K93111L30396L33465K52017K28824L75603N60098N80706M52361
10081D4073306L55946L69373M13107M28892M46232M71548M68811M70855N55919
10072D8053989O81114P06584O37634O47122P59763P40353M80350K77382M40838
$$ plain form
10063 53425129 54197220 55001376 55504269 55823657 56312103 57007906 57631775 58076331 58550466
10054 58550466 59185819 59817582 60288625 60715829 61283121 61964544 62631251 63277260 63954763
10045 63954763 64609391 65169814 65715493 66379843 67151342 67926524 68689975 69478850 70235983
10036 70235983 70878314 71466659 72130632 72863993 73576463 74303571 75144730 76012186 76701014
10027 76701014 77248892 77954201 78925425 79871391 80525239 81061186 81836820 82863391 83835284
10018 83835284 84651227 85592245 86878999 88294422 89450960 90322540 91283248 92599935 94088336
10009 94088336 95412296 96601378 98030339 99859945 101762925 103396172 104944431 106869567
10001 106869567 109192621 111429745 113339724 115331172 117854899 120711333 123361714 125740681
$$ packed form
10063E3425129P72091Q04156N02893L19388M88446O95803O23869M44556M74135
10054E8550466O35353O31763M71043M27204N67292O81423O66707O46009O77503
10045F3954763O54628N60423N45679O64350P71499P75182P63451P88875P57133
10036G0235983O42331N88345O63973P33361P12470P27108Q41159Q67456O88828
10027G6701014N47878P05309R71224R45966O53848N35947P75634J026571R71893
10018H3835284Q15943R41018J286754J415423J156538Q71580R60708J316687J488401
10009I4088336J323960J189082J428961J829606J902980J633247J548259J925136
10001A06869567K323054K237124J909979J991448K523727K856434K650381K378967
$$ plain form
9993 125740681 128291655 131234122 134281784 137205595 140233681 143637110 147258776 150786439
9985 150786439 154268141 157995725 161997890 166003233 169868104 173713282 177621609 181509969
9977 181509969 185361895 189285439 193216330 196833539 199947155 202748005 205466245 207976699
9969 207976699 209997730 211532410 212796263 213761350 214110740 213712931 212849737 211818807 210525376
9960 210525376 208672749 206228755 203477823 200638559 197622061 194218377 190404279 186396244
9952 186396244 182448943 178653078 174918394 171121336 167247329 163385193 159621081 155991395
9944 155991395 152516756 149193350 145944008 142686310 139487103 136525643 133823321 131138448
9936 131138448 128267147 125349239 122694249 120354565 118071926 115647748 113165320 110797806
$$ packed form
9993A25740681K550974K942467L047662K923811L028086L403429L621666L527663
9985A50786439L481702L727584M002165M005343L864871L845178L908327L888360
9977A81509969L851926L923544L930891L617209L113616K800850K718240K510454
9969B07976699K021031J534680J263853R65087L49390l97809q63194j030930j293431
9960B10525376j852627k443994k750932k839264l016498l403684l814098m008035
9952A86396244l947301l795865l734684l797058l874007l862136l764112l629686
9944A55991395l474639l323406l249342l257698l199207k961460k702322k684873
9936A31138448k871301k917908k654990k339684k282639k424178k482428k367514
$$ plain form
9928 110797806 108583320 106476370 104462197 102512223 100555097 98597462 96754108 95057221
9920 95057221 93371004 91619553 89951645 88508022 87160856 85706907 84219440 82940432
9912 82940432 81862702 80710405 79369696 78058044 76969166 76005271 75008335 74032189 73186858
9903 73186858 72382015 71452083 70437494 69528335 68782650 68086409 67350183 66566948 65709398
9894 65709398 64758703 63827419 63065706 62423136 61677814 60741263 59767686 58904544 58104655
9885 58104655 57282111 56501952 55865431 55291862 54573247 53641780 52678954 51932693 51466412
9876 51466412 51096345 50566778 49803791 48995618 48389774 48022044 47703295 47264654 46730522
9867 46730522 46232496 45839169 45510445 45154470 44697919 44157993 43658504 43305115 43043870
$$ packed form
9928A10797806k214486k106950k014173j949974j957126j957635j843354j696887
9920I5057221j686217j751451j667908j443623j347166j453949j487467j279008
9912H2940432j077730j152297j340709j311652j088878r63895r96936r76146q45331
9903G3186858q04843r29932j014589r09159p45685o96241p36226p83235q57550
9894F5709398r50695r31284p61713o42570p45322r36551r73577q63142p99889
9885E8104655q22544p80159o36521n73569p18615r31467r62826p46261m66281
9876E1466412l70067n29567p62987q08173o05844l67730l18749m38641n34132
9867D6730522m98026l93327l28724l55975m56551n39926m99489l53389k61245
$$ plain form
9858 43043870 42735784 42366533 42051196 41816616 41544115 41188242 40885356 40747505 40699428 40627796
9848 40627796 40535983 40423436 40180984 39778119 39401780 39213206 39110956 38951210 38841107 38925524
9838 38925524 39017175 38802512 38362827 38104958 38156808 38225103 38131299 38077918 38210321 38299079
9828 38299079 38122621 37860475 37810095 37950642 38078841 38162201 38249665 38232239 38042641 37935037
9818 37935037 38182496 38596379 38745052 38603183 38570684 38832533 39122520 39215689 39249556 39385457
9808 39385457 39515063 39541038 39646884 40000275 40410817 40591092 40615333 40811195 41259246 41684944
9798 41684944 41862463 41899726 42057457 42431149 42886114 43235513 43428565 43574303 43795592 44101705
9788 44101705 44457010 44905298 45475046 45997981 46252129 46328810 46604884 47243053 47984137 48599309
$$ packed form
9858D3043870l08086l69251l15337k34580k72501l55873l02886j37851m8077p1632
9848D0627796r1813j12547k42452m02865l76339j88574j02250j59746j10103Q4417
9838C8925524R1651k14663m39685k57869N1850O8295r3804n3381J32403Q8758
9828C8299079j76458k62146n0380J40547J28199Q3360Q7464j7426j89598j07604
9818C7935037K47459M13883J48673j41869l2499K61849K89987R3169L3867J35901
9808C9385457J29606K5975J05846L53391M10542J80275K4241J95862M48051M25698
9798D1684944J77519L7263J57731L73692M54965L49399J93052J45738K21289L06113
9788D4101705L55305M48288N69748N22935K54148P6681K76074O38169P41084O15172
$$ plain form
9778 48599309 49253050 50139785 51028162 51571619 51925452 52608167 53774297 55051336 56147096
9769 56147096 57203172 58420080 59723333 61010675 62403939 64001642 65641224 67174483
9761 67174483 68766222 70643022 72724209 74793310 76887438 79196342 81671622 84077349
9753 84077349 86405831 88916463 91720208 94609303 97368848 100002029 102551778 104924699
9745 104924699 107004935 108753531 110091631 110871799 111078173 110872873 110319987 109251221 107556709
9736 107556709 105419884 103069296 100472831 97525061 94396735 91390995 88512036 85499372
9728 85499372 82312100 79267075 76596653 74140965 71636173 69092780 66702446 64534958
9720 64534958 62531012 60678412 58982102 57324690 55565392 53766433 52148405 50808905
$$ packed form
9778D8599309O53741Q86735Q88377N43457L53833O82715J166130J277039J095760
9769E6147096J056076J216908J303253J287342J393264J597703J639582J533259
9761F7174483J591739J876800K081187K069101K094128K308904K475280K405727
9753H4077349K328482K510632K803745K889095K759545K633181K549749K372921
9745A04924699K080236J748596J338100P80168K06374k05300n52886j068766j694512
9736A07556709k136825k350588k596465k947770l128326l005740k878959l012664
9728H5499372l187272l045025k670422k455688k504792k543393k390334k167488
9720F4534958k003946j852600j696310j657412j759298j798959j618028j339500
$$ plain form
9712 50808905 49621540 48418711 47147477 45843596 44586322 43496879 42650805 41951985
9704 41951985 41197864 40303682 39373983 38540123 37830059 37208452 36624820 35998727 35281528
9695 35281528 34562863 33988118 33541980 33062102 32504698 32015110 31657813 31273933 30741652
9686 30741652 30200729 29843169 29622938 29361574 29018390 28654238 28242079 27746037 27300321
9677 27300321 27055813 26907473 26641080 26308609 26153172 26159756 26022863 25641841 25305270 25219367
9667 25219367 25169541 24892597 24520000 24336344 24277652 24033260 23582025 23263848 23261902 23323420
9657 23323420 23146993 22824984 22681928 22775163 22795167 22498815 22050534 21782817 21716908 21554289
9647 21554289 21179347 20904982 21012570 21248335 21117390 20610669 20241386 20285700 20389263 20143876
$$ packed form
9712E0808905j187365j202829j271234j303881j257274j089443q46074o98820
9704D1951985p54121q94182r29699q33860p10064o21607n83632o26093p17199
9695C5281528p18665n74745m46138m79878n57404m89588l57297l83880n32281
9686C0741652n40923l57560k20231k61364l43184l64152m12159m96042m45716
9677B7300321k44508j48340k66393l32471j55437O584j36893l81022l36571q5903
9667B5219367m9826k76944l72597j83656n8692k44392m51235l18177j946O1518
9657B3323420j76427l22009j43056R3235K0004k96352m48281k67717o5909j62619
9647B1554289l74942k74365J07588K35765j30945n06721l69283M4314J03563k45387
$$ plain form
9637 20143876 19710685 19538142 19686074 19802188 19663721 19395397 19178891 19046936 18979172 18955852
9627 18955852 18896720 18747006 18613581 18620452 18664958 18535081 18234634 17963791 17814812 17729684
9617 17729684 17706335 17758629 17716488 17411395 17059080 17070729 17423696 17627382 17437635 17181684
9607 17181684 17169824 17207392 17004706 16713847 16665511 16821414 16886843 16798021 16719361 16680230 16579277
9596 16579277 16465083 16464894 16489842 16341744 16078486 15955966 16022214 16071020 15995720 15900177 15853696
9585 15853696 15812328 15787779 15825353 15823312 15657527 15467129 15496679 15660817 15630354 15384854 15275728
9574 15275728 15437215 15553517 15400547 15221725 15293149 15455641 15411095 15222090 15158447 15230068
9564 15230068 15232117 15144829 15146045 15266711 15329919 15237813 15087366 14988905 14948820 14931253 14897592
$$ packed form
9637B0143876m33191j72543J47932J16114j38467k68324k16506j31955o7764k3320
9627A8955852n9132j49714j33425O871M4506j29877l00447k70843j48979q5128
9617A7729684k3349N2294m2141l05093l52315J1649L52967K03686j89747k55951
9607A7181684j1860L7568k02686k90859m8336J55903O5429q8822p8660l9131j00953
9596A6579277j14194j89K4948j48098k63258j22520O6248M8806p5300r5543m6481
9585A5853696m1368k4549L7574k041j65785j90398K9550J64138l0463k45500j09126
9574A5275728J61487J16302j52970j78822P1424J62492m4546j89005o3643P1621
9564A5230068K049q7288J216J20666O3208r2106j50447r8461m0085j7567l3661
$$ plain form
9553 14897592 14816836 14749664 14835567 15064989 15190850 15047175 14823221 14788817 14862408 14740907
9543 14740907 14403803 14175209 14256516 14475760 14579705 14547528 14512778 14543933 14603153 14617756
9533 14617756 14541411 14421609 14388242 14472976 14504115 14334561 14097257 14027972 14103254 14111902 14043324
9522 14043324 14095813 14281596 14352323 14201680 14031997 13999968 13994983 13918839 13886840 13954616 13928333
9511 13928333 13692111 13476783 13522990 13684871 13675446 13539724 13548706 13726429 13820849 13709009
9501 13709009 13525311 13387197 13269642 13177048 13190748 13294257 13349636 13288448 13166385 13030822
9491 13030822 12906250 12887359 13041880 13229030 13228054 13052020 12920315 12917598 12914708 12844803 12803511
9480 12803511 12828138 12831014 12812809 12878858 12968800 12860273 12558610 12380934 12484497 12611275
$$ packed form
9553A4897592q0756o7172Q5903K29422J25861j43675k23954l4404P3591j21501
9543A4740907l37104k28594Q1307K19244J03945l2177l4750L1155N9220J4603
9533A4617756p6345j19802l3367Q4734L1139j69554k37304o9285P5282Q648o8578
9522A4043324N2489J85783P0727j50643j69683l2029m985p6144l1999O7776k6283
9511A3928333k36222k15328M6207J61881r425j35722Q982J77723R4420j11840
9501A3709009j83698j38114j17555r2594J3700J03509N5379o1188j22063j35563
9491A3030822j24572j8891J54521J87150r76j76034j31705k717k890o9905m1292
9480A2803511K4627K876j8205O6049Q9942j08527l01663j77676J03563J26778
$$ plain form
9470 12611275 12521242 12382099 12433599 12529865 12393129 12138070 12115650 12315106 12355955 12096568
9460 12096568 11844116 11851983 11964310 11933175 11798330 11732888 11726298 11660491 11565179 11563144 11628435
9449 11628435 11609395 11480186 11391344 11436984 11510353 11463451 11322814 11244044 11272701 11266404 11118224
9438 11118224 10962861 11008964 11191591 11201304 10932263 10678251 10710052 10861095 10802420 10578259
9428 10578259 10509264 10619883 10580124 10293072 10126123 10350876 10698058 10755575 10544858 10373130
9418 10373130 10307993 10171860 9962834 9900045 10030238 10108900 9962137 9735529 9681439 9852194
9408 9852194 10075217 10125881 9908532 9571326 9415199 9561953 9768567 9733499 9509379 9387157
9398 9387157 9439036 9473617 9431049 9473350 9608393 9583695 9320268 9125706 9242569 9463589
$$ packed form
9470A2611275r0033j39143N1500R6266j36736k55059k2420J99456M0849k59387
9460A2096568k52452P867J12327l1135j34845o5442o590o5807r5312k035O5291
9449A1628435j9040j29209q8842M5640P3369m6902j40637p8770K8657o297j48180
9438A1118224j55363M6103J82627R713k69041k54012L1801J51043n8675k24161
9428A0578259o8995J10619l9759k87052j66949K24753L47182N7517k10717j71728
9418A0373130o5137j36133k09026o2789J30193P8662j46763k26608n4090J70755
9408I852194K23023N0664k17349l37206j56127J46754K06614l5068k24120j22222
9398I387157N1879L4581m2568M2301J35043k4698k63427j94562J16863K21020
$$ plain form
9388 9463589 9472992 9335631 9327744 9459978 9515473 9446799 9382890 9309544 9106544 8888260 8934582
9377 8934582 9225452 9395133 9259495 9058690 9018292 8994113 8800567 8622995 8764559 9122363
9367 9122363 9268176 9041806 8763246 8773977 8995054 9085006 8908332 8681259 8665743 8840464
9357 8840464 8945627 8820856 8605056 8545453 8675448 8801047 8794871 8752199 8794239 8853384 8775573
9346 8775573 8556541 8348022 8265835 8299943 8386305 8459821 8449656 8329762 8185462 8144251 8224121
9335 8224121 8317023 8328667 8268888 8200961 8174347 8219869 8336550 8451291 8450288 8294428 8076163
9324 8076163 7935059 7933758 8025530 8118925 8161612 8175472 8216795 8301614 8385701 8423009 8411645
9313 8411645 8366997 8294041 8216916 8185361 8203404 8199138 8125054 8042319 8031760 8062366 8038341 7950339
$$ packed form
9388I463589R403j37361p887J32234N5495o8674o3909p3346k03000k18284M6322
9377H934582K90870J69681j35638k00805m0398k4179j93546j77572J41564L57804
9367I122363J45813k26370k78560J0731K21077Q9952j76674k27073j5516J74721
9357H840464J05163j24771k15800n9603J29995J25599o176m2672M2040N9145p7811
9346H775573k19032k08519q2187L4108Q6362P3516j0165j19894j44300m1211P9870
9335H224121R2902J1644n9779o7927k6614M5522J16681J14741j003j55860k18265
9324H076163j41104j301R1772R3395M2687J3860M1323Q4819Q4087L7308j1364
9313H411645m4648p2956p7125l1555J8043m266p4084q2735j0559L0606k4025q8002
$$ plain form
9301 7950339 7881629 7873231 7881288 7873459 7873931 7895670 7908635 7891511 7846363 7765147 7664464 7640228
9289 7640228 7772486 7967765 8026015 7899312 7755363 7734243 7780579 7796531 7819464 7919182 8025722
9278 8025722 8014094 7903517 7827463 7833355 7841807 7793267 7718929 7666127 7651179 7682489 7742109 7760658
9266 7760658 7705363 7666213 7737151 7837592 7806111 7672633 7647379 7779050 7827507 7620777 7367692
9255 7367692 7390286 7635670 7726098 7512256 7304933 7424100 7735932 7861866 7722270 7599077
9245 7599077 7677546 7808871 7814305 7768151 7798486 7806715 7636600 7402381 7362810 7510761 7583113
9234 7583113 7495654 7456556 7559619 7587097 7401154 7239939 7354227 7578196 7586247 7411448
9224 7411448 7340877 7394885 7322166 7104578 7036953 7208498 7314727 7169989 7030610 7140982
$$ packed form
9301G950339o8710q398Q057p829M72K1739J2965j7124m5148q1216j00683k4236
9289G640228J32258J95279N8250j26703j43949k1120M6336J5952K2933R9718J06540
9278H025722j1628j10577p6054N892Q452m8540p4338n2802j4948L1310N9620J8549
9266G760658n5295l9150P0938J00441l1481j33478k5254J31671M8457k06730k53085
9255G367692K2594K45384R0428k13842k07323J19167L11832J25934j39596j23193
9245G599077P8469J31325N434m6154L0335Q229j70115k34219l9571J47951P2352
9234G583113q7459l9098J03063K7478j85943j61215J14288K23969Q051j74799
9224G411448p0571N4008p2719k17588o7625J71545J06229j44738j39379J10372
$$ plain form
9214 7140982 7289900 7177008 6972168 7075471 7440441 7590643 7325408 6993800 6947981 7076723
9204 7076723 7080962 6944352 6877959 6956017 7052523 7070151 7034057 6991257 6976800 7055093 7245210
9193 7245210 7415198 7397698 7224906 7108713 7149546 7204263 7124643 7006633 7064909 7313954
9183 7313954 7525986 7521315 7370842 7253369 7223303 7222922 7248604 7358211 7521116 7607517 7580252
9172 7580252 7582662 7749619 8007430 8156595 8109867 7964832 7875081 7928384 8116883 8337431
9162 8337431 8441685 8374005 8249533 8221832 8301889 8394872 8468421 8550723 8589281 8487894 8311506
9151 8311506 8271455 8424439 8548376 8437343 8184053 8022265 7997827 7970978 7875749 7784182
9141 7784182 7728267 7640570 7501322 7394192 7368413 7367435 7341389 7318261 7313202 7277852 7203980 7174110
$$ packed form
9214G140982J48918j12892k04840J03303L64970J50202k65235l31608m5819J28742
9204G076723M239j36610o6393P8058R6506J7628l6094m2800j4457P8293J90117
9193G245210J69988j7500j72792j16193M0833N4717p9620j18010N8276K49045
9183G313954K12032m671j50473j17473l0066l81K5682J09607J62905Q6401k7265
9172G580252K410J66957K57811J49165m6728j45035q9751N3303J88499K20548
9162H337431J04254o7680j24472k7701Q0057R2983P3549Q2302L8558j01387j76388
9151H311506m0051J52984J23937j11033k53290j61788k4438k6849r5229r1567
9141G784182n5915q7697j39248j07130k5779r78k6046k3128n059l5350p3872k9870
$$ plain form
9129 7174110 7228071 7266908 7183024 7020884 6916619 6929975 7022893 7149819 7266007 7288275 7168041
9118 7168041 6994128 6914130 6952265 7007891 7032071 7077090 7143355 7121305 6971305 6848225 6926258
9107 6926258 7162001 7347214 7360420 7258331 7145763 7073162 7058254 7089961 7092611 6997011 6872704
9096 6872704 6869205 6979734 7000320 6821604 6639012 6718787 7021717 7233923 7165550 6954521
9086 6954521 6835456 6853127 6887994 6859186 6795495 6757545 6780356 6869839 6990451 7072660 7078649
9075 7078649 7038943 6992197 6932991 6863766 6841809 6900309 6964460 6937872 6854300 6845357 6948784
9064 6948784 7043056 7010353 6891807 6824437 6863195 6921382 6883346 6744767 6626803 6646389 6782224
9053 6782224 6904771 6944765 6963653 7012518 7011705 6884806 6748125 6793945 6985096 7059388 6908276
$$ packed form
9129G174110N3961L8837q3884j62140j04265J3356R2918J26926J16188K2268j20234
9118G168041j73913p9998L8135N5626K4180M5019O6265k2050j50000j23080P8033
9107F926258K35743J85213J3206j02089j12568p2601j4908L1707K650r5600j24307
9096F872704l499J10529K0586j78716j82592P9775L02930K12206o8373k11029
9086F954521j19065J7671L4867k8808o3691l7950K2811Q9483J20612Q2209N989
9075G078649l9706m6746n9206o9225k1957N8500O4151k6588q3572q943J03427
9064F948784R4272l2703j18546o7370L8758N8187l8036j38579j17964J9586J35835
9053F782224J22547L9994J8888M8865q13j26899j36681M5820J91151P4292j51112
$$ plain form
9042 6908276 6765444 6880496 7153601 7283705 7187001 7051055 7005290 6966520 6852981 6750695
9032 6750695 6773169 6901037 7052129 7181716 7224693 7086081 6822560 6696952 6866822 7113412
9022 7113412 7098519 6841388 6688721 6797299 6927060 6862485 6774025 6931519 7237772 7342122
9012 7342122 7150437 6922105 6844464 6812970 6738086 6776354 7034664 7266558 7170604 6877216
9002 6877216 6794515 6982754 7053174 6804083 6597666 6835732 7321789 7514994 7298467 7091085
8992 7091085 7179322 7336671 7265487 7085233 7107995 7331537 7459631 7343817 7137878 7033620
8982 7033620 7067505 7192547 7342665 7410262 7341517 7266391 7350795 7514520 7512244 7320003 7186880
8971 7186880 7229270 7256454 7145292 7098584 7290591 7505614 7449246 7241937 7237874 7456323 7585151
$$ packed form
9042F908276j42832J15052K73105J30104r6704j35946m5765l8770j13539j02286
9032F750695K2474J27868J51092J29587M2977j38612k63521j25608J69870K46590
9022G113412j4893k57131j52667J08578J29761o4575q8460J57494L06253J04350
9012G342122j91685k28332p7641l1494p4884L8268K58310K31894r5954k93388
9002F877216q2701J88239P0420k49091k06417K38066M86057J93205k16527k07382
8992G091085Q8237J57349p1184j80254K2762K23542J28094j15814k05939j04258
8982G033620L3885J25042J50118O7597o8745p5126Q4404J63725k276j92241j33123
8971G186880M2390K7184j11162m6708J92007K15023n6368k07309m063K18449J28828
$$ plain form
8960 7585151 7518508 7479640 7562406 7571301 7453104 7476610 7750020 7930986 7742066 7472360 7565386
8949 7565386 7916261 8030437 7786488 7573407 7643253 7771645 7706052 7578237 7636908 7830644
8939 7830644 7917792 7841656 7764435 7802716 7907582 7970274 7930697 7822653 7780177 7920179 8160787
8928 8160787 8274600 8197600 8136406 8255805 8425945 8450657 8391958 8433401 8530552 8481496 8309883
8917 8309883 8276665 8463374 8628281 8594909 8530396 8651520 8851487 8863899 8690149 8601814
8907 8601814 8731964 8903395 8923936 8855190 8870177 8986768 9098922 9188152 9317610 9430158
8897 9430158 9357036 9108706 8978920 9187787 9527816 9589577 9319190 9106393 9248921 9566994
8887 9566994 9710644 9654558 9647720 9785667 9910530 9915891 9887263 9895430 9884206 9844659 9889689
$$ packed form
8960G585151o6643l8868Q2766Q895j18197K3506K73410J80966j88920k69706R3026
8949G565386L50875J14176k43949k13081O9846J28392o5593j27815N8671J93736
8939G830644Q7148p6136p7221L8281J04866O2692l9577j08044m2476J40002K40608
8928H160787J13813p7000o1194J19399J70140K4712n8699M1443R7151m9056j71613
8917H309883l3218J86709J64907l3372o4513J21124J99967J2412j73750q8335
8907H601814J30150J71431K0541o8746J4987J16591J12154Q9230J29458J12548
8897I430158p3122k48330j29786K08867L40029O1761k70387k12797J42528L18073
8887I566994J43650n6086o838J37947J24863N361k8628Q167j1224l9547M5030
$$ plain form
8876 9889689 10045016 10155540 10131493 10112047 10228693 10374843 10406352 10420711 10587999 10806790
8866 10806790 10822167 10662058 10650677 10927167 11234189 11316819 11285295 11382903 11578252 11639856
8856 11639856 11525363 11440981 11518506 11657273 11738109 11802821 11921430 12030512 12044042 12031261
8846 12031261 12119476 12252423 12225641 12013035 11899548 12150572 12627347 12902868 12769748 12475382
8836 12475382 12385019 12554521 12770401 12908168 13047921 13244165 13392074 13411940 13413784 13546057
8826 13546057 13770524 13922176 13942259 13922350 13942427 13992655 14055941 14146197 14238795 14269167 14243937
8815 14243937 14270123 14428824 14684614 14948687 15158515 15273240 15290761 15313539 15479903 15750281
8805 15750281 15887426 15783430 15698211 15972473 16542129 16962478 16956994 16736110 16672125 16842687
$$ packed form
8876I889689J55327J10524k4047j9446J16646J46150L1509J4359J67288K18791
8866A0806790J5377j60109j1381K76490L07022Q2630l1524R7608J95349O1604
8856A1639856j14493q4382P7525J38767Q0836O4712J18609J09082J3530j2781
8846A2031261Q8215J32947k6782k12606j13487K51024M76775K75521j33120k94366
8836A2475382r0363J69502K15880J37767J39753J96244J47909J9866J844J32273
8826A3546057K24467J51652K0083j9909K0077N0228O3286R0256R2598L0372k5230
8815A4243937K6186J58701K55790K64073K09828J14725J7521K2778J66364K70378
8805A5750281J37145j03996q5219K74262N69656M20349n484k20884o3985J70562
$$ plain form
8795 16842687 17061123 17224784 17409089 17649762 17849765 17959504 18090362 18351455 18670895
8786 18670895 18885434 18961972 19033380 19218874 19483582 19703222 19827236 19933385 20116358 20360105
8776 20360105 20568079 20713319 20882397 21128013 21360312 21488346 21616523 21940982 22431366
8767 22431366 22788439 22823358 22747574 22924098 23397525 23856189 24061642 24128077 24299229 24605218
8757 24605218 24888321 25087663 25321399 25675008 26056293 26335930 26540158 26805513 27182852
8748 27182852 27582927 27911046 28167392 28396155 28621187 28879630 29244126 29727583 30202572
8739 30202572 30511038 30663513 30855937 31257650 31825815 32358220 32704621 32905030 33129552
8730 33129552 33490199 33921619 34280288 34561212 34933432 35501696 36121557 36571613 36850896
$$ packed form
8795A6842687K18436J63661J84305K40673K00003J09739J30858K61093L19440
8786A8670895K14539P6538P1408J85494K64708K19640J24014J06149J82973K43747
8776B0360105K07974J45240J69078K45616K32299J28034J28177L24459M90384
8767B2431366L57073L4919p5784J76524M73427M58664K05453O6435J71152L05989
8757B4605218K83103J99342K33736L53609L81285K79637K04228K65355L77339
8748B7182852M00075L28119K56346K28763K25032K58443L64496M83457M74989
8739C0202572L08466J52475J92424M01713N68165N32405L46401K00409K24522
8730C3129552L60647M31420L58669K80924L72220N68264O19861M50056K79283
$$ plain form
8721 36850896 37147974 37544919 37953048 38364680 38929030 39661777 40301240 40654265 40924211
8712 40924211 41449998 42218294 42908614 43391047 43889313 44595646 45389987 46070791 46656795
8703 46656795 47290645 47988624 48672032 49364067 50174944 51116553 52080397 53005258 53949458
8694 53949458 54974671 56049190 57102179 58114510 59121787 60164990 61269753 62455635
8686 62455635 63732957 65078575 66427756 67717963 68951063 70186116 71458912 72753262
8678 72753262 74072925 75458312 76855427 78056093 78914314 79582808 80360297 81293831 82115524
8669 82115524 82625223 82940511 83245340 83455870 83323485 82794419 82090525 81441617 80861393
8660 80861393 80194220 79298139 78174014 76962583 75810156 74727916 73626102 72472714
$$ packed form
8721C6850896K97078L96945M08129M11632N64350P32747O39463L53025K69946
8712D0924211N25787P68296O90320M82433M98266P06333P94341O80804N86004
8703D6656795O33850O97979O83408O92035Q10877R41609R63844R24861R44200
8694E3949458J025213J074519J052989J012331J007277J043203J104763J185882
8686F2455635J277322J345618J349181J290207J233100J235053J272796J294350
8678G2753262J319663J385387J397115J200666Q58221O68494P77489R33534Q21693
8669H2115524N09699L15288L04829K10530j32385n29066p03894o48908n80224
8660H0861393o67173q96081j124125j211431j152427j082240j101814j153388
$$ plain form
8652 72472714 71313446 70133995 68867079 67588457 66512205 65676108 64826188 63782342
8644 63782342 62729002 61910646 61203533 60295322 59199664 58252956 57598686 56997862 56223001
8635 56223001 55358820 54595797 53954471 53349860 52756829 52188908 51642379 51140996 50706701
8626 50706701 50240293 49593112 48808499 48114091 47612747 47166952 46654449 46131381 45656457
8617 45656457 45173191 44681642 44311560 44088890 43829301 43393801 42844955 42239063 41529574
8608 41529574 40824071 40411785 40294223 40015206 39286160 38474899 38059478 37867700 37379245
8599 37379245 36602927 36049766 35872222 35652057 35149025 34672836 34480906 34317290 33869576
8590 33869576 33277990 32837568 32511711 32101272 31650527 31329320 31093533 30791103 30457993
$$ packed form
8652G2472714j159268j179451j266916j278622j076252q36097q49920j043846
8644F3782342j053340q18356p07113r08211j095658r46708o54270o00824p74861
8635E6223001q64181p63023o41326o04611n93031n67921n46529n01383m34295
8626E0706701m66408o47181p84613o94408n01344m45795n12503n23068m74924
8617D5656457m83266m91549l70082k22670k59589m35500n48846o05892p09489
8608D1529574p05503m12286j17562k79017p29046q11261m15421j91778m88455
8599C7379245p76318n53161j77544k20165n03032m76189j91930j63616m47714
8590C3869576n91586m40422l25857m10439m50745l21207k35787l02430l33110
$$ plain form
8581 30457993 30204928 29947479 29552938 29136436 28903044 28789501 28567018 28221796 27925519
8572 27925519 27691270 27382425 27030665 26812914 26706743 26494803 26143268 25848337 25646915
8563 25646915 25320470 24799635 24337436 24114001 23963919 23697388 23424059 23317173 23283320 23134419
8553 23134419 22904107 22714314 22489849 22122060 21794466 21780996 21958982 21899487 21490946 21110826
8543 21110826 21047887 21090945 20912268 20581516 20394122 20364471 20235970 19938163 19697747 19651042
8533 19651042 19640003 19506490 19339582 19260552 19165043 18905218 18594392 18471597 18521710 18496253
8523 18496253 18315448 18175966 18184239 18153111 17926431 17678801 17656396 17775195 17752748 17555623
8513 17555623 17414210 17396354 17277692 16931929 16580489 16485095 16591443 16671730 16666379 16659910 16617411
$$ packed form
8581C0457993k53065k57449l94541m16502k33392j13543k22483l45222k96277
8572B7925519k34249l08845l51760k17751j06171k11940l51535k94931k01422
8563B5646915l26445n20835m62199k23435j50082k66531k73329j06886l3853j48901
8553B3134419k30312j89793k24465l67789l27594j3470J77986n9495m08541l80120
8543B1110826o2939M3058j78677l30752j87394k9651j28501k97807k40416m6705
8533A9651042j1039j33513j66908p9030r5509k59825l10826j22795N0113k5457
8523A8496253j80805j39482Q273l1128k26680k47630k2405J18799k2447j97125
8513A7555623j41413j7856j18662l45763l51440r5394J06348Q0287n351o469m2499
$$ plain form
8502 16617411 16396887 16011705 15664195 15488900 15442369 15477314 15622927 15804227 15779333 15433743
8492 15433743 15023444 14922116 15155706 15373558 15303536 15058032 14901796 14868216 14775612 14564384
8482 14564384 14417573 14487377 14648441 14648761 14437314 14203912 14104764 14084271 14009393 13862637 13719565
8471 13719565 13620645 13568312 13589934 13680149 13716298 13581609 13381653 13372542 13604251 13792429 13677221
8460 13677221 13386126 13252896 13345768 13409656 13289752 13158065 13195490 13263609 13112004 12791638
8450 12791638 12605604 12671669 12783956 12764230 12718896 12809787 12944732 12895345 12643072 12408525
8440 12408525 12338830 12336269 12251180 12116517 12091834 12231242 12407863 12477116 12444134 12417056 12424693
8429 12424693 12367716 12186857 11994594 11939605 11989962 11988705 11911868 11898464 11982654 11988236 11804253
$$ packed form
8502A6617411k20524l85182l47510j75295m6531L4945J45613J81300k4894l45590
8492A5433743m10299j01328K33590K17852p0022k45504j56236l3580r2604k11228
8482A4564384j46811O9804J61064L20k11447k33402r9148k0493p4878j46756j43072
8471A3719565r8920n2333K1622R0215L6149j34689j99956r111K31709J88178j15208
8460A3677221k91095j33230R2872O3888j19904j31687L7425O8119j51605l20366
8450A2791638j86034O6065J12287j9726m5334R0891J34945m9387k52273k34547
8440A2408525o9695k561q5089j34663k4683J39408J76621O9253l2982k7078P637
8429A2424693n6977j80859j92263n4989N0357j257p6837j3404Q4190N582j83983
$$ plain form
8418 11804253 11595537 11571482 11678410 11719253 11674559 11673275 11709810 11652978 11531362 11542031 11719420
8407 11719420 11842604 11769528 11639114 11608739 11594775 11455172 11277915 11272787 11440877 11541801
8397 11541801 11395614 11096721 10901279 10952642 11132356 11193580 11061564 10930900 10972767 11052539
8387 11052539 10939526 10712064 10645300 10709110 10572916 10212967 10072847 10368285 10657301 10494762
8377 10494762 10154257 10183478 10499241 10543362 10233335 10088900 10335568 10522716 10276124 9885662
8367 9885662 9792115 9914036 9895893 9724059 9665643 9771484 9835800 9765514 9662281 9585902 9509189
8356 9509189 9467283 9511020 9550799 9468364 9343873 9356009 9488965 9549778 9457034 9311929 9195534
8345 9195534 9090457 9003142 8981096 9000220 8995912 8999110 9077523 9158067 9092890 8902975 8765526
$$ packed form
8418A1804253k08716k4055J06928M0843m4694j284L6535n6832j21616J0669J77389
8407A1719420J23184p3076j30414l0375j3964j39603j77257n128J68090J00924
8397A1541801j46187k98893j95442N1363J79714O1224j32016j30664M1867P9772
8387A1052539j13013k27462o6764O3810j36194l59949j40120K95438K89016j62539
8377A0494762l40505K9221L15763M4121l10027j44435K46668J87148k46592l90462
8367I885662r3547J21921j8143j71834n8416J05841O4316p0286j03233p6379p6713
8356I509189m1906M3737L9779q2435j24491J2136J32956O0813r2744j45105j16395
8345I195534j05077q7315k2046J9124m308L198P8413Q0544o5177j89915j37449
$$ plain form
8334 8765526 8742053 8713794 8623264 8577258 8635515 8684055 8626942 8549222 8560994 8597823 8519353
8323 8519353 8339606 8224402 8273298 8399263 8439335 8336108 8189624 8136161 8188555 8230786
8313 8230786 8185801 8129677 8180429 8319226 8400801 8323729 8132864 7974843 7984678 8158026 8301572
8302 8301572 8207851 7932445 7763989 7839914 7972633 7990579 8024153 8213498 8353948 8191026
8292 8191026 7921674 7968106 8302125 8461095 8277383 8107334 8197487 8307378 8206940 8101539
8282 8101539 8221608 8368401 8276846 8131325 8264430 8551728 8584560 8330057 8151005 8208378
8272 8208378 8292602 8275988 8309387 8470833 8588143 8555771 8523673 8608870 8670806 8550110 8342032
8261 8342032 8262907 8368803 8535337 8629946 8625268 8611277 8715587 8932254 9068618 8989456 8844544
$$ packed form
8334H765526k3473k8259r0530m6006N8257M8540n7113p7720J1772L6829p8470
8323H519353j79747j15204M8896J25965M0072j03227j46484n3463N2394M2231
8313H230786m4985n6124N0752J38797Q1575p7072j90865j58021R835J73348J43546
8302H301572r3721k75406j68456P5925J32719J7946L3574J89345J40450j62922
8292H191026k69352M6432L34019J58970j83712j70049R0153J09891j00438j05401
8282H101539J20069J46793r1555j45521J33105K87298L2832k54503j79052N7373
8272H208378Q4224j6614L3399J61446J17310l2372l2098Q5197O1936j20696k08078
8261H342032p9125J05896J66534R4609m678j3991J04310K16667J36364p9162j44912
$$ plain form
8250 8844544 8865098 9006479 9046740 8992722 9074086 9322710 9499144 9507093 9532277 9649230 9648148
8239 9648148 9439151 9287876 9405464 9611819 9684150 9746851 9980946 10205644 10147923 9944962
8229 9944962 9955551 10182467 10305371 10232674 10196596 10299830 10388674 10432623 10615183 10926007
8219 10926007 11054027 10872392 10685383 10766985 10961422 11011436 11009946 11186535 11437021 11452816
8209 11452816 11247123 11178267 11413881 11694572 11743296 11651989 11689179 11897532 12082941 12119700
8199 12119700 12079561 12079192 12164674 12365386 12701646 13064992 13232137 13132867 13011392 13151596
8189 13151596 13491596 13716845 13739070 13837317 14227586 14728453 15034641 15132743 15215184 15330962
8179 15330962 15399968 15480202 15709857 16011299 16166783 16206603 16396452 16769526 17013653 16975445
$$ packed form
8250H844544K0554J41381M0261n4018Q1364K48624J76434P949K5184J16953j082
8239I648148k08997j51275J17588K06355P2331O2701K34095K24698n7721k02961
8229I944962J0589K26916J22904p2697l6078J03234Q8844M3949J82560L10824
8219A0926007J28020j81635j87009Q1602J94437N0014j490J76589K50486J5795
8209A1452816k05693o8856K35614K80691M8724r1307L7190K08353J85409L6759
8199A2119700m0139l69Q5482K00712L36260L63346J67145r9270j21475J40204
8189A3151596L40000K25249K2225R8247L90269N00867L06188R8102Q2441J15778
8179A5330962O9006Q0234K29655L01442J55484L9820J89849L73074K44127l8208
$$ plain form
8169 16975445 16954172 17259008 17734240 18011639 18053462 18140850 18424842 18775060 19035493 19192122
8159 19192122 19300746 19437302 19691401 20042273 20297810 20335929 20335297 20558386 20971358 21318406
8149 21318406 21525390 21752316 22045613 22238039 22269054 22334651 22592427 22933120 23179765 23332747
8139 23332747 23481615 23633644 23775804 23981563 24314646 24711748 25064554 25342864 25577055
8130 25577055 25821272 26171000 26669910 27158352 27411156 27500173 27780679 28379633 28953918 29179760
8120 29179760 29250756 29586998 30215537 30791423 31149329 31463748 31859018 32217124 32454471 32679225
8110 32679225 32945861 33116433 33121104 33135616 33323215 33573517 33675876 33612250 33501442 33373670
8100 33373670 33194240 33028008 32975945 32975645 32850981 32579170 32356650 32345998 32462925 32488293
$$ packed form
8169A6975445k1273L04836M75232K77399M1823Q7388K83992L50218K60433J56629
8159A9192122J08624J36556K54099L50872K55537L8119o32K23089M12972L47048
8149B1318406K06984K26926K93297J92426L1015O5597K57776L40693K46645J52982
8139B3332747J48868J52029J42160K05759L33083L97102L52806K78310K34191
8130B5577055K44217L49728M98910M88442K52804Q9017K80506N98954N74285K25842
8120B9179760P0996L36242O28539N75886L57906L14419L95270L58106K37347K24754
8110C2679225K66636J70572M671J4512J87599K50302J02359o3626j10808j27772
8100C3373670j79430j66232n2063l00j24664k71811k22520j0652J16927K5368
$$ plain form
8090 32488293 32343847 32185919 32210671 32403247 32547645 32518305 32479313 32675933 33070682 33363526
8080 33363526 33405283 33401282 33599590 33944397 34203203 34319933 34442112 34647233 34836404 34910424
8070 34910424 34901283 34900905 34969623 35128087 35334113 35454669 35366842 35115976 34890159 34810836 34812350
8059 34812350 34739324 34503757 34147026 33802936 33582435 33437070 33177872 32706890 32169571 31761748
8049 31761748 31445755 31024091 30472770 30007107 29776441 29666039 29474468 29148057 28765819
8040 28765819 28418536 28179003 28074474 28010650 27831672 27526715 27265530 27164127 27143733 27091549
8030 27091549 27003528 26867609 26586710 26178631 25883512 25850862 25843766 25517111 24926552 24476877
8020 24476877 24356830 24307227 24032992 23590705 23208547 22910958 22535379 22036547 21566166 21237715
$$ packed form
8090C2488293j44446j57928K4752J92576J44398k9340l8992J96620L94749K92844
8080C3363526M1757m001J98308L44807K58806J16730J22179K05121J89171P4020
8070C4910424r141l78O8718J58464K06026J20556q7827k50866k25817p9323J514
8059C4812350p3026k35567l56731l44090k20501j45365k59198m70982n37319m07823
8049C1761748l15993m21664n51321m65663k30666j10402j91571l26411l82238
8040B8765819l47283k39533j04529o3824j78978l04957k61185j01403k0394n2184
8030B7091549q8021j35919k80899m08079k95119l2650p096l26655n90559m49675
8020B4476877j20047m9603k74235m42287l82158k97589l75579m98832m70381l28451
$$ plain form
8010 21237715 20960857 20574531 20067687 19589093 19250054 18984447 18644649 18200655 17772037
8001 17772037 17458325 17217602 16949427 16624076 16276033 15938036 15644336 15430545 15259243
7992 15259243 15017480 14666485 14314334 14055145 13839765 13618910 13484164 13486809 13431874 13101055
7982 13101055 12627215 12370947 12414611 12457477 12276128 12010322 11863761 11775400 11584006 11331972
7972 11331972 11178061 11113801 10981236 10733897 10504620 10404615 10370289 10241071 9949762 9621917
7962 9621917 9456912 9470855 9433171 9175066 8868261 8786148 8856791 8759503 8466221 8305575
7952 8305575 8377929 8321976 7913279 7514740 7558047 7861361 7901999 7591722 7325402 7336758
7942 7336758 7441446 7419711 7266532 7024943 6714602 6477038 6485312 6660965 6752965 6705570
$$ packed form
8010B1237715k76858l86326n06844m78594l39039k65607l39798m43994m28618
8001A7772037l13712k40723k68175l25351l48043l37997k93700k13791j71302
7992A5259243k41763l50995l52151k59189k15380k20855j34746K645n4935l30819
7982A3101055m73840k56268M3664M2866j81349k65806j46561q8361j91394k52034
7972A1331972j53911o4260j32565k47339k29277j00005l4326j29218k91309l27845
7962I621917j65005J3943l7684k58105l06805q2113P0643r7288k93282j60646
7952H305575P2354n5953m08697l98539M3307L03314M0638l10277k66320J1356
7942G336758J04688k1735j53179k41589l10341k37564Q274J75653R2000m7395
$$ plain form
7932 6705570 6660751 6622683 6471557 6303231 6346720 6497367 6370743 5931073 5619556 5688754
7922 5688754 5853893 5826796 5744965 5774551 5727462 5461997 5281476 5475603 5764196 5685961
7912 5685961 5317581 5106533 5149045 5145405 4984516 4867271 4862919 4811861 4702773 4720751 4865671
7901 4865671 4912159 4804344 4716957 4678034 4522998 4287045 4227328 4348454 4329220 4077193
7891 4077193 3933996 4111776 4325699 4264086 4067592 4019737 4070384 4028587 3979725 4115467
7881 4115467 4312940 4272573 3990082 3747352 3684756 3694459 3704028 3758770 3813960 3727215 3511145
7870 3511145 3369083 3414381 3522664 3514328 3358074 3169513 3101272 3212900 3366330 3329314
7860 3329314 3091056 2944909 3083104 3254299 3087298 2659779 2425979 2592099 2883754 2984315
$$ packed form
7932F705570m4819l8068j51126j68326M3489J50647j26624m39670l11517O9198
7922E688754J65139k7097q1831K9586m7089k65465j80521J94127K88593p8235
7912E685961l68380k11048M2512l640j60889j17245m352n1058j09088J7978J44920
7901D865671M6488j07815q7387l8923j55036k35953n9717J21126j9234k52027
7891D077193j43197J77780K13923o1613j96494m7855N0647m1797m8862J35742
7881D115467J97473m0367k82491k42730o2596R703R569N4742N5190q6745k16070
7870C511145j42062M5298J08283q336j56254j88561o8241J11628J53430l7016
7860C329314k38258j46147J38195J71195j67001m27519k33800J66120K91655J00561
$$ plain form
7850 2984315 2901098 2795269 2724156 2698020 2765070 2880433 2874103 2695821 2524730 2502371 2534151
7839 2534151 2500970 2478385 2562486 2653331 2625852 2564415 2592323 2606628 2455342 2266771 2283201
7828 2283201 2425334 2376303 2109608 1958699 2070933 2173339 2064987 1975518 2144035 2354644
7818 2354644 2276118 2034798 1995358 2110259 2008664 1711596 1682409 2022545 2189064 1828511
7808 1828511 1389339 1447510 1823308 1937225 1763178 1763407 2001820 2046300 1811602 1777828 2129791
7797 2129791 2340285 2005698 1540273 1533288 1849156 1938583 1727785 1581708 1580445 1471418
7787 1471418 1271732 1296590 1547553 1644518 1476656 1388305 1550536 1656069 1481019 1289283
7777 1289283 1363915 1518836 1434570 1189237 1092912 1201043 1324792 1369206 1370531 1334582 1292226
$$ packed form
7850B984315q3217j05829p1113k6136O7050J15363o330j78282j71091k2359L1780
7839B534151l3181k2585Q4101R0845k7479o1437K7908J4305j51286j88571J6430
7828B283201J42133m9031k66695j50909J12234J02406j08352q9469J68517K10609
7818B354644p8526k41320l9440J14901j01595k97068k9187L40136J66519l60553
7808A828511m39172N8171L75798J13917j74047K29K38413M4480k34698l3774L51963
7797B129791K10494l34587m65425o985L15868Q9427k10798j46077j263j09027
7787A471418j99686K4858K50963R6965j67862q8351J62231J05533j75050j91736
7777A289283P4632J54921q4266k45333r6325J08131J23749M4414J325l5949m2356
$$ plain form
7766 1292226 1367432 1550680 1584576 1344019 1135271 1285948 1603290 1628493 1329583 1121731
7756 1121731 1214157 1354927 1299766 1159327 1134958 1209496 1273249 1328221 1396809 1399971 1279986
7745 1279986 1120055 1028864 1015968 1057046 1154975 1261426 1269655 1168726 1089255 1123633 1212050
7734 1212050 1265014 1276077 1254190 1178072 1088986 1094027 1192850 1230212 1115258 966194 932439
7723 932439 986244 1011074 1005005 1064582 1216117 1370506 1422231 1333244 1158134 1020500 998404
7712 998404 1008618 901702 702768 627900 799078 1079533 1277468 1368661 1401707 1335539 1147903
7701 1147903 996943 1066901 1291972 1416178 1320377 1136858 1041317 1071738 1158231 1202624 1121147
7690 1121147 930889 798167 872941 1068276 1147536 1053249 983218 1070936 1160770 1043790 798696
$$ packed form
7766A292226P5206J83248L3896k40557k08748J50677L17342K5203k98910k07852
7756A121731R2426J40770n5161j40439k4369P4538O3753N4972O8588L162j19985
7745A279986j59931r1191j2896M1078R7929J06451Q229j00929p9471L4378Q8417
7734A212050N2964J1063k1887p6118q9086N041R8823L7362j14954j49064l3755
7723I32439N3805K4830o069N9577J51535J54389N1725q8987j75110j37634k2096
7712I98404J0214j06916j98934p4868J71178K80455J97935R1193L3046o6168j87636
7701A147903j50960O9958K25071J24206r5801j83519r5541L0421Q6493M4393q1477
7690A121147j90258j32722P4774J95335P9260r4287p0031Q7718Q9834j16980k45094
$$ plain form
7679 798696 707571 867119 1072640 1123484 1072659 1070559 1095160 1009980 838169 779836 916171
7668 916171 1072081 1073642 994145 993482 1030440 944752 775282 755703 951790 1116405 1012405
7657 1012405 727012 541417 589246 757720 860414 816292 701011 671438 789112 910767
7647 910767 851487 657624 566311 664329 774672 755605 707040 754290 828669 834998 851364
7636 851364 950565 987271 817444 609252 656793 947978 1183797 1192383 1070477 938090 814216
7625 814216 739946 772148 831603 790276 717920 788255 930383 876447 621288 512581 738104
7614 738104 1013555 985711 713260 512003 497246 531696 522464 526916 591610 668432 698338
7603 698338 673137 623954 603324 632136 635822 526940 381444 395723 607560 811739 842112
$$ packed form
7679G98696r1125J59548K05521N0844n0825k100K4601q5180j71811n8333J36335
7668I16171J55910J561p9497o63L6958q5688j69470j9579J96087J64615j04000
7657A012405k85393j85595M7829J68474J02694m4122j15281k9573J17674J21655
7647I10767n9280j93863r1313R8018J10343j9067m8565M7250P4379O329J6366
7636H51364R9201L6706j69827k08192M7541K91185K35819Q586j21906j32387j23874
7625H14216p4270L2202N9455m1327p2356P0335J42128n3936k55159j08707K25523
7614G38104K75451k7844k72451k01257j4757L4450r232M452O4694P6822K9906
7603F98338k5201m9183k0630K8812L686j08882j45496J4279K11837K04179L0373
$$ plain form
7592 842112 783842 792756 854532 863870 816142 771718 730467 677956 666620 730521 805665 829650
7580 829650 815975 758137 613859 468338 510818 720548 801301 606409 395921 441635 608203
7569 608203 615096 502520 490288 546766 492502 411877 533976 764762 781714 588792 522916
7558 522916 661416 695189 510670 420629 602504 750889 589506 352699 397052 629370
7548 629370 714855 638214 641380 729958 664343 425448 310102 482243 715194 706616 468063
$$ packed form
7592H42112n8270Q914O1776R338m7728m4424m1251n2511j1336O3901P5144K3985
7580H29650j3675n7838j44278j45521M2480K09730Q0753j94892k10488M5714J66568
7569F08203O893j12576j2232N6478n4264q0625J22099K30786J6952j92922o5876
7558E22916J38500L3773j84519r0041J81875J48385j61383k36807M4353K32318
7548F29370Q5485p6641L166Q8578o5615k38895j15346J72141K32951q578k38553
$$ [...]
##END NTUPLES=NMR SPECTRUM
##END=
