##TITLE=1H ikalashn
CG-1217-A
20.11.2024
##JCAMPDX= 6.0         $$ Bruker NMR JCAMP-DX V2.0
##DATA TYPE= NMR SPECTRUM
##DATA CLASS= NTUPLES
##ORIGIN= UXNMR, Bruker Analytische Messtechnik GmbH
##OWNER= root
$$ TOPSPIN		Version 1.3
$$ 2024-11-20 11:00:05.109 +0400  Irina@DPX200
$$ Compression mode = diff/dup
##.OBSERVE FREQUENCY= 200.131300845
##.OBSERVE NUCLEUS= ^1H
##.ACQUISITION MODE= SIMULTANEOUS
##.ACQUISITION SCHEME= undefined
##.AVERAGES= 16
##.DIGITISER RES= 18
##SPECTROMETER/DATA SYSTEM= spect
##.PULSE SEQUENCE= zg
##.SOLVENT NAME= CDCl3
##.SHIFT REFERENCE= INTERNAL, CDCl3, 1, 17.49637
##AUDIT TRAIL= $$ (NUMBER, WHEN, WHO, WHERE, WHAT)
$$ ##TITLE= Audit trail, TOPSPIN		Version 1.3
$$ ##JCAMPDX= 5.01
$$ ##ORIGIN= Bruker BioSpin GmbH
$$ ##OWNER= Irina
$$ $$ F:/spectra/data/iren/nmr/1H/4/pdata/1/auditp.txt
$$ ##AUDIT TRAIL=  $$ (NUMBER, WHEN, WHO, WHERE, VERSION, WHAT)
(   1,<2024-11-20 10:59:28.156 +0400>,<Irina>,<DPX200>,<TOPSPIN 1.3>,
      <created by zg
	started at 2024-11-20 10:58:19.906 +0400,
	POWCHK disabled, PULCHK disabled
       configuration hash MD5:
       BE 6D 3F 07 2A EA 11 49 91 17 2B D3 AF B3 58 0D
       data hash MD5: 16K
       82 16 47 B8 61 DB 2B 11 12 EC 98 30 D7 6A 85 3B>)
(   2,<2024-11-20 10:59:29.281 +0400>,<Irina>,<DPX200>,<TOPSPIN 1.3>,
      <Start of raw data processing
       efp BC_mod = 2 LB = 0.02 FT_mod = 6 PKNL = 1 PHC0 = 208.8465 PHC1 = 1.368872 SI = 32K 
       data hash MD5: 32K
       90 AB B8 15 47 1D 82 3E 5E 4C B6 F1 A2 CB FB E9>)
(   3,<2024-11-20 10:59:31.671 +0400>,<Irina>,<DPX200>,<TOPSPIN 1.3>,
      <apk 
       data hash MD5: 32K
       DE FB FE AF B5 1D 0F 53 E4 E4 EE DB 97 6C BD E3>)
(   4,<2024-11-20 10:59:33.968 +0400>,<Irina>,<DPX200>,<TOPSPIN 1.3>,
      <abs n ABSG = 5 
       data hash MD5: 32K
       61 C1 42 3C 08 0D E0 69 4E 69 59 2F 77 B5 8B 98>)
(   5,<2024-11-20 10:59:51.890 +0400>,<Irina>,<DPX200>,<TOPSPIN 1.3>,
      <pk fgphup PHC0 = -15.3187 PHC1 = 24.8 
       data hash MD5: 32K
       63 63 25 FE B1 33 04 7F 72 C4 97 23 5B 23 76 A0>)
(   6,<2024-11-20 10:59:53.765 +0400>,<Irina>,<DPX200>,<TOPSPIN 1.3>,
      <abs n ABSG = 5 
       data hash MD5: 32K
       26 4B 25 EE 9A C7 60 F9 A9 DB A0 A5 20 F5 5C 07>)
$$ ##END=
$$ 
$$ $$ hash MD5
$$ $$ FD FA 5E E9 6F C4 EC 71 81 68 49 BE 3F 13 03 32
##$RELAX= 
##$RELAX= 
##$RELAX= 
##$RELAX= 
##$RELAX= 
##$RELAX= 
##$RELAX= 
##$RELAX= 
##$RELAX= 
$$ Bruker specific parameters
$$ --------------------------
##$DU= <F:/spectra>
##$EXPNO= 4
##$NAME= <1H>
##$PROCNO= 1
##$TYPE= <nmr>
##$USER= <iren>
##$AMP= (0..31)
100 100 100 100 100 100 100 100 100 100 100 100 100 100 100 100 100 100 
100 100 100 100 100 100 100 100 100 100 100 100 100 100 
##$ANAVPT= -1
##$AQSEQ= 0
##$AQ_mod= 1
##$AUNM= <au_zg>
##$AUTOPOS= <>
##$BF1= 200.13
##$BF2= 200.13
##$BF3= 200.13
##$BF4= 200.13
##$BF5= 200.13
##$BF6= 200.13
##$BF7= 200.13
##$BF8= 200.13
##$BYTORDA= 1
##$CFDGTYP= 0
##$CFRGTYP= 5
##$CHEMSTR= <none>
##$CNST= (0..63)
$$ [...]
##$SW_h= 4401.40845070422
##$TD= 16384
##$TD0= 1
##$TE= 300
##$TE2= 300
##$TE3= 300
##$TEG= 300
##$TL= (0..7)
0 120 120 120 120 120 120 120 
##$TP= (0..7)
150 150 150 150 150 150 150 150 
##$TP07= 0
##$TPNAME0= <>
##$TPNAME1= <>
##$TPNAME2= <>
##$TPNAME3= <>
##$TPNAME4= <>
##$TPNAME5= <>
##$TPNAME6= <>
##$TPNAME7= <>
##$TPOAL= (0..7)
0.5 0.5 0.5 0.5 0.5 0.5 0.5 0.5 
##$TPOFFS= (0..7)
0 0 0 0 0 0 0 0 
##$TUNHIN= 0
##$TUNHOUT= 0
##$TUNXOUT= 0
##$USERA1= <user>
##$USERA2= <user>
##$USERA3= <user>
##$USERA4= <user>
##$USERA5= <user>
##$V9= 5
##$VALIST= <valist>
##$VCLIST= <CCCCCCCCCCCCCCC>
##$VD= 0
##$VDLIST= <DDDDDDDDDDDDDDD>
##$VPLIST= <PPPPPPPPPPPPPPP>
##$VTLIST= <TTTTTTTTTTTTTTT>
##$WBST= 1024
##$WBSW= 25
##$XGAIN= (0..3)
0 0 0 0 
##$XL= 0
##$YL= 0
##$YMAX_a= 223333
##$YMIN_a= -334180
##$ZGOPTNS= <>
##$ZL1= 120
##$ZL2= 120
##$ZL3= 120
##$ZL4= 120
##$ABSF1= 17.49637
##$ABSF2= -4.496376
##$ABSG= 5
##$ABSL= 3
##$ALPHA= 0
##$AQORDER= 0
##$ASSFAC= 0
##$ASSFACI= 0
##$ASSFACX= 0
##$ASSWID= 0
##$AUNMP= <proc_1d>
##$AXLEFT= 0
##$AXRIGHT= 0
##$AXTYPE= 0
##$AXUNIT= <>
##$AZFE= 0.1
##$AZFW= 0.1
##$BCFW= 0
##$BC_mod= 2
##$BYTORDP= 0
##$COROFFS= 0
##$CY= 7568.61572265625
##$DATMOD= 1
##$DC= 0
##$DFILT= <>
##$DTYPP= 0
##$F1P= 17.9538593292236
##$F2P= -4.03888763876832
##$FCOR= 0.5
##$FTSIZE= 32768
##$FT_mod= 6
##$GAMMA= 0
##$GB= 0
##$INTBC= 0
##$INTSCL= 5.656564e-011
##$ISEN= 128
##$LB= 0.02
##$LEV0= 0
##$LPBIN= 0
##$MAXI= 945.577
##$MC2= 0
##$MEAN= 0
##$ME_mod= 0
##$MI= -402.1523
##$NCOEF= 0
##$NC_proc= -7
##$NLEV= 6
##$NOISF1= 8.587773
##$NOISF2= 6.764455
##$NSP= 0
##$NTH_PI= 0
##$NZP= 0
##$OFFSET= 17.49637
##$PC= 1
##$PHC0= 215.8025
##$PHC1= -9.918781
##$PH_mod= 1
##$PKNL= yes
##$PPARMOD= 0
##$PPDIAG= 0
##$PPIPTYP= 0
##$PPMPNUM= 100
##$PPRESOL= 1
##$PSCAL= 0
##$PSIGN= 0
##$REVERSE= no
##$SF= 200.13
##$SI= 32768
##$SIGF1= 16.12182
##$SIGF2= -4.496377
##$SINO= 3.521527
##$SIOLD= 32768
##$SREGLST= <1H.CDCl3>
##$SSB= 0
##$STSI= 32768
##$STSR= 0
##$SW_p= 4401.40845070422
##$SYMM= 0
##$S_DEV= 0
##$TDeff= 16384
##$TDoff= 0
##$TI= <>
##$TILT= no
##$TM1= 0
##$TM2= 0
##$TOPLEV= 0
##$USERP1= <user>
##$USERP2= <user>
##$USERP3= <user>
##$USERP4= <user>
##$USERP5= <user>
##$WDW= 1
##$XDIM= 32768
##$YMAX_p= 437763876
##$YMIN_p= -712524
$$ End of Bruker specific parameters
$$ ---------------------------------
##NTUPLES= NMR SPECTRUM
##VAR_NAME=  FREQUENCY,     SPECTRUM/REAL,   SPECTRUM/IMAG
##SYMBOL=    X,             R,               I
##VAR_TYPE=  INDEPENDENT,   DEPENDENT,       DEPENDENT
##VAR_FORM=  AFFN,          ASDF,            ASDF
##VAR_DIM=   32768,         32768,           32768
##UNITS=     HZ,            ARBITRARY UNITS, ARBITRARY UNITS
##FACTOR=    0.134324425510551, 1,           1
##FIRST=     4401.40845070422, 13310,        -1124328
##LAST=      0,             -135735,         -829785
##MIN=       0,             -712524,         0
##MAX=       4401.40845070422, 437763876,    0
$$ Real data points
##PAGE= N=1
##DATA TABLE= (X++(R..R)), XYDATA
$$ [...]
$$ plain form
13658 12615386 12065278 11512341 10944978 10371700 9829042 9360909 8984428 8674635 8385799
13649 8385799 8089444 7792687 7522206 7292690 7093379 6907251 6736064 6591760 6464795
13640 6464795 6326410 6174451 6048892 5975519 5919855 5837417 5749955 5715012 5725231 5709128 5651671
13629 5651671 5637202 5718079 5803015 5760574 5604602 5482578 5474682 5494730 5426109 5279822 5154677
13618 5154677 5089078 5030004 4935882 4836013 4768564 4713568 4626250 4511985 4428476 4413276 4435297
13607 4435297 4429443 4366706 4276710 4205372 4167013 4144875 4123403 4101061 4077054 4048454 4023626
13596 4023626 4015748 4014715 3989973 3937238 3897525 3902893 3922612 3900078 3834976 3786439 3787906 3799735
13584 3799735 3769293 3708821 3680887 3716636 3776103 3793272 3747248 3684382 3670730 3720269 3777075
$$ packed form
13658A2615386n50108n52937n67363n73278n42658m68133l76481l09793k88836
13649H385799k96355k96757k70481k29516j99311j86128j71187j44304j26965
13640F464795j38385j51959j25559p3373n5664q2438q7462l4943J0219j6103n7457
13629E651671j4469Q0877Q4936m2441j55972j22024p896K0048o8621j46287j25145
13618E154677o5599n9074r4122r9869o7449n4996q7318j14265q3509j5200K2021
13607D435297n854o2737q9996p1338l8359k2138k1472k2342k4007k8600k4828
13596D023626p878j033k4742n2735l9713N368J9719k2534o5102m8537J467J1829
13584C799735l0442o0472k7934L5749N9467J7169m6024o2866j3652M9539N6806
$$ plain form
13573 3777075 3781245 3740570 3706959 3690519 3650954 3588846 3578878 3660930 3753009 3751702 3686628 3677658
13561 3677658 3746291 3783553 3734985 3699210 3766096 3855858 3835331 3734534 3711466 3816623 3928654
13550 3928654 3946817 3920711 3933228 3964451 3956751 3933791 3953543 3992554 3980401 3925138 3904161
13539 3904161 3933847 3944039 3898771 3855625 3869394 3906832 3903832 3855996 3803553 3764042 3730390
13528 3730390 3712258 3728837 3766467 3784128 3767286 3749723 3770144 3819576 3846485 3819813 3776855
13517 3776855 3783433 3841075 3873509 3835779 3793055 3830455 3917627 3949879 3913386 3904961 3969536 4031584
13505 4031584 4039096 4062901 4164864 4263919 4253102 4183746 4196551 4302630 4375132 4355619 4327716
13494 4327716 4358113 4395665 4384479 4366591 4397315 4441980 4436721 4392657 4365193 4363692 4358661 4343905
$$ packed form
13573C777075M170m0675l3611j6440l9565o2108r968Q2052R2079j307o5074q970
13561C677658O8633L7262m8568l5775O6886Q9762k0527j00797k3068J05157J12031
13550C928654J8163k6106J2517L1223p700k2960J9752L9011j2153n5263k0977
13539C904161K9686J0192m5268m3146J3769L7438l000m7836n2443l9511l3652
13528C730390j8132J6579L7630J7661j6842j7563K0421M9432K6909k6672m2958
13517C776855O578N7642L2434l7730m2724L7400Q7172L2252l6493q425O4575O2048
13505D031584P512K3805J01963R9055j0817o9356J2805J06079P2502j9513k7903
13494D327716L0397L7552j1186j7888L0724M4665n259m4064k7464j501n031j4756
$$ plain form
13482 4343905 4330818 4308064 4260220 4203995 4162461 4126619 4078240 4022448 3967083 3906368 3853990
13471 3853990 3843592 3861271 3837142 3752102 3687341 3702583 3731171 3682079 3589424 3557002 3594185
13460 3594185 3620431 3610429 3615306 3643828 3644416 3620789 3646474 3730145 3778327 3742632 3702415 3735189
13448 3735189 3792792 3786977 3732393 3717015 3767460 3821699 3820726 3770754 3722369 3723291 3779228 3841170
13436 3841170 3853907 3826538 3816261 3835913 3836756 3800369 3776636 3798037 3830247 3850584 3895578 3973194
13424 3973194 4012712 3981834 3973501 4072980 4204454 4232656 4173370 4167440 4262479 4360476 4394659
13413 4394659 4422835 4502634 4591147 4630982 4644764 4677965 4721856 4759848 4825667 4941384 5046188
13402 5046188 5066282 5030180 5041341 5142017 5263362 5316024 5286500 5234764 5229417 5297686 5415608
$$ packed form
13482D343905j3087k2754m7844n6225m1534l5842m8379n5792n5365o0715n2378
13471C853990j0398J7679k4129q5040o4761J5242K8588m9092r2655l2422L7183
13460C594185K6246j0002M877K8522N88k3627K5685Q3671M8182l5695m0217L2774
13448C735189N7603n815n4584j5378N0445N4239r73m9972m8385R22N5937O1942
13436C841170J2737k7369j0277J9652Q43l6387k3733K1401L2210K0337M4994P7616
13424C973194L9518l0878q333R9479J31474K8202n9286n930R5039R7997L4183
13413D394659K8176P9799Q8513L9835J3782L3201M3891L7992O5819J15717J04804
13402E046188K0094l6102J1161J00676J21345N2662k9524n1736n347O8269J17922
$$ plain form
13391 5415608 5527554 5581513 5564835 5518934 5510544 5564787 5625761 5616890 5549563 5521697 5576397
13380 5576397 5620927 5553085 5423400 5378929 5461498 5559127 5564300 5486564 5387844 5299086 5238033
13369 5238033 5224720 5231177 5188846 5094747 5039029 5073442 5123808 5098125 5017083 4962860 4951898
13358 4951898 4938071 4901430 4855770 4800159 4737175 4710530 4749884 4801154 4784819 4706495 4642379
13347 4642379 4632904 4656723 4690053 4722628 4732495 4713487 4708711 4748411 4782534 4755874 4718867 4760547
13335 4760547 4850255 4868236 4799769 4768927 4843953 4935826 4955142 4955424 5025297 5124206 5141395 5074703
13323 5074703 5037612 5095019 5186740 5231763 5235493 5257860 5319925 5384821 5416722 5422761 5429541 5444962
13311 5444962 5469041 5527066 5645335 5786073 5863032 5856563 5858811 5949734 6080023 6153698 6182355
$$ packed form
13391E415608J11946N3959j6678m5901q390N4243O0974q871o7327k7866N4700
13380E576397M4530o7842j29685m4471Q2569R7629N173p7736r8720q8758o1053
13369E238033j3313O457m2331r4099n5718L4413N0366k5683q1042n4223j0962
13358D951898j3827l6641m5660n5611o2984k6645L9354N1270j6335p8324o4116
13347D642379r475K3819L3330L2575R867j9008m776L9700L4123k6660l7007M1680
13335D760547Q9708J7981o8467l0842P5026R1873J9316K82O9873R8909J7189o6692
13323E074703l7091N7407R1721M5023L730K2367O2065O4896L1901O039O780J5421
13311E444962K4079N8025J18269J40738P6959o469K248R0923J30289P3675K8657
$$ plain form
13300 6182355 6255460 6381410 6476252 6513868 6566488 6668786 6758360 6797158 6842658 6937636 7029254
13289 7029254 7069186 7103493 7184311 7275563 7331441 7389868 7493813 7592882 7630687 7669342 7807184
13278 7807184 8011645 8155814 8205587 8259179 8401996 8619334 8857050 9082803 9279697 9453073
13268 9453073 9651312 9923177 10259653 10622211 10993304 11338694 11572505 11649924 11651838 11679387
13258 11679387 11711452 11682993 11652077 11730572 11870159 11897445 11783880 11706244 11788142 11947435
13248 11947435 12074305 12201938 12397837 12623120 12819439 13022295 13264097 13465998 13561950
13239 13561950 13645811 13847126 14122130 14323520 14442314 14619717 14917794 15226941 15434989
13230 15434989 15566307 15699267 15836150 15921064 15939713 15948662 16018627 16166905 16339959 16473173
$$ packed form
13300F182355P3105J25950R4842L7616N2620J02298Q9574L8798M5500R4978R1618
13289G029254L9932L4307Q0818R1252N5878N8427J03945R9069L7805L8655J37842
13278G807184K04461J44169M9773N3592J42817K17338K37716K25753J96894J73376
13268I453073J98239K71865L36476L62558L71093L45390K33811P7419J914K7549
13258A1679387L2065k8459l0916P8495J39587K7286j13565p7636Q1898J59293
13248A1947435J26870J27633J95899K25283J96319K02856K41802K01901R5952
13239A3561950Q3861K01315K75004K01390J18794J77403K98077L09147K08048
13230A5434989J31318J32960J36883Q4914J8649Q949O9965J48278J73054J33214
$$ plain form
13220 16473173 16579149 16743407 17006799 17301958 17555731 17800837 18109169 18455395 18743687
13211 18743687 18954551 19165780 19419507 19658746 19821197 19922583 20016269 20128863 20266707
13202 20266707 20438807 20641208 20847484 21033916 21194283 21326395 21423920 21475066 21455303 21352658
13192 21352658 21226126 21184850 21250244 21289116 21166320 20925988 20725314 20618983 20526385 20404771
13182 20404771 20324379 20342469 20416610 20488178 20556616 20625390 20663691 20671999 20705068 20781161 20846130
13171 20846130 20874375 20923616 21036147 21167532 21274025 21391178 21557591 21735772 21882892 22029851
13161 22029851 22210833 22379459 22479187 22538578 22610082 22668428 22660366 22607498 22567096 22532520 22464413
13150 22464413 22381935 22331726 22306119 22285144 22312355 22420016 22521767 22504001 22393391 22301281
$$ packed form
13220A6473173J05976J64258K63392K95159K53773K45106L08332L46226K88292
13211A8743687K10864K11229K53727K39239J62451J01386R3686J12594J37844
13202B0266707J72100K02401K06276J86432J60367J32112R7525N1146j9763j02645
13192B1352658j26532m1276O5394L8872j22796k40332k00674j06331r2598j21614
13182B0404771q0392J8090P4141P1568O8438O8774L8301Q308L3069P6093O4969
13171B0846130K8245M9241J12531J31385J06493J17153J66413J78181J47120J46959
13161B2029851J80982J68626R9728N9391P1504N8346q062n2868m0402l4576o8107
13150B2464413q2478n0209k5607k0975K7211J07661J01751j7766j10610r2110
$$ plain form
13140 22301281 22226488 22067445 21830170 21656165 21604043 21559814 21430769 21289650 21240947 21264074
13130 21264074 21288086 21322589 21407799 21514747 21606468 21737972 21982535 22297303 22568726 22769970
13120 22769970 22977488 23243945 23544614 23848653 24161545 24483761 24790264 25066566 25322191
13111 25322191 25565231 25800851 26046366 26305595 26540143 26714961 26864447 27061028 27317464
13102 27317464 27568909 27759631 27908511 28080639 28323620 28634371 28964388 29262721 29534939
13093 29534939 29843161 30222687 30627247 30996248 31344943 31732898 32169630 32620893 33093843
13084 33093843 33636658 34250212 34877822 35498863 36160384 36894350 37675978 38492785 39378954
13075 39378954 40338233 41307447 42257105 43262453 44399348 45623877 46846950 48094278
$$ packed form
13140B2301281p4793j59043k37275j74005n2122m4229j29045j41119m8703K3127
13130B1264074K4012L4503Q5210J06948R1721J31504K44563L14768K71423K01244
13120B2769970K07518K66457L00669L04039L12892L22216L06503K76302K55625
13111B5322191K43040K35620K45515K59229K34548J74818J49486J96581K56436
13102B7317464K51445J90722J48880J72128K42981L10751L30017K98333K72218
13093B9534939L08222L79526M04560L69001L48695L87955M36732M51263M72950
13084C3093843N42815O13554O27610O21041O61521P33966P81628Q16807Q86169
13075C9378954R59279R69214R49658J005348J136895J224529J223073J247328
$$ plain form
13067 48094278 49489680 51087005 52822894 54658015 56669483 58953300 61507879 64280120
13059 64280120 67280819 70583324 74222149 78138767 82196684 86174138 89740817 92530942
13051 92530942 94320791 95156966 95316683 95153418 94948065 94819113 94709612 94487350 94128217
13042 94128217 93819213 93844019 94357146 95312920 96632644 98375383 100663943 103451270 106440787
13033 106440787 109275168 111761171 113890029 115727907 117400098 119161313 121331164 124062154
13025 124062154 127222633 130582448 134063128 137702512 141397580 144822583 147661472 149837369
13017 149837369 151455483 152605164 153309052 153604372 153550624 153164463 152455433 151543583 150640605
13008 150640605 149859320 149093323 148116589 146753503 144942872 142738838 140339080 138065793
$$ packed form
13067D8094278J395402J597325J735889J835121K011468K283817K554579K772241
13059F4280120L000699L302505L638825L916618M057917L977454L566679K790125
13051I2530942J789849Q36175J59717j63265k05353j28952j09501k22262l59133
13042I4128217l09004K4806N13127R55774J319724J742739K288560K787327K989517
13033A06440787K834381K486003K128858J837878J672191J761215K169851K730990
13025A24062154L160479L359815L480680L639384L695068L425003K838889K175897
13017A49837369J618114J149681P03888K95320n3748l86161p09030r11850r02978
13008A50640605p81285p65997r76734j363086j810631k204034k399758k273287
$$ plain form
13000 138065793 136209332 134850374 133858685 133075544 132494619 132287555 132676004 133769549 135517294
12991 135517294 137815417 140615350 143845379 147226216 150275594 152577783 154023483 154778667
12983 154778667 155123139 155382005 155880844 156781618 157956653 159135452 160174864 161087915 161825678
12974 161825678 162163923 161832195 160650030 158522869 155442936 151563783 147168560 142478275
12966 142478275 137553089 132429585 127255772 122205001 117341836 112683657 108338408 104459801
12958 104459801 101083902 98113666 95462979 93127936 91113873 89377513 87861366 86525083
12950 86525083 85334851 84283261 83428426 82849330 82543597 82425241 82444111 82654645 83140346
12941 83140346 83917951 84946483 86185559 87598410 89117963 90645817 92069253 93245452
$$ packed form
13000A38065793j856461j358958r91689p83141n80925k07064L88449J093545J747745
12991A35517294K298123K799933L230029L380837L049378K302189J445700P55184
12983A54778667L44472K58866M98839R00774J175035J178799J039412R13051P37763
12974A61825678L38245l31728j182165k127161l079933l879153m395223m690285
12966A42478275m925186n123504n173813n050771m863165m658179m345249l878607
12958A04459801l375899k970236k650687k335043k014063j736360j516147j336283
12950H6525083j190232j051590q54835n79096l05733j18356J8870K10534M85701
12941H3140346P77605J028532J239076J412851J519553J527854J423436J176199
$$ plain form
12933 93245452 93983637 94097993 93513139 92306745 90623523 88549986 86102033 83336936
12925 83336936 80417807 77507468 74627771 71708022 68775213 65997847 63498194 61214294
12917 61214294 59027834 56954971 55099899 53458413 51895086 50327188 48825520 47495037
12909 47495037 46332938 45249971 44179065 43120516 42111646 41181369 40317988 39477654
12901 39477654 38645126 37866474 37177691 36526597 35836723 35134757 34523187 34015666 33495784
12892 33495784 32876486 32216324 31626676 31133273 30684305 30235012 29765487 29264067 28749894
12883 28749894 28270860 27830785 27363357 26827790 26282534 25807271 25394735 24980293 24541026
12874 24541026 24102518 23676745 23253465 22832080 22415066 21997062 21598540 21265503 20990836
$$ packed form
12933I3245452P38185J14356n84854j206394j683222k073537k447953k765097
12925H3336936k919129k910339k879697k919749k932809k777366k499653k283900
12917F1214294k186460k072863j855072j641486j563327j567898j501668j330483
12909D7495037j162099j082967j070906j058549j008870r30277q63381q40334
12901C9477654q32528p78652o88783o51094o89874p01966o11570n07521n19882
12892C3495784o19298o60162n89648m93403m48968m49293m69525n01420n14173
12883B8749894m79034m40075m67428n35567n45256m75263m12536m14442m39267
12874B4541026m38508m25773m23280m21385m17014m18004l98522l33037k74667
$$ plain form
12865 20990836 20694600 20342904 20019692 19797112 19599988 19310384 18959014 18681306 18503400
12856 18503400 18311200 18042740 17776241 17586966 17432854 17241330 17020089 16821299 16664332
12847 16664332 16544498 16456481 16363232 16199930 15955090 15700525 15505735 15368485 15252239 15133444
12837 15133444 14986614 14787116 14559293 14360309 14193398 14010233 13820986 13706217 13675928
12828 13675928 13618806 13459420 13271595 13152657 13072932 12950534 12801320 12700326 12647049 12583556
12818 12583556 12508060 12459097 12417174 12333643 12235173 12188632 12178261 12129885 12046694 12004321 12011497
12807 12011497 11994986 11934947 11897140 11906972 11906124 11867429 11841733 11848439 11827048 11749976 11682263 11668299
12795 11668299 11653369 11585556 11508188 11475600 11454174 11386566 11288231 11202808 11121988 11024457 10934947
$$ packed form
12865B0990836k96236l51696l23212k22580j97124k89604l51370k77708j77906
12856A8503400j92200k68460k66499j89275j54112j91524k21241j98790j56967
12847A6664332j19834q8017r3249j63302k44840k54565j94790j37250j16246j18795
12837A5133444j46830j99498k27823j98984j66911j83165j89247j14769l0289
12828A3675928n7122j59386j87825j18938p9725j22398j49214j00994n3277o3493
12818A2583556p5496m8963m1923q3531r8470m6541j0371m8376q3191m2373P176
12807A2011497j6511o0039l7807R832q48l8695k5696O706k1391p7072o7713j3964
12795A1668299j4930o7813p7368l2588k1426o7608r8335q5423q0820r7531q9510
$$ plain form
12784 10934947 10870456 10790122 10675950 10593758 10583294 10561520 10449802 10331888 10343558 10444980
12774 10444980 10462625 10354321 10269627 10311055 10386413 10371271 10296444 10278718 10347816 10437871 10498672
12763 10498672 10530112 10539677 10540246 10569957 10651319 10742969 10784738 10781537 10794728 10851513 10902924 10879927
12751 10879927 10768786 10624766 10519741 10473840 10437162 10347555 10199983 10039282 9896640 9771308
12741 9771308 9669806 9610271 9574915 9509579 9394882 9273668 9183831 9111355 9039566 8993087 8988821
12730 8988821 8987959 8948529 8889416 8847420 8803746 8717997 8615301 8570211 8604770 8661847 8686601
12719 8686601 8683700 8682658 8690794 8698646 8702822 8709199 8728716 8768091 8808699 8809739 8757648 8692639 8652559
12706 8652559 8613945 8533644 8424772 8331676 8248001 8135018 8016599 7966477 7980978 7956274 7839732
$$ packed form
12784A0934947o4491q0334j14172q2192j0464k1774j11718j17914J1670J01422
12774A0444980J7645j08304q4694M1428P5358j5142p4827j7726O9098R0055O0801
12763A0498672L1440R565N69K9711Q1362R1650M1769l201J3191N6785N1411k2997
12751A0879927j11141j44020j05025m5901l6678q9607j47572j60701j42642j25332
12741I771308j01502n9535l5356o5336j14697j21214q9837p2476p1789m6479m266
12730H988821q62l9430n9113m1996m3674q5749j02696m5090L4559N7077K4754
12719H686601k901j042Q136P852M176O377J9517L9375M0608J040n2091o5009m0080
12706H652559l8614q0301j08872r3096q3675j12983j18419n0122J4501k4704j16542
$$ plain form
12695 7839732 7721113 7701019 7733796 7695398 7571697 7474204 7468008 7484655 7441291 7363995 7329114
12684 7329114 7334697 7310827 7242651 7201458 7230727 7267227 7226996 7130743 7077549 7103516 7133948
12673 7133948 7091257 6991209 6901548 6856254 6851334 6879187 6914458 6904288 6834479 6775189 6792243
12662 6792243 6838596 6815596 6727678 6680717 6719564 6766227 6749329 6702635 6688500 6704790 6723659
12651 6723659 6750202 6780447 6767453 6699531 6654769 6701506 6790942 6824437 6786976 6738624 6713555
12640 6713555 6708126 6733408 6793824 6842096 6838967 6826920 6857945 6888823 6855760 6813999 6866636 6973306
12628 6973306 6988856 6906338 6890487 7014028 7127357 7087762 6973968 6944843 6999815 7029258 7022324
12617 7022324 7061127 7145821 7183044 7148422 7125789 7166859 7227313 7269415 7324803 7416193 7502967
$$ packed form
12695G839732j18619k0094L2777l8398j23701r7493o196J6647m3364p7296l4881
12684G329114N583k3870o8176m1193K9269L6500m0231r6253n3194K5967L0432
12673G133948m2691j00048q9661m5294m920K7853L5271j0170o9809n9290J7054
12662F792243M6353k3000q7918m6961L8847M6663j6898m6694j4135J6290J8869
12651F723659K6543L0245j2994o7922m4762M6737Q9436L3495l7461m8352k5069
12640F713555n429K5282O0416M8272l129j2047L1025L0878l3063m1761N2637J06670
12628F973306J5550q2518j5851J23541J13329l9595j13794k9125N4972K9443o934
12617G022324L8803Q4694L7223l4622k2633M1070O0454M2102N5388R1390Q6774
$$ plain form
12606 7502967 7550664 7587708 7649174 7717767 7760491 7780909 7801951 7834057 7885858 7968152 8062973
12595 8062973 8125994 8144320 8158696 8208427 8289028 8381681 8482714 8579453 8640232 8663538 8701114
12584 8701114 8790915 8893246 8937741 8919736 8907106 8951548 9027438 9069664 9053354 9022144 9038061
12573 9038061 9109117 9177651 9188227 9153188 9130694 9148731 9181450 9198788 9206462 9229480 9282082
12562 9282082 9359745 9438358 9483532 9489268 9501280 9564148 9652171 9704096 9726074 9793734 9933184
12551 9933184 10069441 10132905 10156231 10212247 10305664 10389710 10454796 10533067 10632998 10730025 10812140
12540 10812140 10883284 10933206 10954927 10980122 11043930 11125809 11182737 11230673 11323529 11448961 11522259
12529 11522259 11508892 11484176 11530189 11629382 11711626 11764208 11833511 11938425 12044566 12127584 12211997
$$ packed form
12606G502967M7697L7044O1466O8593M2724K0418K1042L2106N1801Q2294R4821
12595H062973O3021J8326J4376M9731Q0601R2653J01033R6739O0779K3306L7576
12584H701114Q9801J02331M4495j8005j2630M4442P5890M2226j6310l1210J5917
12573I038061P1056O8534J0576l5039k2494J8037L2719J7338P674K3018N2602
12562I282082P7663P8613M5174N736J2012O2868Q8023N1925K1978O7660J39450
12551I933184J36257O3464K3326N6016R3417Q4046O5086P8271R9931R7027Q2115
12540A0812140P1144M9922K1721K5195O3808Q1879N6928M7936R2856J25432P3298
12529A1522259j3367k4716M6013R9193Q2244N2582O9303J04914J06141Q3018Q4413
$$ plain form
12518 12211997 12328379 12464220 12581703 12669153 12752861 12861548 12996301 13137542 13265963 13369530
12508 13369530 13448250 13530922 13669620 13880971 14096803 14220813 14249876 14290784 14425204 14606017
12498 14606017 14737420 14814187 14907373 15035826 15143106 15209818 15298382 15447776 15597736 15674703
12488 15674703 15700372 15749440 15832028 15886240 15876633 15838868 15821954 15835805 15868649 15915793 15970508
12477 15970508 16013762 16035177 16049390 16074714 16105086 16117893 16105231 16085501 16083231 16104333 16133964
12466 16133964 16156386 16174416 16208159 16273471 16361077 16439634 16485401 16509661 16546561 16607751 16665340
12455 16665340 16698377 16738227 16829388 16951253 17031992 17054874 17093744 17207621 17354367 17463546
12445 17463546 17548594 17672746 17832259 17958634 18031920 18110883 18240652 18401946 18566099 18733065
$$ packed form
12518A2211997J16382J35841J17483Q7450Q3708J08687J34753J41241J28421J03567
12508A3369530P8720Q2672J38698K11351K15832J24010K9063M0908J34420J80813
12498A4606017J31403P6767R3186J28453J07280O6712Q8564J49394J49960P6967
12488A5674703K5669M9068Q2588N4212r607l7765j6914J3851L2844M7144N4715
12477A5970508M3254K1415J4213K5324L0372J2807j2662j9730k270K1102K9631
12466A6133964K2422J8030L3743O5312Q7606P8557M5767K4260L6900O1190N7589
12455A6665340L3037L9850R1161J21865Q0739K2882L8870J13877J46746J09179
12445A7463546Q5048J24152J59513J26375P3286P8963J29769J61294J64153J66966
$$ plain form
12435 18733065 18898480 19048501 19204383 19406872 19641551 19850148 20028640 20231458 20463186
12426 20463186 20668456 20860039 21136411 21511118 21849101 22066138 22275071 22610932 23012771
12417 23012771 23331298 23576771 23883726 24267766 24601489 24834739 25065988 25363837 25673864
12408 25673864 25952289 26252024 26612167 26982149 27321768 27669451 28048109 28409844 28743099
12399 28743099 29128575 29607486 30093647 30508203 30909351 31382584 31882375 32305411 32667829
12390 32667829 33084344 33594958 34124055 34606897 35064683 35549773 36086138 36664134 37240004
12381 37240004 37749699 38166449 38521085 38829616 39054494 39196995 39365815 39662980 40042004
12372 40042004 40372991 40618552 40851881 41129540 41451967 41837318 42327515 42912911 43536012
$$ packed form
12435A8733065J65415J50021J55882K02489K34679K08597J78492K02818K31728
12426B0463186K05270J91583K76372L74707L37983K17037K08933L35861M01839
12417B3012771L18527K45473L06955L84040L33723K33250K31249K97849L10027
12408B5673864K78425K99735L60143L69982L39619L47683L78658L61735L33255
12399B8743099L85476M78911M86161M14556M01148M73233M99791M23036L62418
12390C2667829M16515N10614N29097M82842M57786M85090N36365N77996N75870
12381C7240004N09695M16750L54636L08531K24878J42501J68820K97165L79024
12372D0042004L30987K45561K33329K77659L22427L85351M90197N85396O23101
$$ plain form
12363 43536012 44170397 44819443 45455867 46058177 46691036 47441117 48281600 49116867 49955744
12354 49955744 50901898 51955550 52976164 53894857 54822597 55867641 56966909 57996163
12346 57996163 58952667 59926368 60960126 62035678 63150513 64330498 65605657 67027554
12338 67027554 68657316 70489342 72454112 74542664 76841152 79380844 82050059 84732180
12330 84732180 87423338 90098011 92544119 94467594 95717401 96308097 96297864 95783110 94956449
12321 94956449 94007670 92972976 91802729 90551220 89364584 88300806 87306457 86368265
12313 86368265 85544180 84837469 84186916 83608273 83210173 83034376 83001285 83046083 83194711 83484116
12303 83484116 83932925 84614873 85626900 86954573 88509045 90327400 92578206 95327703
$$ packed form
12363D3536012O34385O49046O36424O02310O32859P50081Q40483Q35267Q38877
12354D9955744R46154J053652J020614R18693R27740J045044J099268J029254
12346E7996163R56504R73701J033758J075552J114835J179985J275159J421897
12338F7027554J629762J832026J964770K088552K298488K539692K669215K682121
12330H4732180K691158K674673K446108J923475J249807N90696j0233n14754q26661
12321I4956449r48779j034694j170247j251509j186636j063778r94349r38192
12313H6368265q24085p06711o50553n78643l98100j75797l3091M4798J48628K89405
12303H3484116M48809O81948J012027J327673J554472J818355K250806K749497
$$ plain form
12295 95327703 98480692 102016503 106074163 110677689 115561394 120415312 125115927 129509786
12287 129509786 133129145 135402987 136122800 135508617 133870116 131412128 128329806 124836387
12279 124836387 121033213 116924029 112610184 108331907 104281526 100510151 97045407 93955980
12271 93955980 91252510 88853651 86703564 84816457 83172067 81688543 80345172 79218197
12263 79218197 78345743 77665202 77133713 76804116 76726173 76870133 77202903 77753182 78557019
12254 78557019 79620491 80955016 82542416 84247962 85900659 87485164 89092655 90629401
12246 90629401 91758051 92230606 92114694 91572667 90591946 89103263 87219515 85149043 82957287
12237 82957287 80605808 78160174 75766149 73460551 71187287 68975389 66931987 65079452
$$ packed form
12295I5327703L152989L535811M057660M603526M883705M853918M700615M393859
12287A29509786L619359K273842P19813o14183j638501k457988l082322l493419
12279A24836387l803174m109184m313845m278277m050381l771375l464744l089427
12271I3955980k703470k398859k150087j887107j644390j483524j343371j126975
12263G9218197q72454o80541n31489l29597p7943J43960L32770N50279Q03837
12254G8557019J063472J334525J587400J705546J652697J584505J607491J536746
12246I0629401J128650M72555j15912n42027r80721j488683j883748k070472k191756
12237H2957287k351479k445634k394025k305598k273264k211898k043402j852535
$$ plain form
12229 65079452 63363319 61802252 60462497 59294725 58167333 57064959 56091360 55273414
12221 55273414 54531466 53852066 53308990 52882759 52434526 51902344 51360267 50846434 50308742
12212 50308742 49766977 49337026 49020810 48659996 48189588 47752626 47455952 47198734 46874645
12203 46874645 46560651 46344699 46137808 45847346 45586226 45494062 45473428 45341539 45156787 45143094
12193 45143094 45335357 45553191 45723419 45984816 46434635 46986693 47539358 48090639 48612369
12184 48612369 48984502 49147247 49179094 49142522 48989350 48711248 48453489 48358877 48386436 48395635
12174 48395635 48345696 48311046 48349340 48451756 48601862 48808756 49087031 49443973 49873058 50340208
12164 50340208 50800449 51232161 51617611 51904424 52058366 52151862 52310797 52559185 52808136
$$ packed form
12229F5079452j716133j561067j339755j167772j127392j102374r73599q17946
12221E5273414p41948o79400n43076m26231m48233n32182n42077n13833n37692
12212E0308742n41765m29951l16216l60814m70408m36962k96674k57218l24089
12203D6874645l13994k15952k06891k90462k61120r2164k0634j31889j84752j3693
12193D5143094J92263K17834J70228K61397M49819N52058N52665N51281N21730
12184D8612369L72133J62745L1847l6572j53172k78102k57759r4612K7559R199
12174D8395635m9939l4650L8294J02416J50106K06894K78275L56942M29085M67150
12164E0340208M60241M31712L85450K86813J53942R3496J58935K48388K48951
$$ plain form
12155 52808136 53016061 53253084 53573093 53937123 54318933 54773694 55328371 55910537 56475563
12146 56475563 57108031 57893884 58774683 59641350 60506355 61467746 62554226 63720424 64955975
12137 64955975 66288026 67704648 69175632 70713898 72311607 73853181 75212678 76417228
12129 76417228 77594490 78772741 79861997 80838178 81817535 82917590 84145899 85450026
12121 85450026 86780656 88087195 89356337 90684063 92208438 93939729 95758854 97613749
12113 97613749 99595405 101763600 104025335 106284979 108617780 111179302 114009591 117047000
12105 117047000 120294857 123849195 127763416 131989443 136469825 141205015 146201487 151415723
12097 151415723 156782186 162255039 167796528 173360171 178917179 184479881 190068069 195648929
$$ packed form
12155E2808136K07925K37023L20009L64030L81810M54761N54677N82166N65026
12146E6475563O32468P85853Q80799Q66667Q65005R61391J086480J166198J235551
12137F4955975J332051J416622J470984J538266J597709J541574J359497J204550
12129G6417228J177262J178251J089256R76181R79357J100055J228309J304127
12121H5450026J330630J306539J269142J327726J524375J731291J819125J854895
12113I7613749J981656K168195K261735K259644K332801K561522K830289L037409
12105A17047000L247857L554338L914221M226027M480382M735190M996472N214236
12097A51415723N366463N472853N541489N563643N557008N562702N588188N580860
$$ plain form
12089 195648929 201117638 206331978 211157422 215483338 219219514 222313620 224796496 226795962
12081 226795962 228460444 229823776 230713495 230777403 229628826 227047935 223119089 218187094
12073 218187094 212659940 206845048 200938192 195064777 189257362 183463891 177702559 172205390
12065 172205390 167309754 163203018 159862503 157226246 155266265 153837670 152600396 151215760
12057 151215760 149567733 147728573 145806957 143940422 142349738 141229856 140577126 140235340
12049 140235340 140121569 140306683 140853652 141663039 142502177 143108148 143239074 142726280 141572647
12040 141572647 139988416 138274544 136648722 135172306 133810466 132535350 131371384 130340596
12032 130340596 129359551 128214597 126686819 124728753 122519040 120346213 118432910 116831484
$$ packed form
12089A95648929N468709N214340M825444M325916L736176L094106K482876J999466
12081B26795962J664482J363332Q89719O3908j148577k580891l928846m931995
12073B18187094n527154n814892n906856n873415n807415n793471n761332n497169
12065A72205390m895636m106736l340515k636257j959981j428595j237274j384636
12057A51215760j648027j839160j921616j866535j590684j119882o52730l41786
12049A40235340j13771J85114N46969Q09387Q39138O05971J30926n12794j153633
12040A41572647j584231j713872j625822j476416j361840j275116j163966j030788
12032A30340596r81045j144954j527778j958066k209713k172827j913303j601426
$$ plain form
12024 116831484 115443699 114142642 112909378 111866627 111177526 110921108 111070601 111567460
12016 111567460 112389141 113540410 114964500 116430389 117520477 117806217 117088538 115454116
12008 115454116 113111844 110250812 107056960 103720039 100310808 96733881 92929074 89073391
12000 89073391 85458463 82197286 79185039 76341330 73746190 71500941 69575866 67855709
11992 67855709 66253518 64729468 63265084 61863811 60527666 59213031 57867717 56520997
11984 56520997 55261593 54110557 52996775 51877485 50793117 49773269 48783896 47813312
11976 47813312 46920168 46138160 45410060 44672979 43938426 43235674 42548162 41857923 41178725
11967 41178725 40495875 39757902 38983134 38277996 37678654 37075904 36386606 35697416 35125576
$$ packed form
12024A16831484j387785j301057j233264j042751o89101k56418J49493M96859
12016A11567460Q21681J151269J424090J465889J090088K85740p17679j634422
12008A15454116k342272k861032l193852l336921l409231l576927l804807l855683
12000H9073391l614928l261177l012247k843709k595140k245249j925075j720157
11992F7855709j602191j524050j464384j401273j336145j314635j345314j346720
11984E6520997j259404j151036j113782j119290j084368j019848r89373r70584
11976D7813312q93144p82008p28100p37081p34553p02752o87512o90239o79198
11967D1178725o82850p37973p74768p05138n99342o02750o89298o89190n71840
$$ plain form
11958 35125576 34630287 34097250 33535382 33038964 32605838 32150370 31669463 31240491 30863274
11949 30863274 30455067 30009117 29613057 29289659 28956220 28570566 28186643 27830757 27451860
11940 27451860 27038976 26662602 26345500 26011888 25625246 25257834 24952315 24632464 24240429
11931 24240429 23853475 23557146 23295404 22968255 22607446 22324541 22126878 21911773 21625821
11922 21625821 21315928 21024542 20736314 20440968 20165977 19929610 19723752 19549452 19410783
11913 19410783 19273548 19092894 18886234 18717895 18604550 18496055 18360661 18226975 18118418
11904 18118418 18001110 17832175 17622761 17417541 17232596 17044259 16832659 16614893 16428381
11895 16428381 16284537 16149282 15985154 15805677 15654413 15527932 15371119 15171095 14994327
$$ packed form
11958C5125576m95289n33037n61868m96418m33126m55468m80907m28972l77217
11949C0863274m08207m45950l96060l23398l33439l85654l83923l55886l78897
11940B7451860m12884l76374l17102l33612l86642l67412l05519l19851l92035
11931B4240429l86954k96329k61742l27149l60809k82905j97663k15105k85952
11922B1625821l09893k91386k88228k95346k74991k36367k05858j74300j38669
11913A9410783j37235j80654k06660j68339j13345j08495j35394j33686j08557
11904A8118418j17308j68935k09414k05220j84945j88337k11600k17766j86512
11895A6428381j43844j35255j64128j79477j51264j26481j56813k00024j76768
$$ plain form
11886 14994327 14882115 14769372 14582597 14370935 14240907 14185176 14089724 13915663 13756366 13680194
11876 13680194 13629937 13541414 13460723 13451600 13461398 13389437 13246865 13136275 13087504 13024155 12903556
11865 12903556 12785861 12726385 12683912 12589511 12445710 12302827 12183612 12084118 12008248 11945565
11855 11945565 11851254 11709854 11586521 11542029 11520983 11412683 11217067 11050757 10969915 10893134
11845 10893134 10751169 10612297 10571195 10589141 10555458 10463365 10404311 10402873 10382777 10313847 10271246
11834 10271246 10297479 10307585 10208474 10042066 9926465 9897635 9887865 9837793 9759273 9694084 9664762
11823 9664762 9664724 9660421 9613619 9532277 9477802 9487738 9521029 9523765 9514722 9543774 9591685 9589731 9534383
11810 9534383 9500851 9523812 9537744 9473544 9358338 9271203 9236278 9210525 9160146 9100483 9056357
$$ packed form
11886A4994327j12212j12743j86775k11662j30028n5731r5452j74061j59297p6172
11876A3680194n0257q8523q0691r123R798p1961j42572j10590m8771o3349j20599
11865A2903556j17695n9476m2473r4401j43801j42883j19215r9494p5870o2683
11855A1945565r4311j41400j23333m4492k1046j08300j95616j66310q0842p6781
11845A0893134j41965j38872m1102J7946l3683r2093n9054j438k0096o8930m2601
11834A0271246K6233J0106r9111j66408j15601k8830r770n0072p8520o5189k9322
11823I664762l8m303m6802q1342n4475R936L3291K736r043K9052M7911j954n5348
11810I534383l3532K2961J3932o4200j15206q7135l4925k5753n0379n9663m4126
$$ plain form
11799 9056357 9019178 8963674 8892667 8840325 8823543 8809537 8756922 8681293 8643043 8662622 8690708
11788 8690708 8685371 8674016 8698620 8740450 8756894 8764289 8813788 8896177 8946558 8952699 8985977 9096035
11776 9096035 9234618 9325786 9371455 9444753 9602215 9837589 10106769 10368012 10605451 10838431
11766 10838431 11110219 11453335 11853594 12239442 12513087 12621178 12607881 12566392 12516709 12375564
11756 12375564 12089631 11748336 11488479 11316796 11118637 10833185 10519417 10235997 9961039
11747 9961039 9670623 9402070 9181871 8970447 8742069 8548082 8430485 8338929 8212987 8085555
11737 8085555 8011169 7944696 7806398 7639410 7572727 7616991 7621316 7481561 7291048 7211293 7262157
11726 7262157 7325560 7320633 7286112 7288714 7325696 7349646 7343365 7328899 7322811 7319625 7311639 7290333
$$ packed form
11799I056357l7179n5504p1007n2342j6782j4006n2615p5629l8250J9579K8086
11788H690708n337j1355K4604M1830J6444P395M9499Q2389N0381O141L3278J10058
11776I096035J38583R1168M5669P3298J57462K35374K69180K61243K37439K32980
11766A0838431K71788L43116M00259L85848K73645J08091j3297m1489m9683j41145
11756A2375564k85933l41295k59857j71683j98159k85452l13768k83420k74958
11747I961039k90416k68553k20199k11424k28378j93987j17597r1556j25942j27432
11737H085555p4386o6473j38298j66988o6683M4264M325j39755j90513p9755N0864
11726G262157O3403m927l4521K602L6982K3950o281j4466o088l186p986k1306
$$ plain form
11714 7290333 7230611 7115187 6984554 6915243 6918692 6905990 6800918 6652218 6569395 6567565 6550613
11703 6550613 6448279 6297897 6176548 6116065 6102708 6102300 6069252 5986691 5905019 5876267 5853681
11692 5853681 5750983 5610059 5584485 5708109 5810058 5748205 5611382 5571168 5626580 5639646
11682 5639646 5565563 5494968 5487349 5500786 5491411 5467308 5433852 5383961 5348117 5363130 5391591 5363525
11670 5363525 5294253 5265264 5290446 5302249 5274171 5254394 5266684 5276033 5265495 5254777 5237990
11659 5237990 5200208 5191935 5272487 5378668 5380207 5278961 5213719 5243182 5274965 5249605 5232140
11648 5232140 5256532 5244738 5170881 5145158 5221559 5276004 5210505 5131539 5162754 5213293 5129369
11637 5129369 4978320 4962439 5097516 5189788 5125644 4995113 4915382 4901710 4936452 5011783 5073039
$$ packed form
11714G290333n9722j15424j30633o9311L449j2702j05072j48700q2823j830j6952
11703F550613j02334j50382j21349o0483j3357m08l3048q2561q1672k8752k2586
11692E853681j02698j40924k5574J23624J01949o1853j36823m0214N5412J3066
11682E639646p4083p0595p619J3437r375k4103l3456m9891l5844J5013K8461k8066
11670E363525o9272k8989K5182J1803k8078j9777J2290R349j0538j0718j6787
11659E237990l7782q273Q0552J06181J539j01246o5242K9463L1783k5360j7465
11648E232140K4392j1794p3857k5723P6401N4445o5499p8966L1215N0539q3924
11637E129369j51049j5881J35077R2272o4144j30531p9731j3672L4742P5331O1256
$$ plain form
11626 5073039 5055171 4999263 5003566 5048963 5021716 4927630 4912657 5019384 5094681 5026134 4915397
11615 4915397 4903902 4960256 4976390 4968507 5025117 5117333 5121299 5017764 4934139 4966554 5058895
11604 5058895 5093791 5041139 4980890 5004725 5112010 5201803 5183583 5094467 5060563 5129876 5212648
11593 5212648 5227184 5225972 5297998 5407636 5439651 5379789 5336752 5375714 5435843 5448575 5443132
11582 5443132 5470941 5496608 5451304 5361160 5330139 5389823 5447327 5417486 5342484 5319928 5353208
11571 5353208 5355159 5293980 5246279 5272919 5320720 5309475 5257188 5237165 5248090 5221725 5147666
11560 5147666 5092322 5084716 5081640 5074185 5127183 5253700 5339336 5280871 5145229 5094329 5177364
11549 5177364 5289747 5333714 5329728 5344504 5382895 5401865 5393367 5400174 5453962 5533017 5591950 5615312
$$ packed form
11626E073039j7868n5908M303M5397k7247r4086j4973J06727P5297o8547j10737
11615D915397j1495N6354J6134p883N6610R2216L966j03535q3625L2415R2341
11604E058895L4896n2652o0249K3835J07285Q9793j8220q9116l3904O9313Q2772
11593E212648J4536j212P2026J09638L2015n9862m3037L8962O0129J2732n443
11582E443132K7809K5667m5304r0144l1021N9684N7504k9841p5002k2556L3280
11571E353208J951o1179m7701K6640M7801j1245n2287k0023J0925k6365p4059
11560E147666n5344p606l076p455N2998J26517Q5636n8465j35642n0900Q3035
11549E177364J12383M3967l986J4776L8391J8970q498O807N3788P9055N8933K3362
$$ plain form
11537 5615312 5625540 5643179 5660329 5664341 5670610 5708195 5778144 5849257 5895100 5915653 5924643 5936993
11525 5936993 5965970 6009984 6046530 6063029 6084421 6139594 6211130 6256758 6272005 6287340 6310304
11514 6310304 6322327 6330981 6367761 6428173 6470724 6482847 6490559 6499151 6491253 6487882 6529691 6584507
11502 6584507 6568557 6488840 6460580 6534296 6613276 6613920 6598920 6650322 6708991 6673434 6589169 6588262
11490 6588262 6672035 6707092 6641785 6584254 6628943 6723114 6761318 6726577 6680552 6673347 6711695
11479 6711695 6774002 6820373 6820565 6795864 6803653 6867502 6953653 7023069 7072117 7116460 7168958 7239018
11467 7239018 7325858 7413548 7495447 7590309 7711507 7848903 8010423 8234216 8507111 8720833
11457 8720833 8785236 8748583 8724201 8733401 8715515 8662336 8628625 8619981 8586276 8528379 8496334 8476079
$$ packed form
11537E615312J0228J7639J7150M012O269L7585O9949P1113M5843K0553Q990J2350
11525E936993K8977M4014L6546J6499K1392N5173P1536M5628J5247J5335K2964
11514F310304J2023Q654L6780O0412M2551J2123P712Q592p898l371M1809N4816
11502F584507j5950p9717k8260P3716P8980O44j5000N1402N8669l5557q4265r07
11490F588262Q3773L5057o5307n7531M4689R4171L8204l4741m6025p205L8348
11479F711695O2307M6371J92k4701P789O3849Q6151O9416M9048M4343N2498P0060
11467G239018Q6840Q7690Q1899R4862J21198J37396J61520K23793K72895K13722
11457H720833O4403l6653k4382R200j7886n3179l3711q644l3705n7897l2045k0255
$$ plain form
11445 8476079 8402740 8301757 8278707 8332213 8321569 8184586 8047366 8026827 8053460 8007800 7924260
11434 7924260 7917713 7981726 8009800 7979719 7973330 8020923 8056293 8044617 8045273 8110393 8203333 8262617
11422 8262617 8290936 8335689 8411967 8483693 8514620 8514337 8521835 8547443 8556523 8532595 8525514 8583995
11410 8583995 8663770 8684426 8671977 8738193 8892039 8991270 8949530 8882128 8944330 9109802 9230816
11399 9230816 9260569 9283843 9354420 9433579 9493448 9564738 9657236 9727981 9763129 9818577 9943101
11388 9943101 10111709 10260855 10352388 10392399 10424594 10508479 10665852 10847527 10985560 11070787
11378 11070787 11147873 11253919 11399323 11580191 11760891 11876194 11911286 11950702 12079293 12260212
11368 12260212 12386765 12431750 12458214 12499039 12529160 12562430 12667996 12854542 13027602 13112796
$$ packed form
11445H476079p3339j00983k3050N3506j0644j36983j37220k0539K6633m5660q3540
11434G924260o547O4013K8074l0081o389M7593L5370j1676O56O5120R2940N9284
11422H262617K8319M4753P6278P1726L0927k83P498K5608R080k3928p081N8481
11410H583995P9775K0656j2449O6216J53846R9231m1740o7402O2202J65472J21014
11399I230816K9753K3274P0577P9159N9869P1290R2498P0745L5148N5448J24524
11388I943101J68608J49146R1533M0011L2195Q3885J57373J81675J38033Q5227
11378A1070787P7086J06046J45404J80868J80700J15303L5092L9416J28591J80919
11368A2260212J26553M4985K6464M0825L0121L3270J05566J86546J73060Q5194
$$ plain form
11358 13112796 13156198 13251795 13418607 13599645 13751162 13889076 14058135 14279123 14525049 14750962
11348 14750962 14953683 15179377 15451682 15729070 15973668 16221411 16522924 16849422 17132871
11339 17132871 17375966 17640143 17939920 18237517 18536726 18889569 19300787 19711266 20090762
11330 20090762 20470407 20874201 21296951 21757556 22291489 22883094 23491550 24145126 24902007
11321 24902007 25698478 26349495 26740024 26916516 26957665 26876932 26712037 26583661 26560380 26549612
11311 26549612 26427745 26220333 26056634 25992807 25980359 25986341 26051751 26225788 26505910 26855508
11301 26855508 27245457 27671199 28145274 28674621 29249804 29869864 30562305 31354302 32249655
11292 32249655 33262127 34419146 35683691 36955811 38247916 39759692 41603279 43496825
$$ packed form
11358A3112796M3402R5597J66812J81038J51517J37914J69059K20988K45926K25913
11348A4750962K02721K25694K72305K77388K44598K47743L01513L26498K83449
11339A7132871K43095K64177K99777K97597K99209L52843M11218M10479L79496
11330B0090762L79645M03794M22750M60605N33933N91605O08456O53576P56881
11321B4902007P96471O51017L90529J76492M1149q0733j64895j28376k3281j0768
11311B6549612j21867k07412j63699o3827j2448N982O5410J74037K80122L49598
11301B6855508L89949M25742M74075N29347N75183O20060O92441P91997Q95353
11292C2249655J012472J157019J264545J272120J292105J511776J843587J893546
$$ plain form
11284 43496825 44918782 45553774 45414894 44601177 43243788 41712455 40491230 39645235 38687683
11275 38687683 37213155 35440179 33878054 32673278 31604418 30571662 29721868 29122627
11267 29122627 28641461 28183412 27791120 27472660 27155666 26847676 26635222 26492484 26290997
11258 26290997 26029400 25850455 25788947 25704125 25518289 25329886 25223658 25151403 25073946 25044508
11248 25044508 25068038 25043443 24933081 24832868 24785904 24685393 24466341 24244026 24141821 24107523
11238 24107523 24021141 23876775 23741757 23631430 23536616 23492540 23517124 23552857 23557750 23581360 23674103
11227 23674103 23800762 23917100 24047558 24214083 24375134 24507443 24660430 24864476 25083152
11218 25083152 25316585 25631902 26016537 26336535 26537895 26749445 27064137 27358079 27479772
$$ packed form
11284D3496825J421957O34992j38880q13717j357389j531333j221225q45995r57552
11275C8687683j474528j772976j562125j204776j068860j032756q49794n99241
11267B9122627m81166m58049l92292l18460l16994l07990k12454j42738k01487
11258B6290997k61597j78945o1508q4822j85836j88403j06228p2255p7457k9438
11248B5044508K3530k4595j10362j00213m6964j00511k19052k22315j02205l4298
11238B4107523q6382j44366j35018j10327r4814m4076K4584L5733M893K3610R2743
11227B3674103J26659J16338J30458J66525J61051J32309J52987K04046K18676
11218B5083152K33433L15317L84635L19998K01360K11550L14692K93942J21693
$$ plain form
11209 27479772 27494109 27557821 27650684 27631203 27500361 27407763 27415599 27440377 27430993 27438760 27494243
11198 27494243 27563862 27656577 27841723 28124507 28415839 28665199 28930696 29278196 29683033 30063675
11188 30063675 30361533 30575128 30760208 30991316 31277814 31536471 31697998 31813502 31995659
11179 31995659 32280466 32607132 32907919 33160358 33380766 33618763 33917949 34228341 34406661
11170 34406661 34359694 34134621 33823135 33461235 33086110 32782223 32567717 32333076 32010877
11161 32010877 31713179 31570793 31534281 31489184 31475784 31609626 31853284 32067932 32248808 32506469
11151 32506469 32840892 33142447 33407119 33738288 34129774 34468237 34779063 35244182 35918034
11142 35918034 36645490 37346679 38171760 39247211 40433453 41456966 42145378 42430382 42277660
$$ packed form
11209B7479772J4337O3712R2863j9481j30842r2598P836K4778r384P767N5483
11198B7494243O9619R2715J85146K82784K91332K49360K65497L47500M04837L80642
11188C0063675K97858K13595J85080K31108K86498K58657J61527J15504J82157
11179C1995659K84807L26666L00787K52439K20408K37997K99186L10392J78320
11170C4406661m6967k25073l11486l61900l75125l03887k14506k34641l22199
11161C2010877k97698j42386l6512m5097j3400J33842K43658K14648J80876K57661
11151C2506469L34423L01555K64672L31169L91486L38463L10826M65119O73852
11142C5918034P27456P01189Q25081J075451J186242J023513O88412K85004j52722
$$ plain form
11133 42277660 41763018 41109043 40499646 39914502 39236678 38446711 37626914 36859855 36213421
11124 36213421 35750757 35467466 35278006 35126206 35043192 35055857 35133352 35271399 35517026 35847481
11114 35847481 36144084 36364204 36621241 37006695 37453981 37881383 38348786 38945856 39630055
11105 39630055 40316727 41043769 41898373 42851072 43824291 44881880 46180021 47733148 49389785
11096 49389785 51080191 52953234 55179789 57677410 60093678 62035969 63280815 63807214
11088 63807214 63742990 63349247 62973678 62834317 62782768 62426289 61609708 60664809 60032498 59755522
11078 59755522 59560169 59345534 59293049 59491977 59773112 60009149 60306232 60759739 61257330
11069 61257330 61689070 62152480 62771051 63471878 64114996 64706280 65326598 65977124 66634649
$$ packed form
11133D2277660n14642o53975o09397n85144o77824p89967q19797p67059o46434
11124C6213421m62664k83291j89460j51800q3014J2665P7495J38047K45627L30455
11114C5847481K96603K20120K57037L85454M47286M27402M67403N97070O84199
11105C9630055O86672P27042Q54604R52699R73219J057589J298141J553127J656637
11096D9389785J690406J873043K226555K497621K416268J942291J244846N26399
11088F3807214o4224l93743l75569j39361n1549l56479q16581r44899o32311k76976
11078E9755522j95353k14635n2485J98928K81135K36037K97083M53507M97591
11069F1257330M31740M63410O18571P00827O43118N91284O20318O50526O57525
$$ plain form
11060 66634649 67332033 68057507 68714052 69299479 69970440 70804215 71671753 72480788 73349595
11051 73349595 74382027 75476259 76543474 77711823 79102709 80603126 82089235 83681797
11043 83681797 85532005 87543023 89569928 91708900 94095879 96592266 98983996 101336620
11035 101336620 103828978 106383783 108806981 111156367 113606268 116065320 118313649 120424322
11027 120424322 122648855 124950348 127051575 128900710 130687995 132433275 133966072 135304165
11019 135304165 136651782 138030322 139310158 140588886 142110217 143816673 145434767 147009211
11011 147009211 148870940 151042633 153184593 155203869 157396734 159874318 162372253 164780759
11003 164780759 167336673 170096793 172735517 175092163 177426010 179886072 182212454 184223854
$$ packed form
11060F6634649O97384P25474O56545N85427O70961Q33775Q67538Q09035Q68807
11051G3349595J032432J094232J067215J168349J390886J500417J486109J592562
11043H3681797J850208K011018K026905K138972K386979K496387K391730K352624
11035A01336620K492358K554805K423198K349386K449901K459052K248329K110673
11027A20424322K224533K301493K101227J849135J787285J745280J532797J338093
11019A35304165J347617J378540J279836J278728J521331J706456J618094J574444
11011A47009211J861729K171693K141960K019276K192865K477584K497935K408506
11003A64780759K555914K760120K638724K356646K333847K460062K326382K011400
$$ plain form
10995 184223854 186125594 188059341 189818102 191299359 192779896 194442012 196082959 197591481
10987 197591481 199242225 201207336 203254603 205245665 207432060 209923519 212383559 214600260
10979 214600260 216809093 219087961 221035714 222459507 223737612 225045631 225921869 226128963
10971 226128963 226192815 226445481 226303231 225246968 223761125 222470610 221138174 219481118
10963 219481118 218189042 218006357 218528487 219120996 220325148 223026624 226943719 231427171
10955 231427171 237061576 244815885 254321080 264885403 277426187 293022428 310274779
10948 310274779 327205196 345542277 369190248 397249236 422058638 436067958 437763876
10941 437763876 429230581 411972342 388787764 366326290 350103161 337588603 321055064
$$ packed form
10995A84223854J901740J933747J758761J481257J480537J662116J640947J508522
10987A97591481J650744J965111K047267J991062K186395K491459K460040K216701
10979B14600260K208833K278868J947753J423793J278105J308019Q76238K07094
10971B26128963O3852K52666j42250j056263j485843j290515j332436j657056
10963B19481118j292076j82685N22130N92509J204152K701476L917095M483452
10955B31427171N634405P754309R505195J0564323J2540784J5596241J7252351
10948C10274779J6930417J8337081K3647971K8058988K4809402J4009320J695918
10941D37763876q533295j7258239k3184578k2461474j6223129j2514558j6533539
$$ plain form
10934 321055064 297728251 273065357 253241999 238522462 225815594 214077620 204214251
10927 204214251 195904499 187691211 179394063 172077399 166007384 160389571 154813263 149506280
10919 149506280 144419922 139300324 134451754 130381121 126910562 123539638 120373761 117805771
10911 117805771 115608612 113254498 110848430 108845243 107088343 105028665 102705471 100622132
10903 100622132 98783930 96732013 94457028 92423084 90685672 88798139 86653004 84658543
10895 84658543 82980006 81311983 79535699 77941797 76637714 75341564 73943367 72708023
10887 72708023 71730696 70716563 69506121 68333476 67350319 66345052 65160806 63986436
10879 63986436 63006770 62124177 61230583 60413314 59697783 58917577 58035967 57285558 56796805
$$ packed form
10934C21055064k3326813k4662894j9823358j4719537j2706868j1737974r863369
10927B04214251q309752q213288q297148p316664o070015n617813n576308n306983
10919A49506280n086358n119598m848570m070633l470559l370924l165877k567990
10911A17805771k197159k354114k406068k003187j756900k059678k323194k083339
10903A00622132j838202k051917k274985k033944j737412j887533k145135j994461
10895H4658543j678537j668023j776284j593902j304083j296150j398197j235344
10887G2708023r77327j014133j210442j172645r83157j005267j184246j174370
10879F3986436r79666q82593q93594q17269p15531p80206q81610p50409m88753
$$ plain form
10870 56796805 56381716 55871213 55378970 55037481 54743418 54363507 53948154 53554524 53094135
10861 53094135 52539408 52052500 51723197 51394828 50933335 50458321 50116940 49829791 49466367
10852 49466367 49097988 48865442 48731246 48555419 48308756 48051189 47801568 47562729 47369424
10843 47369424 47198912 46951461 46616802 46324057 46135104 45947242 45700491 45501379 45416798
10834 45416798 45330796 45158146 45023394 45053486 45152717 45172561 45162311 45248706 45387059 45443989
10824 45443989 45435526 45470952 45523925 45464821 45285414 45104853 44969205 44810139 44594111 44363216
10814 44363216 44128789 43858496 43575138 43349029 43178251 42976104 42696240 42394615 42152655
10805 42152655 41994099 41885023 41778985 41663292 41577083 41566191 41622252 41710447 41849817 42097084
$$ packed form
10870E6796805m15089n10503m92243l41489k94063l79911m15353l93630m60389
10861E3094135n54727m86908l29303l28369m61493m75014l41381k87149l63424
10852D9466367l68379k32546j34196j75827k46663k57567k49621k38839j93305
10843D7369424j70512k47451l34659k92745j88953j87862k46751j99112q4581
10834D5416798q6002j72650j34752L0092R9231J9844j0250Q6395J38353N6930
10824D5443989q463L5426N2973n9104j79407j80561j35648j59066k16028k30895
10814D4363216k34427k70293k83358k26109j70778k02147k79864l01625k41960
10805D2152655j58556j09076j06038j15693q6209j0892N6061Q8195J39370K47267
$$ plain form
10795 42097084 42455832 42889811 43425887 44140057 45037844 46067097 47255149 48696446 50393454
10786 50393454 52263117 54299798 56510188 58620213 60074890 60471357 59852829 58512838
10778 58512838 56727487 54776490 52939253 51232595 49345659 47075565 44675463 42546214
10770 42546214 40751581 39107779 37602508 36392601 35452763 34558733 33629793 32805983 32152253
10761 32152253 31541028 30884877 30262876 29743885 29267650 28768862 28266990 27782845 27303616
10752 27303616 26863357 26522635 26243943 25918586 25530608 25162261 24836910 24501640 24164841
10743 24164841 23892732 23660118 23364942 23006989 22692511 22443960 22169942 21848208 21568851
10734 21568851 21359834 21137531 20876986 20667501 20542134 20405850 20195580 19971829 19795025
$$ packed form
10795D2097084L58748M33979N36076P14170Q97787J029253J188052J441297J697008
10786E0393454J869663K036681K210390K110025J454677L96467o18528j339991
10778E8512838j785351j950997j837237j706658j886936k270094k400102k129249
10770D2546214j794633j643802j505271j209907r39838q94030r28940q23810o53730
10761C2152253o11225o56151o22001n18991m76235m98788n01872m84145m79229
10752B7303616m40259l40722k78692l25357l87978l68347l25351l35270l36799
10743B4164841k72109k32614k95176l57953l14478k48551k74018l21734k79357
10734B1568851k09017k22303k60545k09485j25367j36284k10270k23751j76804
$$ plain form
10725 19795025 19645650 19515128 19437027 19381360 19260081 19082911 18960947 18912809 18826514 18662539
10715 18662539 18522063 18449360 18345715 18163494 18008536 17948648 17890623 17760841 17642551 17604714
10705 17604714 17550261 17380044 17171751 17045592 16970412 16851714 16706414 16604526 16531690 16444985
10695 16444985 16370764 16318741 16206090 16006113 15859608 15878742 15945355 15882226 15733897 15680825
10685 15680825 15740376 15761857 15689473 15627911 15641822 15669553 15660238 15644578 15640578 15619202 15589784
10674 15589784 15604021 15654068 15674701 15665444 15705902 15825618 15953668 16026824 16068740 16134344 16240012
10663 16240012 16372827 16521430 16681258 16855160 17043092 17218532 17352703 17478485 17665420
10654 17665420 17903301 18098852 18234244 18420508 18719305 19029298 19253854 19464164 19761820
$$ packed form
10725A9795025j49375j30522p8101n5667j21279j77170j21964m8138q6295j63975
10715A8662539j40476p2703j03645j82221j54958n9888n8025j29782j18290l7837
10705A7604714n4453j70217k08293j26159p5180j18698j45300j01888p2836q6705
10695A6444985p4221n2023j12651j99977j46505J9134O6613o3129j48329n3072
10685A5680825N9551K1481p2384o1562J3911K7731r315j5660m000k1376k9418
10674A5589784J4237N0047K0633r257M0458J19716J28050P3156M1916O5604J05668
10663A6240012J32815J48603J59828J73902J87932J75440J34171J25782J86935
10654A7665420K37881J95551J35392J86264K98797L09993K24556K10310K97656
$$ plain form
10645 19761820 20087608 20326989 20513227 20744697 20974576 21085380 21129184 21282032 21567514
10636 21567514 21828283 21986858 22141800 22370969 22621804 22853432 23129575 23501729 23923217
10627 23923217 24333035 24721293 25083668 25419626 25790578 26261380 26773268 27199484 27533483
10618 27533483 27889418 28314940 28752200 29188516 29679531 30204626 30672215 31097453 31597724
10609 31597724 32178342 32714123 33191122 33759955 34474144 35184100 35792405 36411503 37143580
10600 37143580 37899191 38585123 39295217 40143020 41053590 41897570 42705929 43579873 44502996
10591 44502996 45415278 46367322 47424975 48514526 49538780 50563152 51711008 52950571
10583 52950571 54161921 55346999 56597555 57919761 59270143 60703890 62298747 63984267
$$ packed form
10645A9761820L25788K39381J86238K31470K29879J10804M3804J52848K85482
10636B1567514K60769J58575J54942K29169K50835K31628K76143L72154M21488
10627B3923217M09818L88258L62375L35958L70952M70802N11888M26216L33999
10618B7533483L55935M25522M37260M36316M91015N25095M67589M25238N00271
10609C1597724N80618N35781M76999N68833P14189P09956O08305O19098P32077
10600C7143580P55611O85932P10094Q47803R10570Q43980Q08359Q73944R23123
10591D4502996R12282R52044J057653J089551J024254J024372J147856J239563
10583E2950571J211350J185078J250556J322206J350382J433747J594857J685520
$$ plain form
10575 63984267 65644868 67353097 69293089 71470878 73707758 75917991 78182169 80527591
10567 80527591 82851333 85118592 87452755 89963359 92648256 95526262 98695623 102167394
10559 102167394 105773287 109325763 112762674 116078217 119248620 122317169 125441017 128757294
10551 128757294 132284120 136023461 140068942 144539842 149506073 155062792 161385446 168608295
10543 168608295 176718324 185667195 195523982 206412418 218357255 231327939 245406865
10536 245406865 260718245 277020893 293320005 307895641 318790417 324480742 324405968
10529 324405968 319137329 310087251 298823524 286338061 272819010 258166670 242742431
10522 242742431 227509589 213421426 200842840 189662626 179755120 171087163 163496120
$$ packed form
10575F3984267J660601J708229J939992K177789K236880K210233K264178K345422
10567H0527591K323742K267259K334163K510604K684897K878006L169361L471771
10559A02167394L605893L552476L436911L315543L170403L068549L123848L316277
10551A28757294L526826L739341M045481M470900M966231N556719O322654P222849
10543A68608295Q110029Q948871R856787J0888436J1944837J2970684J4078926
10536B45406865J5311380J6302648J6299112J4575636J0894776N690325p4774
10529C24405968n268639r050078j1263727j2485463j3519051j4652340j5424239
10522B42742431j5232842j4088163j2578586j1180214r907506q667957p591043
$$ plain form
10515 163496120 156689002 150506723 144966945 140010531 135432988 131135864 127227664 123770159
10507 123770159 120617802 117634011 114891961 112512856 110451561 108600638 106982550 105666782
10499 105666782 104585346 103595064 102656818 101801435 100976437 100079575 99104308 98107293 97057162
10490 97057162 95846762 94435652 92860801 91128014 89214016 87165841 85088033 83036242
10482 83036242 81013334 79045124 77158914 75313195 73457668 71642659 69957546 68376913
10474 68376913 66783567 65137029 63505965 61937102 60406324 58902396 57446834 56025166
10466 56025166 54608924 53248464 52024303 50900218 49757380 48593438 47541376 46646682
10458 46646682 45777948 44837596 43918777 43137492 42424355 41628844 40760574 39971999 39321183
$$ packed form
10515A63496120o807118o182279n539778m956414m577543m297124l908200l457505
10507A23770159l152357k983791k742050k379105k061295j850923j618088j315768
10499A05666782j081436r90282r38246q55383q24998q96862r75267r97015j050131
10490I7057162j210400j411110j574851j732787j913998k048175k077808k051791
10482H3036242k022908j968210j886210j845719j855527j815009j685113j580633
10474F8376913j593346j646538j631064j568863j530778j503928j455562j421668
10466E6025166j416242j360460j224161j124085j142838j163942j052062q94694
10458D6646682q68734r40352r18819p81285p13137p95511q68270p88575o50816
$$ plain form
10449 39321183 38694138 37985018 37238094 36557900 35957363 35364314 34739989 34119722 33535277
10440 33535277 32956270 32344996 31738669 31222285 30815896 30440568 30020816 29574172 29159566
10431 29159566 28781192 28404776 28041679 27743901 27518344 27310626 27082574 26851119 26637227
10422 26637227 26421476 26165177 25845438 25468431 25076231 24725866 24423084 24098011 23695347
10413 23695347 23262325 22883188 22553301 22203229 21832716 21517700 21273416 21015667 20694951
10404 20694951 20376525 20134601 19942574 19727958 19477856 19230177 19003290 18788942 18585392
10395 18585392 18394653 18208920 18026296 17855602 17692970 17528256 17379559 17272885 17182465
10386 17182465 17052172 16887182 16755231 16679321 16605127 16501000 16409124 16360242 16319414 16263103
$$ packed form
10449C9321183o27045p09120p46924o80194o00537n93049o24325o20267n84445
10440C3535277n79007o11274o06327n16384m06389l75328m19752m46644m14606
10431B9159566l78374l76416l63097k97778k25557k07718k28052k31455k13892
10422B6637227k15751k56299l19739l77007l92200l50365l02782l25073m02664
10413B3695347m33022l79137l29887l50072l70513l15016k44284k57749l20716
10404B0694951l18426k41924j92027k14616k50102k47679k26887k14348k03550
10395A8585392j90739j85733j82624j70694j62632j64714j48697j06674r0420
10386A7182465j30293j64990j31951p5910p4194j04127r1876m8882m0828n6311
$$ plain form
10376 16263103 16229571 16239101 16244378 16219828 16216627 16258655 16271782 16207793 16157346 16227329 16367544
10365 16367544 16440685 16420493 16392754 16386185 16337658 16226899 16118234 16044343 15958548 15836045 15723637
10354 15723637 15645697 15548381 15391760 15227096 15122823 15066400 15000484 14920506 14874182 14877311 14883974
10343 14883974 14850631 14797729 14785338 14833280 14887579 14884720 14836767 14816176 14852991 14894658 14889264
10332 14889264 14858095 14846304 14847609 14830551 14801748 14782375 14749671 14665627 14544695 14431213 14325031
10321 14325031 14190705 14027087 13866322 13715363 13560032 13415461 13307908 13215084 13090488
10312 13090488 12941776 12821136 12743951 12680361 12616599 12555268 12467879 12327803 12183721 12113878
10302 12113878 12106752 12075059 11991165 11914713 11878498 11849235 11817846 11818491 11827675 11757330 11593693 11433818
$$ packed form
10376A6263103l3532R530N277k4550l201M2028J3127o3989n0447O9983J40215
10365A6367544P3141k0192k7739o569m8527j10759j08665p3891q5795j22503j12408
10354A5723637p7940r7316j56621j64664j04273n6423o5916p9978m6324L129O663
10343A4883974l3343n2902j2391M7942N4299k859m7953k0591L6815M1667n394
10332A4889264l1169j1791J305j7058k8803j9373l2704q4044j20932j13482j06182
10321A4325031j34326j63618j60765j50959j55331j44571j07553r2824j24596
10312A3090488j48712j20640p7185o3590o3762o1331q7389j40076j44082o9843
10302A2113878p126l1693q3894p6452l6215k9263l1389O45R184p0345j63637j59875
$$ plain form
10290 11433818 11330575 11213644 11030751 10849386 10727289 10594600 10382881 10175365 10085792
10281 10085792 10053980 9919742 9672387 9471400 9410961 9403176 9329660 9191789 9057303 8948041
10271 8948041 8844615 8746790 8674769 8640691 8648203 8690270 8731899 8734711 8718031 8755808 8887436
10260 8887436 9064250 9212756 9327001 9465856 9663329 9864133 9960335 9893874 9713512 9514581
10250 9514581 9331476 9125381 8877830 8637082 8441572 8256110 8038958 7825134 7672657
10241 7672657 7559127 7412777 7230501 7080745 6989553 6908357 6809396 6730341 6692096 6645333
10231 6645333 6545210 6422863 6331862 6266628 6187865 6100264 6049080 6047339 6050666 6010854 5929857
10220 5929857 5852833 5815886 5803970 5766644 5684300 5604038 5583466 5611196 5624912 5605672 5599854
$$ packed form
10290A1433818j03243j16931j82893j81365j22097j32689k11719k07516q9573
10281A0085792l1812j34238k47355k00987o0439p785p3516j37871j34486j09262
10271H948041j03426r7825p2021l4078P512M2067M1629K812j6680L7777J31628
10260H887436J76814J48506J14245J38855J97473K00804R6202o6461j80362j98931
10250I514581j83105k06095k47551k40748j95510j85462k17152k13824j52477
10241G672657j13530j46350j82276j49756r1192q1196r8961p9055l8245m6763
10231F645333j00123j22347r1001o5234p8763q7601n1184j741L327l9812q0997
10220E929857p7024l6947j1916l7326q2344q0262k0572K7730J3716j9240n818
$$ plain form
10209 5599854 5631635 5651547 5611975 5548858 5532687 5561847 5564101 5502431 5426549 5403208 5433822
10198 5433822 5466457 5466094 5443664 5422844 5406976 5389886 5382194 5404337 5451733 5486971 5482756 5464257
10186 5464257 5488620 5578156 5688414 5753796 5760671 5764535 5829577 5956399 6082568 6160288 6217462
10175 6217462 6321254 6490514 6676506 6835710 6987754 7179811 7416932 7656044 7862922
10166 7862922 8056577 8296071 8626834 9038792 9490777 9989657 10614588 11418618 12337516
10157 12337516 13281063 14311511 15615481 17235469 18902194 20195280 20817044 20689033
10149 20689033 19918933 18790512 17673206 16750325 15849588 14688746 13277562 11927920
10141 11927920 10873399 10059192 9346556 8735258 8277165 7915844 7553580 7195953 6906731
$$ packed form
10209E599854L1781J9912l9572o3117j6171K9160K254o1670p5882k3341L0614
10198E433822L2635l63k2430k0820j5868j7090p692K2143M7396L5238m215j8499
10186E464257K4363Q9536J10258O5382O875L864O5042J26822J26169P7720N7174
10175F217462J03792J69260J85992J59204J52044J92057K37121K39112K06878
10166G862922J93655K39494L30763M11958M51985M98880O24931Q04030R18898
10157A2337516R43547J030448J303970J619988J666725J293086O21764j28011
10149B0689033p70100j128421j117306r22881r00737j160842j411184j349642
10141A1927920j054521q14207p12636o11298m58093l61321l62264l57627k89222
$$ plain form
10132 6906731 6675501 6439351 6193214 5977438 5786303 5581525 5375118 5213546 5091398
10123 5091398 4955384 4788674 4630513 4516709 4447209 4400779 4344122 4249224 4136506 4067329
10113 4067329 4058781 4052617 4010394 3978827 4001104 4026980 3990449 3921052 3885992 3868773 3808498 3723991
10101 3723991 3686700 3690325 3661169 3589878 3538447 3514658 3457287 3362079 3305693 3314206 3319282 3285300
10089 3285300 3269821 3302367 3309579 3238014 3161716 3174227 3237739 3238868 3158047 3089383 3102769 3164680
10077 3164680 3202538 3189173 3146769 3103406 3066131 3028193 2994449 2988769 3021401 3061773 3074874
10066 3074874 3075330 3102331 3145439 3149961 3104134 3064594 3076426 3117514 3142031 3134754 3108724 3094817
10054 3094817 3137378 3241394 3323477 3294468 3201096 3189617 3300788 3410290 3427472 3438782 3561383
$$ packed form
10132F906731k31230k36150k46137k15776j91135k04778k06407j61572j22148
10123E091398j36014j66710j58161j13804o9500m6430n6657r4898j12718o9177
10113D067329q548o164m2223l1567K2277K5876l6531o9397l5060j7219o0275q4507
10101C723991l7291L625k9156p1291n1431k3789n7371r5208n6386Q513N076l3982
10089C285300j5479L2546P212p1565p6298J2511O3512J129q0821o8664J3386O1911
10077C164680L7858j3365m2404m3363l7275l7938l3744n680L2632M0372J3101
10066C074874M56K7001M3108M522m5827l9540J1832M1088K4517p277k6030j3907
10054C094817M2561J04016Q2083k9009r3372j1479J11171J09502J7182J1310J22601
$$ plain form
10043 3561383 3749872 3867049 3884250 3889431 3934463 3992962 4050222 4122763 4191465 4212615 4196257
10032 4196257 4187967 4179114 4123770 4036929 3978121 3938146 3848405 3716624 3642644 3664119 3688730
10021 3688730 3630834 3526895 3456217 3425286 3398658 3378632 3376654 3352314 3262091 3147557 3105634
10010 3105634 3174428 3295562 3384349 3400457 3358362 3304700 3284500 3305693 3337261 3350750 3349346
9999 3349346 3349681 3360869 3393664 3459070 3537495 3579057 3560731 3520044 3508025 3530113 3555788 3563681
9987 3563681 3552562 3527775 3502111 3495927 3517135 3553183 3591255 3625886 3643138 3631304 3616308 3644319
9975 3644319 3712630 3765074 3780282 3810381 3893612 3984419 4027925 4056163 4135751 4250720 4323157
9964 4323157 4343295 4392754 4520295 4669949 4771779 4848817 4981074 5190283 5412819 5589056
$$ packed form
10043C561383J88489J17177J7201N181M5032N8499N7260P2541O8702K1150j6358
10032D196257q290q853n5344q6841n8808l9975q9741j31781p3980K1475K4611
10021C688730n7896j03939p0678l0931k6628k0026j978k4340r0223j14534m1923
10010C105634O8794J21134Q8787J6108m2095n3662k0200K1193L1568J3489j404
9999C349346L35J1188L2795O5406P8425M1562j8326m0687j2019K2088K5675P893
9987C563681j1119k4787k5664o184K1208L6048L8072L4631J7252j1834j4996K8011
9975C644319O8311N2444J5208L0099Q3231R0807M3506K8238P9588J14969P2437
9964D323157K0138M9459J27541J49654J01830P7038J32257K09209K22536J76237
$$ plain form
9954 5589056 5740965 5935229 6180883 6400699 6527499 6598864 6700905 6825506 6862633 6764747
9944 6764747 6635379 6582645 6550598 6399278 6119200 5849201 5677932 5541108 5349286 5118027
9934 5118027 4915393 4757854 4623356 4510081 4416463 4305589 4153302 4001574 3906947 3860278
9924 3860278 3808915 3733963 3653437 3570846 3475917 3382199 3311698 3251607 3173904 3088735 3031803
9913 3031803 3006317 2981309 2938972 2881345 2803603 2708346 2632145 2604113 2590180 2536765 2458277
9902 2458277 2415159 2414028 2405649 2378741 2366629 2352480 2271803 2141373 2077805 2128210 2182781 2137494
9890 2137494 2053372 2049422 2109941 2123230 2066882 2021533 2018659 2007569 1977856 1984155 2024336 2019152
9878 2019152 1957688 1942752 2025101 2101759 2067057 1973390 1937222 1956215 1939528 1876471 1846994
$$ packed form
9954E589056J51909J94264K45654K19816J26800P1365J02041J24601L7127r7886
9944F764747j29368n2734l2047j51320k80078k69999j71269j36824j91822k31259
9934E118027k02634j57539j34498j13275r3618j10874j52287j51728r4627m6669
9924C860278n1363p4952q0526q2591r4929r3718p0501o0091p7703q5169n6932
9913C031803k5486k5008m2337n7627p7742r5257p6201k8032j3933n3415p8488
9902B458277m3118j131q379k6908j2112j4149q0677j30430o3568N0405N4571m5287
9890B137494q4122l950O0519J3289n6348m5349k874j1090k9713O299M0181n184
9878B019152o1464j4936Q2349P6658l4702r3667l6168J8993j6687o3057k9477
$$ plain form
9867 1846994 1873471 1883374 1839078 1798094 1801922 1793868 1711497 1601631 1569548 1636565 1710985 1702919
9855 1702919 1623801 1555499 1545769 1560429 1539622 1479180 1432497 1436666 1469767 1493583 1503691 1509154
9843 1509154 1494643 1448035 1407786 1430031 1508193 1572516 1579280 1559248 1561084 1581772 1578476 1531088
9831 1531088 1471717 1455593 1506298 1584440 1618319 1578799 1512373 1482354 1494298 1505948 1491640
9820 1491640 1457780 1407765 1339741 1278885 1264782 1296206 1324908 1312714 1263503 1197813 1133103
9809 1133103 1091604 1087558 1099767 1092762 1068021 1056734 1063342 1060376 1038963 1016405 993794 959058
9797 959058 932052 945934 979649 975090 929375 898375 897555 881066 839577 828645 864699 884158
9785 884158 853382 828672 848842 859222 814435 770009 787396 827065 827713 816751 841096 859150
$$ packed form
9867A846994K6477R903m4296m0984L828q054q2371j09866l2083O7017P4420q066
9855A702919p9118o8302r730J4660k0807o0442m6683M169L3101K3816J0108N463
9843A509154j4511m6608m0249K2245P8162O4323O764k0032J836K0688l296m7388
9831A531088n9371j6124N0705P8142L3879l9520o6426l0019J1944J1650j4308
9820A491640l3860n0015o8024o0856j4103L1424K8702j2194m9211o5690o4710
9809A133103m1499m046J2209p005k4741j1287O608k966k1413k2558k2611l4736
9797I59058k7006J3882L3715m559m5715l1000q20j6489m1489j0932L6054J9459
9785H84158l0776k4710K0170J0380m4787m4426J7387L9669O48j0962K4345J8054
$$ plain form
9773 859150 814356 753492 750163 766533 723352 658509 667680 720939 701388 615637 594321 664832
9761 664832 694260 608069 509185 505098 550401 550635 514953 509739 538088 551690 529290 482355
9749 482355 432163 418886 471306 540333 540175 479972 459537 505827 528947 486271 460924 504476
9737 504476 531658 471493 405153 433775 509592 528132 502376 508361 530486 505315 461540 469461
9725 469461 496335 461436 400392 419457 505322 538443 494545 476815 531506 582377 581186 581409
9713 581409 614811 623477 572224 515917 496086 474783 432452 431353 507890 585936 576754 504019
9701 504019 458815 477382 522638 549273 541282 515958 515634 558162 589642 544871 457284 428743
9689 428743 478634 517948 498306 481230 515456 553363 551683 550981 577428 566058 477429 399631
$$ packed form
9773H59150m4794o0864l329J6370m3181o4843R171N3259j9551q5751k1316P0511
9761F64832K9428q6191r8884m087M5303K34l5682n214K8349J3602k2400m6935
9749D82355n0192j3277N2420O9027j58o0203k0435M6290K3120m2676k5347M3552
9737E04476K7182o0165o6340K8622P5817J8540k5756N985K2125k5171m3775P921
9725D69461K6874l4899o1044J9065Q5865L3121m3898j7730N4691N0871j191K23
9713E81409L3402Q666n1253n6307j9831k1303m2331j099P6537P8046r182p2735
9701E04019m5204J8567M5256K6635p991k5324l24M2528L1480m4771q7587k8541
9689D28743M9891L9314j9642j7076L4226L7907j680p02K6447j1370q8629p7798
$$ plain form
9677 399631 420552 472837 433836 327379 288325 350081 405514 386740 356482 382204 422084
9666 422084 399290 328488 301521 363080 445700 444059 344768 255292 276763 372642 424291 404088
9654 404088 397877 438510 436678 340220 245111 246940 284026 256339 212417 258267 340514 307089
9642 307089 168681 108162 200353 301291 279418 196589 167827 177092 148926 105304 126314
9631 126314 209095 272270 271101 228721 180249 150885 161512 201241 223692 212648 209432 235509
9619 235509 246910 217068 197011 224297 242338 200090 165546 223480 308752 282302 157851
9608 157851 100859 177123 250742 197332 89068 67450 129267 161904 133774 118613 147279
9597 147279 159554 121793 87896 103809 135496 141302 144559 174072 192933 160830 123179 153360
$$ packed form
9677C99631K0921N2285l9001j06457l9054O1756N5433j8774l0258K5722L9880
9666D22084k2794p0802k6967O1559Q2620j641r9291q9476K1471R5879N1649k0203
9654D04088o211M0633j832r6458r5109J829L7086k7687m3922M5850Q2247l3425
9642C07089j38408o0519R2191J00938k1873q2829k8762R265k8166m3622K1010
9631A26314Q2781O3175j169m2380m8472k9364J0627L9729K2451j1044l216K6077
9619B35509J1401k9842k0057K7286J8041m2248l4544N7934Q5272k6450j24451
9608A57851n6992P6264P3619n3410j08264k1618O1817L2637k8130j5161K8666
9597A47279J2275l7761l3897J5913L1687N806L257K9513J8861l2103l7651L0181
$$ plain form
9585 153360 230421 263463 231201 204827 221031 227522 188254 151928 160878 171174 133629 87781
9573 87781 93583 123292 112440 78217 88406 138123 160922 150789 165514 204937 196818 128052
9561 128052 83962 114480 155365 136673 88104 74922 97542 119485 139060 169559 193713 195977
9549 195977 199960 223074 236695 220011 206180 222774 236064 212244 183666 189450 200569 178933
9537 178933 164609 216028 295603 308651 241682 174974 163987 189578 222633 257508 277766 264579
9525 264579 245962 267050 307414 301318 245606 209372 225141 251977 265064 294676 342471 345601
9513 345601 277481 211239 218138 260384 256058 207840 189502 226651 269182 285190 313793 396677
9501 396677 500428 547203 511610 453856 446025 486804 515199 499844 473091 463065 438948 365183
$$ packed form
9585A53360P7061L3042l2262k6374J6204O491l9268l6326Q950J0296l7545m5848
9573H7781N802K9709j0852l4223J0189M9717K2799j0133J4725L9423q119o8766
9561A28052m4090L0518M0885j8692m8569j3182K2620K1943J9575L0499K4154K264
9549A95977L983K3114J3621j6684j3831J6594J3290k3820k8578N784J1119k1636
9537A78933j4324N1419P9575J3048o6969o6708j0987K5591L3055L4875K0258j3187
9525B64579j8617K1088M0364o096n5712l6234J5769K6836J3087K9612M7795L130
9513C45601o8120o6242O899M2246m326m8218j8338L7149M2531J6008K8603Q2884
9501C96677J03751M6775l5593n7754p831M0779K8395j5355k6753j0026k4117p3765
$$ plain form
9489 365183 277302 248841 295367 360881 392350 381959 343946 298170 271857 272098 264695 224355
9477 224355 186497 194097 218482 204943 172930 180428 205443 173849 106411 111603 203845 259026
9465 259026 205674 134209 137283 160401 116881 51161 60140 122146 137055 93612 68513 83221
9453 83221 85114 64695 77045 136757 189079 200141 193014 183805 161121 138980 152193 185174
9441 185174 179055 126044 87790 101709 133417 141758 131826 122319 111605 94761 73209 41384
9429 41384 3863 -3889 36584 74927 54537 9951 18917 68033 67241 5791 -17927 43547 104558
9416 104558 82873 26627 28474 80006 93903 33704 -47968 -82806 -52943 1220 15150 -35716
9404 -35716 -98928 -108950 -82968 -92579 -145221 -179105 -182735 -213966 -273936 -281255 -222645 -204128
$$ packed form
9489C65183q7881k8461M6526O5514L1469j0391l8013m5776k6313K41p403m0340
9477B24355l7858P600K4385j3539l2013P498K5015l1594o7438N192R2242N5181
9465B59026n3352p1465L074K3118m3520o5720Q979O2006J4909m3443k5099J4708
9453H3221J893k0419J2350N9712N2322J1062p127r209k2684k2141J3213L2981
9441A85174o119n3011l8254J3919L1708Q341r932r507j0714j6844k1552l1825
9429D1384l7521p752M0473L8343k0390m4586Q966M9116p92o1450k3718O1474O1011
9416A04558k1685n6246J847N1532J3897o0199q1672l4838K9863N4163J3930n0866
9404c5716o3212j0022K5982r611n2642l3884l630l1231n9970p319N8610J8517
$$ plain form
9392 -204128 -275084 -326821 -271422 -201489 -235459 -307833 -279516 -181294 -160106 -223017 -232271 -153986
9380 -153986 -114917 -172962 -213917 -149909 -64341 -63848 -111300 -110846 -63239 -33388 -36207 -49388 -80294
9367 -80294 -133528 -163809 -141425 -116017 -138241 -167994 -143136 -92906 -90467 -127254 -133123 -103650
9355 -103650 -107751 -166502 -215642 -206815 -169571 -147296 -136529 -122053 -120166 -148811 -187632 -201606
9343 -201606 -187300 -173439 -185577 -221582 -254907 -260092 -241847 -231135 -241968 -247429 -217318 -163938
9331 -163938 -127162 -127453 -155178 -188344 -198163 -163588 -112194 -114887 -193990 -267100 -244412 -159973
9319 -159973 -129381 -183140 -230085 -204333 -158247 -162228 -189603 -173557 -127464 -124414 -176653 -215686
9307 -215686 -198855 -168218 -177841 -212908 -220702 -194375 -180777 -207047 -238470 -229402 -192212 -181063
$$ packed form
9392b04128p0956n1737N5399O9933l3970p2374K8317R8222K1188o2911r254P8285
9380a53986L9069n8045m0955O4008Q5568M93m7452M54M7607K9851k819j3181l0906
9367h0294n3234l0281K2384K5408k2224k9753K4858N0230K439l6787n869K9473
9355a03650m101n8751m9140Q827L7244K2275J0767J4476J887k8645l8821j3974
9343b01606J4306J3861j2138l6005l3325n185J8245J0712j0833n461L0111N3380
9331a63938L6776k91k7725l3166r819L4575N1394k693p9103p3110K2688Q4439
9319a59973L0592n3759m6945K5752M6086l981k7375J6046M6093L050n2239l9033
9307b15686J6831L0637r623l5067p794K6327J3598k6270l1423R068L7190J1149
$$ plain form
9295 -181063 -210692 -231282 -202489 -157202 -155390 -197964 -233274 -238715 -242766 -261504 -267250 -240961
9283 -240961 -210960 -211072 -233181 -246896 -237460 -203926 -153715 -120584 -146572 -215049 -245298 -196418
9271 -196418 -135578 -147548 -210095 -227789 -172213 -115195 -120241 -167427 -201479 -199671 -172358 -140632
9259 -140632 -131293 -155176 -178345 -155891 -104161 -90082 -132038 -165651 -137753 -83120 -66875 -93440
9247 -93440 -121302 -135824 -154284 -177480 -186367 -178465 -167075 -152907 -133414 -128393 -154655 -183744
9235 -183744 -171000 -126432 -110298 -149491 -201598 -219258 -212562 -221315 -251243 -268014 -245124 -194836
9223 -194836 -151393 -134928 -134458 -125401 -103771 -94954 -119621 -159496 -173377 -144152 -93987 -54445
9211 -54445 -38564 -44314 -69034 -110544 -157934 -187124 -175259 -132633 -112416 -157392 -231466 -245108
$$ packed form
9295a81063k9629k0590K8793M5287J812m2574l5310n441m051j8738n746K6289
9283b40961L0001j12k2109j3715R436L3534N0211L3131k5988o8477l0249M8880
9271a96418O0840j1970o2547j7694N5576N7018n046m7186l4052J808K7313L1726
9259a40632R339k3883k3169K2454N1730J4079m1956l3613K7898N4633J6245k6565
9247i3440k7862j4522j8460k3196q887P902J1390J4168J9493N021k6262k9089
9235a83744J2744M4568J6134l9193n2107j7660O696q753k9928j6771K2890N0288
9223a94836M3443J6465M70R057K1630Q817k4667l9875j3881K9225N0165L9542
9211e4445J5881n750k4720m1510m7390k9190J1865M2626K0217m4976p4074j3642
$$ plain form
9199 -245108 -171518 -94390 -101209 -169927 -217214 -223498 -233836 -252409 -227372 -153056 -102877 -127749
9187 -127749 -189964 -233425 -255599 -269141 -255763 -211043 -180195 -190203 -193806 -144423 -83605 -81500
9175 -81500 -124144 -139719 -115632 -105416 -126374 -135691 -116995 -109865 -131034 -139655 -113782 -96359
9163 -96359 -122381 -154676 -143039 -106638 -102175 -135562 -161239 -158705 -155788 -169856 -172821 -138501 -95362
9150 -95362 -98535 -156404 -215622 -227637 -204491 -188069 -186307 -176510 -159545 -159278 -164034 -130030 -68060
9137 -68060 -61311 -146720 -237439 -234935 -172140 -155758 -196117 -201576 -140401 -94880 -122116 -161425
9125 -161425 -136872 -74470 -50177 -75175 -99059 -92956 -73182 -64316 -79371 -115483 -143646 -134516
9113 -134516 -113275 -139731 -208204 -230616 -162950 -83155 -81415 -132413 -153714 -141383 -155170 -198359
$$ packed form
9199b45108P3590P7128o819o8718m7287o284j0338j8573K5037P4316N0179k4872
9187a27749o2215m3461k2174j3542J3378M4720L0848j0008l603M9383O0818K105
9175h1500m2644j5575K4087J0216k0958r317J8696P130k1169q621K5873J7423
9163i6359k6022l2295J1637L6401M463l3387k5677K534K917j4068k965L4320M3139
9150i5362l173n7869n9218j2015K3146J6422J762R797J6965K67m756L4004O1970
9137f8060O749q5409r0719K504O2795J6382m0359n459O1175M5521k7236l9309
9125a61425K4553O2402K4293k4998k3884O103J9774Q866j5055l6112k8163R130
9113a34516K1241k6456o8473k2412O7666P9795J740n0998k1301J2331j3787m3189
$$ plain form
9101 -198359 -210142 -172085 -135056 -133343 -147052 -160148 -186438 -221224 -227152 -188932 -137783 -109809
9089 -109809 -117180 -157341 -207155 -218073 -169941 -117629 -123116 -155984 -138390 -80049 -72351 -134618
9077 -134618 -168187 -104668 -9544 20197 -12381 -41474 -48663 -63740 -93464 -114884 -117133 -101827
9065 -101827 -66973 -30430 -36129 -93214 -142317 -128381 -75226 -42332 -42907 -56520 -86682 -141895
9053 -141895 -185564 -174069 -131821 -122073 -148558 -151695 -106045 -57624 -48478 -59669 -54764 -37511
9041 -37511 -35473 -52292 -65472 -62496 -59905 -82661 -127332 -154832 -136500 -102962 -113622 -169753
9029 -169753 -202379 -170429 -121993 -115692 -127268 -95217 -27003 10555 -7568 -38856 -42621 -17195
9017 -17195 23399 52048 23143 -67054 -130429 -81699 24236 49029 -28202 -82477 -47303 -17783
$$ packed form
9101a98359j1783L8057L7029J713j3709j3096k6290l4786n928L8220N1149K7974
9089a09809p371m0161m9814j0918M8132N2312n487l2868J7594N8341P698o2267
9077a34618l3569O3519R5124K9741l2578k9093p189j5077k9724k1420k249J5306
9065a01827L4854L6543n699n7085m9103J3936N3155L2894n75j3613l0162n5213
9053a41895m3669J1495M2248R748k6485l137M5650M8421R146j1191M905J7253
9041c7511K038j6819j3180K976K591k2756m4671k7500J8332L3538j0660n6131
9029a69753l2626L1950M8436O301j1576L2051O8214L7558j8123l1288l765K5426
9017a7195M0594K8649k8905r0197o3375M8730J05935K4793p7231n4275L5174K9520
$$ plain form
9005 -17783 -74630 -128130 -61869 54574 52934 -67971 -127206 -31733 88735 83376 -3272 -20508
8993 -20508 56246 103620 42879 -55580 -86379 -47520 -14983 -25891 -44225 -28739 12843 43051
8981 43051 37281 -1505 -48686 -70230 -47520 1657 41723 61239 73518 72548 26937 -58158
8969 -58158 -110043 -65612 37275 95416 66334 11650 4884 41735 67242 57305 36640 30429
8957 30429 32439 24404 5603 -8600 -11775 -17737 -38478 -57682 -46727 -11153 5750 -17711 -46843
8944 -46843 -42902 -22754 -25784 -43038 -31339 12160 45775 53431 61597 78453 75255 45411 24800
8931 24800 28772 24347 -4523 -19690 3182 20898 -12405 -67662 -81853 -45458 2262 35979
8919 35979 48412 18786 -60727 -141851 -164468 -138128 -123464 -137540 -139094 -112298 -99471 -125736
$$ packed form
9005a7783n6847n3500O6261J16443j640j20905n9235R5473J20468n359q6648j7236
8993b0508P6754M7374o0741r8459l0799L8859L2537j0908j8334J5486M1582L0208
8981D3051n770l8786m7181k1544K2710M9177M0066J9516J2279r70m5611q5095
8969e8158n1885M4431J02887N8141k9082n4684o766L6851K5507r937k0665o211
8957C0429K010q035j8801j4203l175n962k0741j9204J0955L5574J6903k3461k9132
8944d6843L941K0148l030j7254J1699M3499L3615P656Q166J6856l198k9844k0611
8931B4800L972m425k8870j5167K2872J7716l3303n5257j4191L6395M7720L3717
8919C5979J2433k9626p9513q1124k2617K6340J4664j4076j554K6796J2827k6265
$$ plain form
8907 -125736 -145946 -106305 -25005 29947 27464 1237 -6216 5790 15492 25529 56875 94438
8895 94438 80387 -4042 -80691 -57525 39456 89997 48600 7369 46996 107536 87504 11540
8883 11540 -5948 58534 100527 42829 -62392 -117467 -96373 -41559 3788 20519 4661 -30058
8871 -30058 -54798 -48663 -12589 35910 67832 60050 32569 42238 101726 138877 94205 25176
8859 25176 32354 102313 123257 58423 -3204 6213 43113 55722 74909 130993 167069 125478
8847 125478 58635 58043 112573 131387 87327 48653 68999 119763 143557 122267 81475 61902
8835 61902 85701 125977 127056 82302 59011 104731 167522 169326 125554 115493 152476 170220
8823 170220 140607 117910 142190 176160 176837 165663 179113 200407 195619 181641 198776 234730
$$ packed form
8907a25736k0210L9641Q1300N4952k483k6227p453J2006R702J0037L1346L7563
8895I4438j4051q4429p6649K3166R6981N0541m1397m1231L9627O0540k0032p5964
8883A1540j7488O4482M1993n7698j05221n5075K1094N4814M5347J6731j5858l4719
8871c0058k4740O135L6074M8499L1922p782k7481R669N9488L7151m4672o9029
8859B5176P178O9959K0944o4834o1627R417L6900J2609J9187N6084L6076m1591
8847A25478o6843n92N4530J8814m4060l8674K0346N0764K3794k1290m0792j9573
8835F1902K3799M0276J079m4754k3291M5720O2791J804m3772j0061L6983J7744
8823A70220k9613k2697K4280L3970O77j1174J3450K1294m788j3978J7135L5954
$$ plain form
8811 234730 234433 183220 129027 113711 127680 148805 182536 232390 266830 260660 246209 269036
8799 269036 305517 292207 240221 236674 301077 331301 259438 176590 200791 287470 302542 242728
8787 242728 227592 280625 290949 225648 204029 286138 353862 311757 255391 299952 370848 332352
8775 332352 226189 199621 262447 300535 288626 303258 345655 337888 293182 307558 371163 371087
8763 371087 305135 302236 385109 407321 302853 214316 269355 390626 443431 429577 413850
8752 413850 388852 341641 338584 413129 473034 443931 398846 417651 434817 375025 322520 378853
8740 378853 456144 414400 322780 358816 497927 544608 461776 423890 511657 590589 562377
8729 562377 520533 557965 611052 611819 626811 713027 781379 747190 694402 737357 817721 799408
$$ packed form
8811B34730k97n1213n4193j5316J3969K1125L3731M9854L4440o170j4451K2827
8799B69036L6481j3310n1986l547O4403L0224p1863q2848K4201Q6679J5072n9814
8787B42728j5136N3033J0324o5301k1619Q2109O7724m2105n6366M4561P0896l8496
8775C32352j06163k6568O2826L8088j1909J4632M2397p767m4706J4376O3605p6
8763C71087o5952k899Q2873K2212j04468q8537N5039J21271N2805j3854j5727
8752D13850k4998m7211l057P4545N9905k9103m5085J8805J7166n9792n2505N6333
8740C78853P7291m1744r1620L6036J39111M6681q2832l7886Q7767P8932k8212
8729E62377m1844L7432N3087P67J4992Q6216O8352l4189n2788M2955Q0364j8313
$$ plain form
8717 799408 695389 639187 672494 713667 717341 722345 741698 736058 712340 732167 794534 812782
8705 812782 746768 671177 666656 713759 745173 747476 755297 779687 797023 797282 801504 828124 866696
8692 866696 894123 906449 922298 951200 970523 952311 908377 881712 890831 914945 940510 980033
8680 980033 1028356 1050662 1045840 1069723 1147384 1213673 1210164 1199619 1289907 1456890 1548088 1488654
8668 1488654 1391035 1403537 1517699 1600901 1583338 1529569 1523784 1557120 1563861 1525366 1486531 1478800
8656 1478800 1477233 1453912 1436735 1473021 1549054 1596017 1584265 1563991 1586962 1629703 1635766 1606657
8644 1606657 1600815 1650291 1722543 1768546 1776050 1770691 1789034 1850973 1937444 2001318 2023549 2045582
8632 2045582 2113477 2203951 2252273 2248935 2253093 2300511 2358243 2398979 2461474 2583679 2716800
$$ packed form
8717G99408j04019n6202L3307M1173L674N004J9353n640k3718J9827O2367J8248
8705H12782o6014p5591m521M7103L1414K303P821K4390J7336K59M222K6620L8572
8692H66696K7427J2326J5849K8902J9323j8212m3934k6665R119K4114K5565L9523
8680I80033M8323K2306m822K3883P7661O6289l509j0545R0288J66983R1198n9434
8668A488654r7619J2502J14162Q3202j7563n3769n785L3336O741l8495l8835p731
8656A478800j567k3321j7177L6286P6033M6963j1752k0274K2971M2741O063k9109
8644A606657n842M9476P2252M6003P504n359J8343O1939Q6471O3874K2231K2033
8632B045582O7895R0474M8322l338M158M7418N7732M0736O2495J22205J33121
$$ plain form
8621 2716800 2776695 2768777 2790051 2892076 3004929 3034550 2988255 2948892 2949990 2942276 2887033 2819228
8609 2819228 2788043 2781721 2755274 2704139 2663736 2651547 2653978 2660205 2664636 2644906 2588043 2535031
8597 2535031 2542638 2595979 2619918 2591023 2571907 2607250 2654235 2661640 2656454 2690435 2746721 2768676
8585 2768676 2754348 2757205 2806428 2879416 2942720 2978866 2989406 3006881 3075966 3186898 3269404
8574 3269404 3297277 3342323 3458277 3574128 3601139 3596254 3694205 3899111 4080297 4183376 4309105
8563 4309105 4547085 4858526 5180942 5535910 5960128 6422747 6885085 7357727 7820956 8167076
8553 8167076 8306302 8263818 8096266 7795417 7377576 6989558 6782220 6706608 6568966 6284222
8543 6284222 5952229 5675139 5429793 5167396 4930026 4790002 4736533 4696083 4634251 4579920
$$ packed form
8621B716800N9895p918K1274J02025J12853K9621m6295l9363J098p714n5243o7805
8609B819228l1185o322k6447n1135m0403j2189K431O227M431j9730n6863n3012
8597B535031P607N3341K3939k8895j9116L5343M6985P405n186L3981N6286K1955
8585B768676j4328K857M9223P2988O3304L6146J0540J7475O9085J10932Q2506
8574C269404K7873M5046J15954J15851K7011m885R7951K04906J81186J03079J25729
8563D309105K37980L11441L22416L54968M24218M62619M62338M72642M63229L46120
8553H167076J39226m2484j67552l00849m17841l88018k07338p5612j37642k84744
8543F284222l31993k77090k45346k62397k37370j40024n3469m0450o1832n4331
$$ plain form
8533 4579920 4562473 4569708 4570625 4557136 4554789 4590681 4650887 4688011 4686962 4699602 4782103 4917943
8521 4917943 5045894 5150475 5271950 5428759 5587597 5725190 5869163 6053446 6276946 6539213
8511 6539213 6880478 7338871 7884227 8450924 9053912 9822338 10852555 12020803 13004655
8502 13004655 13541746 13634560 13447125 13055147 12423812 11630982 10941025 10543384 10314049 9965057
8492 9965057 9377593 8666648 7966579 7310549 6725563 6290708 6036168 5879161 5715826 5511826
8482 5511826 5276009 5025345 4809015 4684225 4625355 4533337 4377779 4250358 4226346 4253990
8472 4253990 4246757 4211187 4202577 4211998 4187986 4137210 4118839 4152536 4200267 4232713 4260406 4306706
8460 4306706 4393152 4540435 4745792 4971832 5189657 5420395 5712805 6096926 6562740 7039789
$$ packed form
8533D579920j7447P235R17j3489k347L5892O0206L7124j049J2640Q2501J35840
8521D917943J27951J04581J21475J56809J58838J37593J43973J84283K23500K62267
8511F539213L41265M58393N45356N66697O02988P68426J030217J168248R83852
8502A3004655N37091R2814j87435l91978o31335p92830o89957l97641k29335l48992
8492I965057n87464p10945p00069o56030n84986m34855k54540j57007j63335k04000
8482E511826k35817k50664k16330j24790n8870r2018j55558j27421k4012K7644
8472D253990p233l5570q610R421k4012n0776j8371L3697M7731L2446K7693M6300
8460D306706Q6446J47283K05357K26040K17825K30738K92410L84121M65814M77049
$$ plain form
8450 7039789 7389441 7485327 7335210 7065452 6762949 6416252 6045246 5765063 5624609 5482295
8440 5482295 5173128 4736076 4342030 4044795 3752995 3428360 3154705 2990310 2886317 2787071
8430 2787071 2698110 2617804 2505710 2361070 2242861 2175183 2116900 2052162 2016274 1999386 1928277
8419 1928277 1793628 1697053 1708641 1762893 1761647 1704458 1652043 1630676 1635762 1663225 1678345 1623263
8407 1623263 1512494 1443225 1450541 1442687 1353779 1259289 1240072 1233591 1153202 1069668 1110311 1227946
8395 1227946 1246727 1126565 1010539 991758 996863 946916 884138 866493 860576 824506 798125
8384 798125 821327 841373 792365 709024 675659 703890 737337 743805 732617 708348 674115 660320
8372 660320 689222 725543 715366 660647 608035 580297 566348 562421 572084 577752 563086 553668
$$ packed form
8450G039789L49652R5886j50117k69758l02503l46697l71006k80183j40454j42314
8440E482295l09167m37052l94046k97235k91800l24635k73655j64395j03993r9246
8430B787071q8961q0306j12094j44640j18209o7678n8283o4738l5888j6888p1109
8419A928277j34649r6575J1588N4252j246n7189n2415k1367N086K7463J5120n5082
8407A623263j10769o9269P316p854q8908r4490j9217o481q0389q3534M0643J17635
8395A227946J8781j20162j16026j8781N105m9947o2778j7645n917l6070k6381
8384G98125K3202K0046m9008q3341l3365K8231L3447O468j1188k4269l4233j3795
8372F60320K8902L6321j0177n4719n2612k7738j3949l927R663N668j4666r418
$$ plain form
8360 553668 581950 618843 601979 538951 517103 580927 654204 634406 534035 468107 501732
8349 501732 566822 559748 481611 427435 447569 486194 480070 454118 463057 486519 463948 411211
8337 411211 406535 454438 462977 389332 313085 308563 330470 303894 255566 259252 301703 309806 283477
8324 283477 293053 350087 382797 349828 288197 235495 192531 178333 227773 305937 318687 249460
8312 249460 195518 218956 255755 240554 227188 286818 361553 342071 249862 213054 268090 308461
8300 308461 253127 158388 117923 137595 166589 188087 213825 228243 202204 148451 115217 125767
8288 125767 154660 164602 148178 131899 145153 181723 197214 160738 102690 83631 116541 152882
8276 152882 150820 122106 100917 102099 124573 159403 176655 143226 77530 47015 80822 124148
$$ packed form
8360E53668K8282L6893j6864o3028k1848O3824P3277j9798j00371o5928L3625
8349E01732O5090p074p8137n4176K0134L8625o124k5952Q939K3462k2571n2737
8337D11211m676M7903Q539p3645p6247m522K1907k6576m8328L686M2451Q103k6329
8324B83477R576N7034L2710l2969o1631n2702m2964j4198M9440P8164J2750o9227
8312B49460n3942K3438L6799j5201j3366N9630P4735j9482r2209l6808N5036M0371
8300C08461n5334r4739m0465J9672K8994K1498K5738J4418k6039n3753l3234J0550
8288A25767K8893R942j6424j6279J3254L6570J5491l6476n8048j9059L2910L6341
8276A52882k062k8714k1189J182K2474L4830J7252l3429o5696l0515L3807M3326
$$ plain form
8264 124148 117727 83890 82786 113967 124416 100513 86612 107747 131592 123855 96628 81869
8252 81869 90916 117328 150317 170294 157978 121825 91654 74666 46714 1534 -22066 13363
8240 13363 89807 149342 153245 110658 59890 34457 38301 45020 28816 -2515 -18427 -7377
8228 -7377 12883 27156 39485 52472 55254 41254 17491 -8164 -28234 -28400 -9608 -8962 -51802
8215 -51802 -86688 -33670 88355 157236 107468 21633 6059 43921 49396 11387 -12548 -8784
8203 -8784 -9364 -267 59768 127813 102144 -13601 -84737 -33725 49981 57551 23419 45797 116731
8190 116731 144769 109399 79702 89798 101212 97243 114540 152541 143031 60189 -12366 9574
8178 9574 85251 106039 51253 8997 40257 95013 95314 50173 35946 83035 136706 138683 103337
$$ packed form
8264A24148o421l3837j104L1181J0449k3903j3901K1135K3845p737k7227j4759
8252H1869R047K6412L2989J9977j2316l6153l0171j6988k7952m5180k3600L5429
8240A3363P6444N9535L903m2587n0768k5433L844O719j6204l1331j5912J1050
8228g377K0260J4273J2329J2987K782j4000k3763k5655k0070j66J8792O46m2840
8215e1802l4886N3018J22025O8881m9768q5835j5574L7862N475l8009k3935L764
8203h784n80R097O0035O8045k5669j15745p1136N1012Q3706P570l4132K2378P0934
8190A16731K8038l5370k9697J0096J1414l969J7297L8001r510q2842p2555K1940
8178I574P5677K0788n4786m2256L1260N4756L01m5141j4227M7089N3671J977l5346
$$ plain form
8165 103337 85139 99188 112684 103553 85269 69677 45484 10753 -6033 18509 69932 121036
8153 121036 165135 197897 192358 131588 52102 12934 24359 44472 46800 53022 89257 142631
8141 142631 177314 173416 139780 104939 99354 127933 158586 158269 137819 133962 149617 149569 122080
8128 122080 103413 121987 154669 164578 152152 141015 141497 159040 209396 283388 318703 259513
8116 259513 139992 59107 66069 115903 149914 169625 199920 222476 200191 151895 145173 203925
8104 203925 269517 279926 251811 245179 270014 279696 253162 226738 227194 228328 210185 210584 260387
8091 260387 306883 279424 211924 207046 271562 290199 205758 127186 177888 308798 366615 309805
8079 309805 246166 262515 323825 361852 370095 371293 366200 361742 389346 446840 473991 434926
$$ packed form
8165A03337j8198J4049J3496r131j8284j5592k4193l4731j6786K4542N1423N1104
8153A21036M4099L2762n539o0770p9486l9168J1425K0113K328O222L6235N3374
8141A42631L4683l898l3636l4841n585K8579L0653l17k0450l857J5655m8k7489
8128A22080j8667J8574L2682R909j2426j1137M82J7543N0356P3992L5315n9190
8116B59513j19521q0885O962M9834L4011J9711L0295K2556k2285m8296o722N8752
8104B03925O5592J0409k8115o632K4835R682k6534k6424M56J134j8143L99M9803
8091B60387M6496k7459o7500m878O4516J8637q4441p8572N0702J30910N7817n6810
8079C09805o3639J6349O1310L8027Q243J198n093m458K7604N7494K7151l9065
$$ plain form
8067 434926 378314 365781 386640 399396 411060 444956 467878 433116 374697 369785 413297 423032
8055 423032 379339 361170 408885 446126 400206 322962 310890 358671 382280 357348 340593 359948
8043 359948 373906 355969 339318 345773 340090 300806 278719 323340 389189 386990 316185 275555
8031 275555 328612 418960 452882 420827 387498 386559 387319 370186 372966 424753 476853 457398 379138
8018 379138 331095 357137 403440 410024 395962 410372 447178 466594 466238 464499 438789 358669
8006 358669 270530 262372 333500 385529 368430 346259 372157 388154 325612 233967 212361 256424
7994 256424 275009 238694 209666 224076 242706 237984 242310 276730 305826 303238 298591 316387
7982 316387 324371 289705 238529 210840 198349 178785 174012 214308 269722 278138 231845 184170
$$ packed form
8067D34926n6612j2533K0859J2756J1664L3896K2922l4762n8419m912M3512R735
8055D23032m3693j8169M7715L7241m5920p7244j2072M7781K3609k4932j6755J9355
8043C59948J3958j7937j6651O455n683l9284k2087M4621O5849k199p0805m0630
8031B75555N3057R0348L3922l2055l3329r39P60j7133K780N1787N2100j9455p8260
8018C79138m8043K6042M6303O584j4062J4410L6806J9416l56j739k5710q0120
8006C58669q8139q158P1128N2029j7099k2171K5898J5997o2542r1645k1606M4063
7994B56424J8585l6315k9028J4410J8630m722M326L4420K9096k588m647J7796
7982C16387P984l4666n1176k7689j2491j9564m773M0296N5414Q416m6293m7675
$$ plain form
7970 184170 174700 193191 213066 216039 185452 120750 62724 60806 105530 133871 114897 88866
7958 88866 98558 120927 106164 61264 46461 88537 141032 148224 115014 83269 64240 40578
7946 40578 26213 63261 139956 171990 112716 34585 35195 94633 107063 40586 -26132 -36593
7934 -36593 -31228 -54542 -74229 -49191 -9613 -4895 -23229 -24324 -9050 -542 1726 -2568 -36311
7921 -36311 -89161 -98506 -48050 -18500 -63256 -107862 -73334 -24217 -62220 -134190 -108094 -6928
7909 -6928 14499 -72778 -126839 -83048 -56888 -125596 -186973 -144061 -72559 -72754 -91005 -39990
7897 -39990 16005 -34349 -140200 -159498 -89893 -57186 -99426 -129821 -109767 -96940 -106298 -77824
7885 -77824 -16865 -21732 -117270 -189058 -152017 -75861 -66270 -112957 -140585 -139601 -156145 -194030 -207925
$$ packed form
7970A84170r470J8491J9875K973l0587o4702n8026j918M4724K8341j8974k6031
7958H8866R692K2369j4763m4900j4803M2076N2495P192l3210l1745j9029k3662
7946D0578j4365L7048P6695L2034n9274p8131O10N9438J2430o6477o6718j0461
7934c6593N365k3314j9687K5038L9578M718j8334j095J5274Q508K268m294l3743
7921c6311n2850r345N0456K9550m4756m4606L4528M9117l8003p1970K6096J01166
7909f928K1427q7277n4061M3791K6160o8708o1377M2912P1502j95j8251N1015
7897c9990N5995n0354j05851j9298O9605L2707m2240l0395K0054J2827r358K8474
7885g7824O0959m867r5538p1788L7041P6156R591m6687k7628R84j6544l7885j3895
$$ [...]
##END NTUPLES=NMR SPECTRUM
##END=
