##TITLE=1H ikalashn
CG-1214
16.10.2024
##JCAMPDX= 6.0         $$ Bruker NMR JCAMP-DX V2.0
##DATA TYPE= NMR SPECTRUM
##DATA CLASS= NTUPLES
##ORIGIN= UXNMR, Bruker Analytische Messtechnik GmbH
##OWNER= root
$$ TOPSPIN		Version 1.3
$$ 2024-10-16 11:24:46.765 +0400  Irina@DPX200
$$ Compression mode = diff/dup
##.OBSERVE FREQUENCY= 200.131392401
##.OBSERVE NUCLEUS= ^1H
##.ACQUISITION MODE= SIMULTANEOUS
##.ACQUISITION SCHEME= undefined
##.AVERAGES= 32
##.DIGITISER RES= 18
##SPECTROMETER/DATA SYSTEM= spect
##.PULSE SEQUENCE= zg
##.SOLVENT NAME= D2O
##.SHIFT REFERENCE= INTERNAL, D2O, 1, 17.95386
##AUDIT TRAIL= $$ (NUMBER, WHEN, WHO, WHERE, WHAT)
$$ ##TITLE= Audit trail, TOPSPIN		Version 1.3
$$ ##JCAMPDX= 5.01
$$ ##ORIGIN= Bruker BioSpin GmbH
$$ ##OWNER= Irina
$$ $$ F:/spectra/data/iren/nmr/1H/4/pdata/1/auditp.txt
$$ ##AUDIT TRAIL=  $$ (NUMBER, WHEN, WHO, WHERE, VERSION, WHAT)
(   1,<2024-10-16 11:24:16.234 +0400>,<Irina>,<DPX200>,<TOPSPIN 1.3>,
      <created by zg
	started at 2024-10-16 11:22:08.046 +0400,
	POWCHK disabled, PULCHK disabled
       configuration hash MD5:
       BE 6D 3F 07 2A EA 11 49 91 17 2B D3 AF B3 58 0D
       data hash MD5: 16K
       F5 14 41 F1 56 48 B6 46 7B 50 AA DC 6E 7B B5 96>)
(   2,<2024-10-16 11:24:18.265 +0400>,<Irina>,<DPX200>,<TOPSPIN 1.3>,
      <Start of raw data processing
       efp BC_mod = 2 LB = 0.02 FT_mod = 6 PKNL = 1 PHC0 = 202.7994 PHC1 = 6.872595 SI = 32K 
       data hash MD5: 32K
       DD 54 9A 92 E1 01 10 D5 A3 B7 22 CE C5 D6 6A 01>)
(   3,<2024-10-16 11:24:20.968 +0400>,<Irina>,<DPX200>,<TOPSPIN 1.3>,
      <apk 
       data hash MD5: 32K
       D1 DB 8F 20 49 83 4B BB A0 CB 0E 39 95 54 4C 61>)
(   4,<2024-10-16 11:24:36.078 +0400>,<Irina>,<DPX200>,<TOPSPIN 1.3>,
      <pk fgphup PHC0 = 13.32549 PHC1 = -16 
       data hash MD5: 32K
       D8 16 66 56 E9 01 98 CC 0F 94 F7 66 A2 55 2A E4>)
(   5,<2024-10-16 11:24:37.937 +0400>,<Irina>,<DPX200>,<TOPSPIN 1.3>,
      <abs n ABSG = 5 
       data hash MD5: 32K
       3C 07 5C 5E 88 AE 59 FB 9B 64 64 7D 1A F7 5B 12>)
$$ ##END=
$$ 
$$ $$ hash MD5
$$ $$ 21 0D 0F A1 C2 37 B8 70 05 CE 8A 45 B9 98 74 7C
##$RELAX= 
##$RELAX= 
##$RELAX= 
##$RELAX= 
##$RELAX= 
##$RELAX= 
##$RELAX= 
##$RELAX= 
##$RELAX= 
$$ Bruker specific parameters
$$ --------------------------
##$DU= <F:/spectra>
##$EXPNO= 4
##$NAME= <1H>
##$PROCNO= 1
##$TYPE= <nmr>
##$USER= <iren>
##$AMP= (0..31)
100 100 100 100 100 100 100 100 100 100 100 100 100 100 100 100 100 100 
100 100 100 100 100 100 100 100 100 100 100 100 100 100 
##$ANAVPT= -1
##$AQSEQ= 0
##$AQ_mod= 1
##$AUNM= <au_zg>
##$AUTOPOS= <>
##$BF1= 200.13
##$BF2= 200.13
##$BF3= 200.13
##$BF4= 200.13
##$BF5= 200.13
##$BF6= 200.13
##$BF7= 200.13
##$BF8= 200.13
##$BYTORDA= 1
##$CFDGTYP= 0
##$CFRGTYP= 5
##$CHEMSTR= <none>
##$CNST= (0..63)
1 1 145 1 1 1 1 1 1 1 1 1 1 1 1 1 1 1 1 1 1 1 1 1 1 1 1 1 1 1 1 1 1 1 
1 1 1 1 1 1 1 1 1 1 1 1 1 1 1 1 1 1 1 1 1 1 1 1 1 1 1 1 1 1 
##$CPDPRG= <>
##$CPDPRG1= <>
##$CPDPRG2= <>
##$CPDPRG3= <>
##$CPDPRG4= <mlev>
$$ [...]
##$SW_h= 4401.40845070422
##$TD= 16384
##$TD0= 1
##$TE= 300
##$TE2= 300
##$TE3= 300
##$TEG= 300
##$TL= (0..7)
0 120 120 120 120 120 120 120 
##$TP= (0..7)
150 150 150 150 150 150 150 150 
##$TP07= 0
##$TPNAME0= <>
##$TPNAME1= <>
##$TPNAME2= <>
##$TPNAME3= <>
##$TPNAME4= <>
##$TPNAME5= <>
##$TPNAME6= <>
##$TPNAME7= <>
##$TPOAL= (0..7)
0.5 0.5 0.5 0.5 0.5 0.5 0.5 0.5 
##$TPOFFS= (0..7)
0 0 0 0 0 0 0 0 
##$TUNHIN= 0
##$TUNHOUT= 0
##$TUNXOUT= 0
##$USERA1= <user>
##$USERA2= <user>
##$USERA3= <user>
##$USERA4= <user>
##$USERA5= <user>
##$V9= 5
##$VALIST= <valist>
##$VCLIST= <CCCCCCCCCCCCCCC>
##$VD= 0
##$VDLIST= <DDDDDDDDDDDDDDD>
##$VPLIST= <PPPPPPPPPPPPPPP>
##$VTLIST= <TTTTTTTTTTTTTTT>
##$WBST= 1024
##$WBSW= 25
##$XGAIN= (0..3)
0 0 0 0 
##$XL= 0
##$YL= 0
##$YMAX_a= 1577386
##$YMIN_a= -1465527
##$ZGOPTNS= <>
##$ZL1= 120
##$ZL2= 120
##$ZL3= 120
##$ZL4= 120
##$ABSF1= 17.95386
##$ABSF2= -4.038887
##$ABSG= 5
##$ABSL= 3
##$ALPHA= 0
##$AQORDER= 0
##$ASSFAC= 0
##$ASSFACI= 0
##$ASSFACX= 0
##$ASSWID= 0
##$AUNMP= <proc_1d>
##$AXLEFT= 0
##$AXRIGHT= 0
##$AXTYPE= 0
##$AXUNIT= <>
##$AZFE= 0.1
##$AZFW= 0.1
##$BCFW= 0
##$BC_mod= 2
##$BYTORDP= 0
##$COROFFS= 0
##$CY= 7568.61572265625
##$DATMOD= 1
##$DC= 0
##$DFILT= <>
##$DTYPP= 0
##$F1P= 17.9538593292236
##$F2P= -4.03888763876832
##$FCOR= 0.5
##$FTSIZE= 32768
##$FT_mod= 6
##$GAMMA= 0
##$GB= 0
##$INTBC= 0
##$INTSCL= 1.483618e-010
##$ISEN= 128
##$LB= 0.02
##$LEV0= 0
##$LPBIN= 0
##$MAXI= 945.577
##$MC2= 0
##$MEAN= 0
##$ME_mod= 0
##$MI= -402.1523
##$NCOEF= 0
##$NC_proc= -4
##$NLEV= 6
##$NOISF1= 8.587773
##$NOISF2= 6.764455
##$NSP= 0
##$NTH_PI= 0
##$NZP= 0
##$OFFSET= 17.95386
##$PC= 1
##$PHC0= 210.2701
##$PHC1= -1.02056
##$PH_mod= 1
##$PKNL= yes
##$PPARMOD= 0
##$PPDIAG= 0
##$PPIPTYP= 0
##$PPMPNUM= 100
##$PPRESOL= 1
##$PSCAL= 0
##$PSIGN= 0
##$REVERSE= no
##$SF= 200.13
##$SI= 32768
##$SIGF1= 16.12182
##$SIGF2= -4.496377
##$SINO= 3.521527
##$SIOLD= 32768
##$SREGLST= <1H.CDCl3>
##$SSB= 0
##$STSI= 32768
##$STSR= 0
##$SW_p= 4401.40845070423
##$SYMM= 0
##$S_DEV= 0
##$TDeff= 16384
##$TDoff= 0
##$TI= <>
##$TILT= no
##$TM1= 0
##$TM2= 0
##$TOPLEV= 0
##$USERP1= <user>
##$USERP2= <user>
##$USERP3= <user>
##$USERP4= <user>
##$USERP5= <user>
##$WDW= 1
##$XDIM= 32768
##$YMAX_p= 408710884
##$YMIN_p= -284655
$$ End of Bruker specific parameters
$$ ---------------------------------
##NTUPLES= NMR SPECTRUM
##VAR_NAME=  FREQUENCY,     SPECTRUM/REAL,   SPECTRUM/IMAG
##SYMBOL=    X,             R,               I
##VAR_TYPE=  INDEPENDENT,   DEPENDENT,       DEPENDENT
##VAR_FORM=  AFFN,          ASDF,            ASDF
##VAR_DIM=   32768,         32768,           32768
##UNITS=     HZ,            ARBITRARY UNITS, ARBITRARY UNITS
##FACTOR=    0.134324425510551, 1,           1
##FIRST=     4401.40845070423, 3326,         -1805522
##LAST=      0,             61181,           -1872738
##MIN=       0,             -284655,         0
##MAX=       4401.40845070423, 408710884,    0
$$ Real data points
##PAGE= N=1
##DATA TABLE= (X++(R..R)), XYDATA
$$ [...]
12875 64384 70383 87648 96551 95023 97814 106348 106980 99430 99138 108817 115159 117270 128635 144737
12861 144737 141517 118382 109658 133978 162687 163559 149288 152117 171262 180176 172969 168495 174296
12848 174296 179688 183238 195619 212534 214876 202305 198874 215474 232477 233097 230286 242507 261983
12835 261983 268672 263020 262195 270433 275239 272291 273866 287356 301349 302320 294947 295155 308076 323583
12821 323583 332823 338823 347171 355239 358852 363622 378019 396925 405425 401361 400187 411585 425998
12808 425998 434371 445710 468683 489157 488779 478124 485199 512572 533710 536659 542850 569628 599750
12795 599750 608596 603208 610303 636074 661481 673321 678680 687812 700557 713870 729418 747594
12783 747594 762165 766672 763385 763581 778712 808822 839600 856304 861089 868699 884820 901229 915368
12770 915368 937964 972376 1003219 1019478 1033840 1062136 1097147 1122670 1141643 1167349 1196240
12759 1196240 1215106 1229050 1255136 1291216 1319094 1337874 1364209 1397168 1415413 1417101 1429294
12748 1429294 1463614 1494297 1500324 1500483 1520682 1550307 1561672 1556901 1563829 1593132 1628103 1654369
12736 1654369 1675555 1699497 1728843 1766148 1812522 1861389 1905743 1948041 1991973 2032536 2067686
12725 2067686 2109122 2163916 2216166 2248304 2271180 2307903 2354745 2386849 2400661 2420229 2457809
12714 2457809 2497605 2526771 2555219 2592771 2630659 2660032 2688333 2722569 2754276 2776269 2798582
12703 2798582 2832399 2871692 2905752 2938115 2978536 3026537 3076167 3127423 3180654 3229623 3272388
12692 3272388 3319206 3377308 3437862 3490992 3543713 3608363 3681405 3748607 3805705 3861216 3923633
12681 3923633 3995926 4076256 4155458 4222925 4283656 4356268 4442484 4514693 4551676 4572230 4610747
12670 4610747 4670382 4725952 4766504 4807081 4858920 4914766 4968697 5028099 5098661 5174997 5252006
12659 5252006 5330434 5407681 5478900 5550498 5636320 5736787 5838109 5935965 6043060 6167972
12649 6167972 6303377 6442054 6589635 6754586 6938803 7143367 7370351 7615424 7873206
12640 7873206 8152119 8467288 8818164 9194684 9605999 10070961 10566951 11018680 11361634
12631 11361634 11596479 11759986 11865399 11902355 11881359 11842989 11821853 11825059 11848311 11895194 11978379
12620 11978379 12114446 12318290 12596779 12954256 13407058 13974287 14643936 15370834 16123116
12611 16123116 16898807 17666508 18325371 18780653 19046691 19217608 19340144 19381858 19335948 19278243
12601 19278243 19270888 19267259 19180513 19015673 18862735 18770891 18706141 18649156 18663824 18818792 19079057
12590 19079057 19332667 19516913 19667663 19832287 19979543 20037117 20002865 19969954 20025511 20161094
12580 20161094 20315849 20477767 20682644 20913423 21069811 21076487 20973562 20849148 20722067 20562135
12570 20562135 20403158 20338555 20382332 20422795 20369868 20278901 20247848 20236794 20092687 19750668
12560 19750668 19310658 18882225 18442161 17911671 17313862 16766675 16338911 15995470 15692821
12551 15692821 15456061 15331866 15322534 15412077 15618039 15957374 16368563 16718700 16901607 16900084
12541 16900084 16743598 16440315 15980058 15387775 14736851 14095869 13476424 12847489 12196290
12532 12196290 11559635 10989866 10501989 10068217 9660345 9280269 8944402 8654160 8394477
12523 8394477 8152879 7927227 7718828 7528772 7358506 7204711 7056185 6904295 6753184
12514 6753184 6610971 6475592 6340754 6212048 6103016 6014965 5933450 5846614 5755881 5666961
12504 5666961 5581304 5498515 5416449 5327319 5225485 5121474 5035450 4972517 4916914 4855763 4795300
12493 4795300 4745606 4701263 4647955 4580750 4506787 4435659 4373686 4321118 4269148 4207036 4137492
12482 4137492 4076597 4033166 3998386 3962279 3928524 3903952 3885342 3868336 3858467 3859381 3859398 3844964
12470 3844964 3820046 3796334 3770736 3730341 3675865 3621585 3572696 3520783 3463455 3410922 3368217
12459 3368217 3326396 3278440 3231327 3194149 3163952 3132024 3098202 3071336 3057926 3054282 3048925 3032951
12447 3032951 3010384 2995279 2994189 2996435 2989372 2977745 2976350 2986630 2994181 2989503 2978150 2968516 2962083
12434 2962083 2958644 2959231 2960039 2954465 2945368 2944898 2957707 2974216 2985033 2992839 3005811 3028210 3060932
12421 3060932 3101874 3142411 3173721 3200389 3237654 3292263 3357579 3430050 3515076 3609833 3695679
12410 3695679 3758219 3802933 3840614 3868982 3880316 3876764 3865456 3846706 3818901 3787604 3758660
12399 3758660 3729802 3699688 3677033 3669439 3671663 3676872 3690405 3719001 3755483 3789173 3822339 3858853
12387 3858853 3885420 3886015 3870589 3866341 3880855 3896684 3904554 3917213 3942103 3963397 3965780 3958393
12375 3958393 3957502 3957596 3939480 3901995 3866536 3847703 3834235 3806571 3764706 3728629 3712931 3710094
12363 3710094 3702635 3684257 3660266 3631514 3591565 3541795 3495037 3457167 3418282 3372451 3332997
12352 3332997 3313182 3303035 3284797 3264031 3263133 3286379 3314250 3334109 3353114 3373767 3378564 3351910
12340 3351910 3301837 3246778 3191891 3129963 3056362 2972213 2880064 2785642 2697650 2618555 2542188
12329 2542188 2466284 2399036 2346555 2302199 2255883 2206611 2158908 2114236 2072532 2034962 1999134
12318 1999134 1959182 1915716 1876895 1845198 1814491 1785254 1767757 1761072 1745202 1708714 1670169
12307 1670169 1653820 1654604 1647672 1625580 1603648 1590396 1574874 1546892 1511424 1477090 1445646 1419536
12295 1419536 1405664 1402056 1391371 1359880 1318872 1296612 1306937 1331148 1335656 1307894 1270436 1254402
12283 1254402 1262241 1267008 1248804 1217401 1191979 1173503 1151435 1126772 1110110 1101642 1090864 1074965
12271 1074965 1061432 1052055 1039786 1023535 1011419 1005734 998103 984477 972944 970766 973562 973302 969011
12258 969011 964255 960892 959834 962195 965986 966309 960679 950084 935436 918467 904091 894879 886056
12245 886056 874563 868758 876926 889055 885430 864330 845946 844999 853261 854381 844002 829690 821174
12232 821174 824828 837923 845977 837031 819828 814126 821685 824247 814334 807808 816565 828464 828648 824002
12218 824002 828893 839102 839114 827841 819116 819848 822699 819885 813242 810177 815279 823930 823213 807246
12204 807246 792206 801461 831330 850257 841688 827378 832543 848147 850278 840296 838013 845372 846264
12191 846264 838075 834852 839085 837025 825413 818469 823095 829278 831063 835977 846606 853140 852606 856431
12177 856431 869292 878467 875011 868971 871549 876988 874890 867497 861478 854000 841002 830325 832344
12164 832344 842967 847857 840198 825610 813344 809353 813287 816769 810427 797224 791126 797909 806854
12151 806854 807714 805420 809638 819754 830132 841096 853544 860493 856051 846954 843724 845520 845055 843569
12137 843569 848262 857834 863553 864565 870747 888487 912325 932928 946862 956566 965579 975639 986113
12124 986113 995749 1004908 1013528 1017572 1013577 1007213 1008587 1016069 1014986 998359 979157 973423 979325 982354
12110 982354 974703 959778 942764 926286 911689 897117 878455 857712 843866 839823 837563 832706
12098 832706 831881 836309 832583 814588 801117 811546 833502 837314 817788 798951 798650 810125 819687
12085 819687 821947 814860 799263 787084 791640 806193 810763 803473 804245 821669 838711 841409 840536
12072 840536 850814 866781 875125 876235 877556 878221 876388 880742 898049 918002 926351 925628 927745 933605
12058 933605 936245 937657 944671 951971 947424 933790 928015 936602 946812 946835 941814 943041 950299 952835
12044 952835 944376 931644 927406 935711 945577 943578 932365 928495 938898 950302 949527 943397 946107
12031 946107 955166 955778 945604 939093 946291 960816 971865 977357 981779 989020 999823 1010369 1013813
12018 1013813 1009594 1008651 1020818 1039794 1051075 1052581 1055142 1063052 1067952 1064673 1060702 1065222 1078391
12005 1078391 1095119 1110779 1120813 1123817 1126697 1137163 1150520 1155554 1154032 1159576 1174595 1185471
11993 1185471 1186919 1193245 1214808 1240003 1255156 1268240 1295505 1334920 1371026 1398581 1423093 1443660
11981 1443660 1454774 1462178 1476800 1492812 1491773 1471802 1453006 1447821 1445213 1434344 1425640 1432922
11969 1432922 1448438 1454599 1452685 1460134 1481578 1501766 1510226 1515529 1527483 1539965 1543882 1546925 1564174
11956 1564174 1592281 1609926 1607726 1602882 1614336 1634295 1639641 1627822 1624085 1647941 1685779 1707110
11944 1707110 1700354 1681125 1668791 1667075 1668816 1668859 1666829 1663691 1661441 1662708 1666462 1666966 1660922 1652897
11930 1652897 1649532 1650921 1652896 1656028 1665195 1679038 1687381 1684584 1680862 1692507 1721434 1752006 1770475
11917 1770475 1780501 1794046 1812736 1827208 1833082 1837318 1845823 1853328 1851389 1840784 1829391 1821515
11905 1821515 1816125 1812982 1812980 1813186 1808902 1801401 1797208 1798621 1801477 1804000 1810639 1823583 1836986 1844715
11891 1844715 1848660 1854111 1861699 1869800 1880146 1893759 1905587 1912169 1921363 1943227 1972123 1991060
11879 1991060 1996934 2008092 2039318 2080556 2111204 2127281 2141915 2164196 2191255 2219278 2248620
11868 2248620 2276670 2297895 2313923 2332893 2355646 2373433 2383356 2394543 2412936 2431401 2443325
11857 2443325 2455139 2474217 2493699 2503181 2508445 2525522 2557681 2592703 2622647 2652258 2685576 2717552
11845 2717552 2743802 2767813 2792896 2816233 2837503 2865534 2908235 2959953 3005930 3038256 3063201
11834 3063201 3092911 3131874 3172177 3203207 3225744 3251423 3285783 3319747 3345052 3369401 3403703
11823 3403703 3441041 3465615 3480024 3503833 3542721 3579631 3603810 3628668 3668733 3716111 3755785
11812 3755785 3791284 3837489 3895930 3953725 4002505 4044583 4084172 4124856 4172773 4231770 4297903
11801 4297903 4365673 4433638 4497465 4548118 4587172 4632199 4693505 4756963 4805914 4848725 4905266
11790 4905266 4975902 5045791 5111710 5180173 5245342 5296842 5347097 5420879 5515240 5600021 5664564
11779 5664564 5733616 5826031 5927762 6022113 6119093 6233055 6353861 6464811 6572437 6694179
11769 6694179 6828930 6962987 7095569 7236581 7386626 7539437 7697425 7865754 8038401
11760 8038401 8209774 8392424 8600775 8823085 9034677 9237345 9459611 9714581 9983288
11751 9983288 10248562 10521886 10821751 11143664 11471312 11807462 12173053 12577166 13006980
11742 13006980 13454387 13938233 14486401 15103849 15778626 16521272 17374295 18368609 19492851
11733 19492851 20726454 22069707 23486072 24825754 25882364 26559124 26928649 27096860
11725 27096860 27070994 26823214 26427171 26028607 25688122 25348950 24979114 24658087 24482597
11716 24482597 24462538 24568535 24820299 25245700 25778662 26278206 26655185 26925984 27136935
11707 27136935 27293659 27391831 27477878 27637848 27930601 28354082 28881251 29515884 30295199 31225508
11697 31225508 32223212 33142174 33866327 34363155 34656227 34785883 34806810 34775639 34706728 34575011
11687 34575011 34394432 34245103 34164291 34050863 33762730 33296879 32782221 32285810 31727809
11678 31727809 31036066 30296484 29666070 29185680 28769275 28361899 28021083 27827704 27787958
11669 27787958 27863166 28054690 28408087 28930928 29528685 30035632 30317520 30348906 30186051 29870845
11659 29870845 29392505 28758120 28058440 27410720 26848813 26325444 25826356 25419289 25157458
11650 25157458 24982770 24777394 24491120 24168159 23855390 23540288 23200469 22871428 22618631
11641 22618631 22448037 22280934 22030988 21684949 21288997 20871228 20409399 19880537 19313323
11632 19313323 18766774 18267159 17789647 17302551 16810281 16346401 15937673 15582956 15260043
11623 15260043 14946871 14639151 14349148 14085694 13839992 13597164 13355269 13122194 12899441
11614 12899441 12683434 12479562 12298088 12135954 11978443 11819627 11665183 11515208 11363433
11605 11363433 11215291 11085666 10974980 10870154 10774203 10708301 10675010 10648072 10613295 10589588
11595 10589588 10589671 10591843 10578814 10572798 10592451 10600432 10542817 10426659 10306739 10201095 10075551
11584 10075551 9918023 9771093 9669637 9594880 9519102 9454149 9421014 9406073 9387590 9379703 9407093
11573 9407093 9451788 9466766 9434558 9374814 9299006 9196974 9071521 8949991 8849603 8757952
11563 8757952 8659974 8562445 8479064 8408701 8342115 8278778 8225263 8183214 8146744 8108879 8068391
11552 8068391 8032735 8011133 8000920 7988743 7973003 7973403 8004202 8049651 8085235 8113405 8154293 8208489
11540 8208489 8257880 8301238 8357476 8429491 8496070 8549248 8610792 8699795 8812369 8947205 9119205
11529 9119205 9324322 9518905 9665533 9781525 9910918 10061838 10206430 10339314 10502437
11520 10502437 10741208 11052547 11381781 11659952 11844321 11934423 11952386 11908214 11795763 11626188
11510 11626188 11441710 11275238 11112589 10920898 10703978 10500191 10329726 10175021 10018291
11501 10018291 9872191 9762693 9699163 9670913 9662597 9668129 9696027 9758108 9846324 9933867 10014101
11490 10014101 10119659 10274740 10444543 10571981 10657026 10752357 10879318 11004553 11117733 11272053
11480 11272053 11503362 11752926 11927801 12015287 12080144 12157634 12209106 12193673 12130800 12063396
11470 12063396 11993206 11886781 11729145 11541455 11349956 11161633 10974142 10792262 10624410
11461 10624410 10470888 10326763 10195816 10091463 10018453 9961486 9901520 9837940 9782368 9735323
11451 9735323 9687211 9642553 9621701 9632299 9660246 9697659 9754653 9827201 9879330 9883818 9860812
11440 9860812 9845352 9833251 9797395 9748066 9730486 9755626 9775787 9746743 9679195 9604639 9519978
11429 9519978 9399448 9245284 9091968 8962505 8847593 8731293 8615172 8508332 8408914 8307471
11419 8307471 8202326 8101618 8010667 7923914 7832558 7737380 7649201 7576412 7517765 7470059 7435725
11408 7435725 7416317 7405345 7397338 7398502 7415977 7440291 7453554 7454306 7457748 7468659 7471047 7451510
11396 7451510 7417582 7383034 7347572 7303077 7251370 7203677 7166738 7138143 7112413 7086438 7063092
11385 7063092 7052323 7061822 7084323 7104234 7120674 7151228 7205858 7270882 7330196 7389752 7465624
11374 7465624 7557332 7651472 7746957 7856691 7982699 8107723 8219009 8327804 8455210 8604845
11364 8604845 8758145 8894491 9008928 9109231 9201035 9281235 9345713 9396788 9437397 9461886
11354 9461886 9461962 9442250 9420558 9408189 9396021 9364092 9300543 9209060 9103489 8997429 8893306
11343 8893306 8779376 8642708 8485381 8321233 8158279 7994653 7830672 7670656 7510869
11334 7510869 7341580 7166095 7001343 6852029 6700752 6534046 6362145 6200222 6045426
11325 6045426 5887896 5731349 5585647 5449133 5314570 5183303 5058523 4934795 4810061
11316 4810061 4696752 4603541 4517612 4424248 4331608 4253514 4180031 4092853 4001038 3930271 3880566
11305 3880566 3827073 3763120 3708781 3670964 3628592 3569471 3511318 3469358 3429329 3373078 3309969
11294 3309969 3260592 3224019 3182984 3132476 3084003 3045792 3013118 2976299 2929839 2877168 2830988
11283 2830988 2802781 2788706 2773535 2749266 2719177 2684550 2643694 2605395 2583487 2572810 2551011
11272 2551011 2511786 2475148 2454916 2438810 2414561 2392705 2384557 2377928 2357241 2331578 2319159 2316677
11260 2316677 2307700 2291115 2277275 2263942 2240490 2211312 2191754 2182731 2170424 2150297 2131959 2120136
11248 2120136 2108705 2094373 2080353 2066103 2048030 2030042 2019386 2012764 1999963 1980061 1961484
11237 1961484 1948565 1940525 1939352 1944342 1943401 1925621 1898940 1879537 1868055 1853595 1836719 1828438
11225 1828438 1828565 1825690 1818347 1815617 1816313 1809247 1796529 1794180 1804272 1808363 1797100 1786313 1792569
11212 1792569 1809074 1817609 1811879 1799022 1788539 1787818 1798995 1813739 1819873 1816815 1814730 1817113 1817197
11199 1817197 1813322 1812786 1817100 1819071 1818576 1824636 1836335 1839141 1827742 1815584 1812810 1811508 1803820 1798663
11185 1798663 1806565 1820459 1826010 1822511 1821050 1827994 1840080 1851304 1858441 1864177 1876467 1897955 1917918
11172 1917918 1926329 1932622 1953489 1984224 2004214 2011841 2028542 2063688 2102788 2137771 2177735 2217411
11160 2217411 2229811 2211841 2204194 2236456 2280716 2294128 2283314 2286397 2309128 2324510 2328205 2347761
11148 2347761 2392744 2436883 2461574 2483940 2526727 2586328 2646315 2702850 2761644 2823369 2883788
11137 2883788 2938625 2981375 3005303 3011387 3006014 2991328 2968309 2946201 2934736 2928911 2915972 2894666
11125 2894666 2871785 2844101 2803779 2759384 2728811 2710455 2684570 2646916 2617573 2609492 2610745 2607666
11113 2607666 2605017 2611275 2621654 2629100 2638388 2657259 2684251 2714182 2745247 2774698 2800263 2831565
11101 2831565 2885089 2960224 3035691 3098799 3163046 3245988 3343924 3440797 3529933 3614241 3694820
11090 3694820 3770553 3839739 3892612 3913308 3899864 3871067 3841580 3801423 3734355 3647011 3562891
11079 3562891 3492314 3424741 3350341 3274904 3209687 3155804 3104435 3049900 2998743 2963394 2946046
11068 2946046 2933645 2914090 2892646 2883316 2887789 2894744 2898140 2903297 2915076 2932875 2957345 2989386
11056 2989386 3023643 3056435 3096680 3152156 3209704 3251567 3288368 3348191 3431424 3507083 3560147
11045 3560147 3609998 3670446 3724992 3759205 3785443 3813077 3824826 3809981 3793488 3800447 3815137
11034 3815137 3809629 3793502 3797808 3824133 3848884 3870675 3915404 3995372 4096547 4207398 4331201
11023 4331201 4468620 4614600 4772299 4943532 5105346 5222986 5288060 5319577 5327254 5300453
11013 5300453 5235619 5147976 5050763 4945898 4838927 4740126 4646795 4547042 4445189 4361412 4302223
11002 4302223 4252801 4202184 4155178 4117203 4089051 4077686 4088875 4108544 4116974 4121932 4149444 4200727
10990 4200727 4250858 4294014 4353344 4435986 4516423 4581508 4656032 4760911 4878660 4987559 5102060
10979 5102060 5249066 5426892 5619239 5832115 6085200 6379638 6705791 7075042 7514694
10970 7514694 8033338 8612069 9222281 9827224 10370615 10792098 11062097 11188225 11188080 11071813
10960 11071813 10852703 10558408 10222377 9866865 9495491 9102357 8693058 8296153 7944140
10951 7944140 7642165 7368727 7109341 6872554 6668076 6489782 6330778 6195781 6085734
10942 6085734 5988649 5899967 5833502 5796392 5771738 5743943 5723000 5723909 5740274 5761153 5797148 5863214
10930 5863214 5948127 6028147 6102936 6193684 6312717 6457384 6626694 6822896 7044630 7298282
10920 7298282 7605348 7978754 8406970 8883837 9430601 10049854 10672286 11194957 11570507
10911 11570507 11817742 11947824 11933378 11766024 11496073 11183305 10838038 10440315 9995147
10902 9995147 9537879 9096982 8678827 8284759 7920902 7589284 7283800 6999343 6738825
10893 6738825 6509141 6311833 6137941 5974146 5816175 5671830 5547003 5436118 5333224
10884 5333224 5243031 5170090 5106232 5042191 4983303 4938926 4904668 4871231 4842194 4825215 4814576
10873 4814576 4802480 4799056 4819074 4856542 4896328 4943966 5018622 5122636 5244683 5386506 5556018
10862 5556018 5737700 5901940 6042624 6172437 6280764 6332593 6315932 6257272 6181833 6089193
10852 6089193 5975797 5850265 5717252 5575427 5438281 5325929 5230709 5125933 5015739 4936907
10842 4936907 4900100 4871207 4827128 4786604 4763345 4732534 4675087 4616374 4584212 4560025 4510352
10831 4510352 4441331 4382864 4338097 4286353 4222625 4160527 4106148 4057195 4017703 3988973 3957505
10820 3957505 3914080 3871506 3843028 3819552 3789019 3759858 3743077 3730483 3713618 3703831 3709412 3714544
10808 3714544 3706994 3704172 3723299 3748743 3760670 3774126 3814318 3871578 3917567 3951463 3994471 4051133
10796 4051133 4110667 4175833 4257679 4351059 4444467 4542821 4653754 4766308 4870075 4976771
10786 4976771 5094677 5204320 5291201 5376888 5480048 5572416 5616392 5622879 5626082 5623826 5593042
10775 5593042 5544092 5505738 5472198 5419168 5357432 5314920 5280238 5223394 5159600 5128813 5121635
10764 5121635 5093281 5046405 5028955 5048026 5058415 5045773 5049079 5083633 5109442 5099066 5077240
10753 5077240 5070851 5074060 5082227 5107193 5142198 5164475 5185676 5243807 5334672 5413491 5476130 5569129
10741 5569129 5700531 5813284 5873694 5916010 5969176 6009421 6020420 6032715 6065511 6093787 6109800
10730 6109800 6151170 6229680 6299976 6339539 6389741 6473217 6543132 6565401 6579317 6620026 6650947
10719 6650947 6634712 6604158 6598882 6596387 6571690 6559189 6585549 6606780 6585917 6568078 6600457 6644015
10707 6644015 6649747 6656982 6721316 6805529 6844711 6866904 6941171 7049762 7122157 7161337 7226994
10696 7226994 7321293 7398349 7464444 7565060 7691285 7797667 7893876 8023978 8177176 8312343
10686 8312343 8443838 8608730 8781899 8922166 9064377 9260883 9474979 9646312 9815081
10677 9815081 10056420 10340483 10595051 10856561 11204998 11595991 11927919 12235562 12632461
10668 12632461 13095065 13505726 13884868 14359991 14915690 15413130 15863938 16431174 17135357
10659 17135357 17830149 18510769 19353618 20385287 21434090 22511637 23890674 25651571
10651 25651571 27539194 29506915 31980216 35166084 38411612 40762912 42020657 42753097
10643 42753097 43331377 43490682 42966240 42101287 41524514 41442828 41519170 41387109 41098900 41015040
10633 41015040 41329493 41849260 42353288 43032979 44283942 46116940 48241183 50823874 54502218
10624 54502218 59170021 63336571 65475323 65692648 65198878 64334352 62227768 58568635
10616 58568635 54543403 51362791 48726717 45596327 41904258 38554281 36018517 33876118
10608 33876118 31726509 29741397 28141251 26770537 25451307 24287027 23363210 22508352
10600 22508352 21578991 20689973 19964250 19307571 18612299 17959217 17441864 16983059 16487101
10591 16487101 16006790 15614928 15263061 14900500 14591046 14386253 14213721 14005528 13810847
10582 13810847 13673327 13523185 13300868 13068320 12888881 12710629 12476065 12236535 12047641
10573 12047641 11855752 11600736 11335069 11129072 10947210 10729264 10510403 10349496 10215454
10564 10215454 10054942 9901956 9811641 9751004 9661093 9564866 9508919 9459779 9364640 9256773
10554 9256773 9191443 9130898 9005493 8842425 8719731 8631457 8513298 8371691 8272860 8222995
10544 8222995 8167879 8099021 8058430 8047231 8026783 8004462 8025681 8084559 8130939 8162737 8224293
10533 8224293 8314022 8379466 8407629 8438695 8483623 8505719 8494076 8485025 8500158 8524183 8547682
10522 8547682 8572937 8580327 8549601 8508007 8495650 8495782 8467476 8430874 8440216 8484134 8501199 8491048
10510 8491048 8516428 8587647 8639489 8640277 8631858 8636087 8610829 8532275 8437698 8348448 8228974 8063865
10498 8063865 7900515 7768839 7628920 7448990 7269793 7135718 7020066 6877810 6723483
10489 6723483 6597489 6496091 6392464 6293179 6218792 6156132 6080943 6005095 5955827 5928446 5900112
10478 5900112 5870398 5850666 5833063 5805478 5779165 5769563 5767488 5757146 5743915 5739958 5743622 5754604
10466 5754604 5784473 5831243 5871751 5899845 5941137 6010834 6093718 6185668 6310668 6472595 6642177
10455 6642177 6823188 7069406 7384750 7664968 7806768 7829740 7816848 7775813 7650376 7446927
10445 7446927 7249765 7101876 6956166 6768072 6565050 6392961 6251461 6118383 5994797
10436 5994797 5891165 5800027 5712088 5636282 5580895 5534552 5485038 5440545 5416711 5414836 5422496
10425 5422496 5425243 5415258 5401101 5406705 5444959 5497608 5540482 5580082 5639252 5713908 5776395 5820565
10413 5820565 5870162 5938307 6009974 6071532 6128493 6185530 6235576 6277437 6320253 6364133 6400421
10402 6400421 6434835 6483044 6539684 6583165 6617087 6671681 6754132 6836252 6908296 7004698 7151105
10391 7151105 7325623 7507519 7727681 8025373 8387069 8787873 9270584 9899072 10616647
10382 10616647 11229782 11584506 11708602 11720924 11645356 11405470 10995829 10552058 10198900 9902816
10372 9902816 9552324 9140462 8775136 8518460 8311447 8083849 7857386 7689281 7572602
10363 7572602 7456403 7330829 7229169 7160973 7099733 7033736 6981247 6951023 6925826 6891626 6853670
10352 6853670 6818516 6783440 6745649 6703746 6654030 6601835 6564854 6544598 6510579 6439630 6354483
10341 6354483 6291407 6245208 6183568 6103879 6035130 5990305 5957270 5932581 5924694 5926603 5924391 5930118
10329 5930118 5967505 6029552 6091248 6157071 6247767 6344223 6398751 6405219 6403490 6408270 6392128 6352197
10317 6352197 6332882 6357948 6394411 6412825 6434732 6489010 6564649 6639400 6717705 6810050 6908821
10306 6908821 7011374 7133848 7278301 7419125 7541588 7657691 7767859 7850827 7910883 7987246
10296 7987246 8093255 8196190 8283618 8396304 8562529 8752575 8936707 9139585 9397533 9705533
10286 9705533 10040380 10389710 10728846 11023592 11286460 11570831 11884439 12183909 12481660
10277 12481660 12861504 13349025 13882620 14469732 15233591 16222363 17338934 18589822 20201265
10268 20201265 22242484 24278096 25717181 26464811 26900739 27203856 27076597 26280045 25092616
10259 25092616 23962908 22932026 21710224 20208848 18686944 17386643 16285161 15255493
10251 15255493 14272492 13381446 12598967 11922579 11354271 10864684 10398908 9945554 9539819
10242 9539819 9186136 8844563 8504557 8202400 7949613 7709620 7462920 7234226 7036536
10233 7036536 6845838 6651068 6476534 6334644 6203181 6066765 5937142 5818035 5692876
10224 5692876 5560782 5443549 5345767 5248258 5149068 5068273 5004740 4933418 4853974 4794641 4757335
10213 4757335 4708657 4639507 4582799 4553273 4520309 4464677 4414074 4393039 4381111 4352820 4320518
10202 4320518 4304120 4292475 4268772 4244361 4233396 4219279 4179161 4121276 4069482 4030109 3998816
10191 3998816 3979246 3970162 3954956 3927886 3909646 3913564 3918995 3903044 3875850 3857523 3842414 3815759
10179 3815759 3786093 3770287 3762429 3746913 3727672 3716244 3706221 3688785 3678639 3693118 3718089
10168 3718089 3726797 3722360 3729240 3750990 3769932 3783459 3806960 3842067 3873885 3900689 3936097 3979206
10156 3979206 4012053 4031909 4058375 4101123 4146772 4187056 4235280 4301568 4372499 4431264 4483622
10145 4483622 4548442 4631631 4723061 4815154 4914144 5031983 5169687 5309025 5424368 5506568
10135 5506568 5569167 5623882 5658569 5653892 5617545 5583775 5575251 5579522 5570277 5542108 5515323 5509635
10123 5509635 5520487 5524924 5510170 5490331 5487745 5502310 5513262 5511689 5512954 5529700 5551735 5566680
10111 5566680 5584126 5620866 5674083 5728689 5782344 5843785 5913324 5984263 6057404 6134213 6200535
10100 6200535 6238122 6250110 6255533 6260532 6254814 6235324 6212706 6193089 6172969 6154079 6144618 6143279
10088 6143279 6140243 6136524 6143893 6162550 6178027 6185069 6195260 6213732 6226375 6220130 6201524 6185202
10076 6185202 6175605 6167979 6157135 6138445 6110433 6082330 6068725 6070564 6070711 6054317 6025603 5999560
10064 5999560 5983874 5973011 5954911 5921818 5878007 5834199 5791096 5737575 5672990 5617346 5583534
10053 5583534 5553204 5503316 5446032 5413351 5407504 5398452 5370907 5341090 5321790 5303427 5279128 5257280
10041 5257280 5236983 5201420 5149892 5106122 5077893 5039415 4974846 4908542 4865376 4829310 4773786
10030 4773786 4709826 4667015 4642731 4608830 4560782 4523168 4506956 4493792 4467424 4435194 4412176
10019 4412176 4402634 4401309 4399216 4388115 4371015 4363762 4374156 4388362 4392873 4398336 4421896 4456924
10007 4456924 4483640 4500708 4520674 4541696 4552543 4561672 4590498 4636629 4673516 4691596 4712034
9996 4712034 4752034 4801885 4845783 4882693 4916371 4945050 4971153 5003443 5040996 5071931 5094162
9985 5094162 5118757 5146828 5164229 5167081 5170536 5182057 5188380 5181850 5177415 5186908 5196395 5188458 5170802
9972 5170802 5162837 5167001 5173033 5179568 5191745 5205955 5216035 5228310 5253200 5287311 5319795 5351293
9960 5351293 5391083 5440468 5494109 5552900 5619856 5687688 5747120 5804699 5875390 5958054 6034550
9949 6034550 6094098 6142973 6187620 6223735 6247705 6266033 6285897 6305677 6322080 6339746 6366328
9938 6366328 6401835 6439285 6475011 6514281 6565512 6629993 6699320 6765469 6832297 6912125 7010619
9927 7010619 7122247 7243397 7381818 7547751 7743660 7970119 8234621 8545540 8903481 9307372
9917 9307372 9760022 10251495 10739407 11162251 11476489 11671429 11750079 11713738 11573599 11363081
9907 11363081 11123012 10876300 10625041 10369864 10124023 9908570 9740034 9624045 9556390 9528553
9897 9528553 9535260 9577280 9651950 9737909 9795209 9790038 9720087 9607997 9469246 9297964 9089581
9886 9089581 8862929 8644101 8436019 8222864 8002868 7796637 7619034 7461747 7312405 7174567
9876 7174567 7056751 6954410 6856698 6763364 6683306 6621719 6576731 6542090 6507047 6463124 6417784
9865 6417784 6389732 6382633 6377237 6359756 6342180 6340229 6347814 6352389 6360244 6382743 6409344 6421118 6423049
9852 6423049 6434669 6453828 6459814 6450656 6445263 6446140 6433746 6406076 6389827 6397103 6402699 6385665 6365893
9839 6365893 6372593 6397640 6410578 6406437 6407364 6422330 6435203 6435638 6437369 6457136 6491300 6522590 6541230
9826 6541230 6552449 6566868 6587208 6604754 6610567 6608757 6611114 6618043 6616487 6601602 6587096 6584760 6586257
9813 6586257 6577924 6563243 6555704 6556874 6556895 6551666 6545060 6538018 6528992 6521722 6519882 6518459 6513325 6513562 6529062
9798 6529062 6551410 6564922 6573037 6594158 6632337 6672914 6709455 6754346 6816959 6889996 6964963 7044708
9786 7044708 7133199 7228748 7334553 7459053 7597300 7730199 7853774 7990866 8158399 8340290
9776 8340290 8512698 8682134 8875079 9098527 9336139 9580747 9846560 10146943 10481687 10851553
9766 10851553 11266322 11730356 12235166 12772694 13339573 13918405 14469804 14957292 15371404
9757 15371404 15717494 15988235 16161820 16222537 16170830 16016256 15772072 15454727 15077949 14648574
9747 14648574 14177673 13692427 13223294 12778128 12341363 11902149 11471859 11068913 10696551
9738 10696551 10342678 9994686 9648689 9310495 8992404 8702692 8434262 8171247 7910598
9729 7910598 7666555 7447230 7239249 7027293 6818461 6631798 6470036 6317998 6165592 6016056
9719 6016056 5872871 5735041 5605821 5489482 5377452 5255081 5126212 5012627 4921683 4832867
9709 4832867 4728204 4619499 4529735 4460072 4393142 4320723 4249362 4182075 4112341 4037871 3967007
9698 3967007 3908133 3861076 3820020 3778083 3729896 3676271 3624743 3579446 3534340 3483966 3435801
9687 3435801 3401195 3376868 3347037 3303669 3254393 3209808 3172315 3138703 3105587 3070794 3035515
9676 3035515 3004889 2981008 2957920 2930430 2903753 2885304 2870910 2850863 2826961 2810214 2802001 2791472
9664 2791472 2773661 2756413 2745031 2732679 2712661 2690085 2673758 2663342 2651361 2633639 2613048
9653 2613048 2595459 2583881 2574602 2560628 2541903 2527196 2520151 2510956 2491917 2473178 2468089 2469603
9641 2469603 2460487 2443510 2438528 2447956 2449362 2429976 2406247 2397370 2398218 2392452 2377195 2360573 2346676
9628 2346676 2335304 2326259 2314417 2292367 2266072 2253204 2256602 2256094 2237920 2214123 2198916 2185781
9616 2185781 2166257 2151755 2153119 2155056 2137948 2112553 2104291 2111867 2111644 2098115 2089060 2090565 2087308
9603 2087308 2072753 2061890 2065258 2072360 2069982 2059299 2048101 2041895 2046737 2064343 2081694 2083049 2074121
9590 2074121 2075230 2089249 2098437 2095370 2091833 2091655 2082142 2062314 2051807 2057270 2056480 2034414 2010538
9577 2010538 2007876 2016462 2012989 1998825 1990585 1986531 1972403 1952640 1945877 1951728 1949786 1933480 1920022
9564 1920022 1921813 1929680 1931578 1929425 1928784 1927031 1921500 1918262 1923277 1931644 1932969 1923701 1910434 1903615
9550 1903615 1908283 1917625 1918272 1906978 1897362 1901893 1912564 1911909 1900299 1896806 1910996 1929164 1935298
9537 1935298 1932791 1934883 1942202 1943018 1933810 1927228 1934804 1949180 1952286 1940244 1930406 1938142 1954757 1959867
9523 1959867 1951287 1946647 1953805 1957894 1946468 1931092 1929697 1939921 1946542 1946313 1947210 1949127 1944880 1938194
9509 1938194 1941584 1955246 1965272 1965250 1963512 1965793 1966768 1963711 1963437 1969097 1973504 1972488 1972162 1975595 1974863
9494 1974863 1965578 1958176 1964066 1978973 1990109 1992938 1991359 1987990 1984908 1988974 2004902 2024372 2031727
9481 2031727 2021697 2005352 1997622 2003161 2014886 2023021 2024365 2023757 2027256 2035864 2047378 2060936 2075234
9468 2075234 2085583 2089787 2094933 2109902 2131757 2148347 2154375 2155653 2157509 2160045 2166094 2181190 2201531
9455 2201531 2213953 2213612 2210872 2214924 2222027 2227103 2235029 2250362 2265754 2271916 2271892 2274952 2282747 2291474
9441 2291474 2301484 2314246 2325346 2331223 2338220 2354224 2375310 2391642 2403717 2421639 2449578 2481365
9429 2481365 2511933 2544657 2585994 2637972 2695167 2745076 2774824 2782595 2778609 2770228 2752460 2719983
9417 2719983 2681317 2650795 2630880 2612186 2587673 2557821 2525564 2495365 2473983 2463345 2456225 2446719
9405 2446719 2438962 2436358 2430699 2415571 2403110 2410079 2430971 2443188 2438370 2430790 2433287 2442574 2452321
9392 2452321 2464125 2479300 2493765 2507277 2525676 2549358 2571789 2592901 2619702 2649558 2669615
9381 2669615 2679687 2697700 2731305 2761210 2768182 2762407 2767256 2783667 2791458 2781879 2768336 2762807 2758819
9368 2758819 2744272 2719387 2694211 2674859 2658754 2640492 2617684 2591535 2564503 2539172 2519506
9357 2519506 2510029 2509652 2508104 2495269 2474844 2461484 2462006 2466949 2464572 2455453 2447220 2441686 2435353 2428833
9343 2428833 2427656 2434308 2444835 2453458 2457855 2460406 2465201 2472493 2477191 2476275 2475403 2482017 2494078 2504121
9329 2504121 2512716 2526964 2546218 2562612 2577126 2599980 2631187 2657366 2674717 2697532 2733182 2766030
9317 2766030 2781167 2788752 2806241 2828385 2835533 2824167 2808835 2798218 2788589 2778878 2774055 2773543 2771413
9304 2771413 2767827 2767542 2769969 2773766 2785840 2809925 2832030 2836454 2832178 2842562 2871717 2904060 2935865
9291 2935865 2980325 3036978 3082991 3104800 3115007 3126334 3130758 3118566 3098578 3083447 3070561 3052577
9279 3052577 3032891 3016514 2999293 2979866 2968467 2969547 2969437 2956426 2939831 2933851 2936173 2938698 2944628
9266 2944628 2956434 2961797 2952938 2945815 2956017 2969025 2962450 2946473 2949590 2970947 2982480 2977210 2977682
9253 2977682 2991323 2996058 2983306 2978390 2997270 3015035 3004358 2979775 2973460 2986084 2994025 2992580
9241 2992580 2998359 3013865 3021766 3016023 3011261 3016323 3022250 3022690 3024595 3030859 3032445 3027249 3027889 3038916
9227 3038916 3044090 3031710 3017791 3025135 3049340 3065997 3066708 3067192 3078829 3091641 3092314 3084655 3082789
9214 3082789 3092952 3110210 3126884 3137307 3139583 3139232 3146652 3164892 3183980 3193171 3194428 3197255 3204733
9201 3204733 3212899 3220401 3229331 3238227 3243974 3249900 3261863 3276455 3284748 3289211 3303266 3329060 3349860
9188 3349860 3353950 3353660 3367667 3393957 3415865 3428704 3442874 3462280 3477631 3484725 3494103 3515651
9176 3515651 3544903 3571890 3594965 3619134 3647464 3679770 3714001 3745348 3771126 3799464 3842677
9165 3842677 3896535 3937989 3953684 3960556 3984707 4027099 4065990 4089674 4109118 4136191 4165954 4187891
9153 4187891 4202501 4217457 4235420 4254963 4278152 4307874 4339968 4366155 4384844 4403408 4429383
9142 4429383 4463365 4500465 4534928 4562967 4584310 4602188 4620901 4643830 4673883 4712229 4753845
9131 4753845 4788176 4809658 4825703 4848260 4878623 4907639 4930711 4953350 4978986 5001620 5017977
9120 5017977 5038108 5072214 5112004 5139018 5150604 5163038 5185932 5208813 5220898 5230186 5249694 5274756
9108 5274756 5290085 5294067 5298890 5308272 5312893 5310168 5310338 5316274 5314613 5298210 5282109 5281770 5287292 5278049
9094 5278049 5255343 5239343 5236310 5231558 5217838 5207451 5206542 5198702 5170484 5136641 5119002 5111291 5089210
9081 5089210 5050937 5021215 5011795 5003492 4978654 4949071 4933754 4925953 4905222 4872638 4849276 4841853
9069 4841853 4833908 4814538 4793793 4781399 4770036 4751727 4733928 4724366 4713959 4692137 4667935 4656122
9057 4656122 4650453 4632905 4605659 4589852 4590803 4588509 4570007 4548913 4540304 4535477 4518870 4495968 4484460
9044 4484460 4485317 4482247 4467821 4453396 4451409 4460409 4470020 4471698 4463305 4450498 4443551 4446598 4452346 4453890
9030 4453890 4456355 4466721 4477873 4477108 4467636 4465280 4473814 4481032 4482001 4487211 4500698 4509305 4505772 4505152
9016 4505152 4521501 4542065 4544993 4534010 4533494 4552522 4575476 4589046 4597511 4606539 4611936 4613591 4623334
9003 4623334 4646492 4669219 4677804 4679615 4690139 4708484 4722796 4733746 4753116 4780154 4799104 4804214
8991 4804214 4809293 4824776 4841477 4848919 4856520 4880436 4916501 4943068 4949783 4949299 4958246 4978306 5000728
8978 5000728 5020605 5040067 5061771 5084635 5105144 5120934 5133637 5147460 5163426 5177693 5188815
8967 5188815 5202899 5225496 5251431 5270588 5282400 5296117 5317146 5342179 5368156 5395777 5422103
8956 5422103 5440697 5453427 5471912 5501293 5531722 5552688 5567306 5584919 5607184 5629617 5650185
8945 5650185 5668169 5680859 5689942 5705296 5733541 5767606 5795576 5814565 5828458 5839090 5848949 5865239
8933 5865239 5890533 5916142 5935725 5957421 5989466 6022655 6043883 6059708 6086751 6123741 6155257
8922 6155257 6180946 6216229 6261716 6297610 6315962 6334084 6364019 6391149 6399350 6399101 6411544 6437581
8910 6437581 6461505 6476760 6491120 6511663 6538482 6569087 6598680 6621595 6640734 6667303 6702985
8899 6702985 6734144 6754564 6780338 6826573 6881617 6923844 6955093 6995767 7051503 7106877 7152040
8888 7152040 7195380 7246981 7306765 7372960 7447427 7528283 7609733 7692442 7782699 7879261 7972888
8877 7972888 8061393 8153651 8255717 8363669 8474039 8593060 8732653 8901508 9096456 9295331
8867 9295331 9465475 9592051 9691850 9784962 9861602 9898106 9898975 9894802 9898097 9892052 9870869 9859473
8855 9859473 9876554 9906222 9930505 9968048 10051223 10177695 10314751 10446528 10587993 10749787
8845 10749787 10915427 11063789 11195632 11323442 11445119 11543232 11609615 11658578 11709291 11761286
8835 11761286 11798431 11817673 11839762 11882103 11933853 11975237 12012987 12073926 12167040 12278822 12408475
8824 12408475 12578140 12799285 13059588 13357119 13711840 14114110 14490088 14756998 14897657
8815 14897657 14945191 14910730 14774292 14546175 14287341 14049711 13829461 13599343 13360930 13142796
8805 13142796 12965392 12828997 12725070 12642697 12572364 12516461 12488322 12491004 12506844 12518162 12527697
8794 12527697 12546176 12568771 12578148 12566068 12538874 12502377 12450729 12371598 12259028 12122667 11984479
8783 11984479 11861054 11749360 11638225 11532604 11452283 11403857 11371513 11344302 11334855 11356064 11394635
8772 11394635 11429008 11463928 11521512 11598108 11654738 11659270 11619516 11562053 11493123 11399012 11278662
8761 11278662 11154666 11046686 10949795 10850256 10751864 10670517 10607037 10544516 10476084 10416482 10375974
8750 10375974 10340023 10291384 10238904 10203043 10181175 10151727 10110273 10076411 10062113 10057377 10053380 10056172
8738 10056172 10067243 10072492 10064215 10055653 10059603 10069611 10076702 10087418 10108482 10129721 10141042 10152012
8726 10152012 10174658 10200178 10214716 10226608 10253867 10293088 10325521 10348200 10374366 10407011 10436860
8715 10436860 10464440 10498847 10534695 10555872 10564334 10579731 10606419 10626864 10634862 10649033 10681841 10718990
8703 10718990 10744103 10763330 10789592 10820525 10849522 10883366 10929983 10979795 11017738 11046386 11080658
8692 11080658 11124996 11170548 11211223 11249648 11289774 11334247 11386730 11448097 11512562 11573621 11629858
8681 11629858 11680456 11722762 11760613 11806115 11864183 11923073 11970157 12010420 12059035 12120706 12186086
8670 12186086 12244772 12293764 12337131 12384251 12443696 12513138 12580940 12641819 12702057 12765076 12824680
8659 12824680 12879781 12940697 13009726 13071609 13118760 13169872 13242460 13320336 13374250 13406795 13448742
8648 13448742 13513179 13581231 13635762 13682359 13730243 13777089 13822881 13877055 13939656 13994529 14034761
8637 14034761 14078202 14142436 14217704 14280729 14325686 14366077 14412329 14461525 14506623 14546158 14586570
8626 14586570 14638822 14706659 14775874 14826265 14858652 14896289 14952520 15013352 15063049 15108951 15163399
8615 15163399 15217401 15255897 15287907 15334280 15391130 15434795 15463491 15503433 15565392 15624158 15657223
8604 15657223 15679859 15719953 15774903 15818652 15842380 15863055 15893351 15926268 15953955 15982659 16020321
8593 16020321 16062805 16101953 16137828 16173982 16208084 16236895 16265547 16302055 16344740 16384079 16416932
8582 16416932 16450878 16492795 16539900 16585335 16627728 16670953 16716979 16762829 16804070 16839241 16871222
8571 16871222 16905482 16946249 16993006 17040603 17083279 17119253 17152550 17190254 17235266 17280640 17315473
8560 17315473 17340132 17370452 17418736 17473769 17511362 17526069 17539645 17571683 17613427 17641791 17651767
8549 17651767 17661275 17685938 17721538 17753528 17775314 17793944 17822034 17864617 17911647 17947512 17972140
8538 17972140 18004818 18057878 18115341 18153563 18177591 18215571 18276177 18335548 18375829 18413661 18472521
8527 18472521 18544440 18603304 18646909 18699267 18771181 18843226 18895975 18937528 18987928 19049838 19110656
8516 19110656 19166315 19225147 19287776 19339916 19373935 19406707 19462372 19540519 19616012 19673394 19726983
8505 19726983 19796669 19875662 19939377 19981577 20022060 20076159 20135698 20188326 20238848 20298293 20364278
8494 20364278 20427368 20488588 20555686 20628022 20699767 20773362 20854740 20938627 21014484 21085299 21164263
8483 21164263 21253212 21341364 21426409 21517517 21612934 21695293 21759750 21828135 21919607 22021674 22108895
8472 22108895 22180336 22257139 22346883 22432495 22500511 22561779 22634354 22718066 22797814 22866304 22932863
8461 22932863 23010805 23103785 23205672 23308769 23410265 23513933 23627710 23757287 23899189 24041427
8451 24041427 24174977 24305249 24447886 24610497 24782809 24950013 25112260 25282892 25468323
8442 25468323 25659948 25849228 26040019 26237133 26430119 26600909 26745820 26877687 27004059
8433 27004059 27114797 27197439 27255219 27299964 27333055 27345868 27338261 27324107 27314489 27305655 27290367 27272889
8421 27272889 27263372 27262791 27263719 27263120 27263661 27263406 27254783 27233892 27199767 27144045 27054907 26935021 26801733
8408 26801733 26662788 26504974 26315444 26101115 25875995 25642657 25401062 25164164 24946136
8399 24946136 24742170 24538370 24337012 24154244 23996947 23860029 23742202 23643855 23552744 23455372
8389 23455372 23361957 23295110 23252175 23206608 23151487 23110375 23093451 23075233 23036142 22997637 22989055
8378 22989055 23001406 23003855 22990420 22980256 22982521 22990552 23003380 23024171 23042293 23045668 23048011 23074316
8366 23074316 23118682 23145930 23139740 23121633 23115131 23117629 23118229 23119110 23124990 23130441 23131363 23133793 23140253 23142337
8352 23142337 23136631 23132396 23133825 23131282 23120563 23113283 23116026 23117636 23112199 23116015 23142540 23176661 23196370
8339 23196370 23207413 23231841 23270844 23304954 23327392 23351355 23382957 23410946 23429043 23448022 23476871
8328 23476871 23508006 23530618 23546456 23563333 23582361 23599745 23614381 23627163 23638134 23648482 23659686
8317 23659686 23668080 23667481 23660308 23657805 23664391 23669778 23663363 23649735 23641713 23642680 23645476 23647285 23655288 23674172
8303 23674172 23695803 23708298 23712082 23719190 23736520 23757913 23776664 23797567 23827694 23860841 23884164 23899658
8291 23899658 23924877 23967929 24014867 24049880 24077026 24111726 24159486 24214536 24272576 24332289 24388798
8280 24388798 24438237 24486399 24541713 24602057 24659291 24713613 24770849 24827513 24872458 24903970 24932378
8269 24932378 24964352 24996740 25027130 25057248 25083537 25098635 25107093 25125700 25160691 25196835 25218374
8258 25218374 25230783 25251619 25287385 25329849 25370246 25407286 25443616 25482155 25525291 25573164 25623965
8247 25623965 25677706 25736137 25797578 25857096 25913451 25969969 26027585 26085208 26148282 26225946 26315414
8236 26315414 26401049 26476264 26554599 26648499 26747549 26832221 26903090 26980766 27077910 27185103 27286675
8225 27286675 27379419 27471128 27567894 27668022 27765385 27855559 27938936 28018254 28094258 28166920 28240289
8214 28240289 28320098 28405180 28488199 28567227 28648575 28734947 28820953 28905896 28999566 29106297 29214640
8203 29214640 29315234 29418707 29539758 29670953 29791468 29899289 30015103 30151822 30298119
8194 30298119 30438110 30572194 30709356 30849588 30984020 31107348 31223215 31339462 31460702
8185 31460702 31583492 31700242 31811858 31931926 32070155 32216696 32355406 32489411 32637471
8176 32637471 32804723 32974940 33136897 33301122 33481204 33672839 33862661 34046634 34228218
8167 34228218 34407431 34583086 34758740 34936433 35111197 35280710 35453002 35635425 35823777
8158 35823777 36011808 36202748 36400491 36598827 36792851 36992321 37207527 37428914 37639382
8149 37639382 37842893 38060838 38300149 38544537 38779900 39009169 39237342 39461829 39686674
8140 39686674 39927525 40188846 40451049 40695894 40933143 41184758 41450871 41710348 41951320
8131 41951320 42181945 42409997 42630478 42839941 43048081 43265172 43488307 43710834 43937987
8122 43937987 44180777 44437570 44694510 44946094 45204463 45482665 45776544 46071667 46364090
8113 46364090 46663851 46976830 47293307 47601324 47905137 48220175 48550639 48882676 49203941
8104 49203941 49520862 49847973 50186121 50523827 50859892 51210238 51584756 51968763 52341100
8095 52341100 52705014 53084142 53486570 53891035 54278292 54660854 55064594 55489719 55911233
8086 55911233 56317514 56726776 57157828 57603323 58045869 58487096 58942965 59417314 59898428
8077 59898428 60380339 60869966 61369814 61868831 62357855 62843241 63336632 63838530 64340567
8068 64340567 64839444 65340162 65846693 66355703 66860718 67360441 67862754 68379665 68915691
8059 68915691 69462634 70010907 70564513 71136575 71729726 72331804 72934823 73546258 74173654
8050 74173654 74809971 75446837 76092838 76761720 77447725 78132247 78815025 79517822 80250722
8041 80250722 80994434 81728890 82464141 83226076 84021460 84835333 85657505 86492359 87343093
8032 87343093 88205498 89081980 89984831 90916887 91862399 92808092 93763109 94745678 95756969
8023 95756969 96781650 97811158 98852789 99914407 100991532 102074374 103160814 104257568
8015 104257568 105371423 106501582 107638425 108769473 109889374 111004346 112125313 113258945
8007 113258945 114408096 115576373 116765391 117970101 119185131 120415521 121673281 122962854
7999 122962854 124278116 125615071 126978904 128375620 129805187 131267666 132769111 134315603
7991 134315603 135906225 137537300 139210641 140934548 142719535 144574325 146501589 148496652
7983 148496652 150555038 152680707 154880087 157149706 159479807 161870106 164330563 166867410
7975 166867410 169483876 172195453 175023744 177969427 181014989 184166377 187466722 190948647
7967 190948647 194596672 198385030 202333240 206488248 210862879 215431740 220186021 225152599
7959 225152599 230353803 235787371 241458358 247394057 253608621 260085762 266819398 273841936
7951 273841936 281184434 288833026 296754952 304946114 313416089 322137209 331042720 340066968
7943 340066968 349149223 358193825 367055781 375568696 383557268 390815614 397105289 402197477
7935 402197477 405910608 408110733 408710884 407699881 405166591 401280659 396250061 390296066
7927 390296066 383645221 376516023 369102325 361569580 354060896 346698538 339580303 332778452
7919 332778452 326341107 320291929 314626478 309305213 304251113 299369729 294590906 289894341
7911 289894341 285289413 280779387 276360142 272043106 267849859 263778844 259802732 255909709
7903 255909709 252125595 248481630 244981587 241618940 238406302 235360789 232470519 229703216
7895 229703216 227045350 224507733 222090873 219769216 217518245 215338223 213239787 211219536
7887 211219536 209261423 207352078 205482734 203643148 201826210 200035749 198279382 196555528
7879 196555528 194857507 193188933 191562221 189979127 188426633 186899350 185410352 183963164
7871 183963164 182525891 181061409 179582744 178148391 176796960 175525340 174351189 173343146
7863 173343146 172520635 171738748 170752314 169423013 167811689 166039896 164123230 161999879
7855 161999879 159676174 157252790 154803989 152308237 149729240 147110971 144549592 142103066
7847 142103066 139769841 137537757 135411994 133397633 131488190 129678005 127965387 126339377
7839 126339377 124780904 123282069 121850159 120487893 119182510 117920483 116701771 115531339
7831 115531339 114404861 113312307 112251147 111226875 110242126 109293730 108380959 107508382 106676831
7822 106676831 105878029 105104002 104357875 103649690 102985849 102370667 101814777 101330728 100920835
7813 100920835 100581814 100321503 100151423 100050852 99951749 99775135 99477002 99050261 98496916
7804 98496916 97819704 97034662 96168409 95240160 94261621 93252500 92236600 91221901 90205603
7795 90205603 89202841 88247978 87358050 86514822 85695435 84903546 84155791 83452517 82779010
7786 82779010 82125744 81491809 80875740 80276847 79699319 79143291 78598884 78060128 77535848
7777 77535848 77033926 76543887 76050447 75556847 75077891 74615188 74156939 73699276 73249766
7768 73249766 72809714 72370176 71928426 71493636 71072018 70658304 70246082 69836485 69432875
7759 69432875 69035312 68643234 68256777 67874257 67494360 67120025 66753912 66393079 66035333
7750 66035333 65685409 65344754 65001715 64645893 64286897 63942124 63609777 63273708 62933392
7741 62933392 62605526 62292283 61973125 61638983 61311649 61012556 60730367 60439756 60139998
7732 60139998 59852945 59588402 59332432 59070823 58807491 58554897 58316699 58084863 57848720
7723 57848720 57604651 57359816 57125939 56906873 56694135 56476911 56253217 56028642 55808147
7714 55808147 55592309 55378146 55161513 54942466 54728700 54527668 54335370 54141453 53945738
7705 53945738 53758095 53579402 53396868 53205100 53017834 52848161 52688948 52525305 52356588
7696 52356588 52192402 52034675 51878057 51722336 51570772 51420701 51268880 51121892 50988387
7687 50988387 50865157 50743549 50624346 50512008 50399927 50278926 50156859 50049935 49954800 49849809
7677 49849809 49727496 49605427 49497789 49395576 49285634 49172194 49064663 48956802 48835168
7668 48835168 48701710 48571992 48452541 48332810 48200865 48057342 47910835 47765786 47619045
7659 47619045 47466093 47307124 47145602 46982090 46813330 46639233 46466334 46299633 46134642
7650 46134642 45963576 45786790 45611830 45443924 45283718 45130281 44978251 44817088 44643998
7641 44643998 44473207 44319602 44177090 44028552 43874299 43731458 43604319 43476306 43337466
7632 43337466 43200301 43079003 42970067 42863851 42759516 42657418 42551839 42442949 42341129
7623 42341129 42247202 42144304 42024043 41904788 41805863 41717304 41615149 41495265 41371246 41248648
7613 41248648 41123416 40997950 40875837 40746371 40597323 40438745 40290861 40151727 40000920
7604 40000920 39832879 39661037 39490074 39312230 39132983 38969997 38819678 38655357 38470487
7595 38470487 38294139 38146982 38009500 37855891 37696277 37558886 37446619 37338276 37223101
7586 37223101 37109369 37003951 36904433 36808985 36717942 36629113 36543714 36469166 36403847 36331326 36245785
7575 36245785 36168705 36118439 36076888 36014766 35940611 35890978 35873699 35856641 35819776 35784075 35773282
7564 35773282 35776170 35768582 35752031 35746856 35759893 35779759 35795994 35805698 35808183 35807809 35815464 35833969 35849648
7551 35849648 35851563 35849889 35859337 35873074 35872762 35859671 35854809 35868341 35888990 35907002 35929039 35964113
7539 35964113 36010756 36065891 36132383 36208990 36285335 36357096 36435886 36533512 36645126 36758805 36874053
7528 36874053 36998782 37134189 37275488 37423401 37581586 37745491 37908102 38076011 38264184
7519 38264184 38472110 38680610 38878294 39076131 39285905 39497733 39693311 39871903 40046450
7510 40046450 40219521 40381917 40534594 40692620 40861971 41029909 41188737 41355207 41552073
7501 41552073 41778654 42014054 42244772 42474520 42707824 42938036 43154744 43352632 43529260
7492 43529260 43683006 43818051 43944791 44070537 44194644 44316251 44441990 44582023 44741799
7483 44741799 44920415 45114012 45318852 45534092 45762141 46002941 46249224 46493545 46738997
7474 46738997 46994874 47262491 47536459 47821313 48132922 48477778 48845082 49228504 49641409
7465 49641409 50096659 50583520 51082139 51591436 52121501 52663446 53190568 53690821 54176397
7456 54176397 54657181 55127067 55585051 56048565 56532504 57032410 57543283 58078954 58654557
7447 58654557 59262553 59886690 60530469 61209458 61920090 62638851 63352157 64065905 64783811
7438 64783811 65498658 66212056 66942850 67705148 68493988 69304044 70147119 71036277 71964348
7429 71964348 72914514 73883832 74879111 75894807 76913459 77927527 78943398 79960541 80962460
7420 80962460 81934900 82879280 83798399 84680509 85512512 86304375 87084492 87867491 88638376
7411 88638376 89375591 90081661 90781306 91493756 92219092 92952626 93699506 94467889 95258101
7402 95258101 96070414 96917699 97817108 98771812 99775319 100834300 101971811 103203641 104525891
7393 104525891 105932546 107430706 109028236 110719087 112493298 114351137 116294935 118317752
7385 118317752 120414839 122596290 124871637 127230736 129656930 132146436 134688765 137234833
7377 137234833 139712809 142071198 144273415 146251149 147906200 149173286 150043653 150508859
7369 150508859 150526514 150081629 149251286 148161301 146895238 145491153 144012414 142560891 141209605
7360 141209605 139971993 138857178 137912983 137186296 136674122 136346737 136197217 136236685 136458100
7351 136458100 136839431 137375206 138073732 138924863 139898193 140975311 142158917 143444312 144804206
7342 144804206 146212032 147663355 149162003 150696845 152245048 153791079 155328638 156842403
7334 156842403 158294938 159634628 160813910 161797056 162551617 163040526 163233328 163126621 162744288
7325 162744288 162113497 161248037 160156376 158849641 157330050 155585891 153618225 151468397
7317 151468397 149203148 146877275 144528530 142203557 139961287 137841607 135849475 133980781
7309 133980781 132249572 130678917 129277337 128037079 126948536 126006143 125205191 124540121
7301 124540121 124000712 123565065 123203699 122895594 122631958 122399232 122168811 121910280 121603677
7292 121603677 121230526 120765587 120190325 119504478 118710108 117792388 116730986 115522460 114173359
7283 114173359 112676201 111013310 109186536 107226635 105170840 103046951 100882365 98710493
7275 98710493 96557969 94436359 92354259 90327741 88371283 86487338 84672753 82927909
7267 82927909 81252064 79637478 78077649 76576785 75142810 73773952 72459092 71189192
7259 71189192 69963333 68786148 67663328 66595879 65574858 64586700 63628941 62715275 61858055
7250 61858055 61049918 60270321 59506904 58761445 58035912 57322445 56610188 55895439 55180464
7241 55180464 54464899 53741533 53001030 52241707 51475520 50721679 49990739 49275748 48561923
7232 48561923 47843962 47131109 46436785 45767024 45118299 44482968 43856806 43243919 42653772
7223 42653772 42090571 41546592 41009700 40477214 39958154 39460438 38979051 38499733 38013720
7214 38013720 37526671 37051585 36593335 36143258 35691579 35242076 34808202 34395207 33994679
7205 33994679 33600429 33221552 32871637 32549242 32237718 31923817 31610317 31310343 31033776
7196 31033776 30778577 30531990 30282289 30032448 29797537 29583440 29374332 29150151 28911485
7187 28911485 28675406 28449844 28226350 27998291 27770102 27543518 27309572 27063140 26813417
7178 26813417 26569645 26326688 26076386 25824156 25579967 25338477 25083922 24813833 24544050
7169 24544050 24288681 24046655 23809696 23571890 23328311 23075902 22821652 22580202 22356051
7160 22356051 22135743 21905540 21670713 21448573 21246465 21055848 20866681 20678739 20497379
7151 20497379 20325145 20160829 20002888 19850754 19704358 19563732 19428246 19296389 19167487
7142 19167487 19042562 18921395 18800014 18673923 18542848 18409083 18272208 18129687 17982486
7133 17982486 17835205 17689699 17543129 17393226 17239834 17079570 16906677 16724243 16547194
7124 16547194 16385615 16230643 16067831 15900793 15747270 15610952 15473456 15321118 15164825
7115 15164825 15020984 14884950 14740676 14590013 14452025 14332449 14212950 14077179 13932042
7106 13932042 13793954 13666747 13544517 13426388 13315157 13207090 13095587 12981571 12869354
7097 12869354 12756017 12637106 12520097 12417844 12328058 12233830 12128312 12024559 11933483 11845372
7087 11845372 11745577 11639505 11546557 11471684 11397662 11308591 11209336 11115298 11031634 10951942 10873068
7076 10873068 10799812 10733254 10664339 10585758 10503933 10430215 10363397 10292073 10214766 10144879 10090052
7065 10090052 10038642 9976893 9909655 9850127 9795998 9733403 9662591 9600408 9553282 9505591 9443419
7054 9443419 9374896 9315746 9266854 9218822 9169140 9120903 9071422 9016405 8961396 8915902 8878904
7043 8878904 8841582 8800883 8758565 8711728 8658830 8610798 8578226 8549289 8501353 8437228 8387011
7032 8387011 8365095 8347793 8309006 8258226 8221151 8196932 8162359 8113336 8072862 8052445 8031431
7021 8031431 7988460 7934402 7894949 7871367 7840002 7788943 7735115 7698553 7674946 7645547 7605145
7010 7605145 7565343 7532496 7498045 7455526 7414091 7385164 7364005 7336659 7300549 7265334 7235263
6999 7235263 7204532 7171176 7141296 7115445 7084804 7047391 7014118 6989754 6961988 6922231 6884067
6988 6884067 6863686 6852169 6828246 6792654 6766221 6754320 6737875 6705503 6671683 6651769 6638058
6977 6638058 6614968 6582903 6551769 6523027 6494206 6471073 6458231 6445268 6419807 6388615 6367548
6966 6367548 6354652 6333269 6300862 6273365 6257325 6238885 6209105 6180868 6167122 6157455 6133278 6096881
6954 6096881 6067781 6054030 6043598 6024658 6000473 5980127 5964726 5948615 5928226 5904469 5879453
6943 5879453 5854978 5833220 5815805 5801301 5784821 5762705 5738920 5723205 5718050 5710835 5688049 5656602
6931 5656602 5638449 5639866 5639935 5619311 5587638 5567541 5561185 5552126 5535334 5523140 5519996 5513388 5496838
6918 5496838 5482074 5477656 5473379 5460007 5448751 5453228 5463867 5460425 5442630 5427603 5420977 5412331 5398858
6905 5398858 5390566 5386749 5369229 5330109 5288631 5266053 5256658 5239152 5207573 5174364 5147779 5123005
6893 5123005 5095757 5070437 5051010 5033802 5013870 4992011 4972111 4956402 4945652 4939591 4934888 4926651
6881 4926651 4914466 4903906 4899474 4897934 4891660 4878636 4866441 4863413 4866321 4862178 4845843 4829634 4826660
6868 4826660 4829262 4818394 4794498 4780650 4787405 4793209 4775227 4744246 4727460 4726716 4719430 4697034 4674460
6855 4674460 4658222 4633737 4595540 4563803 4552333 4541380 4506413 4459752 4436174 4442604 4448762 4429983
6843 4429983 4395966 4369130 4353100 4335347 4309880 4284047 4266498 4257556 4251206 4241841 4228790 4215488
6831 4215488 4203795 4190587 4172865 4154334 4141695 4134642 4124961 4106821 4083707 4063218 4047641 4031340
6819 4031340 4007306 3976740 3950757 3938196 3932014 3915408 3883484 3849113 3822546 3797637 3767591 3740992
6807 3740992 3726440 3712612 3684532 3652256 3638047 3636968 3618843 3575299 3536512 3527593 3533121 3524177
6795 3524177 3500614 3483363 3478654 3474366 3464130 3451986 3437200 3416054 3397134 3394122 3401926 3398801
6783 3398801 3375924 3348340 3331923 3324526 3316052 3304141 3292248 3281702 3272257 3263647 3252684 3235716
6771 3235716 3216221 3202193 3194327 3185356 3172416 3160154 3149710 3135743 3118074 3105037 3099895 3094131
6759 3094131 3080802 3065566 3057338 3055520 3053422 3048020 3039831 3028467 3014146 2999606 2986800 2975660
6747 2975660 2967010 2960491 2950197 2931953 2914479 2910180 2913419 2904210 2878259 2854749 2845119 2833920 2806338
6734 2806338 2777006 2769872 2781219 2785951 2773848 2756489 2741481 2723274 2700888 2683382 2672906 2660191
6722 2660191 2642219 2628638 2625109 2624641 2620662 2614983 2607647 2592890 2571473 2553617 2542928 2530449 2512048
6709 2512048 2498092 2496199 2496754 2487200 2470718 2458502 2451253 2440983 2426251 2414142 2409402 2410001 2411054
6696 2411054 2406907 2393180 2372478 2353859 2342029 2332899 2324111 2321323 2327139 2332292 2326546 2311497 2294763
6683 2294763 2279612 2268837 2268981 2278859 2282678 2268321 2245161 2229470 2219935 2205329 2190220 2190957 2206112
6670 2206112 2212716 2197441 2173549 2159763 2157763 2158371 2156001 2148254 2133529 2117892 2113165 2119348 2119949
6657 2119949 2104337 2083756 2073708 2070622 2060154 2041231 2025892 2018325 2009605 1994267 1978928 1970850
6645 1970850 1967847 1963959 1957596 1949681 1939492 1927291 1917205 1912414 1908697 1897209 1875171 1851385 1837804
6632 1837804 1835384 1832353 1819468 1802578 1793662 1792635 1787830 1774298 1760042 1750642 1739787 1722654 1707859
6619 1707859 1705197 1709328 1708072 1701225 1697535 1696338 1687398 1669732 1655957 1653507 1653812 1646572 1634715 1627167
6605 1627167 1624114 1618294 1606797 1593721 1583059 1575373 1570609 1568727 1567552 1564076 1558200 1551925 1544525
6592 1544525 1532090 1513724 1495908 1487202 1487876 1487773 1477659 1461320 1451469 1452904 1455949 1450378 1439796
6579 1439796 1434770 1435451 1430922 1416360 1401532 1398239 1405742 1413395 1413057 1403982 1388933 1371549 1357130
6566 1357130 1350773 1352204 1354338 1349604 1338178 1328016 1325004 1325146 1320585 1311910 1307241 1307758 1303423 1288640
6552 1288640 1273053 1267451 1266860 1260197 1250722 1250668 1257815 1255843 1240659 1227899 1227143 1226072 1211525 1191289
6538 1191289 1180258 1176519 1168211 1156554 1153661 1159964 1161159 1149699 1135694 1132363 1140188 1148820 1147758
6525 1147758 1133869 1114601 1103363 1105135 1108639 1100608 1084690 1075465 1076215 1076372 1071354 1069419 1074222 1075663
6511 1075663 1066444 1055005 1051101 1048905 1037633 1022053 1017804 1028273 1039358 1038696 1029458 1021765 1019074
6498 1019074 1018164 1016939 1016342 1016578 1015643 1011543 1003878 993875 984431 978915 976988 972026 957550 938917
6484 938917 932939 947811 966153 960450 928623 900920 902191 919562 922576 906103 892643 895408 902948
6471 902948 904435 906364 912823 910439 890177 867998 863613 870215 867139 854912 853656 868501 880354
6458 880354 874861 859735 846793 835934 826586 827773 842671 855273 847750 824589 806109 802252 805360
6445 805360 806911 808811 815435 823426 824574 815665 802150 792439 789520 789381 788322 788533 792030 792656 783191
6430 783191 769606 766437 774884 778517 768165 757901 763542 775626 771212 747812 727057 723871 729689
6417 729689 731302 730305 734202 740145 739649 732844 726994 724361 720887 715047 709964 707682 707984 711756 718921
6402 718921 723694 718759 705009 691651 685834 687153 692484 699887 705922 705389 697561 688532 683866 682379
6388 682379 680429 678582 679343 680606 676613 665711 653945 649989 656932 668147 671504 660863 644081
6375 644081 635242 637618 640614 636731 632942 637507 643446 637822 623476 616681 622654 628284 623271 614698
6361 614698 613715 619851 626598 631306 630688 618546 599461 592687 607003 622067 613763 590837 583892 600489
6347 600489 615526 609746 594109 586725 586781 585023 583192 586785 590794 588631 585924 589965 593302 583981
6333 583981 566672 557547 561391 569016 575071 582463 588877 584903 569811 556863 557622 569371 581162
6320 581162 584384 575707 558478 543713 541533 549147 554659 553726 553572 559008 564634 564551 560659 556896 553216
6305 553216 549665 548950 550802 550885 548780 549012 550744 546151 534676 528742 536704 548488 548666 538024 530981
6290 530981 534568 540911 540525 533833 527116 523621 521997 520323 518986 519877 523179 525892 525496 524277 526472
6275 526472 531565 535031 535548 535482 533794 526096 514143 507629 512295 522190 527564 525211 518404 512720 513838
6260 513838 522147 527981 521418 508580 506296 517095 523794 515662 504685 505159 511641 511268 505739 504898
6246 504898 507908 506875 501472 495082 485392 474321 476218 496629 513489 503159 477522 468943 483378
6233 483378 497047 497764 498167 504673 505559 498641 499961 512349 514884 499708 490607 504391 520108 512020
6219 512020 491481 487781 503764 519123 525647 530497 532958 526076 516993 519785 530276 531342 521181
6206 521181 514047 515036 516372 516839 522156 527327 522162 513823 519201 534244 537382 525931 520214 525623
6192 525623 521906 502032 490174 502191 517126 512886 504949 518032 538199 531248 501136 490557
6180 490557 517872 548161 543007 513496 501353 521786 549075 555535 543556 532993 532031 532966 530309
6167 530309 528932 532652 536607 537070 539585 548296 554753 549402 539233 539575 550075 554715 547333 540610
6153 540610 544282 550298 548822 545266 549459 558190 561325 558343 556953 559963 563957 567544 572151 577585
6139 577585 583682 592535 603194 609256 607825 605481 609381 618248 627231 634413 637450 633298 627786 634484
6125 634484 655391 674054 677996 675821 679701 684077 678575 670914 676805 693967 706586 711329 718794
6112 718794 731447 740373 744266 752807 768985 784699 796099 808123 822230 834319 845981 863595
6100 863595 885602 904432 920277 938924 958469 974122 992817 1025090 1065673 1101471 1134629 1175907
6088 1175907 1220080 1253844 1284250 1329543 1383556 1422332 1446652 1482007 1533848 1583060 1630883
6077 1630883 1702257 1794089 1871079 1930412 2016060 2145206 2281267 2413057 2591746 2840295
6067 2840295 3102918 3359044 3707637 4219679 4756410 5079696 5138165 5098482 5069945 4956041
6057 4956041 4655609 4269610 3976640 3787626 3566528 3256385 2947451 2721661 2552386 2387870
6047 2387870 2235431 2116527 2010788 1895883 1793520 1730187 1688381 1635997 1574382 1521818
6037 1521818 1474892 1420447 1365657 1324027 1287349 1240307 1189313 1150015 1118748 1082410 1045053
6026 1045053 1018195 994986 961844 928133 914647 915745 902663 866122 827644 803671 785794 765728
6014 765728 753279 753813 749785 725091 692835 677534 679392 677954 666205 658128 660634 659470 642108
6001 642108 618687 607410 608963 609074 601185 592479 587763 580536 564694 545711 533464 529321 526566
5988 526566 520368 511985 505290 503532 507329 511750 508234 494523 480078 475403 477655 474272 461016 448649
5974 448649 448655 458037 462652 453161 435115 424258 431566 450521 460630 448032 421683 403575 403550 410888
5960 410888 411468 404531 398459 397485 398854 398735 395383 389279 384000 383603 385960 383347 373720 365901 367566
5945 367566 372832 369854 358138 349520 351461 357248 355815 346290 338636 341454 351954 358748 354135 342141
5931 342141 332774 329924 329080 326211 322792 320807 319710 321118 328728 338806 339171 325413 310881 310705
5917 310705 321590 328717 327847 326789 327245 321381 309065 303092 310230 319524 318503 311158 309230 312592
5903 312592 309968 296620 281423 275988 282897 294716 300396 294003 280877 273299 276913 284569 286731
5890 286731 282817 277240 270381 261606 256313 259628 265858 265474 261306 264982 276187 279821 268891 256191
5876 256191 254350 257224 253716 248878 253970 262290 255558 234115 220302 226514 238771 241423 240766 249784
5862 249784 263325 266579 259710 255473 257282 258001 257545 262182 266778 258565 241604 235957 245735 249931
5848 249931 236444 223792 231907 249484 251749 237477 225157 221485 217811 212675 213472 217093 212182
5835 212182 201441 199422 206392 207350 200210 200362 210809 213476 200826 190874 196084 201814 194712 189604
5821 189604 203606 222234 219889 201437 193531 202052 208283 204721 204725 213723 218423 211557 203620 201747
5807 201747 198417 190337 188044 195722 200367 193761 187896 193879 201125 194868 182223 181642 193668 200965
5793 200965 194780 184886 182561 186870 190375 189049 184142 180322 182615 190402 195561 191458 181841 175994
5779 175994 177323 181680 184392 183679 179559 174857 175279 183131 192065 192627 182646 169472 162740 165747 171895
5764 171895 170339 159311 151598 159044 173698 176504 165370 159219 169154 182026 181942 172404 164615 159049
5750 159049 154232 159298 177998 192231 184517 167984 168667 183980 187282 172755 164858 176833 189394
5737 189394 183807 170859 169466 176203 175541 166230 158739 156339 155451 157158 163560 168881 167017 162072 160428
5722 160428 159479 155231 153028 158268 163990 160713 152201 148545 149952 150553 151670 156695 158739 149277 135033
5707 135033 130255 135389 139611 141594 149728 162145 165294 155398 144607 141848 143083 144782 151051 160900
5693 160900 163088 152103 137843 131896 134135 138680 142579 143066 137477 131861 137920 154888 166736 164800
5679 164800 159752 161678 162458 151564 137466 136483 147474 154077 148751 140289 139041 146449 157297 162002
5665 162002 150268 124239 104562 109996 132390 145411 137912 124688 122366 129073 133342 130798 124321
5652 124321 116746 111516 114202 125330 135583 135161 126179 120252 124105 131729 132147 123124 114948 118801
5638 118801 132335 141238 136827 126921 124950 133052 142191 145387 143511 140305 139257 143867 153401 159460
5624 159460 154751 144928 143698 155708 171706 180886 180552 173589 164671 159641 160380 159622 149305 134395
5610 134395 128476 134353 140106 137328 131946 131948 134963 134586 130485 125883 122267 121462 125056 127822 121594 110421
5594 110421 109970 124610 137518 133520 120026 113073 113721 113250 112567 118779 128058 130043 126608 128325 133051
5579 133051 126880 109529 100417 111517 128765 130981 117524 106254 109351 120630 125658 118473 107005
5566 107005 103026 107563 109677 101851 91030 88391 93596 97623 96559 92778 86893 80129 80194 90920
5552 90920 99868 92980 79063 79787 95047 101202 88702 76911 81061 89036 87351 87535 103881 122401
5538 122401 118734 96669 82357 85727 92865 94231 95372 98248 95218 86017 80873 82412 83259 84866
5524 84866 97810 117965 124797 112614 101531 104731 106857 92893 78631 88138 113832 125441 113015
5511 113015 95931 90004 89340 85103 81583 85118 92171 97028 100020 101157 96364 87054 83464 90625
5497 90625 99599 100387 95447 92086 89302 82518 75673 77250 86918 96125 100408 101813 100493 94364 87668
5482 87668 89157 98361 102834 94463 81450 77908 86308 96346 98034 90577 80310 74452 75752 80379
5468 80379 82756 83700 89224 98820 101900 92068 78419 73399 74486 70144 61443 62347 75703 84693 76735
5453 76735 63137 62616 74268 81198 76056 68034 65633 67147 70151 76657 83825 82135 70807 64754
5439 64754 75926 95037 103134 96615 88309 85608 81528 70671 61492 64584 76741 85759 86387 82611
5425 82611 77448 70654 65653 67655 72693 69681 58413 54319 66457 80929 79371 66480 62285 70286
5411 70286 73296 63609 56358 63173 71477 65565 53778 55191 68409 74594 67341 58771 56334 53858
5397 53858 48660 48149 53252 53163 45306 44202 59019 76092 77416 66129 59665 64814 73225 77138 77236
5382 77236 76945 78269 81313 81642 73004 58863 53395 62342 71702 67293 57007 58182 68904 70395
5368 70395 56818 44317 46922 58923 66890 66726 62582 58977 59864 67560 77610 81073 74791 63619
5354 63619 52652 45327 47569 61721 76064 74547 59966 52797 61917 72158 69192 61297 63747
5341 63747 74110 78075 71686 63174 58048 55634 56611 61834 66260 64493 59825 58719 60319 60607 61752
5326 61752 66815 70534 67222 62311 62655 61296 48840 35739 42135 64569 75015 59747 38668
5313 38668 34883 43454 45878 41128 43012 54533 64075 65052 63042 62573 60497 55018 49787 45611 38002
5298 38002 27235 22134 28262 38918 43560 40110 33447 26569 20332 18684 25306 34770 35604 25900
5284 25900 18862 26198 40616 44115 32911 23603 30212 44439 47826 38045 31338 39141 53780 61391
5270 61391 59899 57540 59611 64013 66569 64481 56955 48048 46027 53256 59360 52929 39113 35407
5256 35407 47584 60030 56048 39294 26583 25785 31284 37416 44018 49001 48401 47006 56431 76327
5242 76327 89190 83560 72368 75499 91438 101396 97484 90025 87200 84819 80038 78658 81737 79642
5228 79642 68397 58652 58103 57704 48002 37425 38882 46995 45942 34665 27245 30675 38057 42916
5214 42916 45634 45752 41398 36414 36065 37234 34911 34162 40667 44764 34241 18878 18785 30047 29442
5199 29442 15491 12982 27972 32856 14069 831 18823 44172 39433 14538 10571 33703 48634
5186 48634 37696 24797 30612 40263 33593 19553 18397 28369 32033 25017 19408 23302 31448 35156
5172 35156 32854 30946 36800 48491 53152 42548 27802 27136 40112 48463 43744 37493 39402 42746
5158 42746 40059 37203 40277 41905 33481 20585 13710 12684 12271 14521 22646 29687 26615 17153 13184
5143 13184 19293 30963 42439 47381 39242 22033 13240 23052 37377 35746 20454 11686 17278
5130 17278 25072 25442 23778 26377 28864 25433 18952 15493 16506 20648 26515 30628 29351 24559 20775
5115 20775 16762 9115 4434 15509 40835 59517 55047 36369 26005 31880 40368 36488 22745
5102 22745 14368 19476 29268 30188 22237 18052 23012 26049 17080 4842 5273 16927 22492 14625 5513
5087 5513 6493 11417 8398 -1404 -6518 -1776 6508 10376 8750 5873 5129 5940 6195 6632 10361 17195
5071 17195 22165 22186 19829 17417 13399 9100 10932 18788 21686 15327 13238 25316 35994 25305
5057 25305 4416 3381 24574 37740 26962 12594 14204 20128 12711 -532 -3794 -1177 -3397
5044 -3397 -2904 10841 24198 16504 -3710 -8940 4956 15566 12231 8268 11438 10855 1937 -1421
5030 -1421 8178 16376 10676 668 -99 3951 2924 2029 11245 23705 23381 10357 1504 6062 14484
5015 14484 14157 5706 -975 -645 2611 3104 2080 5346 12252 12985 2495 -7966 -3496 12315 20253
5000 20253 11738 -699 -3142 2424 7176 9782 12599 13394 10908 10881 16759 21452 18402 14270 19121
4985 19121 28598 28033 13017 -4336 -10088 -2139 10795 18205 15882 8350 2258 -2272 -7908 -8781
4971 -8781 4635 25595 31579 14477 -5000 -7073 -1675 -7614 -16632 -6124 18409 25293 4714
4958 4714 -14914 -9303 9099 16264 11677 8444 6209 -2484 -10256 -3777 10471 12415 -148 -7459
4944 -7459 1517 13363 12269 2197 -2912 124 3875 4573 6071 11790 19593 23940 19966 7944
4930 7944 -3974 -5772 2259 7893 2071 -8569 -10355 -892 8225 6573 -3665 -12718 -14434 -9883
4916 -9883 -3285 2290 5809 6877 4610 -911 -6154 -6178 -1086 2926 2227 1315 4493 6729 1944 -2990
4900 -2990 4346 20078 25332 15117 8933 20242 31078 17198 -11640 -21734 -3742 15330 13696
4887 13696 3000 2925 10226 11467 8959 11453 11174 -4560 -24752 -24276 -2775 11452 3054 -8439
4873 -8439 -673 17276 20737 6415 -6834 -8259 -5971 -7025 -5124 4810 13335 8810 -4051 -9483
4859 -9483 -2471 5268 2743 -6422 -12515 -13848 -13867 -10364 -151 7782 -736 -21152 -29010 -12427 7924
4844 7924 5836 -13564 -22638 -11753 307 -1826 -8571 -4626 6157 8183 -2419 -13915 -14938
4831 -14938 -5696 5149 9471 6778 4313 7513 11280 6999 -2826 -6966 -3785 -4901 -15379 -22647
4817 -22647 -14417 1925 9169 3528 -3058 -992 6009 7451 -2496 -19417 -31491 -30525 -21417 -15499
4803 -15499 -14334 -9424 317 3788 -3880 -11578 -9763 -4650 -4073 -2988 2747 1884 -14163 -29894 -24792
4788 -24792 -6571 -1124 -12640 -19728 -12658 -7603 -15918 -23759 -15945 -1171 2276 -7325 -18165 -24042
4774 -24042 -26594 -25852 -21507 -19003 -23572 -31364 -34790 -33537 -33240 -35947 -37504 -32541 -19709 -5590 -2955
4759 -2955 -17156 -33864 -31699 -10136 8046 7518 -798 -882 3235 -1662 -12895 -15957 -8838 -4821
4745 -4821 -11218 -20058 -21959 -17242 -10432 -3952 -1107 -6960 -21225 -35344 -40616 -36733 -30610 -29200
4731 -29200 -34424 -42804 -48512 -47124 -37387 -22048 -9252 -9324 -23496 -37774 -36723 -23323 -15294 -20484
4717 -20484 -27410 -23857 -13144 -6108 -7342 -14947 -23558 -23328 -8783 7143 4729 -10862 -11337 10066
4703 10066 21737 2092 -21364 -12873 12409 10744 -19745 -36917 -23832 -13317 -29891 -49990
4691 -49990 -44629 -27515 -28889 -44772 -46314 -27400 -11176 -12777 -22075 -25389 -23776 -24456 -27510 -26563
4677 -26563 -16532 512 14450 15966 8897 6033 9480 7189 -4758 -11697 -3925 4417 -2791 -15557
4663 -15557 -13196 260 1130 -15172 -26081 -18056 -7596 -14152 -29892 -32968 -20464 -10566 -14735
4650 -14735 -23346 -22719 -15042 -12923 -19677 -25598 -24424 -22833 -27571 -32294 -28007 -19736 -18290 -19669 -11491
4635 -11491 300 -5702 -30061 -43273 -27441 -4980 -4719 -18084 -16152 2213 10646 -666 -12499
4622 -12499 -11368 -8362 -14445 -21111 -18045 -11107 -9580 -10597 -9184 -11239 -22848 -35456 -34653 -19355
4608 -19355 -3204 -71 -13295 -34406 -48363 -45586 -32404 -24395 -28103 -36141 -40290 -39520 -34119 -23739
4594 -23739 -14313 -15038 -24137 -29023 -24924 -21136 -23540 -24165 -15890 -5539 -3007 -6842 -9476 -8855 -7573
4579 -7573 -7809 -12444 -23067 -33430 -34944 -30918 -32227 -36937 -31918 -18966 -17515 -32131 -40615 -28859
4565 -28859 -14530 -16945 -25401 -21551 -13651 -19752 -32052 -29680 -16609 -14160 -22417 -22664 -15040 -18852
4551 -18852 -34025 -37639 -25160 -20391 -33087 -39850 -23956 -4481 -4568 -15389 -15491 -6917 -7269 -18999
4537 -18999 -29631 -33591 -33804 -28949 -17408 -8022 -10400 -19318 -23029 -21539 -22650 -25496 -22717 -15173
4523 -15173 -10833 -11690 -13366 -14523 -16072 -15075 -9991 -7437 -13033 -20388 -20112 -14781 -13564 -17136 -19750
4508 -19750 -21059 -23327 -22599 -16596 -15760 -29817 -47034 -45730 -26610 -14573 -24100 -40118 -41145 -27334
4494 -27334 -15288 -14492 -19730 -22679 -22224 -22781 -26449 -29395 -27727 -25209 -28549 -34140 -29865 -14995 -5607
4479 -5607 -10785 -17197 -11837 -6188 -16969 -34236 -35193 -23419 -24008 -39886 -45604 -31508 -21375 -31492
4465 -31492 -42236 -31817 -13577 -13557 -28562 -34183 -23930 -14293 -16375 -25020 -32907 -36147 -29407 -13555
4451 -13555 -4108 -13766 -30600 -32756 -20905 -14783 -19921 -21970 -16026 -16421 -29636 -40098 -34749 -23054
4437 -23054 -19340 -21040 -19180 -17497 -24840 -37075 -42005 -37144 -29626 -22767 -15066 -9208 -9767 -13244 -11597
4422 -11597 -5760 -5716 -15714 -27859 -32591 -28836 -21641 -15726 -14297 -19520 -30110 -40071 -42633 -35987 -25104
4407 -25104 -17696 -17347 -20542 -22002 -22138 -25629 -32618 -36826 -34609 -30395 -29296 -29215 -25524 -19671 -17182 -19490
4391 -19490 -23389 -26936 -30516 -33172 -32882 -29725 -24770 -17640 -9678 -6778 -12607 -20713 -20847 -13117 -8405
4376 -8405 -13584 -23673 -30816 -33719 -34471 -32755 -28756 -26818 -30020 -34068 -32360 -25496 -20340 -20283 -21285
4361 -21285 -18319 -12003 -7600 -9499 -17537 -27551 -35199 -39652 -42963 -45869 -46517 -44442 -42812 -43973 -44958
4346 -44958 -40997 -32391 -24654 -22374 -25561 -30815 -33052 -27977 -17596 -11997 -19314 -33303 -37797 -26584
4332 -26584 -12555 -12068 -24991 -36656 -36808 -29639 -25439 -28513 -34752 -37102 -32265 -24499 -22449 -29428
4318 -29428 -38547 -41569 -40046 -41022 -43763 -40604 -32220 -30694 -41482 -52095 -47837 -32078 -20782 -21402
4304 -21402 -27847 -33497 -37568 -38712 -33742 -25256 -21329 -24559 -29365 -32247 -35876 -40059 -38481 -29637 -22254
4289 -22254 -23699 -30527 -36403 -41097 -44751 -42473 -34043 -30454 -38888 -47989 -41705 -23153 -10334 -11061
4275 -11061 -17489 -24040 -33541 -43539 -44236 -35768 -31683 -37991 -44221 -43787 -46523 -58154 -63734 -49889 -31157
4260 -31157 -31885 -48854 -55628 -42647 -29200 -31681 -41929 -45286 -41109 -34649 -25416 -16195 -18442 -33706
4246 -33706 -42975 -31949 -15693 -17504 -31525 -31227 -12949 -3671 -18806 -37634 -35490 -20612 -18817
4233 -18817 -33568 -43384 -35005 -19290 -12503 -17626 -28480 -39948 -48280 -49800 -44635 -36689 -28288 -20859
4219 -20859 -20168 -30948 -44978 -46231 -32269 -19216 -19322 -25472 -26810 -27334 -35203 -43324 -38644 -26519
4205 -26519 -26617 -43117 -56484 -50507 -32913 -21413 -21194 -25405 -28612 -29680 -27213 -21228 -16048 -15619 -19564
4190 -19564 -27135 -38239 -46631 -41941 -25704 -15549 -23388 -38444 -43817 -40797 -41413 -44362 -38005 -24667
4176 -24667 -20822 -30637 -38990 -36280 -31110 -30273 -25372 -12084 -5360 -17866 -35827 -35977 -18986 -6538
4162 -6538 -8965 -15102 -14336 -10811 -12184 -18806 -28452 -39758 -47190 -44139 -34717 -31141 -35604 -36868 -29724
4147 -29724 -24705 -30873 -41219 -45023 -43973 -44537 -43618 -35335 -25412 -24429 -30373 -31910 -27290 -26194 -32179
4132 -32179 -36422 -31900 -23131 -18310 -20442 -28510 -38661 -42608 -34670 -22475 -19929 -26924 -28740 -20275
4118 -20275 -16032 -26507 -38852 -35853 -23912 -23898 -38748 -48904 -41202 -26191 -21862 -32115 -46844
4105 -46844 -54473 -49825 -36753 -26334 -26578 -33078 -36515 -37050 -40051 -40082 -26696 -8488 -9870 -33877
4091 -33877 -49604 -34465 -10435 -13093 -37457 -46015 -27185 -11435 -21159 -36519 -30371 -12904 -14949
4078 -14949 -39787 -59178 -54543 -38162 -29837 -31964 -35728 -37765 -40234 -42690 -43611 -45536 -50662 -53707
4064 -53707 -46729 -31507 -21193 -26486 -42891 -55453 -55587 -48890 -44598 -42642 -37275 -30015 -29019 -34612
4050 -34612 -36135 -28227 -20743 -24526 -34920 -39130 -34566 -29453 -28891 -30745 -32970 -34980 -33886 -29353 -29149
4035 -29149 -38297 -46009 -38174 -21402 -16965 -28711 -36431 -28009 -18527 -24897 -38497 -40285 -31048 -27396
4021 -27396 -34483 -41421 -40940 -36648 -31409 -23918 -17688 -19311 -26030 -28180 -25897 -29662 -40632 -44909 -34742
4006 -34742 -23010 -26090 -40871 -50418 -47868 -42696 -43490 -45426 -40013 -30479 -28524 -35975 -39222 -28737
3992 -28737 -17062 -24267 -46889 -58035 -43970 -23374 -18444 -23639 -21926 -17845 -28158 -46702 -48780
3979 -48780 -31729 -21082 -28902 -35466 -26132 -18300 -30426 -47378 -43455 -24130 -16273 -25938 -34110
3966 -34110 -31087 -28170 -33343 -38649 -36853 -31856 -27610 -23117 -22172 -31409 -44152 -43332 -26996 -14643
3952 -14643 -19882 -32019 -35081 -31189 -31892 -36801 -35717 -26745 -19095 -19087 -23021 -24295 -21513 -19022 -22070
3937 -22070 -30592 -37667 -37512 -33921 -34604 -38443 -37733 -33148 -34307 -42208 -44363 -34433 -24348 -27027 -37209
3922 -37209 -40943 -36136 -31294 -29630 -27302 -24497 -26290 -32900 -38336 -38649 -34711 -28368 -22368 -21666 -28068
3907 -28068 -35764 -38132 -35933 -33478 -31641 -30865 -34757 -42722 -45967 -40523 -36758 -43894 -52702 -49212 -39456
3892 -39456 -40991 -51977 -51021 -31850 -16375 -23080 -40435 -45554 -36081 -28104 -30855 -38633 -43688 -44128
3878 -44128 -40673 -35878 -35459 -41519 -45846 -39000 -25812 -22253 -34461 -49202 -50583 -40790 -36696 -46746
3864 -46746 -59135 -57530 -43314 -33253 -35461 -38693 -31100 -19459 -18718 -28822 -35564 -32286 -26766 -25808
3850 -25808 -26610 -26653 -29412 -35373 -38745 -38051 -38882 -41413 -37881 -28873 -28021 -40767 -51999 -47564 -36116
3835 -36116 -34311 -40490 -40916 -34989 -34179 -38778 -36499 -26371 -24263 -37395 -49555 -42766 -22945 -11955
3821 -11955 -19411 -33335 -38242 -33985 -32681 -40243 -47457 -43298 -32967 -33033 -47259 -58664 -52474 -36748
3807 -36748 -29690 -34742 -41132 -42999 -43338 -42355 -36804 -29815 -27830 -29103 -28757 -32185 -46504 -60620 -54780
3792 -54780 -32372 -20074 -29594 -41308 -36397 -23618 -19201 -20308 -17951 -19263 -33310 -46947 -40840
3779 -40840 -23086 -20499 -37848 -51661 -47952 -41100 -46172 -54553 -51521 -41688 -39898 -46725 -49804 -44718
3765 -44718 -39562 -39970 -42734 -45606 -51495 -58605 -56522 -40291 -22374 -20424 -34235 -44827 -39335 -27395
3751 -27395 -25396 -31963 -31397 -19425 -11417 -20455 -38537 -47530 -41410 -29482 -22673 -24313 -30849 -35164
3737 -35164 -32463 -27486 -30397 -40456 -42306 -27308 -10027 -10633 -27089 -39984 -41444 -41835 -47376 -49532
3723 -49532 -42599 -35780 -38117 -43437 -41450 -35334 -36684 -47505 -57451 -57511 -49060 -39725 -34968 -33525 -29425
3708 -29425 -20411 -14015 -19622 -33721 -41285 -35614 -28159 -31746 -41457 -42017 -30268 -19692 -22228 -33838
3694 -33838 -41104 -37308 -28496 -24794 -28021 -30105 -25084 -19470 -24717 -40202 -51864 -50522 -43508 -42832
3680 -42832 -48544 -51131 -46012 -38162 -34292 -36134 -40031 -39499 -31072 -20802 -20200 -31564 -43348 -45634
3666 -45634 -42991 -43646 -43394 -33101 -18263 -15831 -29962 -44433 -44235 -33969 -28317 -32361 -38896 -40225
3652 -40225 -35729 -30098 -28636 -32521 -36518 -34451 -28512 -27889 -35127 -39982 -32799 -19344 -14219 -21299 -29364
3637 -29364 -28633 -23471 -23741 -29481 -32083 -28839 -27364 -32894 -38860 -36624 -29569 -28636 -35429 -39757 -35919
3622 -35919 -31792 -36238 -44981 -46425 -36976 -23919 -16460 -19510 -32028 -45113 -46579 -35333 -26443 -32231
3608 -32231 -42763 -37964 -17267 -2080 -6229 -19130 -25176 -25860 -30960 -37785 -34466 -20829 -11874 -18085
3594 -18085 -32432 -41393 -41686 -39895 -39624 -37028 -30317 -26878 -34388 -47020 -49218 -36404 -23978 -28178
3580 -28178 -43663 -50741 -42612 -32834 -33552 -38792 -36472 -27619 -23507 -28276 -34348 -34849 -32864 -35805 -44485
3565 -44485 -50926 -47099 -34503 -22758 -17943 -16328 -13183 -12532 -20238 -31179 -34672 -31972 -34975 -44687
3551 -44687 -45614 -29293 -10473 -8386 -21476 -33310 -36216 -35181 -33261 -28545 -24672 -29719 -41850 -48077
3537 -48077 -41908 -33009 -34118 -45225 -55933 -58740 -54924 -49762 -46040 -42290 -36072 -28316 -23063 -22588
3523 -22588 -25275 -28903 -32294 -33113 -29800 -27265 -32564 -41442 -39337 -22760 -9002 -13678 -28174 -33406
3509 -33406 -27830 -24495 -25956 -22929 -16844 -21253 -35878 -40742 -26328 -11117 -15291 -31603 -38888 -34178
3495 -34178 -33100 -42792 -51942 -49335 -38955 -32073 -32866 -36960 -39380 -38864 -35446 -27915 -16741 -8442 -11289
3480 -11289 -23122 -29270 -19977 -5362 -3119 -14740 -26335 -31112 -35600 -42230 -42974 -35648 -30016 -30034
3466 -30034 -26649 -17945 -18625 -35498 -50438 -46042 -33610 -33893 -42004 -37439 -22159 -19767 -36055 -47896
3452 -47896 -38627 -21071 -14901 -20733 -29011 -37814 -47221 -48644 -35756 -18739 -13646 -21341 -28280 -25506
3438 -25506 -17236 -11964 -13229 -19346 -26428 -30912 -32052 -31988 -32510 -33534 -34893 -36528 -36880 -34697 -31897 -30577
3422 -30577 -29115 -26732 -28553 -37605 -45135 -41030 -32512 -37153 -55082 -64962 -54270 -37124 -31164 -31981
3408 -31981 -25834 -16091 -18077 -33024 -45484 -46245 -42279 -41795 -42660 -40044 -35697 -34293 -36303 -38209 -36532
3393 -36532 -30530 -23761 -22410 -28970 -38853 -45480 -45848 -39534 -28344 -20114 -24169 -36857 -41351 -30925
3379 -30925 -21636 -28512 -39759 -34076 -16715 -13990 -31891 -46015 -40067 -29859 -34731 -45959 -43868
3366 -43868 -32045 -30723 -42457 -47806 -36303 -21712 -20328 -29378 -35670 -34933 -32700 -32146 -30612 -26288
3352 -26288 -21526 -19570 -22123 -29504 -39641 -47461 -48945 -45833 -42943 -40752 -35203 -26407 -21851 -26167
3338 -26167 -32362 -30744 -23755 -21891 -25250 -22125 -10544 -7110 -23299 -44234 -46751 -31873 -21548
3325 -21548 -25839 -32466 -30547 -25444 -24197 -24165 -24898 -34256 -50741 -55248 -35901 -9072 873 -7029 -16441
3310 -16441 -22058 -31088 -41579 -41832 -31904 -25404 -27123 -27751 -24480 -26970 -36258 -37714 -25669 -16923 -25832
3295 -25832 -41233 -44277 -36384 -31323 -29481 -20611 -6937 -2441 -9424 -14989 -13583 -15206 -25358 -32882
3281 -32882 -27292 -16504 -16347 -29171 -42058 -42558 -30117 -15449 -12732 -27487 -47802 -52979 -35805
3268 -35805 -11262 1492 -467 -7615 -15202 -26205 -39541 -46344 -41013 -29825 -24897 -31523 -42443
3255 -42443 -44263 -31456 -14664 -10641 -21539 -30599 -23977 -10210 -8518 -21842 -33398 -30240 -18872
3242 -18872 -13753 -19305 -28653 -34284 -34642 -33211 -34070 -36392 -33868 -23850 -15109 -18603 -31003 -37546 -33356
3227 -33356 -30408 -37614 -45296 -39559 -24529 -18330 -29284 -45802 -50418 -38338 -21956 -19063 -33852
3214 -33852 -49033 -43890 -22060 -10217 -23099 -42630 -43372 -27259 -16782 -21443 -30166 -33767 -34956
3201 -34956 -34529 -26461 -12303 -5000 -11509 -23532 -30846 -32486 -30526 -25053 -20207 -22910 -30597 -32454
3187 -32454 -27158 -25269 -29296 -28125 -18438 -13215 -18501 -21146 -13913 -12730 -29351 -45349 -38593 -21090
3173 -21090 -20840 -35219 -35348 -14840 -597 -9408 -24901 -29160 -29696 -38332 -45712 -37285 -19756 -11845
3159 -11845 -17746 -26055 -28552 -26362 -22770 -21103 -24547 -29509 -26494 -15845 -12499 -24225 -35922 -30189
3145 -30189 -14498 -10246 -20406 -27563 -23012 -18032 -22107 -27292 -22957 -13586 -11464 -18937 -27093 -28246
3131 -28246 -22680 -15312 -11233 -13422 -20405 -26351 -26561 -23235 -23446 -30003 -36176 -33000 -22379 -17766 -27062
3116 -27062 -39360 -37733 -23498 -15865 -24974 -38390 -41258 -37046 -36734 -38277 -32800 -24589 -26214 -34858
3102 -34858 -32398 -13833 776 -7890 -32367 -48949 -46904 -36080 -29176 -27555 -25985 -23251 -22891 -26162
3088 -26162 -29266 -28970 -27809 -29979 -33537 -31996 -24295 -17297 -16667 -21556 -30022 -41008 -47668 -40375 -23281
3073 -23281 -15087 -22393 -26206 -11391 3907 -7751 -37897 -50211 -33586 -16619 -21662 -33831 -30831
3060 -30831 -18418 -15403 -22033 -25579 -24863 -28172 -35535 -41189 -45791 -50022 -45782 -30933 -21957 -31838
3046 -31838 -45511 -40452 -23144 -18462 -28310 -30773 -19978 -15099 -24038 -29159 -20495 -14035 -21067 -25997
3032 -25997 -15309 -5491 -17272 -39629 -46301 -35847 -28129 -29120 -27001 -20077 -20997 -30925 -33965 -23334
3018 -23334 -12437 -12863 -19470 -24889 -31586 -40266 -41809 -31943 -21487 -20925 -25465 -26093 -25362 -30283 -37764
3003 -37764 -39434 -35257 -31225 -28596 -25772 -25814 -31469 -37033 -35739 -31104 -30334 -30932 -25856 -18176 -17134 -22092
2987 -22092 -24552 -24925 -31635 -42538 -43770 -31592 -20191 -21134 -28355 -30650 -26646 -20225 -13686 -12998 -25886
2972 -25886 -45099 -48340 -27816 -5745 -4790 -16494 -18501 -11440 -14210 -28898 -36872 -30046 -21417 -20416
2958 -20416 -20142 -15203 -11496 -11089 -7182 -1758 -7388 -21955 -24229 -8342 307 -16873 -38674 -34564
2944 -34564 -12242 -4952 -20300 -33169 -28094 -18165 -16484 -16519 -11770 -11753 -23161 -32627 -25710 -11849
2930 -11849 -12692 -30421 -43393 -34164 -10863 3227 -4143 -22811 -33778 -30063 -20246 -13193 -7735
2917 -7735 -1146 1673 -3705 -11354 -14203 -16816 -25887 -33892 -28798 -16968 -17285 -31448 -39678 -30792 -17865
2902 -17865 -16146 -22081 -24324 -21653 -19493 -19756 -22714 -28512 -31000 -22810 -11558 -14590 -30920 -38024
2888 -38024 -26572 -16506 -23872 -34559 -31495 -25850 -34296 -43999 -32739 -10916 -7695 -22088 -25229
2875 -25229 -11049 -6647 -24902 -42005 -35852 -17241 -7027 -7153 -10162 -14971 -17706 -8489 7028
2862 7028 5071 -19859 -38652 -28646 -8987 -9368 -23172 -22901 -8564 -5900 -21687 -34276 -30334
2849 -30334 -21653 -20138 -21567 -21254 -23353 -26700 -21623 -9278 -5435 -16267 -28085 -30362 -31101 -38271
2835 -38271 -43363 -37531 -29120 -29204 -31779 -25310 -14781 -14594 -25233 -33581 -33309 -29985 -27816 -25335 -23370
2820 -23370 -24494 -24989 -19479 -12824 -14544 -21551 -20816 -11327 -8460 -20821 -36047 -37994 -27728 -18557
2806 -18557 -18203 -24277 -30717 -30937 -21263 -8915 -9212 -25661 -40171 -34469 -15034 -3207 -5046 -7287
2792 -7287 -2370 408 -6705 -16480 -20081 -20953 -25229 -28894 -25940 -21034 -21744 -24267 -20235 -13988 -19014
2777 -19014 -37127 -53351 -53743 -39090 -19837 -6802 -7845 -23017 -39799 -42775 -31998 -22831 -23844
2764 -23844 -25679 -18583 -10319 -15199 -31514 -42404 -37757 -24703 -15135 -11561 -8883 -4731 -3378 -10237
2750 -10237 -24115 -35531 -34424 -20759 -5571 65 -4871 -13402 -19144 -20084 -17060 -12760 -10965 -13526
2736 -13526 -18506 -22903 -25593 -26175 -23569 -18099 -12926 -11159 -13160 -17803 -23948 -29634 -32573 -32321 -29333
2721 -29333 -22606 -12991 -7575 -13300 -25392 -30549 -24114 -15749 -15091 -20702 -26825 -30903 -29580 -18595
2707 -18595 -3572 680 -9653 -19619 -17685 -12844 -16871 -23176 -20489 -15530 -21149 -30921 -28997 -19397
2693 -19397 -20037 -29842 -29184 -15792 -12531 -30645 -49792 -47473 -28622 -12880 -8918 -13621 -21675 -24553
2679 -24553 -14416 441 -617 -20685 -36153 -30011 -16436 -16118 -24377 -24020 -16146 -15468 -23471 -27410
2665 -27410 -21216 -10146 45 3757 -6228 -25331 -32432 -17344 -2046 -12013 -36201 -42476 -26442
2652 -26442 -14504 -19227 -23552 -15562 -9046 -16966 -28952 -30160 -23883 -21114 -22867 -25521 -30312 -36005
2638 -36005 -34509 -24369 -17132 -20841 -28459 -30786 -28645 -24593 -16416 -7513 -8786 -19881 -23958 -13248
2624 -13248 -3886 -10603 -22439 -22195 -16221 -22242 -36547 -37660 -20048 -1925 1660 -5397 -13996 -21818
2610 -21818 -26734 -23192 -12373 -5265 -8714 -15666 -14739 -4591 5174 4591 -6432 -16823 -15181 -4030
2596 -4030 1654 -5741 -15179 -12999 -3293 -1440 -11674 -23314 -27618 -26588 -24631 -22110 -19267 -18161
2582 -18161 -18506 -17651 -15326 -13439 -12503 -13272 -18434 -26146 -26664 -14409 630 3918 -4208 -11129 -11504 -11917
2566 -11917 -16497 -20384 -19577 -16953 -15966 -16551 -18629 -22484 -25624 -25915 -25974 -27783 -27324 -22800 -21744 -28862
2550 -28862 -34311 -28521 -21113 -26848 -38982 -38198 -24241 -14823 -14753 -12708 -9311 -18277 -34150 -31707 -9295
2535 -9295 291 -19700 -40415 -32785 -13315 -13538 -28032 -29501 -18686 -19506 -33008 -35785 -23377 -18285
2521 -18285 -29822 -39135 -32996 -23279 -21484 -19506 -9071 1072 1008 -4943 -10389 -17982 -27442 -28775
2507 -28775 -19037 -10625 -11577 -12955 -7672 -5232 -12848 -17699 -6883 7440 4060 -14021 -24023 -17352
2493 -17352 -8007 -6787 -7642 -4829 -5568 -15718 -25836 -23661 -13011 -8052 -12183 -15166 -12371 -14068
2479 -14068 -27343 -38359 -27635 -1163 11327 -4423 -26155 -26326 -10346 -4258 -13912 -20989 -16804
2466 -16804 -13291 -16349 -14690 -5099 -3951 -18834 -30661 -22294 -5801 -971 -4287 -2680 -2160 -14647
2452 -14647 -27797 -19731 1163 3749 -17186 -31319 -19207 427 2086 -11759 -22159 -21133 -13114
2439 -13114 -3979 -1201 -11092 -25058 -23537 -4645 7745 -2239 -18160 -17711 -6644 -4556 -10461 -8491
2425 -8491 -71 -2876 -18740 -28322 -21793 -12613 -14112 -21723 -26804 -30797 -35093 -31302 -14359 4235
2411 4235 8364 -2716 -15083 -16896 -8427 705 366 -9715 -17135 -11315 -788 -4270 -22009 -31494
2397 -31494 -19853 -4812 -9005 -25559 -28205 -9613 10002 12222 891 -9901 -13560 -11295 -6206
2384 -6206 -2893 -4621 -7171 -3717 2146 -1047 -13658 -20814 -13834 -3666 -3346 -7991 -5254 2357 1261
2369 1261 -10429 -19386 -16880 -8394 -954 6016 12056 9909 -3018 -16049 -17844 -12234 -11956 -20035
2355 -20035 -27313 -27339 -23631 -20416 -15619 -7945 -3435 -7564 -15059 -15769 -9187 -4725 -6819 -8790 -5689
2340 -5689 -4453 -12959 -24888 -26872 -18655 -13699 -18029 -21460 -15717 -8839 -10905 -15030 -7103 10023
2326 10023 17694 7453 -7754 -11998 -4470 5692 12386 13523 7238 -4822 -15000 -16660 -10453
2313 -10453 68 13570 26932 31849 22212 2194 -17216 -26802 -22764 -8750 2503 -1668 -17391
2300 -17391 -25929 -18608 -9106 -10839 -14484 -4276 12907 16065 3723 -3778 2900 9528 4454 -4141
2286 -4141 -6924 -9458 -16411 -17795 -7608 -358 -9075 -19734 -11220 7621 7739 -14933 -31355 -22039
2272 -22039 -3115 1652 -6052 -9836 -6651 -5175 -5730 -1039 6624 6427 -2524 -8287 -4321 1659 1096
2257 1096 -3555 -5898 -6113 -7890 -10511 -10339 -6733 -1658 3397 6096 2762 -5851 -12004 -10336 -6744
2242 -6744 -10347 -18078 -16574 -1794 11826 8093 -9838 -22136 -15136 3879 15685 9407 -7895
2229 -7895 -20204 -18935 -9375 -1740 527 494 -773 -5263 -10451 -9191 -1241 2726 -4730 -15519 -16188
2214 -16188 -6378 2101 2160 -2448 -6915 -10777 -12399 -8365 -1264 1207 -1938 -3328 -704 -1342 -7720
$$ [...]
##END NTUPLES=NMR SPECTRUM
##END=
