##TITLE=1H ikalashn
CG-1214-A4
24.10.2024
##JCAMPDX= 6.0         $$ Bruker NMR JCAMP-DX V2.0
##DATA TYPE= NMR SPECTRUM
##DATA CLASS= NTUPLES
##ORIGIN= UXNMR, Bruker Analytische Messtechnik GmbH
##OWNER= root
$$ TOPSPIN		Version 1.3
$$ 2024-10-24 14:03:34.593 +0400  Irina@DPX200
$$ Compression mode = diff/dup
##.OBSERVE FREQUENCY= 200.131300845
##.OBSERVE NUCLEUS= ^1H
##.ACQUISITION MODE= SIMULTANEOUS
##.ACQUISITION SCHEME= undefined
##.AVERAGES= 64
##.DIGITISER RES= 18
##SPECTROMETER/DATA SYSTEM= spect
##.PULSE SEQUENCE= zg
##.SOLVENT NAME= CDCl3
##.SHIFT REFERENCE= INTERNAL, CDCl3, 1, 17.49637
##AUDIT TRAIL= $$ (NUMBER, WHEN, WHO, WHERE, WHAT)
$$ ##TITLE= Audit trail, TOPSPIN		Version 1.3
$$ ##JCAMPDX= 5.01
$$ ##ORIGIN= Bruker BioSpin GmbH
$$ ##OWNER= Irina
$$ $$ F:/spectra/data/iren/nmr/1H/4/pdata/1/auditp.txt
$$ ##AUDIT TRAIL=  $$ (NUMBER, WHEN, WHO, WHERE, VERSION, WHAT)
(   1,<2024-10-24 14:02:58.234 +0400>,<Irina>,<DPX200>,<TOPSPIN 1.3>,
      <created by zg
	started at 2024-10-24 13:58:44.968 +0400,
	POWCHK disabled, PULCHK disabled
       configuration hash MD5:
       BE 6D 3F 07 2A EA 11 49 91 17 2B D3 AF B3 58 0D
       data hash MD5: 16K
       F4 18 9B B8 57 8C A7 54 E5 D2 A2 B3 98 11 3C 8D>)
(   2,<2024-10-24 14:02:59.609 +0400>,<Irina>,<DPX200>,<TOPSPIN 1.3>,
      <Start of raw data processing
       efp BC_mod = 2 LB = 0.02 FT_mod = 6 PKNL = 1 PHC0 = -49.1772 PHC1 = 10.96906 SI = 32K 
       data hash MD5: 32K
       9B 42 48 8D 5F E1 74 C1 56 5C 0E 92 A3 2C 88 26>)
(   3,<2024-10-24 14:03:02.468 +0400>,<Irina>,<DPX200>,<TOPSPIN 1.3>,
      <apk 
       data hash MD5: 32K
       82 C9 E1 37 BA D1 2E 61 6A C2 D6 C2 58 D2 59 CE>)
(   4,<2024-10-24 14:03:04.765 +0400>,<Irina>,<DPX200>,<TOPSPIN 1.3>,
      <abs n ABSG = 5 
       data hash MD5: 32K
       FC 9D 9B 39 4C FA 76 36 5B 48 DF 95 97 A3 A8 1D>)
(   5,<2024-10-24 14:03:17.796 +0400>,<Irina>,<DPX200>,<TOPSPIN 1.3>,
      <pk fgphup PHC0 = 18.75 PHC1 = -28.8 
       data hash MD5: 32K
       CD 43 43 C9 7B C8 A6 C2 CA A7 43 E4 37 0B C8 24>)
(   6,<2024-10-24 14:03:19.437 +0400>,<Irina>,<DPX200>,<TOPSPIN 1.3>,
      <abs n ABSG = 5 
       data hash MD5: 32K
       7E F9 77 CA 54 D9 12 C7 94 A9 41 37 1F 3A 11 EC>)
$$ ##END=
$$ 
$$ $$ hash MD5
$$ $$ F8 75 E0 7D 12 C0 9A 4D B9 E1 10 C3 4A 92 74 6B
##$RELAX= 
##$RELAX= 
##$RELAX= 
##$RELAX= 
##$RELAX= 
##$RELAX= 
##$RELAX= 
##$RELAX= 
##$RELAX= 
$$ Bruker specific parameters
$$ --------------------------
##$DU= <F:/spectra>
##$EXPNO= 4
##$NAME= <1H>
##$PROCNO= 1
##$TYPE= <nmr>
##$USER= <iren>
##$AMP= (0..31)
100 100 100 100 100 100 100 100 100 100 100 100 100 100 100 100 100 100 
100 100 100 100 100 100 100 100 100 100 100 100 100 100 
##$ANAVPT= -1
##$AQSEQ= 0
##$AQ_mod= 1
##$AUNM= <au_zg>
##$AUTOPOS= <>
##$BF1= 200.13
##$BF2= 200.13
##$BF3= 200.13
##$BF4= 200.13
##$BF5= 200.13
##$BF6= 200.13
##$BF7= 200.13
##$BF8= 200.13
##$BYTORDA= 1
##$CFDGTYP= 0
##$CFRGTYP= 5
##$CHEMSTR= <none>
##$CNST= (0..63)
$$ [...]
##$SW_h= 4401.40845070422
##$TD= 16384
##$TD0= 1
##$TE= 300
##$TE2= 300
##$TE3= 300
##$TEG= 300
##$TL= (0..7)
0 120 120 120 120 120 120 120 
##$TP= (0..7)
150 150 150 150 150 150 150 150 
##$TP07= 0
##$TPNAME0= <>
##$TPNAME1= <>
##$TPNAME2= <>
##$TPNAME3= <>
##$TPNAME4= <>
##$TPNAME5= <>
##$TPNAME6= <>
##$TPNAME7= <>
##$TPOAL= (0..7)
0.5 0.5 0.5 0.5 0.5 0.5 0.5 0.5 
##$TPOFFS= (0..7)
0 0 0 0 0 0 0 0 
##$TUNHIN= 0
##$TUNHOUT= 0
##$TUNXOUT= 0
##$USERA1= <user>
##$USERA2= <user>
##$USERA3= <user>
##$USERA4= <user>
##$USERA5= <user>
##$V9= 5
##$VALIST= <valist>
##$VCLIST= <CCCCCCCCCCCCCCC>
##$VD= 0
##$VDLIST= <DDDDDDDDDDDDDDD>
##$VPLIST= <PPPPPPPPPPPPPPP>
##$VTLIST= <TTTTTTTTTTTTTTT>
##$WBST= 1024
##$WBSW= 25
##$XGAIN= (0..3)
0 0 0 0 
##$XL= 0
##$YL= 0
##$YMAX_a= 383526
##$YMIN_a= -921294
##$ZGOPTNS= <>
##$ZL1= 120
##$ZL2= 120
##$ZL3= 120
##$ZL4= 120
##$ABSF1= 17.49637
##$ABSF2= -4.496376
##$ABSG= 5
##$ABSL= 3
##$ALPHA= 0
##$AQORDER= 0
##$ASSFAC= 0
##$ASSFACI= 0
##$ASSFACX= 0
##$ASSWID= 0
##$AUNMP= <proc_1d>
##$AXLEFT= 0
##$AXRIGHT= 0
##$AXTYPE= 0
##$AXUNIT= <>
##$AZFE= 0.1
##$AZFW= 0.1
##$BCFW= 0
##$BC_mod= 2
##$BYTORDP= 0
##$COROFFS= 0
##$CY= 7568.61572265625
##$DATMOD= 1
##$DC= 0
##$DFILT= <>
##$DTYPP= 0
##$F1P= 17.9538593292236
##$F2P= -4.03888763876832
##$FCOR= 0.5
##$FTSIZE= 32768
##$FT_mod= 6
##$GAMMA= 0
##$GB= 0
##$INTBC= 0
##$INTSCL= 1.936888e-010
##$ISEN= 128
##$LB= 0.02
##$LEV0= 0
##$LPBIN= 0
##$MAXI= 945.577
##$MC2= 0
##$MEAN= 0
##$ME_mod= 0
##$MI= -402.1523
##$NCOEF= 0
##$NC_proc= -6
##$NLEV= 6
##$NOISF1= 8.587773
##$NOISF2= 6.764455
##$NSP= 0
##$NTH_PI= 0
##$NZP= 0
##$OFFSET= 17.49637
##$PC= 1
##$PHC0= -44.81844
##$PHC1= 23.12236
##$PH_mod= 1
##$PKNL= yes
##$PPARMOD= 0
##$PPDIAG= 0
##$PPIPTYP= 0
##$PPMPNUM= 100
##$PPRESOL= 1
##$PSCAL= 0
##$PSIGN= 0
##$REVERSE= no
##$SF= 200.13
##$SI= 32768
##$SIGF1= 16.12182
##$SIGF2= -4.496377
##$SINO= 3.521527
##$SIOLD= 32768
##$SREGLST= <1H.CDCl3>
##$SSB= 0
##$STSI= 32768
##$STSR= 0
##$SW_p= 4401.40845070422
##$SYMM= 0
##$S_DEV= 0
##$TDeff= 16384
##$TDoff= 0
##$TI= <>
##$TILT= no
##$TM1= 0
##$TM2= 0
##$TOPLEV= 0
##$USERP1= <user>
##$USERP2= <user>
##$USERP3= <user>
##$USERP4= <user>
##$USERP5= <user>
##$WDW= 1
##$XDIM= 32768
##$YMAX_p= 338329444
##$YMIN_p= -721169
$$ End of Bruker specific parameters
$$ ---------------------------------
##NTUPLES= NMR SPECTRUM
##VAR_NAME=  FREQUENCY,     SPECTRUM/REAL,   SPECTRUM/IMAG
##SYMBOL=    X,             R,               I
##VAR_TYPE=  INDEPENDENT,   DEPENDENT,       DEPENDENT
##VAR_FORM=  AFFN,          ASDF,            ASDF
##VAR_DIM=   32768,         32768,           32768
##UNITS=     HZ,            ARBITRARY UNITS, ARBITRARY UNITS
##FACTOR=    0.134324425510551, 1,           1
##FIRST=     4401.40845070422, 109531,       -768889
##LAST=      0,             330984,          -1833237
##MIN=       0,             -721169,         0
##MAX=       4401.40845070422, 338329444,    0
$$ Real data points
##PAGE= N=1
##DATA TABLE= (X++(R..R)), XYDATA
$$ [...]
13330E4772231J50596K65770L83216L86355L26715K83527L03993L94505M69741
13321E7736649M31400L62218M54407O71569P32692N50218L91269M29260M59874
13312F2219556L12864K09840L65683N38020M04601J49119J83827M55893N51873
13303F5391276L98167L11389L70201L01762O9837K3473K86421M98605M03682K51076
13293F8305889L29819M92435M73431L62665L98641N17279M66232K38181Q4027
13284G1668599J60012L81641N67854N79791M07078K29911K71087M98056O40921
13275G5404950N84284N09322N37419N12193L08393P6476l8269j49385l58338n04750
13265G6882295m69570m54743o32816p83085o57481m60899n21932o93136n87767
$$ plain form
13330 54772231 54922827 55188597 55571813 55958168 56284883 56568410 56872403 57266908 57736649
13321 57736649 58168049 58530267 58984674 59656243 60388935 60939153 61330422 61759682 62219556
13312 62219556 62532420 62742260 63107943 63645963 64050564 64199683 64383510 64839403 65391276
13303 65391276 65789443 66100832 66471033 66772795 66842632 66866105 67152526 67651131 68054813 68305889
13293 68305889 68635708 69128143 69601574 69964239 70362880 70880159 71346391 71584572 71668599
13284 71668599 71828611 72210252 72778106 73357897 73764975 73994886 74265973 74764029 75404950
13275 75404950 75989234 76498556 77035975 77548168 77856561 77933037 77894768 77745383 77387045 76882295
13265 76882295 76412725 75957982 75325166 74542081 73884600 73423701 72901769 72208633 71620866
13256G1620866k71851j62326k93302k72322r729J04043r6076k28805q047K85041
13246G0667492K97969J64323J93457L31900L36843K49086K87921M26139M48806
13237G3403936L46010L01843L40984L05567J70733Q4765P1046l1288k58306l98967
13227G4336323l07791j59117k28011n12015p31985o98579n44591n26120o71909
13218F9956205p62149o65782n39115n72841o76343o19405m17855l20996m08622
13209F4973097m74616l89346l08138l73187m49135l56733j82794j34339k19392
13200F2085417k90573l02932l18128l32902l06142k97144l88363n15442n42763
13191E8791028m66016l91408l67436l76809m25515m99699n17819m65316m66370
$$ plain form
13256 71620866 71349015 71186689 70893387 70621065 70611336 70715379 70619303 70390498 70382451 70667492
13246 70667492 70965461 71129784 71323241 71655141 71991984 72241070 72528991 72955130 73403936
13237 73403936 73749946 74051789 74392773 74698340 74869073 74953838 75024884 74993596 74735290 74336323
13227 74336323 74028532 73869415 73641404 73129389 72397404 71698825 71154234 70628114 69956205
13218 69956205 69194056 68528274 67989159 67416318 66739975 66120570 65702715 65381719 64973097
13209 64973097 64498481 64109135 63800997 63427810 62978675 62621942 62439148 62304809 62085417
13200 62085417 61794844 61491912 61173784 60840882 60534740 60237596 59849233 59333791 58791028
13191 58791028 58325012 57933604 57566168 57189359 56763844 56264145 55746326 55281010 54814640
13182E4814640n69212o07577m74208l64357m78986o39186n37693k73432k39264
13173E0630725m94954o63196n19008k93137k49367l06051k70633j69392j31620
13164D7533367j57212j87170k31342k76476k39643j37609j14668j89692j93538
13155D5806017q2025n9849k25260l48421k22006q47N4475l3083q6119j01447j63300
13144D4538135j89741p0950O3639J9832j20622j31820k1976K7857J6577Q1778
13134D4212709J68190R4867o8102n8040J24314J87079L8705o1350M3173J54618
13124D4836163R3245K906P4354K24246K76751K56272K76405L06571K63206J99002
13114D6809121K06712K45600K34557K17123K80682M00852M91966N22620M93405
$$ plain form
13182 54814640 54245428 53637851 53163643 52799286 52320300 51681114 51143421 50869989 50630725
13173 50630725 50135771 49472575 48953567 48660430 48411063 48105012 47834379 47664987 47533367
13164 47533367 47376155 47188985 46957643 46681167 46441524 46303915 46189247 45999555 45806017
13155 45806017 45723992 45664143 45438883 45090462 44868456 44867609 44922084 44889001 44802882 44701435 44538135
13144 44538135 44348394 44277444 44341083 44360915 44240293 44108473 44086497 44114354 44130931 44212709
13134 44212709 44380899 44475766 44407664 44349624 44473938 44661017 44699722 44638372 44681545 44836163
13124 44836163 44929408 44932314 45006668 45230914 45507665 45763937 46040342 46346913 46610119 46809121
13114 46809121 47015833 47261433 47495990 47713113 47993795 48394647 48886613 49409233 49902638
13105D9902638M23209M28485O40583R52660J062748Q97631P55363Q52428R88045
13096E6903790Q99612O97102O24372O01468L89991P5226l2432Q2228J28685J8910
13086F0388952j7944J16876K20532J78388J67565L13389M56529M46248L93100
13077F2663635M34405M86133M24828L02349J91343L6110j39248j07928K11175
13068F4502802M84903L64878K0199p3251J82602L84422K19754j34937l23699k74060
13058F5353613j84427j96233k52188k37949j43744o0921n2289n7269L1951J93005
13048F4393549K52544J00515j52535l17975l58389l68805l90414l70789k80237
13039F2507464j53168l3899K7169k8479j68523k35365j47033o7427k07512n07467
$$ plain form
13105 49902638 50325847 50754332 51394915 52347575 53410323 54307954 55063317 55915745 56903790
13096 56903790 57803402 58500504 59124876 59726344 60116335 60191561 60159129 60241357 60370042 60388952
13086 60388952 60371008 60487884 60708416 60886804 61054369 61367758 61824287 62270535 62663635
13077 62663635 63098040 63584173 64009001 64311350 64502693 64538803 64399555 64291627 64502802
13068 64502802 64987705 65352583 65372782 65299531 65482133 65866555 66086309 65951372 65627673 65353613
13058 65353613 65169186 64972953 64720765 64482816 64339072 64278151 64225862 64168593 64200544 64393549
13048 64393549 64646093 64746608 64594073 64276098 63917709 63548904 63158490 62787701 62507464
13039 62507464 62354296 62320397 62347566 62319087 62150564 61915199 61768166 61700739 61493227 60985760
13029F0985760p17025p68042q37555j018700j171648j181765j141587j154654
13021E2994784j157122j084558j038987j104219j137703r66443p03388o33677
13013D5168687q04130r45730q46585o18887n06151n55566o01771n19069l76829
13004C9393969l32061m31314n59582n74344m56661l13693k55409k99593l81407
12995C5789905m14369l51543k33099j64916k01263k67174k60442k01702j89531
12986C3505866k29492k34566j94141j90474k17511j55337J946O8195o4647k34933
12976C2054906k43074j39328r8954j25366r5694k8830o3912j83704j98651n1251
12966C0826142P3043K0335j17938j67619j15597p6931j03137j30039q4405K0457
$$ plain form
13029 60985760 60268735 59500693 58663138 57644438 56472790 55291025 54149438 52994784
13021 52994784 51837662 50753104 49714117 48609898 47472195 46505752 45802364 45168687
13013 45168687 44364557 43418827 42572242 41953355 41447204 40891638 40289867 39770798 39393969
13004 39393969 39061908 38630594 38071012 37496668 37040007 36726314 36470905 36171312 35789905
12995 35789905 35375536 35023993 34790894 34625978 34424715 34157541 33897099 33695397 33505866
12986 33505866 33276374 33041808 32847667 32657193 32439682 32284345 32286291 32354486 32289839 32054906
12976 32054906 31811832 31672504 31573550 31448184 31352490 31323660 31259748 31076044 30877393 30826142
12966 30826142 30899185 30919520 30801582 30633963 30518366 30441435 30338298 30208259 30123854 30144311
12956C0144311Q7457L1959r8025j40452k6852R2546N2029o4456m0151J23794J98766
12945C0360926R4575n771M0807J25641J20618R9800J52398J74138O3845l7188
12935C1189789M7973K13943K33927J44494J69752L10120L32764J88317J07582
12926C2938661K01119K79071K10150J61897K78933L84890K74165R9369J52963
12917C4981218L85383M74873L33978K15765K84406L88746L61098K77154K77932
12908C7980553L45507M06791M78259N52134N13636L47675K60713L90967N56024
12899D1832259N35306M53489N66477P73312P36052M72168L86749O09673P49773
12890D7115258N44049L31792N09848Q49648Q43877N34848M46832P32118R40277
$$ plain form
12956 30144311 30231768 30263727 30165702 30025250 29998398 30090944 30142973 30078517 30038366 30162160 30360926
12945 30360926 30455501 30449730 30490537 30616178 30736796 30836596 30988994 31163132 31226977 31189789
12935 31189789 31237762 31451705 31685632 31830126 31999878 32309998 32642762 32831079 32938661
12926 32938661 33139780 33418851 33629001 33790898 34069831 34454721 34728886 34828255 34981218
12917 34981218 35366601 35841474 36175452 36391217 36675623 37064369 37425467 37702621 37980553
12908 37980553 38326060 38732851 39211110 39763244 40276880 40624555 40885268 41276235 41832259
12899 41832259 42367565 42821054 43387531 44160843 44896895 45369063 45755812 46365485 47115258
12890 47115258 47659307 47991099 48500947 49350595 50194472 50729320 51176152 51908270 52848547
12881E2848547P59993M92493N32989P73231Q50840P20565O21211O37488O41232
12872E8878589N97403O18400P15051P46699O54271N48111N23908N47660N60935
12863F4391027N67186N73033N50883M99546M63849M67671M85060M87573M76179
12854F8962007M70253M90275N24185N06342M03362L24612M14781N99192O16042
12845G3311051M01020K40538L72917O25065O76852N29709M33703M65808M96686
12836G7553349N09195O11674P48423P36315O13960O16870P57973P88492O57764
12827H3594015O27273P81860Q25598N93989L89572M92190O65006N35391K10285
12818H8715179P4093J43565R0143j65465l43260l15177l05600m79115o87007p71541
$$ plain form
12881 52848547 53608540 54101033 54634022 55407253 56258093 56978658 57599869 58237357 58878589
12872 58878589 59475992 60094392 60809443 61556142 62210413 62758524 63282432 63830092 64391027
12863 64391027 64958213 65531246 66082129 66581675 67045524 67513195 67998255 68485828 68962007
12854 68962007 69432260 69922535 70446720 70953062 71356424 71681036 72095817 72695009 73311051
12845 73311051 73712071 73952609 74325526 74950591 75627443 76157152 76590855 77056663 77553349
12836 77553349 78062544 78674218 79422641 80158956 80772916 81389786 82147759 82936251 83594015
12827 83594015 84221288 85003148 85828746 86422735 86812307 87304497 87969503 88504894 88715179
12818 88715179 88789272 88932837 89022980 88857515 88514255 88199078 87893478 87414363 86727356 85955815
12808H5955815q23194r59543j086675j069657r67847r28808r76385j047630j128244
12799G6967832j217559j249705j174162j052132r76501r49832r16213q59620q05742
12790F7766366p70483p51182p29275o66784n55331m65239m67771n15640m96183
12781F2348478l95370k99969k49134k14515k15581k93354l64525k88496j13709
12772E9913825n9064j88481l08731k78631k04815k06662k08270j40265j41763
12763E8177143l28036n15916m48764j99686q2427k06939l79385m30476l94690
12754E5190824l42441k71809k25342l00990m59551n02491l44023j53185j14762
12745E2476230j79915j81307r5398m7274j03011j87268k04672j49695p8872l4340
$$ plain form
12808 85955815 85132621 84173078 83086403 82016746 81048899 80120091 79143706 78096076 76967832
12799 76967832 75750273 74500568 73326406 72274274 71297773 70347941 69431728 68572108 67766366
12790 67766366 66995883 66244701 65515426 64848642 64293311 63828072 63360301 62844661 62348478
12781 62348478 61953108 61653139 61404005 61189490 60973909 60680555 60316030 60027534 59913825
12772 59913825 59854761 59666280 59357549 59078918 58874103 58667441 58459171 58318906 58177143
12763 58177143 57849107 57333191 56884427 56684741 56602314 56395375 56015990 55585514 55190824
12754 55190824 54848383 54576574 54351232 54050242 53590691 53088200 52744177 52590992 52476230
12745 52476230 52296315 52115008 52019610 51972336 51869325 51682057 51477385 51327690 51248818 51214478
12735E1214478k1255l0565n3081o7372l6287N2167J43861J66720J32250J26608
12725E1627524J72176J78751R0000q574j7225K2706J3520l1415m0599m0453r4927
12714E1871484j35509m3115J15713J43299J9657o1775j7279J214r6726j49292
12704E1647671j2159J74639J90163N8118l8536m8305l5280K6248J86734L07721
12694E2457014J90979p2016j52612M8862K42679J67716n9174j72721j43820j21915
12684E2384992j27744n5506O4270N2170j30262k79830k29251p5337j7430p7890
12674E1508182j19486q0112m1169o2515q1514k6144O1496Q1962R670q7434j26035
12663E1036901o8335M8656J05398j0494k37316l37596j78620M4354K9250k04277
$$ plain form
12735 51214478 51193223 51162658 51109577 51042205 51005918 51058085 51201946 51368666 51500916 51627524
12725 51627524 51799700 51978451 52068451 52059877 52042652 52065358 52078878 52047463 52006864 51966411 51871484
12714 51871484 51735975 51692860 51808573 51951872 51971529 51909754 51892475 51893689 51796963 51647671
12704 51647671 51635512 51810151 52000314 52058432 52019896 51971591 51936311 51962559 52149293 52457014
12694 52457014 52647993 52575977 52423365 52472227 52714906 52882622 52823448 52650727 52506907 52384992
12684 52384992 52257248 52201742 52266012 52318182 52187920 51908090 51678839 51603502 51586072 51508182
12674 51508182 51388696 51308584 51267415 51204900 51123386 51097242 51158738 51240700 51250370 51162936 51036901
12663 51036901 50968566 51017222 51122620 51112126 50874810 50537214 50358594 50402948 50432198 50227921
12653E0227921l12221j12342J38669J06450j48859k83301j65521j0803j3889q8533
12643D9337571o5960L0684N4196k9052j13746j24851r2457o4060l4985J0890M4797
12632D8953027J3383q7673j77135j59249n3597n848j02927k21918j76156M625
12622D7986532R0539k0784j58718j47394n5212l4088n2168J1100R5016K6979j54341
12611D7587461j92816R638K26305K19895N0690n8226k7464N0452R0774P9950K3434
12600D8060093m1963l3144P0882J59168J33599N6578L4056K9129n0743j43982
12590D8273673j04569M3214J21816P8213L7197M7819L324j12084j32073L370Q6478
12579D8346378m4434k13526j61668M4237J20555Q056p5260q438P8650P1741M5017
$$ plain form
12653 50227921 49915700 49803358 49942027 50048477 49899618 49616317 49450796 49439993 49426104 49337571
12643 49337571 49271611 49302295 49356491 49327439 49213693 49088842 48996385 48932325 48897340 48908230 48953027
12632 48953027 48966410 48878737 48701602 48542353 48488756 48482908 48379981 48158063 47981907 47986532
12622 47986532 48077071 48056287 47897569 47750175 47694963 47660875 47608707 47619807 47714823 47741802 47587461
12611 47587461 47394645 47404283 47630588 47850483 47901173 47842947 47815483 47865935 47956709 48036659 48060093
12600 48060093 48018130 47984986 48055868 48215036 48348635 48405213 48439269 48468398 48417655 48273673
12590 48273673 48169104 48212318 48334134 48412347 48449544 48497363 48500687 48388603 48256530 48259900 48346378
12579 48346378 48301944 48088418 47926750 47970987 48091542 48099598 48024338 48015900 48094550 48166291 48211308
12568D8211308P5851R6469M9896K1719Q3415J44785J02899K5082L8468J24532
12558D8974424J68145J45351J18449R2280K3525m8656k7751P3339J18559L7057
12548D9674722p5421r0243p205O8438O3606N793k7302K259N4818O6746L7378K8604
12536D9802193O3858Q2178L9635L694O6690J91499K36801J45503K7361K2265J37939
12525E0819616K60057K86084K15289J28760J08232J65051K33579K40185J83173
12516E2640026J34666J58703K36499K83886K48010J77585J69943K40188K89795
12507E4579301K48211J94650K49881L74051L98287K78090J79907K43878L78004
12498E7124260L98434K92633K15783K65230L76457M34582L98394L14514K71898
$$ plain form
12568 48211308 48287159 48383628 48433524 48455243 48538658 48683443 48786342 48811424 48849892 48974424
12558 48974424 49142569 49287920 49406369 49498649 49522174 49473518 49445767 49519106 49637665 49674722
12548 49674722 49599301 49509058 49501853 49570291 49633897 49639690 49612388 49614647 49669465 49736211 49773589 49802193
12536 49802193 49866051 49948229 49987864 49991558 50058248 50249747 50486548 50632051 50659412 50681677 50819616
12525 50819616 51079673 51365757 51581046 51709806 51818038 51983089 52216668 52456853 52640026
12516 52640026 52774692 52933395 53169894 53453780 53701790 53879375 54049318 54289506 54579301
12507 54579301 54827512 55022162 55272043 55646094 56044381 56322471 56502378 56746256 57124260
12498 57124260 57522694 57815327 58031110 58296340 58672797 59107379 59505773 59820287 60092185
12489F0092185L30296M46164M99835M37824L35505K75028K43200K16217K44263
12480F3120517L50102M39856M36914M12409M47090M67434L90760L32780M53410
12471F6851272O64532P32482O36184N72739O21829O73004O96150P93166R32672
12462G3174030R36835Q22476Q47727J086943J267827J210427J123991J233142
12454H1703398J394342J376590J277508J319784J426045J367905J200923J155732
12446I2222227J173732R68280N52049K93509L59913M71956L64189J74184J68894
12437I6748933L24686M15611L74818L49884M57327O37677P40767O81370N31955
12428A01263028M72931N91192P48476P54953O41818O04751O93275P59995P43869
$$ plain form
12489 60092185 60422481 60868645 61368480 61806304 62141809 62416837 62660037 62876254 63120517
12480 63120517 63470619 63910475 64347389 64759798 65206888 65674322 66065082 66397862 66851272
12471 66851272 67515804 68248286 68884470 69457209 70079038 70752042 71448192 72241358 73174030
12462 73174030 74110865 74933341 75781068 76868011 78135838 79346265 80470256 81703398
12454 81703398 83097740 84474330 85751838 87071622 88497667 89865572 91066495 92222227
12446 92222227 93395959 94364239 94916288 95209797 95569710 96041666 96405855 96580039 96748933
12437 96748933 97073619 97489230 97864048 98213932 98671259 99308936 100049703 100731073 101263028
12428 101263028 101735959 102327151 103075627 103830580 104472398 105077149 105770424 106530419 107274288
12419A07274288P74060R08852R95465R24900Q30075Q60334R20621Q30940O26439
12410A14945974M91163M66665M33187L51924L27666M05139M63799L80447J96717
12401A18462681N6430K5977L3382k2375j36508k01072j46782l9386R225j1691
12391A18029881k2183K0071Q6270J48445J93093J87484J31902J08099J58056J69457
12381A19210575L5730j35904j81071j78191l18680n12320m69562k13368j11989
12372A17125220k77167l56091j53693k9476l08317o72478o26943l06635k65368
12363A14129052n95846q37054p52823o42759p58821r07833q49400o97410o73942
12354A07413164p51987p77051p24467o42096n26859m13010l94663m32542l46059
$$ plain form
12419 107274288 108048348 108957200 109952665 110877565 111707640 112567974 113488595 114319535 114945974
12410 114945974 115437137 115903802 116336989 116688913 117016579 117421718 117885517 118265964 118462681
12401 118462681 118519111 118545088 118578470 118556095 118419587 118218515 118071733 118032347 118041572 118029881
12391 118029881 118007698 118027769 118114039 118262484 118455577 118643061 118774963 118883062 119041118 119210575
12381 119210575 119246305 119110401 118929330 118751139 118432459 117920139 117450577 117237209 117125220
12372 117125220 116848053 116491962 116338269 116308793 116000476 115327998 114701055 114394420 114129052
12363 114129052 113533206 112696152 111943329 111300570 110541749 109633916 108784516 108087106 107413164
12354 107413164 106661177 105884126 105159659 104517563 103990704 103577694 103183031 102750489 102404430
12345A02404430j20934P820q0965k01590k01825k29169m34340o64092p25776p36314
12335I9017245q90080j061680j000885q02210p92125r92515j084997r39698q06868
12326I0646187q78211r94589r61216q72494r00748r75738r33329q44833r14395
12317H2370634j094907j090831q02738n27513n67380q05833q79236o89450n01336
12308G5411410n12804n83397n18220l98043m01600m54727l46564j23733m9031
12299G2023291j59502j91654k1339J48373J79019K59882N67747R36561J113189
12290G4855567J097993R59265N57759j88916r52812j307354j296773j317060j502486
12281G0905183j623902j557413j433269j298657j052724p82428p41592q84554
$$ plain form
12345 102404430 102283496 102291316 102210351 102008761 101806936 101577767 101143427 100479335 99753559 99017245
12335 99017245 98127165 97065485 96064600 95262390 94470265 93477750 92392753 91453055 90646187
12326 90646187 89767976 88773387 87812171 86939677 86038929 85063191 84129862 83285029 82370634
12317 82370634 81275727 80184896 79382158 78854645 78287265 77481432 76602196 75912746 75411410
12308 75411410 74898606 74315209 73796989 73398946 72997346 72542619 72196055 72072322 72023291
12299 72023291 71863789 71672135 71650796 71799169 71978188 72238070 72805817 73742378 74855567
12290 74855567 75953560 76912825 77470584 77281668 76328856 75021502 73724729 72407669 70905183
12281 70905183 69281281 67723868 66290599 64991942 63939218 63156790 62415198 61530644
12273F1530644q43198n27402l19967m49508n93871m20451j40047j31372l17617
12264E7787211l51450k00434j02385r2772k4982M0548p8589k62962k09287K7895
12254E6532793P6106j18418j72310P9905K87535J80349L4074K05973N53767P15618
12244E8375392P13494Q38396J092486J209541J183637J312067J629154J708042
12236F8062209J221065M03054k66196o29744q74168j136237j345851j411932j349264
12227F2672936j203550r96343p70962n93556m88509m36227m23147m29904m03003
12218E6927735l22658k66014l03120l60150l07749j70363j04641j56138j90965
12209E4745937j17252k3936j9744p0634r7179j09129j28686r9600p108K7146o7511
$$ plain form
12273 61530644 60687446 60160044 59840077 59390569 58796698 58376247 58236200 58104828 57787211
12264 57787211 57435761 57235327 57132942 57040170 57015188 57055736 56977147 56714185 56504898 56532793
12254 56532793 56608899 56490481 56318171 56398076 56685611 56865960 56900034 57106007 57659774 58375392
12244 58375392 59088886 59927282 61019768 62229309 63412946 64725013 66354167 68062209
12236 68062209 69283274 69686328 69420132 68790388 67916220 66779983 65434132 64022200 62672936
12227 62672936 61469386 60473043 59702081 59108525 58620016 58183789 57760642 57330738 56927735
12218 56927735 56605077 56339063 56035943 55675793 55368044 55197681 55093040 54936902 54745937
12209 54745937 54628685 54604749 54585005 54514371 54417192 54308063 54179377 54079777 54072669 54099815 54032304
12198E4032304j32946J1703K63184L55185K43771J36491J50492J96234K27036
12189E5483454L33312N06062N65933M53434L51707L69205L33098R0046k04065
12180E8282186l28679l45559m32871n27210m40508k35400j55334k19093k11613
12171E5385919q5349m2250j56203k32335j54505p6280j09586j00009P4681K19205
12161E4723288J05128j21612j18751J39956L27937K54222J18894J80904L75286
12152E5985252M31075K74786J31858K05871L96624M45050K99071J81433K59370
12143E8610390M06147M17430L37811L70648N24537N90466M86278L88192M49754
12134F2581653O02035P24527Q11501Q64006Q27857P67061Q75328J151828J300220
$$ plain form
12198 54032304 53899358 53911061 54174245 54529430 54773201 54909692 55060184 55256418 55483454
12189 55483454 55816766 56322828 56888761 57342195 57693902 58063107 58396205 58486251 58282186
12180 58282186 57953507 57607948 57175077 56647867 56207359 55971959 55816625 55597532 55385919
12171 55385919 55300570 55258320 55102117 54869782 54715277 54638997 54529411 54429402 54504083 54723288
12161 54723288 54828416 54706804 54588053 54728009 55055946 55310168 55429062 55609966 55985252
12152 55985252 56416327 56691113 56822971 57028842 57425466 57870516 58169587 58351020 58610390
12143 58610390 59016537 59433967 59771778 60142426 60666963 61257429 61743707 62131899 62581653
12134 62581653 63183688 63908215 64719716 65583722 66411579 67178640 68053968 69205796 70506016
12125G0506016J160953J002773J106248J286096J187585Q78854P16225P20392
12117G8565142N70425K21516K7214J31524K16108O1178p6124O9920L04512L24412
12107H0415827K35974L22684N15143N16201L24860K20387K79382K95260J74525
12098H3300243N9507L1063J6993L5564K05110M45736M95623L26952K31765L56292
12088H5504848M57143L08800P0087J212M6107k4292k13082l21394k71455j55314
12078H5402660l6346O6075O3560r2259k40577j98358q6683k05575n66578q19141
12068H3286778p23800m62499l49855m24773m90455m33353l29230k83344l06120
12059G9483349l49497l84969m32614n42706p39818r72390j140299j184998j142469
$$ plain form
12125 70506016 71666969 72669742 73775990 75062086 76249671 77128525 77844750 78565142
12117 78565142 79135567 79357083 79384297 79515821 79731929 79793107 79716983 79786903 80091415 80415827
12107 80415827 80651801 80974485 81489628 82005829 82330689 82551076 82830458 83125718 83300243
12098 83300243 83359750 83390813 83407806 83443370 83648480 84094216 84589839 84916791 85148556 85504848
12088 85504848 85961991 86270791 86340878 86342090 86388197 86363905 86150823 85829429 85557974 85402660
12078 85402660 85366314 85432389 85495949 85403690 85163113 84964755 84878072 84672497 84105919 83286778
12068 83286778 82562978 82100479 81750624 81325851 80835396 80402043 80072813 79789469 79483349
12059 79483349 79133852 78748883 78316269 77773563 77033745 76061355 74921056 73736058 72593589
12050G2593589j116776j203134j387466j507620j405448j163216j058728j185033
12042F2566168j271789j066641p45055o66839q19343q48854o40665m84750n63699
12033E5458533o53152n35556l81409m36101n85613n62776m07887l80506n15191
12024E1000342n96583n33630m54310m31349l88326l04413k74221l24406l65940
12015D7327164l51648l09385k29675j03371l8351j27072k34186j60891P465L922
12005D5783972j69008k16423l9987Q8333k9151k16477k51656k04303k19367k18118
11995D4307815q7637K7806p5989k98798l61347k31847j56933k76496m43116m65719
11985D1937739l59005k83073l27214m07311l68231j96742r0647k11338m07949
$$ plain form
12050 72593589 71476813 70273679 68886213 67378593 65973145 64809929 63751201 62566168
12042 62566168 61294379 60227738 59482683 58815844 57996501 57147647 56506982 56022232 55458533
12033 55458533 54805381 54269825 53888416 53452315 52866702 52303926 51896039 51515533 51000342
12024 51000342 50403759 49870129 49415819 48984470 48596144 48291731 48017510 47693104 47327164
12015 47327164 46975516 46666131 46436456 46333085 46294734 46167662 45933476 45772585 45780050 45783972
12005 45783972 45614964 45398541 45358554 45446887 45417736 45201259 44949603 44745300 44525933 44307815
11995 44307815 44220178 44247984 44171995 43873197 43511850 43280003 43123070 42846574 42403458 41937739
11985 41937739 41578734 41295661 40968447 40561136 40192905 39996163 39905516 39694178 39286229
11976C9286229l87042j63757p0087k27555l33746j71260n917j56893m30343l96113
11966C6943516p7792Q3473q6088k83411k56664j38336j18157j29277n5262J2451
11956C5894453n5893j74000j60563j7984P4586M383j45224j95750o7207J16212
11946C5273013J44101j2506j32579m2112J25396J26727k7652j18601o1446L2016
11936C5306357R6081J62218J79927N2739j25615j30548N6867K17057K32746K10971
11926C6258800K24494J99463J24935J13011J78239K08303K08680L04539M50596
11917C8271060M48230L17850L15749M87206N66529M50666L91024N42151P00619
11908D2491084O97589O76119P58721Q24523Q48807J047459J424256J634962J608257
$$ plain form
11976 39286229 38899187 38735430 38665343 38437788 38104042 37932782 37926865 37769972 37339629 36943516
11966 36943516 36865724 36949197 36863109 36579698 36323034 36184698 36066541 35937264 35882002 35894453
11956 35894453 35838560 35664560 35503997 35486013 35560599 35564982 35419758 35224008 35156801 35273013
11946 35273013 35417114 35404608 35272029 35229917 35355313 35482040 35454388 35335787 35274341 35306357
11936 35306357 35402438 35564656 35744583 35797322 35671707 35541159 35598026 35815083 36047829 36258800
11926 36258800 36483294 36682757 36807692 36920703 37098942 37307245 37515925 37820464 38271060
11917 38271060 38719290 39037140 39352889 39840095 40406624 40857290 41248314 41790465 42491084
11908 42491084 43188673 43864792 44623513 45448036 46296843 47344302 48768558 50403520 52011777
11899E2011777J786265K366029K887442L087044L489608M355930M640809L133712
11891G7758616M08516j555767j811344j429724j760145k696067l223204k923216
11883F2767665k235434j664433j350211j215561j102249q80436o46452o15832
11875E3057057p06221n62895j42729J34711K5159j72630j37698J0397O5935J31654
11865E1702740L08668L86652K34942J46350L77156O70885O76334N39592O12005
11856E5655324Q27075Q64995P45157P60036R44994J070794J073649J082815J108024
11847F4132863J075791J074652J204620J306805J199386J028628J011677J018627
11839G3053049Q33766O30578O91548Q34308O81261L73707L96939P43949R06286
$$ plain form
11899 52011777 53798042 56164071 59051513 62138557 65628165 69984095 74624904 77758616
11891 77758616 78167132 76611365 74800021 73370297 71610152 68914085 65690881 62767665
11883 62767665 60532231 58867798 57517587 56302026 55199777 54319341 53672889 53057057
11875 53057057 52350836 51787941 51645212 51779923 51805082 51632452 51494754 51505151 51571086 51702740
11865 51702740 52011408 52398060 52633002 52779352 53156508 53827393 54503727 55043319 55655324
11856 55655324 56482399 57347394 58092551 58852587 59797581 60868375 61942024 63024839 64132863
11847 64132863 65208654 66283306 67487926 68794731 69994117 71022745 72034422 73053049
11839 73053049 73886815 74517393 75208941 76043249 76724510 77098217 77495156 78239105 79145391
11830G9145391P37762O67583R16951J141411J088023J034619J268431J607069
11822H7607240J766330J812920J938949K112432K230365K337379K463804K511955
11814A04781374K475389K485207K508036K333353J979044J712473J529082J069044
11806A20873002K53757m83297q72338j220068j806464k355258k532391k536845
11798A09320098k711625k937897k925701k788744k803060k862634k706233k453936
11790H7130268k384651k387479k179588j884693j826791j903335j757863j459432
11782G1346436j385889j497107j380260j026987q96728j109046j224425j007438
11774F1818556p91560q34786q83826o98790n06533n58137o54596n12159k69873
$$ plain form
11830 79145391 79883153 80550736 81467687 82609098 83697121 84731740 86000171 87607240
11822 87607240 89373570 91186490 93125439 95237871 97468236 99805615 102269419 104781374
11814 104781374 107256763 109741970 112250006 114583359 116562403 118274876 119803958 120873002
11806 120873002 121126759 120643462 119771124 118551056 116744592 114389334 111856943 109320098
11798 109320098 106608473 103670576 100744875 97956131 95153071 92290437 89584204 87130268
11790 87130268 84745617 82358138 80178550 78293857 76467066 74563731 72805868 71346436
11782 71346436 69960547 68463440 67083180 66056193 65159465 64050419 62825994 61818556
11774 61818556 61026996 60192210 59308384 58609594 58103061 57544924 56890328 56378169 56108296
11765E6108296k36362l79175m37031l57824k92204k81761k36574j33628k8759
11756E3724978M0558K9920r6079k18883j35331J10901K05647K0717j65163r0228
11746E3427037J08627J70305J17974J19263J48803Q9994J3603N6496J40720R6820
11736E4489642k3223k4588J03071J84617J45809Q4014P5645Q9999P8803K9314
11726E5233103l3114k6703J03475K37536J88747J7022q272J50158K06751O0313
11716E6129016J6788K40867L82112J45265j27955L2822M13986M28073P8039n9506
11706E7679507K01497L89863K06094j8087M9094J94632J02564q4793m7729J63259
11696E8835901K47470J34420R490j9106k963J2748K0925j2767q7760j21999q4245
$$ plain form
11765 56108296 55871934 55492759 55055728 54697904 54405700 54123939 53887365 53753737 53724978
11756 53724978 53765536 53795456 53699377 53480494 53345163 53456064 53661711 53682428 53517265 53427037
11746 53427037 53535664 53705969 53823943 53943206 54092009 54182003 54195606 54252102 54392822 54489642
11736 54489642 54466419 54441831 54544902 54729519 54875328 54959342 55034987 55124986 55203789 55233103
11726 55233103 55199989 55173286 55276761 55514297 55703044 55720066 55711794 55861952 56068703 56129016
11716 56129016 56145804 56386671 56768783 56914048 56786093 56818915 57232901 57660974 57739013 57679507
11706 57679507 57881004 58270867 58476961 58458874 58507968 58702600 58805164 58720371 58672642 58835901
11696 58835901 59083371 59217791 59227281 59208175 59205212 59217960 59238885 59226118 59138358 59016359 58932114
11685E8932114o2794j04881j29621r8298j03531j80982k19449j82500k13326l64684
11675E7272048m40219l03558j44551j97103l56053l45057j57480n4581j67008
11666E5106438l39155l75457k62144j27732r7206j79428k41939j60315k0635k9611
11656E3272816j77940k13487n5133L6835j04690k32211q7347J26550N5072k05915
11646E2414550k57425n2378O0277n5214j33052k0130N7433p4158k08025j05483
11636E1626395J07073J54028K5857p3998o7285o1152j41852k78973l95009m30135
11626E0464949l93853m00136n48830p42790p80164o71061o54002q09822r00264
11617D4564027p50574n58693n91213p61295p93084o77812o50457p63503q04210
$$ plain form
11685 58932114 58869320 58764439 58634818 58536520 58432989 58252007 58032558 57850058 57636732 57272048
11675 57272048 56831829 56528271 56383720 56186617 55830564 55485507 55328027 55273446 55106438
11666 55106438 54767283 54391826 54129682 54001950 53904744 53725316 53483377 53323062 53302427 53272816
11656 53272816 53094876 52881389 52826256 52863091 52758401 52526190 52438843 52565393 52620465 52414550
11646 52414550 52157125 52104747 52165024 52109810 51976758 51956628 52014061 51939903 51731878 51626395
11636 51626395 51733468 51887496 51913353 51839355 51772070 51710918 51569066 51290093 50895084 50464949
11626 50464949 50071096 49670960 49122130 48379340 47599176 46928115 46274113 45464291 44564027
11617 44564027 43813453 43254760 42663547 41902252 41109168 40431356 39780899 39017396 38213186
11608C8213186o67539n22939n16215n46745m78325l81409l93945m68772m49807
11599C3787490l43715l28144m69112n85778m86125k48136j41068k76130m56808
11590C0452474m36356k34622r0576j39985k69954l08215k36476j60604j57265
11581B8418421k16244k75642k62028j49707k1700j0918j37301k65051k64925j57486
11571B6657419n6620l7519r5590j63511j43582j2914Q8427L239j82695k02601
11561B5854053j781J39091J3591j85439j65117J6288P3020m4351j18212n8970
11551B5522173k0737r3061j59694j34679r0737p0221k837R4080O7165j02118k04977
11540B4804357j26754l9211r7319j63401o2611P6099J9476j56004j66030J3933
$$ plain form
11608 38213186 37545647 37022708 36506493 35959748 35481423 35100014 34706069 34237297 33787490
11599 33787490 33443775 33115631 32646519 32060741 31574616 31326480 31185412 30909282 30452474
11590 30452474 30016118 29781496 29690920 29550935 29280981 28972766 28736290 28575686 28418421
11581 28418421 28202177 27926535 27664507 27514800 27493100 27482182 27344881 27079830 26814905 26657419
11571 26657419 26600799 26563280 26467690 26304179 26160597 26147683 26236110 26239349 26056654 25854053
11561 25854053 25852272 25991363 26004954 25819515 25654398 25670686 25743706 25699355 25581143 25522173
11551 25522173 25501436 25408375 25248681 25114002 25023265 24953044 24950207 25044287 25111452 25009334 24804357
11540 24804357 24677603 24638392 24541073 24377672 24315061 24391160 24410636 24254632 24088602 24102535
11530B4102535J02180l5928j81695j14078P2880J53029R2493K1127m326l1681
11520B4176536o1501k7736O4119J04367K6504q9265j11657j9951P9976R3087M0115
11509B4274594J714k080j5425l9702r667Q5604J40541P0308m9957q4605l7531
11498B4333794k8563p7628n7466R0294K23499J82203J6577q3522m1985L8048N3316
11487B4648567L1436N0203J11904J55084J43696R1502K7613j2662J5997J24459
11477B5387799K43035K75871K16411J57487J60067J67171J03209J6649L7504J93803
11467B6959006L56277L99492L48672L12904L25614L26322K80152K36520K49913
11458B9794872K95107K98322K34222J58806J35858J46738J05759j7112j23781
$$ plain form
11530 24102535 24204715 24168787 23987092 23873014 23945894 24098923 24191416 24212543 24208217 24176536
11520 24176536 24115035 24087299 24151418 24255785 24282289 24193024 24081367 24061416 24141392 24234479 24274594
11509 24274594 24276308 24274228 24258803 24219101 24209434 24295038 24435579 24505887 24455930 24371325 24333794
11498 24333794 24305231 24227603 24170137 24260431 24483930 24666133 24682710 24599188 24557203 24595251 24648567
11487 24648567 24680003 24730206 24842110 24997194 25140890 25232392 25260005 25247343 25263340 25387799
11477 25387799 25630834 25906705 26123116 26280603 26440670 26607841 26711050 26727699 26765203 26959006
11467 26959006 27315283 27714775 28063447 28376351 28701965 29028287 29308439 29544959 29794872
11458 29794872 30089979 30388301 30622523 30781329 30917187 31063925 31169684 31152572 31028791
11449C1028791r4229M4110J27133N6275q3702j54238j38429j13068j01584n8062
11439C0512997J6524M3940k0962j20475j67880j45146r9629p6611q0733q7649
11429B9774376p7618n6649l8284j2494L0399M5115l0199j52967j82038p2307K4736
11418B9252070m0028j90398k39494j70046j26327j46743j05723L8715J33693N8953
11408B8464672r0288j53847j10310k5733P3370J55585J34036J539q5819r708J18282
11397B8471779J27635O3308R5420K17470K56548J69294J03711J40455J86819J82731
11387C0015170K03293K68703K52589J07487N626R2508K39037K23822O5440k1726
11377C1451949N1206J61482J93105J64515J27488R7375J09916K00448K91231K46345
$$ plain form
11449 31028791 30934562 30978672 31105805 31162080 31078378 30924140 30785711 30672643 30571059 30512997
11439 30512997 30529521 30573461 30552499 30432024 30264144 30118998 30019369 29942758 29862025 29774376
11429 29774376 29696758 29640109 29601825 29589331 29619730 29664845 29634646 29481679 29299641 29227334 29252070
11418 29252070 29212042 29021644 28782150 28612104 28485777 28339034 28233311 28272026 28405719 28464672
11408 28464672 28374384 28220537 28110227 28084494 28157864 28313449 28447485 28449024 28363205 28353497 28471779
11397 28471779 28599414 28662722 28758142 28975612 29232160 29401454 29505165 29645620 29832439 30015170
11387 30015170 30218463 30487166 30739755 30847242 30852868 30945376 31184413 31408235 31473675 31451949
11377 31451949 31503155 31664637 31857742 32022257 32149745 32247120 32357036 32557484 32848715 33095060
11367C3095060R1452L0482J62659L25966L35795K49526K40455L08867L10640K28383
11357C5379285K07815L06975L96962L71438K95734K71241K94600L37913M25774
11348C8287737N24886N03048L41351K50849L96116O17433O43640M93455M18566
11339D2477081N04712O07432O67186P81868R31319R50581Q63249R16265J154411
11330D9854104J298258J223969J208722J448038J687362J668408J604998J801064
11322F1794923K098701K193261K231144K529496K925446L060459L148137L700988
11314H3682555M573719N149693N510449O408683P869355Q979428R547464J0628864
11306A42350210J2365508J2538516Q989297K930294k008056m063726m938167o717040
$$ plain form
11367 33095060 33186512 33216994 33379653 33705619 34041414 34290940 34531395 34840262 35150902 35379285
11357 35379285 35587100 35894075 36291037 36662475 36958209 37229450 37524050 37861963 38287737
11348 38287737 38812623 39315671 39657022 39907871 40303987 40921420 41565060 42058515 42477081
11339 42477081 42981793 43589225 44256411 45038279 45969598 46920179 47783428 48699693 49854104
11330 49854104 51152362 52376331 53585053 55033091 56720453 58388861 59993859 61794923
11322 61794923 63893624 66086885 68318029 70847525 73772971 76833430 79981567 83682555
11314 83682555 88256274 93405967 98916416 105325099 113194454 122173882 131721346 142350210
11306 142350210 154715718 167254234 176243531 179173825 177165769 173102043 168163876 161446836
11298A61446836q961109r910704r241520q145028p342501o481430n343469m392136
11290A01628939l928021l623148l178389k760079k515943k231946j766001j362230
11282H0263182j233841j197205j005944p48907o29688n83888m04073r3058J72276
11273G4538854L45963N44661P77198Q21062M52712k41982q65826j092049j032318
11264G4248275j086310j387199j611503j485831j232973j225119j393902j384149
11256F3441289j185194j142078j334767j434395j289840j181731j286628j335755
11248E3250901j103603q43403q67047j011487r40088p28910o99703q31254q07917
11239D5417489n85063m48918n01565n10743l50860k16274k66609l75553l79921
$$ plain form
11298 161446836 152485727 142575023 133333503 125188475 117845974 111364544 106021075 101628939
11290 101628939 97700918 94077770 90899381 88139302 85623359 83391413 81625412 80263182
11282 80263182 79029341 77832136 76826192 76077285 75447597 74863709 74459636 74366578 74538854
11273 74538854 74884817 75429478 76206676 77027738 77480450 77238468 76372642 75280593 74248275
11264 74248275 73161965 71774766 70163263 68677432 67444459 66219340 64825438 63441289
11256 63441289 62256095 61114017 59779250 58344855 57055015 55873284 54586656 53250901
11248 53250901 52147298 51303895 50436848 49425361 48485273 47756363 47056660 46225406 45417489
11239 45417489 44832426 44383508 43881943 43371200 43020340 42804066 42537457 42161904 41781983
11230D1781983l14255k53652j64271o0807q7352k70317l86430k61934m1167K8629
11220C9970427o0173j40554j56788j72412j72707q0455N6246R0792L906o4939
11210C9273343l6870R306O403K4384J41755K89609L27397K30734J15215Q5272
11200D0466548J33096J98861K65477L44698M02437L73782K74955K35378L50088
11191D3045320N29539N86047M82184L99342N00139O98058P67544O54165N45080
11182D8207418N93881P03660O99538O30139P07784R44010J066784R20409P48636
11173E5222259Q55851J128201J206710J087271J159349J559206J895310J863394
11165F5977551J764005K005626K350568K173986J395677O21280K76407R5270l16696
$$ plain form
11230 41781983 41467728 41214076 41049805 40988998 40901646 40631329 40244899 39982965 39941798 39970427
11220 39970427 39910254 39769700 39612912 39440500 39267793 39187338 39243584 39334376 39338282 39273343
11210 39273343 39236473 39245779 39252182 39276566 39418321 39707930 40035327 40266061 40381276 40466548
11200 40466548 40599644 40798505 41063982 41408680 41811117 42184899 42459854 42695232 43045320
11191 43045320 43574859 44160906 44643090 45042432 45542571 46240629 47008173 47662338 48207418
11182 48207418 48801299 49504959 50204497 50834636 51542420 52486430 53553214 54473623 55222259
11173 55222259 56078110 57206311 58413021 59500292 60659641 62218847 64114157 65977551
11165 65977551 67741556 69747182 72097750 74271736 75667413 76288693 76565100 76660370 76343674
11156G6343674q32976j049387r01817o85733n96465n53943m25082j83727J26088
11147G1240632M21539O09420O91553P70610Q77677R31660R52540J109021J414450
11138G9019102J613261J576594J565978J832405K197451K377451K489225K786112
11130I5457579L065068K878614K284833J828377J742023J737218J688793J912822
11122A12595327K541414L229283L806881M628570N856782P025627P871593Q897509
11114A56452986J0200442J0297680P466288K284975k448272m794065n612482o788211
11106A67059341q522363r469707q971924p843479o955679o198685n218843m294511
11098A09584150l865502l730951l357011k714411k243993k109077k001297j714528
$$ plain form
11156 76343674 75510698 74461311 73559494 72873761 72277296 71723353 71298271 71114544 71240632
11147 71240632 71662171 72271591 72963144 73733754 74611431 75543091 76495631 77604652 79019102
11138 79019102 80632363 82208957 83774935 85607340 87804791 90182242 92671467 95457579
11130 95457579 98522647 101401261 103686094 105514471 107256494 108993712 110682505 112595327
11122 112595327 115136741 118366024 122172905 126801475 132658257 139683884 147555477 156452986
11114 156452986 166653428 176951108 184417396 186702371 184254099 179460034 173847552 167059341
11106 167059341 158536978 149067271 140095347 132251868 125296189 119097504 113878661 109584150
11098 109584150 105718648 101987697 98630686 95916275 93672282 91563205 89561908 87847380
11090H7847380j468952j512839j718966j794234j709624j696127j870412k050675
11082G4025551j985543j664302j320828j153237j124012j080803r98997r85041
11074F3712788j058536j090159j011511r35023r58556r86279q94241p62645p50466
11065E5265372q07494p31424m99500l23361l35560m20037m23620l62438l30198
11056E1031740l46956l88407m40663m50848l50013j91744j27134j75398j83208
11047D8377369q7992k1203l5622L9163K85969M69652L67804J40304P0166R6046
11037D9701656l9585k83517l27374j52373q6793k45916l37593j83145l1650j16049
11027D7897661k53911k04780j27493k96289n67821n60305k70976r0087j94551
$$ plain form
11090 87847380 86378428 84865589 83146623 81352389 79642765 77946638 76076226 74025551
11082 74025551 72040008 70375706 69054878 67901641 66777629 65696826 64697829 63712788
11074 63712788 62654252 61564093 60552582 59617559 58659003 57672724 56778483 56015838 55265372
11065 55265372 54457878 53726454 53226954 52903593 52568033 52147996 51724376 51361938 51031740
11056 51031740 50684784 50296377 49855714 49404866 49054853 48863109 48735975 48560577 48377369
11047 48377369 48289377 48268174 48232552 48271715 48557684 49027336 49395140 49535444 49605610 49701656
11037 49701656 49662071 49378554 49051180 48898807 48812014 48566098 48228505 48045360 48013710 47897661
11027 47897661 47643750 47438970 47311477 47015188 46447367 45887062 45616086 45525999 45331448
11018D5331448l27115k68745j65759k07173k75498j76688k2475q6980l56880n09773
11008D2934362l74400j74092j92398l66860m04306k25776p3953j38850k80246
10999D0703481k58646r8406k7378j27289k54944k95264k83088k52273j73646r6051
10989C8836496j42366k86350l33158k12211q4902o5500o9227n6770j50356l25463
10979C7110193k95685K2508K31806P948l33286k82991M7379J09095j82263l41999
10969C6092705j60762l0149k25518m36167l33896j28688j56781k97639k47533
10960C4075572q9521j24494l19654l78733k56741j84669k34536k49970j96114
10951C2041140k12956k96436k63458r2362J602r0715k14758k22284j68953j54084
$$ plain form
11018 45331448 45004333 44735588 44569829 44362656 44087158 43910470 43887995 43801015 43444135 42934362
11008 42934362 42559962 42385870 42193472 41826612 41422306 41196530 41122577 40983727 40703481
10999 40703481 40444835 40346429 40319051 40191762 39936818 39641554 39358466 39106193 38932547 38836496
10989 38836496 38694130 38407780 38074622 37862411 37777509 37712009 37642782 37586012 37435656 37110193
10979 37110193 36814508 36837016 37068822 37076770 36743484 36460493 36507872 36616967 36434704 36092705
10969 36092705 35931943 35901794 35676276 35240109 34906213 34777525 34620744 34323105 34075572
10960 34075572 33986051 33861557 33541903 33163170 32906429 32721760 32487224 32237254 32041140
10951 32041140 31828184 31531748 31268290 31175928 31177530 31086815 30872057 30649773 30480820 30326736
10941C0326736j62767j52949j33045r2867j3658K3708q2331k42151k41436o0601
10931B9168639P8350M0274n8648q8015q8528j17341j11687l4903J6517j9056n2796
10920B8732806k0629j0499p9921j10879p620J05836O5068p2153j21261m0226O3479
10909B8504001J16833J13546L9092p5062r2993O2576K46516K56900J12621k809
10899B9281221k3070l3654n3695O499J47251K29754J83277J11298J24642J89954
10889C0163477K11300J70234J26013J38351K17986L02240K91325J79428J10394
10880C1910748J95104L21586L03957J88945K03633L75497M47126K76180R2546
10871C4315322J67480L92826M30454K02490j2341K4221K26173L56717L28827K42017
$$ plain form
10941 30326736 30163969 30011020 29877975 29785108 29771450 29795158 29712827 29470676 29229240 29168639
10931 29168639 29246989 29287263 29228615 29140600 29052072 28934731 28823044 28788141 28804658 28785602 28732806
10920 28732806 28712177 28701678 28621757 28510878 28503258 28609094 28674162 28602009 28480748 28440522 28504001
10909 28504001 28620834 28734380 28773472 28698410 28605417 28667993 28914509 29171409 29284030 29281221
10899 29281221 29258151 29224497 29170802 29177301 29324552 29554306 29737583 29848881 29973523 30163477
10889 30163477 30374777 30545011 30671024 30809375 31027361 31329601 31620926 31800354 31910748
10880 31910748 32105852 32427438 32731395 32920340 33123973 33499470 33946596 34222776 34315322
10871 34315322 34482802 34875628 35306082 35508572 35496231 35520452 35746625 36103342 36432169 36674186
10861C6674186K13069K58063L06370K84810K04445J63240K24054L12818L11980
10852C8953035K37988K18709K85644L18757K51609K00157K82091M10523M10106
10843D1568619K83197K07017K76571L96782M53626M59100M73249M91861M82968
10834D5092990M59330M51476M63785M94695N35643N29090M24305L05217L33804
10825D9090335N03121N93668M82701L46316L95226N44998N62018M44156M04945
10816E3367484N11455N98312N69650N42004O11993O93061O83982O28689O09175
10807E8815805O23366O51803P08042P56754P28440O70075P11349Q25138Q23725
10798F5314497O73770N91074P04256Q51209Q60190Q11543Q44215R17240R59838
$$ plain form
10861 36674186 36887255 37145318 37451688 37736498 37940943 38104183 38328237 38641055 38953035
10852 38953035 39191023 39409732 39695376 40014133 40265742 40465899 40747990 41158513 41568619
10843 41568619 41851816 42058833 42335404 42732186 43185812 43644912 44118161 44610022 45092990
10834 45092990 45552320 46003796 46467581 46962276 47497919 48027009 48451314 48756531 49090335
10825 49090335 49593456 50187124 50669825 51016141 51411367 51956365 52518383 52962539 53367484
10816 53367484 53878939 54477251 55046901 55588905 56200898 56893959 57577941 58206630 58815805
10807 58815805 59439171 60090974 60799016 61555770 62284210 62954285 63665634 64490772 65314497
10798 65314497 65988267 66579341 67283597 68134806 68994996 69806539 70650754 71567994 72527832
10789G2527832J048393J220200J321697J276118J288613J526535J814018J933035
10781H3956441K001498K220052K470831K555172K617690K895031L233000L342847
10773A05292562L372119L675445M151866M419453M562491N033196N835198O532443
10765A42874773P110695Q044067R395043J0706817J1979946J3790747J6118417
10758B20020505J8131750J9604685K1191255K2331966K0320340J3286015L442928
10751C38329444m617989q868123j1322337j4389874j7661499j9223145j8603427
10744B43643050j6991238j5350698j3708706j2013586j0547566r441200q535975
10737A57054081p783775p261211o830304o247753n553736m968266m514986m102847
$$ plain form
10789 72527832 73576225 74796425 76118122 77394240 78682853 80209388 82023406 83956441
10781 83956441 85957939 88177991 90648822 93203994 95821684 98716715 101949715 105292562
10773 105292562 108664681 112340126 116491992 120911445 125473936 130507132 136342330 142874773
10765 142874773 149985468 158029535 167424578 178131395 190111341 203902088 220020505
10758 220020505 238152255 257756940 278948195 301280161 321600501 334886516 338329444
10751 338329444 333711455 324843332 313520995 299131121 281469622 262246477 243643050
10744 243643050 226651812 211301114 197592408 185578822 175031256 165590056 157054081
10737 157054081 149270306 142009095 135178791 128931038 123377302 118409036 113894050 109791203
10729A09791203l806079l682517l513242l136391k827339k882552l029806k784833
10721H4128444k241933j929203j958901j930745j680645j504785j539022j506160
10713F9837050j264994j080235j117619j151233j028959r76408j138922j236617
10705F0842063j023655p36203p07342q29954p93072o12811n25211n33567m71673
10696E4608575l92773m84152o53000n97384l02572j03514j85266l40945l40106
10687E1208863k62308k97268m12946m23674k94438j96162k57486l79925l62897
10678D8321759j81142n2993j68967m10859m79273k99606j20760j44358k54725
10669D6209076k58943k07599k56995l46402k82338q9480m239j05217j99527j38087
$$ plain form
10729 109791203 105985124 102302607 98789365 95652974 92825635 89943083 86913277 84128444
10721 84128444 81886511 79957308 77998407 76067662 74387017 72882232 71343210 69837050
10713 69837050 68572056 67491821 66374202 65222969 64194010 63217602 62078680 60842063
10705 60842063 59818408 59082205 58374863 57544909 56751837 56139026 55613815 55080248 54608575
10696 54608575 54215802 53731650 53078650 52481266 52178694 52075180 51889914 51548969 51208863
10687 51208863 50946555 50649287 50236341 49812667 49518229 49322067 49064581 48684656 48321759
10678 48321759 48140617 48087624 47918657 47507798 47028525 46728919 46608159 46463801 46209076
10669 46209076 45950133 45742534 45485539 45139137 44856799 44767319 44763080 44657863 44458336 44320249
10659D4320249k6658k5742j13503j62731j31302p0597k7744j7913k9838j6533
10649D3697688M7290Q4020n236j59624j94836o7477M2186q786j23624j37364o6020
10638D3108217l8230o8017o2237j1350p526p1117j03538m4412L9618O5815M1797
10627D2849020J4460n380j1833K9981J15337J53775P9272k5373j4350J12667J93813
10616D3491389J30693K7572L3315J34246K13039K44668K86903L10201K21054P8983
10606D5172063R2102L03827M65677L71357J69081J50186L35858M97501N25766
10597D8083418N33227N94877O35643O30222O86401Q29492Q94764P57716N19175
10588E4164935L39967K27351J10012l123p6354j48861k42962k72155j87396j17979
$$ plain form
10659 44320249 44293591 44267849 44154346 43991615 43860313 43789716 43761972 43744059 43714221 43697688
10649 43697688 43744978 43828998 43823762 43664138 43469302 43401825 43444011 43435225 43311601 43174237 43108217
10638 43108217 43069987 43001970 42939733 42928383 42920857 42849740 42746202 42701790 42741408 42807223 42849020
10627 42849020 42863480 42858100 42846267 42876248 42991585 43145360 43224632 43199259 43184909 43297576 43491389
10616 43491389 43622082 43649654 43682969 43817215 44030254 44274922 44561825 44872026 45093080 45172063
10606 45172063 45264165 45567992 46033669 46405026 46574107 46724293 47060151 47557652 48083418
10597 48083418 48616645 49211522 49847165 50477387 51163788 51993280 52888044 53645760 54164935
10588 54164935 54504902 54732253 54842265 54839142 54762788 54613927 54370965 54098810 53911414 53793435
10578E3793435j98316l29065k94970q2116R9636R9230k8325j51840j91776j19141
10568E2596752K5884J06323K2071j18674j08336O2967J78736J06017k7400m2100
10558E2802240M9806J19010J32370J67457K58797L30383K86038J30819j673L2661
10548E4307908K06626L11382K12570N4289O8693K33377L13960K36693J81383K54264
10538E6381145L20689K74059K23886K51045K10992J972j79516j23901K0602k2778
10528E7358195j87132j81608j6807j840j87567k35396J5550K39314J25109j28130
10518E6799688j36503P0801J37676m3906k04779j49206k5863n7098k17830l12268
10508E5860712k47233j18076p4340j62108k83010l02609k11732j36140j54021
$$ plain form
10578 53793435 53595119 53266054 52971084 52888968 52988604 53087834 53059509 52907669 52715893 52596752
10568 52596752 52622636 52728959 52751030 52632356 52524020 52586987 52765723 52871740 52844340 52802240
10558 52802240 52852046 52971056 53103426 53270883 53529680 53860063 54146101 54276920 54275247 54307908
10548 54307908 54514534 54825916 55038486 55092775 55161468 55394845 55708805 55945498 56126881 56381145
10538 56381145 56701834 56975893 57199779 57450824 57661816 57663788 57484272 57360371 57380973 57358195
10528 57358195 57171063 56989455 56972648 56970808 56783241 56547845 56563395 56802709 56927818 56799688
10518 56799688 56663185 56733986 56871662 56827756 56622977 56473771 56447908 56390810 56172980 55860712
10508 55860712 55613479 55495403 55421063 55258955 54975945 54673336 54461604 54325464 54171443
10499E4171443j88398j55365j16859j58460k06789j41493k7668l2965j36698j44322
10489E2862426j0979Q0342K8593k5718L5141R1317l485j63293k08229j39146q6663
10478E2460306q1566o7831p2077j58724k57163k33894j23530r3281j69995j97907
10468E1004338j02992p035r697l4953M283M1979j1608r3639q5805j1114R763m3621
10456E0659899p5612m7060l5218r3360j53540j29759n7683n5746j54475k32249
10446D9625197j65802j1396M6322n2981j38054l4893J71684K42459J21814L974
10436D9808324L1179R9328N8025m8942r2915j03383k13056l98035m68916l59065
10426D8312544k56925l52653n59024o17648m53043k85854l40538n37463n99720
$$ plain form
10499 54171443 53983045 53827680 53710821 53552361 53345572 53204079 53176411 53143446 53006748 52862426
10489 52862426 52851447 52931789 52960382 52934664 52969805 53061122 53057637 52894344 52686115 52546969 52460306
10478 52460306 52378740 52310909 52238832 52080108 51822945 51589051 51465521 51372240 51202245 51004338
10468 51004338 50901346 50894311 50884614 50849661 50853944 50895923 50884315 50790676 50704871 50693757 50703520 50659899
10456 50659899 50584287 50537227 50502009 50408649 50255109 50125350 50067667 50011921 49857446 49625197
10446 49625197 49459395 49447999 49494321 49441340 49303286 49268393 49440077 49682536 49804350 49808324
10436 49808324 49839503 49938831 49996856 49947914 49854999 49751616 49538560 49140525 48671609 48312544
10426 48312544 48055619 47702966 47143942 46526294 46073251 45787397 45446859 44909396 44309676
10417D4309676m45709l13159m09812n88867n55556l17477j83975l01781m50744
10408D0742596m07605k74413k62421l41663l42872k78563k97543l81619l53514
10399C7802383j87550p2856j25124k35621k62795k07896j48044j36749k06157
10390C6219591l34794l99523k99750j23348l2707j8552K9621N0663j09372l42279
10380C4639550l38697q6753M1081j45596l49090k69199o6458m5307j60673j87761
10370C3031097j49837j96737k43003j28869L539q5061k64513k20311k2311j8830
10360C1705164j96785j89571K8922M1052k62263m11950j32842J58711L3299k48414
10350C0525323k15583M688m8869l34289l66932n0495J55029k5765k89876k74328
$$ plain form
10417 44309676 43863967 43550808 43140996 42552129 41996573 41679096 41495121 41193340 40742596
10408 40742596 40334991 40060578 39798157 39456494 39113622 38835059 38537516 38155897 37802383
10399 37802383 37614833 37541977 37416853 37181232 36918437 36710541 36562497 36425748 36219591
10390 36219591 35884797 35485274 35185524 35062176 35029469 35010917 35040538 35091201 34981829 34639550
10380 34639550 34300853 34214100 34255181 34109585 33760495 33491296 33424838 33379531 33218858 33031097
10370 33031097 32881260 32684523 32441520 32312651 32316190 32231129 31966616 31746305 31723994 31705164
10360 31705164 31508379 31318808 31347730 31388782 31126519 30714569 30581727 30740438 30773737 30525323
10350 30525323 30309740 30314428 30265559 29931270 29564338 29513843 29668872 29643107 29353231 29078903
10340B9078903o1460N0541j4150j15136j40526p5664L1167O7172m6615k01366
10330B8572866k02129n5779K9486l6463j20510j23321j05826r6418k6638N2958
10320B7888226l1131k36649k55619J1435K21686Q4534j72976j60010O4346J16823
10310B7530665q2261k15830j03841M6922J6135j16271j69026j40635j36402j70874
10300B6458582j80717j38162o1876R229J3108p2831j52772j14795j8683l1739
10290B5709344j57134k01505o7176R9852J33794N3563m8127j47906k08614j28823
10280B5037268O9590J62414K1000j44088n9477J88066K60503O4503j28363r7273
10270B5374143L5043L6086r1625j53995o1437O2565N6681p9182j83809j22876
$$ plain form
10340 29078903 29017443 29067984 29053834 28938698 28798172 28722508 28753675 28820847 28774232 28572866
10330 28572866 28370737 28314958 28344444 28307981 28187471 28064150 27958324 27861906 27835268 27888226
10320 27888226 27857095 27620446 27364827 27376262 27597948 27682482 27509506 27349496 27413842 27530665
10310 27530665 27448404 27232574 27128733 27175655 27191790 27075519 26906493 26765858 26629456 26458582
10300 26458582 26277865 26139703 26077827 26087056 26100164 26027333 25874561 25759766 25741083 25709344
10290 25709344 25552210 25350705 25283529 25383381 25517175 25570738 25522611 25374705 25166091 25037268
10280 25037268 25106858 25269272 25290272 25146184 25086707 25274773 25535276 25599779 25471416 25374143
10270 25374143 25409186 25445272 25353647 25199652 25138215 25200780 25257461 25178279 24994470 24871594
10260B4871594L4233P5098q2544k54529k21974l0298Q7756M5400k6097l7968o5076
10249B4395595j47709j82532j23686j01400j89889k33987j03227L3704o1563k91786
10239B2993520l35711j38880O391p7788k02295j49184j5304k2233j57253k27853
10229B1673410j75339j16616j16240j14769q2181p1990r9279j06732q3456r3680
10219B0613128j51362j80212j40939r3497q4536p2339k1759J7018p459n9592p7476
10208A9740975n6029j5259L7115N5031l4659j88311k24959p4348O2100k4656k06411
10197A9070589j70892R6008K51144R4770j31497j17096O2673J09833j8100q8458
10187A9158974j1103K7391r3122k15473j69693l9927L190k1649N431N3563k216
$$ plain form
10260 24871594 24905827 24980925 24898381 24643852 24421878 24391580 24479336 24524736 24498639 24460671 24395595
10249 24395595 24247886 24065354 23941668 23840268 23650379 23416392 23313165 23346869 23285306 22993520
10239 22993520 22657809 22518929 22525320 22447532 22245237 22096053 22080749 22058516 21901263 21673410
10229 21673410 21498071 21381455 21265215 21150446 21068265 20996275 20896996 20790264 20706808 20613128
10219 20613128 20461766 20281554 20140615 20047118 19962582 19890243 19868484 19885502 19878043 19818451 19740975
10208 19740975 19684946 19669687 19706802 19761833 19727174 19538863 19313904 19239556 19301656 19277000 19070589
10197 19070589 18899697 18995705 19246849 19341619 19210122 19093026 19155699 19265532 19247432 19158974
10187 19158974 19147871 19175262 19082140 18866667 18696974 18657047 18660237 18638588 18644019 18697582 18695366
10176A8695366j26044j47778m6788L112q1530j60566j08631j3404j2558p3216
10166A7927963q2468n1607o4159r1260l7399O2020O9461k4533p5640k5166O609
10155A7613821o3293j32912r3785j8628k6707o8798k0594P5333N9625o2921r9206
10144A7161935K4205J23647M2355r1202o2443P6659P2761j27771k67680j47472
10134A6804994P6225J11205n9283j71438o6184R8540Q2486j13661k63830k03963
10124A6295091p720J24621Q7902m2650j21029r2551k7486j480M756M2217P7045
10113A6338716K8048q8407j54478j13785l8921m207N57j4809q3727j69268j49154
10102A5550565j8632M4722l8704p7112P6549K07750M4832k41702k34229O6288
$$ plain form
10176 18695366 18569322 18421544 18374756 18377868 18296338 18135772 18027141 18013737 18001179 17927963
10166 17927963 17845495 17793888 17729729 17638469 17601070 17663090 17732551 17708018 17632378 17607212 17613821
10155 17613821 17550528 17417616 17323831 17305203 17278496 17209698 17189104 17264437 17324062 17261141 17161935
10144 17161935 17186140 17309787 17352142 17260940 17198497 17275156 17347917 17220146 16952466 16804994
10134 16804994 16881219 16992424 16933141 16761703 16695519 16794059 16876545 16762884 16499054 16295091
10124 16295091 16287371 16411992 16499894 16457244 16336215 16243664 16216178 16214698 16219454 16261671 16338716
10113 16338716 16366764 16278357 16123879 16010094 15971173 15966966 15967523 15952714 15868987 15699719 15550565
10102 15550565 15531933 15576655 15537951 15460839 15537388 15745138 15789970 15548268 15314039 15380327
10092A5380327K09171R457j63489j7220J81467Q5078j39467j17974R2427J44058
10082A5663835J4541j0212J03168Q8221q7440j17874J06876K90835K13882M5523
10072A6311355o923j7897r7335j35214l5174N6180l868j02132r2351n4120j02515
10061A5720006j52065j03271n3910q7845p8320M0640N3921j72579l54661j92428
10051A4619488J00236J01921j40658k21061o1802J5721j04121j70075p2592k4962
10041A4042095j14547j30127N486O3778m6941r2926K0507K7736j89186k97718
10031A3288157n7672K20860J60065p9854j19506k915l1395j64587j14083P9115
10021A3178185Q9336r6378j32537P8015K01150K4186k15512k32688r1555k123
$$ plain form
10092 15380327 15589498 15598955 15435466 15418246 15599713 15684791 15545324 15427350 15519777 15663835
10082 15663835 15678376 15668164 15771332 15859553 15772113 15654239 15761115 16051950 16265832 16311355
10072 16311355 16304432 16286535 16189200 16053986 16018812 16074992 16071124 15968992 15876641 15822521 15720006
10061 15720006 15567941 15464670 15410760 15322915 15244595 15285235 15339156 15166577 14811916 14619488
10051 14619488 14719724 14821645 14680987 14459926 14398124 14413845 14309724 14139649 14067057 14042095
10041 14042095 13927548 13797421 13802907 13866685 13819744 13726818 13747325 13775061 13585875 13288157
10031 13288157 13230485 13451345 13611410 13531556 13412050 13409135 13377740 13213153 13099070 13178185
10021 13178185 13267521 13171143 13038606 13116621 13317771 13341957 13126445 12893757 12802202 12800079
10011A2800079J5234N4631J04424Q8040N798q5704j40823j17151j5105N8059M201
10000A2771683r3112q1581K353O759l2702O0532K41961K43649O452j93527j61832
9989A2770635l2142L4347R0750J77466J56241j4326j12956k792J12505L3131r1439
9978A3121420n2053K8200o5623k10075j37779P6984J23862l0232j21415n0741
9968A2682548Q798k4811k9275L0472K7762m7688m5268M4105M1670q1529j20809
9957A2485975L23P5942l4371j69276j40584j3410N5847N7938M3728j4470j12267
9946A2235375j31931k5607P3739N7000o423l5715p1162j12796m3966J24667J65312
9935A2228493j4038j59302n4954J09201N4016j11352r0441P0161O3509j28413
$$ plain form
10011 12800079 12815313 12869944 12974368 13062408 13068206 12982502 12841679 12724528 12709423 12767482 12771683
10000 12771683 12678571 12596990 12599343 12606102 12573400 12633932 12875893 13119542 13125994 12932467 12770635
9989 12770635 12738493 12772840 12863590 13041056 13197297 13182971 13070015 13067223 13179728 13212859 13121420
9978 13121420 13069367 13097567 13031944 12821869 12684090 12761074 12884936 12854704 12733289 12682548
9968 12682548 12691346 12666535 12637260 12667732 12695494 12647806 12602538 12646643 12688313 12606784 12485975
9957 12485975 12486298 12562240 12527869 12358593 12218009 12204599 12260446 12318384 12362112 12347642 12235375
9946 12235375 12103444 12077837 12151576 12208576 12202153 12166438 12095276 11982480 11938514 12063181 12228493
9935 12228493 12214455 12055153 12000199 12109400 12163416 12052064 11961623 12031784 12095293 11966880
9925A1966880j96130l9441O9085l6314j45608n7612Q5145P1244k0120R037J17786
9914A1823952J05531m3747j39578q1512K0372L6607j9798o0262m6394j102M7339
9903A1641408Q5532R5832N2781l9385j16868j10289m1517k811r428L1360J36278
9892A1722893J55348Q19j49755q1515J05705J24983m4350j18415L1219J75424
9882A1922356J09745k8844j5727J01509J17555Q62j01548r8268j6232R0668J50272
9871A2232348Q3715n6187p4844Q9098K14707J02545j09211j44834J1027J48762
9861A2497126J66544J18133J5333j43690k12081n3538J70455J75673K177m0479
9851A2695653J10913J74304J8249j14175l4757P7161R930j21866j09135o154R319
$$ plain form
9925 11966880 11770750 11731309 11800394 11764080 11618472 11560860 11646005 11717249 11697129 11706166 11823952
9914 11823952 11929483 11885736 11746158 11664646 11685018 11721625 11701827 11641565 11595171 11594069 11641408
9903 11641408 11726940 11822772 11875553 11836168 11719300 11609011 11567494 11564683 11555255 11586615 11722893
9892 11722893 11878241 11879060 11729305 11647790 11753495 11878478 11834128 11715713 11746932 11922356
9882 11922356 12032101 12003257 11987530 12089039 12206594 12207456 12105908 12007640 11991408 12082076 12232348
9871 12232348 12316063 12259876 12185032 12274130 12488837 12591382 12482171 12337337 12348364 12497126
9861 12497126 12663670 12781803 12797136 12653446 12441365 12387827 12558282 12733955 12736132 12695653
9851 12695653 12806566 12980870 12999119 12884944 12850187 12927348 12937278 12815412 12706277 12700123 12709442
9840A2709442n0053o6721o2532j03557j01325K7836J25786n423k47814k94595
9830A1931044r0279J18559J51266O2547n1983j75303k63494k34236j13170l0915
9820A1304036m3287q7462j11922j13747p3467K948K0715p2903j59221j17086l0252
9809A0518352k8080l7986M8393R0969q4433k90589k02858P1659J12050j13595
9799A0083882j80996M5618J55356q8460l09239j55892R9115M9925j54736j29805
9789I414768M9593K7999j63627j85964j5764N0486m2384n9839L2077K6701o7775
9778I066271k2668J32729J15784p5520j28732R457M1728r0290p2889J52665J97305
9767I325840q6705k79780r1693J45153Q2371m7233P5605K19815L3867k55804k02808
$$ plain form
9840 12709442 12659389 12592668 12530136 12426579 12325254 12353090 12478876 12473453 12225639 11931044
9830 11931044 11840765 11959324 12110590 12173137 12121154 11945851 11682357 11448121 11334951 11304036
9820 11304036 11260749 11173287 11061365 10947618 10874151 10877099 10897814 10824911 10665690 10548604 10518352
9809 10518352 10490272 10452286 10500679 10591648 10507215 10216626 10013768 10085427 10197477 10083882
9799 10083882 9902886 9948504 10103860 10015400 9706161 9550269 9649384 9699309 9544573 9414768
9789 9414768 9464361 9492360 9328733 9142769 9127005 9177491 9135107 9075268 9107345 9134046 9066271
9778 9066271 9043603 9176332 9292116 9216596 9087864 9097321 9139049 9048759 8975870 9128535 9325840
9767 9325840 9239135 8959355 8867662 9012815 9095186 9047953 9123558 9343373 9377240 9121436 8918628
9756H918628P3966J11698p9907r2211R6598R1904j62563k61320n6546J12846N3624
9745H806717O02Q0805N6484j49526k03806N0084K37742N5746k00361j27617J25463
9734H732333J52724l3214j02148k461K2743p3780q3555L5829P0725o6153j83759
9723H469284j25908Q949N0720j4322p5974n4492J8447K8927p9216j79615j00103
9712G946697Q4517J01206r2787j93674k8639J44601P0170p3501k3821O3649q2937
9701G915481k71520j19501K18453K14243j46829k92883l487K31908N6803j70794
9691G631874m5649J74052N4636k22727j71764J49223K31187l8145k25999q8295
9681G448393R5004N8438m1109K2869J47622J19763j6516p0159k3958j4740q5081
$$ plain form
9756 8918628 8992594 9104292 9024385 8932174 9028772 9120676 8958113 8696793 8640247 8753093 8806717
9745 8806717 8807319 8888124 8944608 8795082 8591276 8641360 8879102 8934848 8734487 8606870 8732333
9734 8732333 8885057 8851843 8749695 8747234 8769977 8696197 8612642 8648471 8719196 8653043 8469284
9723 8469284 8343376 8352325 8403045 8388723 8312749 8258257 8276704 8305631 8226415 8046800 7946697
9712 7946697 8031214 8132420 8039633 7845959 7817320 7961921 8032091 7958590 7934769 7998418 7915481
9701 7915481 7643961 7524460 7742913 7957156 7810327 7517444 7513957 7745865 7802668 7631874
9691 7631874 7586225 7760277 7814913 7592186 7420422 7569645 7800832 7762687 7536688 7448393
9681 7448393 7543397 7601835 7560726 7583595 7731217 7850980 7834464 7764305 7740347 7725607 7640526
9670G640526j42889j23688n7806o42J9293R542J3573N4879O8747k3078j54367
9659G304090j53431J2435J59170J28953n548p3647l7802K0539O0051R4642J00641
9648G610093L5936o3015j02110m5928M9862J05706P3636l0051j02355l6626J09749
9637G604897J30478m6133k01915j14193J02960J57015J5051q1089l4244k0267
9627G512560j15352j17318P6062K07299N7250j41596n0702J88666J51895j55352
9617G613412k67105p187K17678P6076j76364j56492L8280P7973j4143K1898J45847
9606G569873P9683j46505j83116O0270K54348J75960R573k5386P07l7537o7208
9595G690662q456M0639J4592L3543J46903J76004L4403n3523Q2797K28297J29405
$$ plain form
9670 7640526 7497637 7373949 7316143 7315501 7334794 7344336 7357909 7412788 7481535 7458457 7304090
9659 7304090 7150659 7163094 7322264 7451217 7445669 7372022 7334220 7354759 7414810 7509452 7610093
9648 7610093 7646029 7583014 7480904 7434976 7484838 7590544 7664180 7634129 7531774 7495148 7604897
9637 7604897 7735375 7689242 7487327 7373134 7476094 7633109 7648160 7567071 7532827 7512560
9627 7512560 7397208 7279890 7355952 7563251 7620501 7478905 7428203 7616869 7768764 7613412
9617 7613412 7346307 7339120 7556798 7632874 7456510 7300018 7338298 7416271 7402128 7424026 7569873
9606 7569873 7649556 7503051 7319935 7380205 7634553 7810513 7820086 7794700 7795407 7757870 7690662
9595 7690662 7682206 7722845 7737437 7770980 7917883 8093887 8128290 8074767 8157564 8385861 8515266
9584H515266n2063l64K12281K53624R7885M0273J71605K49699J40101J7980M2727
9573I689014J40185J98818K16756J88570J00358P0732K18583L75795K63145j6821
9563A1445135n5931K02385L21978P2539j79301p0699J73340J48181o3906r2717
9553A1901004P3711J19992l1342j39053r4117m2948m9477n399Q1838N1932r4412
9542A1771729j55483p7257m9667j65982k64717k18100j18611o2526j058O0830
9532A0719158k7534k81720m38860l06158o9708k9889j72800k46092j64986r0375
9522H891036j30258j92673j71473j07387r9023j56504k00072j55754l3585O1918
9512G706225K1772j27483k15972j24569N1608J11338l789j53005j90550j35086
$$ plain form
9584 8515266 8463203 8462839 8675120 8928744 9026629 9066902 9238507 9488206 9628307 9646287 9689014
9573 9689014 9829199 10028017 10244773 10433343 10533701 10604433 10823016 11198811 11461956 11445135
9563 11445135 11389204 11591589 11913567 11986106 11806805 11736106 11909446 12057627 11993721 11901004
9553 11901004 11974715 12094707 12063365 11924312 11830195 11787247 11737770 11732371 11814209 11866141 11771729
9542 11771729 11616246 11538989 11489322 11323340 11058623 10840523 10721912 10659386 10658328 10719158
9532 10719158 10691624 10409904 9971044 9664886 9595178 9565289 9392489 9146397 8981411 8891036
9522 8891036 8760778 8568105 8396632 8289245 8190222 8033718 7833646 7677892 7644307 7706225
9512 7706225 7727997 7600514 7384542 7259973 7311581 7422919 7419130 7266125 7075575 6940489
9502F940489j06804j43180j44335k4037J30366J34303l5689j65395q1363Q4584
9492F588939P4616r9044j60926m758J28660K8884j55659j70888o2708o1106j59147
9481E946863j18686J00988K25921Q1355j31199j39472O414N8230l1294p3482K1990
9470E947628J08716N3003o2802r0994m1706k4740n0569l5679K6133M5443K100
9459E876533q971N5581R7726L3507o4508q3167m6446n3659r4741o9327K7304Q1432
9447E751264M2158n198J1306M2628K0992k6934m3295m2387o9992j05037p9848
9436E495657J3904R4304P4706l3368j12542o2672N8090Q0802l4999j03317K7766
9425E498331K03570J46629j15822k49685r2894J07869P3893j04678j48530k2086
$$ plain form
9502 6940489 6833685 6690505 6546170 6522133 6652499 6786802 6751113 6585718 6504355 6588939
9492 6588939 6663555 6564511 6403585 6398827 6527487 6556371 6400712 6229824 6167116 6106010 5946863
9481 5946863 5828177 5929165 6155086 6236441 6105242 5965770 5972184 6030414 5999120 5925638 5947628
9470 5947628 6056344 6109347 6046545 5955551 5913845 5889105 5838536 5802857 5828990 5874433 5876533
9459 5876533 5867562 5923143 6020869 6054376 5989868 5906701 5860255 5806596 5711855 5642528 5669832 5751264
9447 5751264 5793422 5788224 5799530 5842158 5863150 5836216 5792921 5750534 5680542 5575505 5495657
9436 5495657 5509561 5603865 5678571 5645203 5532661 5469989 5528079 5608881 5573882 5470565 5498331
9425 5498331 5701901 5848530 5732708 5483023 5390129 5497998 5571891 5467213 5318683 5296597
9415E296597N8945m010n7674L3743J66706J40519o5207k46848k08881L503J51122
9404E268515R5205l2324l9321L2988N049j00187o8066J20007J96974L2018j37853
9393E373005r0384L0974L801p3823P083J43844Q4328j02077j13141O7034J33489
9382E464133l0708j87451j60185o9475m2923j1191O7803P2481l6014q8837O815
9371D984448R5579M8162k0389J9576Q0836M6594o748K7947P6119K9850m4896m2316
9359E294762j5804n3198q7708k5643N8576M4755k4379l6307o053p889j3028L5657
9347E163741Q5065O5350K1587J1360j0628p1384q6300k4372K355m1993j6568J09428
9335E207641J21176o9423j95368o6121O8411m4015j54563O6322L55689K08554
$$ plain form
9415 5296597 5355542 5351532 5293858 5327601 5494307 5634826 5569619 5322771 5113890 5117393 5268515
9404 5268515 5363720 5331396 5292075 5325063 5330112 5229925 5161859 5281866 5478840 5510858 5373005
9393 5373005 5282621 5313595 5317396 5243573 5250656 5394500 5478828 5376751 5263610 5330644 5464133
9382 5464133 5433425 5245974 5085789 5016314 4973391 4962200 5030003 5102484 5066470 4977633 4984448
9371 4984448 5080027 5128189 5107800 5127376 5208212 5254806 5248058 5276005 5352124 5381974 5337078 5294762
9359 5294762 5278958 5225760 5138052 5112409 5170985 5215740 5191361 5155054 5149001 5141112 5128084 5163741
9347 5163741 5248806 5314156 5335743 5347103 5336475 5265091 5178791 5154419 5156774 5114781 5098213 5207641
9335 5207641 5328817 5259394 5064026 4997905 5066316 5022301 4867738 4934060 5289749 5498303
9325E498303k35959l32676M2022K90815O6182k24738j58601N9219O4004n3866
9315E014705l6373L9187p301m5830R4494K11444M3535k18197k00952K9680R8592
9304E022984l5290n6263J13526J80652Q387j53860j02105K2789L4059j458M6401
9293E079822J11951O4266n7340j12240o4325J2026O0213P9553Q5766Q8703O9473
9282E417868k0121j64346k20291p3281J55575K12970N0840r8748m8918R0355R2480
9271E394383n9640j62117p2392J11432J84352Q7631l6380m7855R305J1281k0452
9260E399548M1526J65832J51012l4377j26789M2464K36235J42013j38626k36239
9250E642599o5264J00892R2515M6128Q6552J18523N4566j0326N690J8402l4303
$$ plain form
9325 5498303 5262344 4929668 4971690 5262505 5328687 5103949 4945348 5004567 5068571 5014705
9315 5014705 4978332 5017519 5010218 4964388 5058882 5270326 5313861 5095664 4894712 4924392 5022984
9304 5022984 4987694 4931431 5044957 5225609 5233996 5080136 4978031 5000820 5034879 5033421 5079822
9293 5079822 5191773 5256039 5198699 5086459 5022134 5034160 5094373 5173926 5259692 5348395 5417868
9282 5417868 5397747 5233401 5013110 4939829 5095404 5308374 5359214 5260466 5211548 5301903 5394383
9271 5394383 5334743 5172626 5100234 5211666 5396018 5483649 5447269 5399414 5408719 5420000 5399548
9260 5399548 5441074 5606906 5757918 5723541 5596752 5639216 5875451 6017464 5878838 5642599
9250 5642599 5577335 5678227 5770742 5816870 5903422 6021945 6076511 6066185 6071875 6090277 6055974
9239F055974m4118P2757J95668J71737L8603o3698q5650m9654M1262J50827J78220
9228F661928J01414M5267R1491J33884M7825j02594j58423p6479P3430K27433
9218G045176L23236K75438R1544o5361n6753N7735J34709J46332J46131J28341
9208H226528O1717l589N986P2421J28455J49482J25575M3107k5573M4629K04959
9197I033697K15580K866j63772o0029J29457J15073r774N1246K39744J94330j32480
9186I615938l37658j68415J13001J56350R682n9188M55K6059m9199j25269j17674
9175I064082m8549R785j1524j22021k15926j71317m5238k2916j21381j42001j5379
9164H157615M1569j09998k39614r0304J58499J11166k29448m27912k41156N0504
$$ plain form
9239 6055974 6011856 6084613 6280281 6452018 6490621 6426923 6341273 6291619 6332881 6483708 6661928
9228 6661928 6763342 6808609 6900100 7033984 7081809 6979215 6820792 6744313 6817743 7045176
9218 7045176 7368412 7643850 7735394 7670033 7613280 7671015 7805724 7952056 8098187 8226528
9208 8226528 8288245 8284656 8290642 8363063 8491518 8641000 8766575 8809682 8784109 8828738 9033697
9197 9033697 9249277 9252143 9088371 9028342 9157799 9272872 9263098 9314344 9554088 9748418 9615938
9186 9615938 9278280 9109865 9222866 9379216 9388898 9329710 9330165 9356224 9307025 9181756 9064082
9175 9064082 9015533 9025318 9013794 8891773 8675847 8504530 8459292 8436376 8314995 8172994 8157615
9164 8157615 8199184 8089186 7849572 7759268 7917767 8028933 7799485 7371573 7130417 7180921
9154G180921P4918j30437k52931j71166n1921m3749q8305o7635P445L1227m2643
9143F445724j48078j90261j42558n9705j6113l7868q5856r7996n0375J9095M9273
9132E685282J6143n4106j26393j82820k01605j54087n5459K1139L0296K0914N6172
9121E055476R8309N6777n9281j30790q8017L348M5651K6895l814j9553k9011m0314
9109D915676m5057k7612J1086L2585P93l7586J0144J12621R6089q9308k13663
9098D765768p0976J66641J62682p1243j96015q7257O507n6663o1918J27243K47311
9087D932080N8579k02588j69076P2045J43971j0873j07010l2518K9517n274m243
9076D704610O1193M4683n3816m7564O8860O3764j05634j71039j3575J10079Q807
$$ plain form
9154 7180921 7255839 7125402 6872471 6701305 6649384 6605635 6517330 6449695 6457140 6488367 6445724
9143 6445724 6297646 6107385 5964827 5905122 5889009 5851141 5765285 5667289 5616914 5636009 5685282
9132 5685282 5701425 5647319 5520926 5338106 5136501 4982414 4926955 4948094 4978390 4999304 5055476
9121 5055476 5153785 5210562 5151281 5020491 4932474 4935822 4981473 5008368 5004554 4985001 4955990 4915676
9109 4915676 4870619 4843007 4854093 4886678 4887471 4849885 4860029 4972650 5068739 4979431 4765768
9098 4765768 4694792 4861433 5024115 4952872 4756857 4669600 4676107 4619444 4557526 4684769 4932080
9087 4932080 4990659 4788071 4618995 4691040 4835011 4824138 4717128 4684610 4714127 4708853 4704610
9076 4704610 4765803 4810486 4756670 4709106 4777966 4841730 4736096 4565057 4551482 4661561 4670368
9065D670368j17037m7800P3042L4265m6185K7807J18635p342k04789j45633J07752
9054D463083J73206k7101j59153n0827O0701n632o6563M3757J31950j2925j99026
9043D351470j08144J66191K33291Q953j62953n1910J25195P5040j19140j58961
9033D359032l341R8126J7747p2724j3442Q3185M3222o2776m2375P7056P6136r0886
9021D468960k00938j01000O9569J08522K5800m7956p8007r4801p0252R583M9138
9010D138618j4301o8393J633R8013O8712j2845L1372J45876J04573r4172j89254
8999D209832p1788M3137k4121j37320r0462O0733J07021J201j11149j06266L299
8988C884117J16158J22433M625r5642k0406J55471J76008k6125k01838j46136
$$ plain form
9065 4670368 4553331 4505531 4578573 4612838 4566653 4594460 4713095 4705753 4500964 4355331 4463083
9054 4463083 4636289 4609188 4450035 4399208 4459909 4454277 4387714 4431471 4563421 4550496 4351470
9043 4351470 4243326 4409517 4642808 4651761 4488808 4436898 4562093 4637133 4517993 4359032
9033 4359032 4355691 4453817 4471564 4398840 4385398 4468583 4511805 4449029 4406654 4483710 4559846 4468960
9021 4468960 4268022 4167022 4236591 4345113 4370913 4322957 4244950 4150149 4079897 4089480 4138618
9010 4138618 4124317 4055924 4057557 4155570 4224282 4211437 4242809 4388685 4493258 4399086 4209832
8999 4209832 4138044 4181181 4157060 4019740 3929278 3990011 4097032 4098233 3987084 3880818 3884117
8988 3884117 4000275 4122708 4127333 4031691 4011285 4166756 4342764 4316639 4114801 3968665
8978C968665R731L7456l7717m6231P319j1994r3014r9473k4844R963q944J5317
8966C726234O8902L3819o8809p3383M5024R8588k0430j63410j42652J8720J47160
8955C669763J24112k7348j67450j34928P0133K14120R6665j36332j63360K9811
8945C575186J15481n9284k25470j21823J05274J63352N5435r086J3780L165n2937
8934C563073n5787j3699j9119m7230j657P5378N9473k2126l4857J4637M690n0697
8922C472079k3666O3755N8155l2005l5031N9726O5387n3195r8287p384J4590j17253
8910C366871j64956L2223K42239J88911k5869j32293j09986r0468m2468R9544
8900C363748J60347l4529k61906j65306J49723K32105o164j70354m8455Q6070
$$ plain form
8978 3968665 3978396 4015852 3978135 3931904 3939223 3927229 3834215 3734742 3709898 3719861 3710917 3726234
8966 3726234 3795136 3828955 3760146 3686763 3731787 3830375 3809945 3646535 3503883 3522603 3669763
8955 3669763 3793875 3766527 3599077 3464149 3534282 3748402 3845067 3708735 3545375 3575186
8945 3575186 3690667 3631383 3405913 3284090 3389364 3552716 3608151 3599065 3612845 3616010 3563073
8934 3563073 3507286 3493587 3474468 3427238 3425581 3500959 3560432 3538306 3503449 3518086 3522776 3472079
8922 3472079 3448413 3512168 3570323 3538318 3503287 3563013 3628400 3575205 3476918 3469534 3484124 3366871
8910 3366871 3201915 3234138 3476377 3665288 3639419 3507126 3397140 3306672 3264204 3363748
8900 3363748 3524095 3489566 3227660 3062354 3212077 3444182 3438018 3267664 3219209 3305279
8890C305279J2017o0619P3367J97833N0245j94826k07848m3328O768o4318k4624
8879C049946J15829J03808p4618j21718P3018K24488J00784j14196j16476O5726
8869C306591J45214k848j95808k03320j8228J62540J74186N7962k8605m5068r3283
8858C259333j75800j15349J37793L05727J43354j41519j56240O9123J34045p0585
8848C389882j91418k0062J62719P5603j13906j23474j2638K7818N4512J67355
8838C416391J86188m2976k36964n6021K65766K18143j38306k32180P4748K50937
8828C705726l254k46020m9309K72394J85685j96589l34184j10751R5857Q7167
8818C406722M8899Q5196M7836q2815q7763P5054J33114l6737j56761J304K18925
$$ plain form
8890 3305279 3317296 3256677 3330044 3527877 3578122 3383296 3175448 3132120 3138888 3074570 3049946
8879 3049946 3165775 3269583 3194965 3073247 3146265 3370753 3471537 3357341 3240865 3306591
8869 3306591 3451805 3448957 3253149 3049829 3031601 3194141 3368327 3426289 3397684 3352616 3259333
8858 3259333 3083533 2968184 3105977 3411704 3555058 3413539 3257299 3326422 3460467 3389882
8848 3389882 3198464 3178402 3341121 3416724 3302818 3179344 3166706 3194524 3249036 3416391
8838 3416391 3602579 3559603 3322639 3266618 3532384 3750527 3612221 3380041 3454789 3705726
8828 3705726 3702472 3456452 3407143 3679537 3865222 3668633 3334449 3223698 3319555 3406722
8818 3406722 3455621 3540817 3588653 3505838 3418075 3493129 3626243 3589506 3432745 3434049 3652974
8807C652974J81285j0925k9033J26392J35670r3176k49420r2937J81277K30145
8797D032252L0468j43942j18281J1658Q5071P4241L5331o30j2739L4170J13836
8786D141435J19879K0473m6170L8764J55708R7429q7072j26362N0369J72530M5030
8775D582013j27819n9112J59262K02759K4541r8571j7490J03354J06530O1078
8765D936545N8093M2115k0135k8587M6265O2600l0352n0569J00562K06227P5996
8754E398760q5452J7721K48081K11587r0260k11133O2013L75586L34954M5244
8744F307101j16822m1013P9341J05922Q0219M9272J521k8162K7088J31681J69822
8733F765970J17029O8812Q3776J09197Q6916L5958l168k6193k9709J4562J03853
$$ plain form
8807 3652974 3834259 3823334 3794301 3920693 4056363 3963187 3713767 3620830 3802107 4032252
8797 4032252 4062720 3918778 3800497 3812155 3897226 3971467 4006798 4006168 3993429 4027599 4141435
8786 4141435 4261314 4281787 4235617 4274381 4430089 4527518 4440446 4314084 4364453 4536983 4582013
8775 4582013 4454194 4395082 4554344 4757103 4781644 4683073 4665583 4768937 4875467 4936545
8765 4936545 4994638 5036753 5016618 4988031 5034296 5096896 5066544 5015975 5116537 5322764 5398760
8754 5398760 5313308 5331029 5579110 5790697 5700437 5489304 5551317 5926903 6261857 6307101
8744 6307101 6190279 6149266 6228607 6334529 6414748 6464020 6465541 6437379 6464467 6596148 6765970
8733 6765970 6882999 6951811 7035587 7144784 7231700 7267658 7264490 7238297 7208588 7223150 7327003
8722G327003J69979J53454R0928P7545J35796J68918Q8197l9068m9393R0128K13958
8711H427445J88438J07080J24824J86245J18770m1137o2091J07748K39400J92736
8701I589458J26286J81041K15686R0356j8555J06232L09151K79898P3365K0887
8691A0973805J66892K13924O7291M149J67113K96524J85589M2847J16673K59595
8681A2494402K04795M5868O4078K25039K40481P4503Q354J70696L36472K88676
8671A4153364J17627L7308R6520J92339K34342J98958J20099Q7633J68653K99524
8661A5706367L48253K97331K61007L11074L92593M21817L67943K46037J33297
8652A8485719J59731L51284N23366M93773L62251L76509N40661O00891M52716
$$ plain form
8722 7327003 7496982 7650436 7741364 7818909 7954705 8123623 8211820 8172752 8123359 8213487 8427445
8711 8427445 8615883 8722963 8847787 9034032 9152802 9111665 9049574 9157322 9396722 9589458
8701 9589458 9715744 9896785 10112471 10202827 10184272 10290504 10599655 10879553 10952918 10973805
8691 10973805 11140697 11354621 11421912 11426061 11593174 11889698 12075287 12118134 12234807 12494402
8681 12494402 12699197 12745065 12809143 13034182 13274663 13349166 13357520 13528216 13864688 14153364
8671 14153364 14270991 14308299 14404819 14597158 14831500 15030458 15150557 15238190 15406843 15706367
8661 15706367 16054620 16351951 16612958 16924032 17316625 17738442 18106385 18352422 18485719
8652 18485719 18645450 18996734 19520100 20013873 20376124 20752633 21293294 21894185 22346901
8643B2346901L09623L76576N77656P21388P47958P03734O44954O64212Q39346
8634B7932348J076629J194660J218411J344562J565560J673256J743853K154633
8626C9903912K832120K973955K044194O99586O9789K86482M40904k493n14229
8617D8734220m48501R448K87330L10340M02718O20388P34152P27275P98952R11088
8607E3087410P93606M48886K39509L46208M81829L30341K96j88058j77721j79709
8597E5182597k98829m09328m04148l57464l72885m17750l99320l11223k17462
8588E1994188j60973j64028k36634k89875j48066J96626M51140L89271K77397
8579E2309046N75910J202668J573418J566334J867659K835443L493094K516108
$$ plain form
8643 22346901 22656524 23033100 23610756 24332144 25080102 25783836 26428790 27093002 27932348
8634 27932348 29008977 30203637 31422048 32766610 34332170 36005426 37749279 39903912
8626 39903912 42736032 45709987 47754181 48453767 48523556 48810038 49250942 49248449 48734220
8617 48734220 48285719 48295167 48582497 48892837 49295555 49915943 50650095 51377370 52176322 53087410
8607 53087410 53881016 54329902 54569411 54915619 55397448 55727789 55728085 55540027 55362306 55182597
8597 55182597 54883768 54474440 54070292 53712828 53339943 52922193 52522873 52211650 51994188
8588 51994188 51833215 51669187 51432553 51142678 50994612 51191238 51642378 52031649 52309046
8579 52309046 52884956 54087624 55661042 57227376 59095035 61930478 65423572 67939680
8571F7939680J27870j901276k387124k047674k225455l027969l499616l192857
8563D9785579k651219k395596k256105j919390j518702j341739j346018j295240
8555C5061570j143895j023081r91659r93371r60077q44754o55430n10505n24265
8546B7414533o11272n80353m41176l93526m74774m87465l62893l01275l98498
8537B3363301m28513k23181n454n0456k16891j58366J19172K76674J94221J49841
8527B3020348L66554O76407Q03370P91626R40518J350523J684938J458965N67850
8518C1661099n15089j147948j152724r52434j032059j386699j620141j481627
8510B2372378j120037q32605p38821p44835p12603o02074m89160m62985m99100
$$ plain form
8571 67939680 68067550 66166274 63779150 61731476 59506021 56478052 52978436 49785579
8563 49785579 47134360 44738764 42482659 40563269 39044567 37702828 36356810 35061570
8555 35061570 33917675 32894594 31902935 30909564 29949487 29104733 28449303 27938798 27414533
8546 27414533 26803261 26222908 25781732 25388206 24913432 24425967 24063074 23761799 23363301
8537 23363301 22934788 22711607 22706153 22655697 22438806 22280440 22399612 22676286 22870507 23020348
8527 23020348 23386902 24063309 24866679 25658305 26598823 27949346 29634284 31093249 31661099
8518 31661099 31146010 29998062 28845338 27892904 26860845 25474146 23854005 22372378
8510 22372378 21252341 20419736 19680915 18936080 18223477 17621403 17132243 16669258 16170158
8501A6170158m82769l83673l15402l54575m06951l60961k73560k63587l05891
8492A3022789k93703k38768k33071k61336k38122j94471k27511k86048k24591
8483A0825168p5106l4848j46433k21650j52078o7656q6363j25336r3626p1539
8473I750533j36372j84978j12890k3983o4826j66753j59365n5730j4709p1913
8463H759014j13310r3580q6397j14403j06931n0805k8827p4602j19090j10347
8453G860722p1620k6102J7801L507j10664k14775j42326N3511J04164r4483k81618
8442G098117j73566J19632K26047J3038k50051k59673m0860J36809R7282q2011
8432F884764j98553j40250J4248Q2029j8267j53519j31924K9526J06104j6163
$$ plain form
8501 16170158 15687389 15303716 14988314 14633739 14226788 13865827 13592267 13328680 13022789
8492 13022789 12729086 12490318 12257247 11995911 11757789 11563318 11335807 11049759 10825168
8483 10825168 10750062 10715214 10568781 10347131 10195053 10127397 10041034 9915698 9822072 9750533
8473 9750533 9614161 9429183 9316293 9292310 9227484 9060731 8901366 8845636 8830927 8759014
8463 8759014 8645704 8552124 8465727 8351324 8244393 8193588 8164761 8090159 7971069 7860722
8453 7860722 7789102 7763000 7780801 7784308 7673644 7458869 7316543 7370054 7474218 7379735 7098117
8442 7098117 6924551 7044183 7270230 7283268 7033217 6773544 6732684 6869493 6966775 6884764
8432 6884764 6686211 6545961 6560209 6642238 6623971 6470452 6338528 6368054 6474158 6457995
8422F457995j58063j10317L4949K0990j52175j99930j197J82654R1878j39265
8412F027519j98512n6992N1853L3001J5361M6077J314j32210j70697n2281J5872
8401E580305r9156k01106p9970J14005R5645q5694j23762M0973J26356k8315k00952
8390E138329j29891R9945J97107O2440j27353j76534o8834P4671J33215P4991
8380E278086l2974r4788q3247n0500l9204l1029m09L6028N3858N3608K7171n1894
8368E064706j58376j90157q3038P8037J39416O9104q010Q537N0716p026j31867
8357D832042j45557J2048J49840O5672j56242k44531j13035M8284Q2460O3688
8347D594669R2189Q9052l5304j60431j14568M1444J05438M6938Q284L1325J6511
$$ plain form
8422 6457995 6299932 6189615 6224564 6245554 6093379 5893449 5892252 6074906 6166784 6027519
8412 6027519 5829007 5772015 5823868 5856869 5872230 5918307 5919621 5787411 5616714 5564433 5580305
8401 5580305 5481149 5280043 5200073 5314078 5409723 5324029 5200267 5241240 5367596 5339281 5138329
8390 5138329 5008438 5108383 5305490 5367930 5240577 5064043 4995209 5069880 5203095 5278086
8380 5278086 5245112 5150324 5067077 5016577 4977373 4946344 4945935 4981963 5035821 5089429 5116600 5064706
8368 5064706 4906330 4716173 4633135 4711172 4850588 4919692 4911682 4920219 4970935 4963909 4832042
8357 4832042 4686485 4698533 4848373 4914045 4757803 4513272 4400237 4448521 4530981 4594669
8347 4594669 4686858 4775910 4740606 4580175 4465607 4507051 4612489 4659427 4667711 4699036 4715547
8336D715547m9589o1419j4716k8571r9559o8621Q7159J62226M0399j07261r1247
8325D484348J4293K8743m6547q0436m3643j2984j6926k5281l6459n7616n6135
8314D151357k1228j223j1541o910Q31n4780j12201o811K13255K41924l0615k69040
8302D093018j59128J04982J32793m6755q2655Q9568J76626N8513m2061K611J9489
8291D347001r5433j61399n0456O9673L7008k9165K5108J02174M9185n7385o5074
8280D171237j9365m5780r8747o6922r766m7270j11843n6061O7491Q4160L961o030
8268C865065O3587M1569j02495j67024l5993J24133J10943k6384q9664k3600M1308
8257C801445L938p3314p1134J6505P2731J0109j14418j71260j15786j7044N2479
$$ plain form
8336 4715547 4665958 4604539 4589823 4561252 4461693 4393072 4480231 4642457 4682856 4575595 4484348
8325 4484348 4498641 4527384 4480837 4400401 4356758 4343774 4326848 4301567 4265108 4207492 4151357
8314 4151357 4130129 4128906 4117365 4110455 4111286 4056506 3944305 3937494 4150749 4392673 4362058 4093018
8302 4093018 3933890 4038872 4171665 4124910 4042255 4131823 4308449 4366962 4324901 4327512 4347001
8291 4347001 4251568 4090169 4039713 4109386 4146394 4117229 4142337 4244511 4293696 4236311 4171237
8280 4171237 4151872 4106092 4007345 3940423 3930657 3883387 3771544 3715483 3782974 3867134 3871095 3865065
8268 3865065 3928652 3970221 3867726 3700702 3664709 3788842 3899785 3873401 3783737 3760137 3801445
8257 3801445 3805383 3732069 3660935 3677440 3750171 3760280 3645862 3474602 3358816 3341772 3394251
8246C394251P4421L8795n1001j10600l8330J09931J45289J2476j13313r0487j6826
8235C354606l7020r4487n3891M9535Q5869O3826P3989P2207m3593j82107j39801
8224C149133O0171J60072M7306q9427o5319M7450Q4984M0503J5454L6975M4562
8213C531864p199j07256j95080j81518m0316J11731J26872K3843m4476k1860k370
8202C194235l6290m4537K3559R3264Q5207J3446p3436j30051q7822O0759J60303
8191C258637O3227j04997q5393R9542J55930l086j15664k5415O8972P339l6680
8180C282412P9161J34021p4782k96455j83411J23072K07546L9955m6420L9431
8170C304530N2584o6326o1823J41361K51689Q5144j42508j80010p7917J5340R4110
$$ plain form
8246 3394251 3468672 3507467 3456466 3345866 3307536 3417467 3562756 3575232 3461919 3371432 3354606
8235 3354606 3317586 3223099 3169208 3218743 3304612 3368438 3442427 3514634 3471041 3288934 3149133
8224 3149133 3209304 3369376 3416682 3327255 3261936 3309386 3394370 3434873 3450327 3487302 3531864
8213 3531864 3524665 3417409 3222329 3040811 3000495 3112226 3239098 3262941 3218465 3196605 3194235
8202 3194235 3157945 3113408 3136967 3230231 3315438 3328884 3255448 3125397 3037575 3098334 3258637
8191 3258637 3321864 3216867 3131474 3231016 3386946 3383860 3268196 3242781 3311753 3319092 3282412
8180 3282412 3361573 3495594 3420812 3124357 2940946 3064018 3271564 3311519 3265099 3304530
8170 3304530 3357114 3290788 3228965 3370326 3622015 3707159 3564651 3384641 3306724 3322064 3416174
8159C416174J50748Q0876p5054q2489R1383J35980j00724k82442q8662K28361
8149C474151K09521p7646j50476J07549K69812N5973k36001k00416Q4144K11387
8139C747998L2203j88631j69624M2165J85658J33361J6951R813Q4729Q0454l6086
8128C938991j17543o4390M6533J17805J54779J48950K2790j72992j99665L3873
8118C909131K50133J66845o9126j11309M3872J06840K6168M9090K11482K10450
8108D793576n2434k12308M274L03484K51906n9837j75652L2373K30785J71022
8098E287189L228l8301K8927N6285K0740O342M3250Q7706R7065M8669n3660j36889
8086E450551r4244P2691K08346J71633J2061r0970m6331N6345P8686L124o7601
$$ plain form
8159 3416174 3566922 3647798 3572744 3490255 3581638 3717618 3616894 3334452 3245790 3474151
8149 3474151 3683672 3606026 3455550 3563099 3832911 3888884 3652883 3452467 3536611 3747998
8139 3747998 3780201 3591570 3421946 3464111 3649769 3783130 3800081 3809894 3894623 3975077 3938991
8128 3938991 3821448 3757058 3803591 3921396 4076175 4225125 4247915 4074923 3875258 3909131
8118 3909131 4159264 4326109 4256983 4145674 4189546 4296386 4322554 4371644 4583126 4793576
8108 4793576 4741142 4528834 4533108 4836592 5088498 5028661 4853009 4885382 5116167 5287189
8098 5287189 5290417 5252116 5281043 5337328 5358068 5364410 5407660 5495366 5592431 5641100 5587440 5450551
8086 5450551 5356307 5428998 5637344 5808977 5821038 5730068 5683737 5740082 5818768 5821892 5754291
8075E754291n6331O59K9476K5678K8929L3654J3880J4784J01282K07657J81090
8064F335049K5509n1585O4316K00000J48527p065k6266J09763J86214J09163L4460
8053G128085R0963J86581J87357J19407P6226N9325L1721J9839L8999J0165j19157
8042G829511k42356k17582q1913j2510q8771k04395k21007j23615j1086J2776
8032F639052o3176j38792j07610r77L7638l9979j03522m8686K3959k8506j35574
8021F033827j04166O7747J69254R1619k6170l5300J1304m999n6952l4112O6073
8010F178125J43740J48420J10910N2080l3763j12017j14756k8006Q2017J33484
8000F560234R0332j6620r7596p4744J3256L3275o0134j37775q1698J4629k9064
$$ plain form
8075 5754291 5697960 5698619 5728095 5753773 5782702 5816356 5830236 5845020 5946302 6153959 6335049
8064 6335049 6360558 6308973 6373289 6573289 6721816 6714751 6688485 6798248 6984462 7093625 7128085
8053 7128085 7219048 7405629 7592986 7712393 7788619 7847944 7879665 7899504 7938503 7948668 7829511
8042 7829511 7587155 7369573 7287660 7275150 7186379 6981984 6760977 6637362 6626276 6639052
8032 6639052 6575876 6437084 6329474 6328497 6366135 6326156 6222634 6173948 6197907 6169401 6033827
8021 6033827 5929661 5997408 6166662 6258281 6232111 6196811 6208115 6203116 6146164 6112052 6178125
8010 6178125 6321865 6470285 6581195 6633275 6599512 6487495 6372739 6344733 6426750 6560234
8000 6560234 6650566 6633946 6536350 6461606 6474862 6508137 6448003 6310228 6228530 6243159 6214095
7989F214095j91411k55642j27669J9286q09j23987j53000n1647K4595k7727j19938
7978E206146j13065j0829N6028O071r4213j21364m9283K5701J0980p6098j50706
7967D689368j63991j19579l2721N4438N3667p0092j92964j49866K4037J06593
7957D198890m941j47781j50308q6968j17378j86884j09001R2387J63216r845k16295
7946C425092k15426n2971N3307K9033j8795k1102l2143q3090r3819k190J02097
7935C089993O9056r9545k14518j22860P8570J40944j4780j78423j29205N6969
7925B676201J18861j4212j37700r0122K5424L1234o2381j18352r3348n2318k9155
7914B254132j1328j7394n9443o8469J2601J00799P7891j3357l6898l45l6143j42308
$$ plain form
7989 6214095 6022684 5767042 5639373 5658659 5657850 5533863 5380863 5329216 5353811 5326084 5206146
7978 5206146 5093081 5082252 5138280 5144351 5050138 4928774 4879491 4905192 4916172 4840074 4689368
7967 4689368 4525377 4405798 4373077 4427515 4481182 4411090 4218126 4068260 4092297 4198890
7957 4198890 4193949 4046168 3895860 3808892 3691514 3504630 3395629 3488016 3651232 3641387 3425092
7946 3425092 3209666 3156695 3210002 3239035 3220240 3199138 3166995 3083905 2990086 2987896 3089993
7935 3089993 3159049 3059504 2844986 2722126 2800696 2941640 2926860 2748437 2619232 2676201
7925 2676201 2795062 2780850 2643150 2553028 2578452 2609686 2547305 2428953 2335605 2283287 2254132
7914 2254132 2242804 2225410 2165967 2097498 2110099 2210898 2288789 2275432 2238534 2238189 2202046 2059738
7902B059738j53599k5389O5272N026o6396r69R4741L8205j07886j19252L7262
7891A826753J55224R8308l4681r6147p8345m8754k7082r374k1585o5673p5393
7880A623251k756Q9607Q9859k1357j36054j31619n910J07386P8284n9150j34380
$$ plain form
7902 2059738 1906139 1880750 1946022 1951048 1884652 1883683 1978424 2016629 1908743 1789491 1826753
7891 1826753 1981977 2080285 2045604 1949457 1871112 1822358 1795276 1785902 1764317 1698644 1623251
7880 1623251 1620495 1710102 1799961 1778604 1642550 1510931 1505021 1612407 1690691 1631541 1497161
$$ [...]
##END NTUPLES=NMR SPECTRUM
##END=
