##TITLE=1H ikalashn
CG-1214-A3
25.10.2024
##JCAMPDX= 6.0         $$ Bruker NMR JCAMP-DX V2.0
##DATA TYPE= NMR SPECTRUM
##DATA CLASS= NTUPLES
##ORIGIN= UXNMR, Bruker Analytische Messtechnik GmbH
##OWNER= root
$$ TOPSPIN		Version 1.3
$$ 2024-10-25 10:54:21.203 +0400  Irina@DPX200
$$ Compression mode = diff/dup
##.OBSERVE FREQUENCY= 200.131300845
##.OBSERVE NUCLEUS= ^1H
##.ACQUISITION MODE= SIMULTANEOUS
##.ACQUISITION SCHEME= undefined
##.AVERAGES= 32
##.DIGITISER RES= 18
##SPECTROMETER/DATA SYSTEM= spect
##.PULSE SEQUENCE= zg
##.SOLVENT NAME= CDCl3
##.SHIFT REFERENCE= INTERNAL, CDCl3, 1, 17.49637
##AUDIT TRAIL= $$ (NUMBER, WHEN, WHO, WHERE, WHAT)
$$ ##TITLE= Audit trail, TOPSPIN		Version 1.3
$$ ##JCAMPDX= 5.01
$$ ##ORIGIN= Bruker BioSpin GmbH
$$ ##OWNER= Irina
$$ $$ F:/spectra/data/iren/nmr/1H/4/pdata/1/auditp.txt
$$ ##AUDIT TRAIL=  $$ (NUMBER, WHEN, WHO, WHERE, VERSION, WHAT)
(   1,<2024-10-25 10:53:53.484 +0400>,<Irina>,<DPX200>,<TOPSPIN 1.3>,
      <created by zg
	started at 2024-10-25 10:51:45.015 +0400,
	POWCHK disabled, PULCHK disabled
       configuration hash MD5:
       BE 6D 3F 07 2A EA 11 49 91 17 2B D3 AF B3 58 0D
       data hash MD5: 16K
       0A C1 6D 30 01 E4 61 9C CF 58 A3 3B B1 62 DE 92>)
(   2,<2024-10-25 10:53:56.125 +0400>,<Irina>,<DPX200>,<TOPSPIN 1.3>,
      <Start of raw data processing
       efp BC_mod = 2 LB = 0.02 FT_mod = 6 PKNL = 1 PHC0 = 320.1802 PHC1 = 4.90348 SI = 32K 
       data hash MD5: 32K
       42 43 13 4F 7B 10 97 BD 57 90 A5 8A A1 44 25 99>)
(   3,<2024-10-25 10:53:58.984 +0400>,<Irina>,<DPX200>,<TOPSPIN 1.3>,
      <apk 
       data hash MD5: 32K
       C0 F0 CE E8 5D 5C A1 3F E4 B8 2E 64 39 4A 87 FA>)
(   4,<2024-10-25 10:54:12.671 +0400>,<Irina>,<DPX200>,<TOPSPIN 1.3>,
      <pk fgphup PHC0 = 2.597095 PHC1 = -8.8 
       data hash MD5: 32K
       D6 97 1C 03 37 17 58 A8 D1 BD 58 97 C7 5B 4E F1>)
(   5,<2024-10-25 10:54:14.093 +0400>,<Irina>,<DPX200>,<TOPSPIN 1.3>,
      <abs n ABSG = 5 
       data hash MD5: 32K
       E2 00 C8 B5 8F A6 41 3D 19 E3 55 9E 57 58 56 2A>)
$$ ##END=
$$ 
$$ $$ hash MD5
$$ $$ B5 20 1E FB E3 C6 42 F3 04 6A 9F 04 ED A2 3F 65
##$RELAX= 
##$RELAX= 
##$RELAX= 
##$RELAX= 
##$RELAX= 
##$RELAX= 
##$RELAX= 
##$RELAX= 
##$RELAX= 
$$ Bruker specific parameters
$$ --------------------------
##$DU= <F:/spectra>
##$EXPNO= 4
##$NAME= <1H>
##$PROCNO= 1
##$TYPE= <nmr>
##$USER= <iren>
##$AMP= (0..31)
100 100 100 100 100 100 100 100 100 100 100 100 100 100 100 100 100 100 
100 100 100 100 100 100 100 100 100 100 100 100 100 100 
##$ANAVPT= -1
##$AQSEQ= 0
##$AQ_mod= 1
##$AUNM= <au_zg>
##$AUTOPOS= <>
##$BF1= 200.13
##$BF2= 200.13
##$BF3= 200.13
##$BF4= 200.13
##$BF5= 200.13
##$BF6= 200.13
##$BF7= 200.13
##$BF8= 200.13
##$BYTORDA= 1
##$CFDGTYP= 0
##$CFRGTYP= 5
##$CHEMSTR= <none>
##$CNST= (0..63)
1 1 145 1 1 1 1 1 1 1 1 1 1 1 1 1 1 1 1 1 1 1 1 1 1 1 1 1 1 1 1 1 1 1 
1 1 1 1 1 1 1 1 1 1 1 1 1 1 1 1 1 1 1 1 1 1 1 1 1 1 1 1 1 1 
##$CPDPRG= <>
##$CPDPRG1= <>
##$CPDPRG2= <>
##$CPDPRG3= <>
$$ [...]
##$SW_h= 4401.40845070422
##$TD= 16384
##$TD0= 1
##$TE= 300
##$TE2= 300
##$TE3= 300
##$TEG= 300
##$TL= (0..7)
0 120 120 120 120 120 120 120 
##$TP= (0..7)
150 150 150 150 150 150 150 150 
##$TP07= 0
##$TPNAME0= <>
##$TPNAME1= <>
##$TPNAME2= <>
##$TPNAME3= <>
##$TPNAME4= <>
##$TPNAME5= <>
##$TPNAME6= <>
##$TPNAME7= <>
##$TPOAL= (0..7)
0.5 0.5 0.5 0.5 0.5 0.5 0.5 0.5 
##$TPOFFS= (0..7)
0 0 0 0 0 0 0 0 
##$TUNHIN= 0
##$TUNHOUT= 0
##$TUNXOUT= 0
##$USERA1= <user>
##$USERA2= <user>
##$USERA3= <user>
##$USERA4= <user>
##$USERA5= <user>
##$V9= 5
##$VALIST= <valist>
##$VCLIST= <CCCCCCCCCCCCCCC>
##$VD= 0
##$VDLIST= <DDDDDDDDDDDDDDD>
##$VPLIST= <PPPPPPPPPPPPPPP>
##$VTLIST= <TTTTTTTTTTTTTTT>
##$WBST= 1024
##$WBSW= 25
##$XGAIN= (0..3)
0 0 0 0 
##$XL= 0
##$YL= 0
##$YMAX_a= 1042289
##$YMIN_a= -1972172
##$ZGOPTNS= <>
##$ZL1= 120
##$ZL2= 120
##$ZL3= 120
##$ZL4= 120
##$ABSF1= 17.49637
##$ABSF2= -4.496376
##$ABSG= 5
##$ABSL= 3
##$ALPHA= 0
##$AQORDER= 0
##$ASSFAC= 0
##$ASSFACI= 0
##$ASSFACX= 0
##$ASSWID= 0
##$AUNMP= <proc_1d>
##$AXLEFT= 0
##$AXRIGHT= 0
##$AXTYPE= 0
##$AXUNIT= <>
##$AZFE= 0.1
##$AZFW= 0.1
##$BCFW= 0
##$BC_mod= 2
##$BYTORDP= 0
##$COROFFS= 0
##$CY= 7568.61572265625
##$DATMOD= 1
##$DC= 0
##$DFILT= <>
##$DTYPP= 0
##$F1P= 17.9538593292236
##$F2P= -4.03888763876832
##$FCOR= 0.5
##$FTSIZE= 32768
##$FT_mod= 6
##$GAMMA= 0
##$GB= 0
##$INTBC= 0
##$INTSCL= 1.936888e-010
##$ISEN= 128
##$LB= 0.02
##$LEV0= 0
##$LPBIN= 0
##$MAXI= 945.577
##$MC2= 0
##$MEAN= 0
##$ME_mod= 0
##$MI= -402.1523
##$NCOEF= 0
##$NC_proc= -6
##$NLEV= 6
##$NOISF1= 8.587773
##$NOISF2= 6.764455
##$NSP= 0
##$NTH_PI= 0
##$NZP= 0
##$OFFSET= 17.49637
##$PC= 1
##$PHC0= 321.3682
##$PHC1= 1.603909
##$PH_mod= 1
##$PKNL= yes
##$PPARMOD= 0
##$PPDIAG= 0
##$PPIPTYP= 0
##$PPMPNUM= 100
##$PPRESOL= 1
##$PSCAL= 0
##$PSIGN= 0
##$REVERSE= no
##$SF= 200.13
##$SI= 32768
##$SIGF1= 16.12182
##$SIGF2= -4.496377
##$SINO= 3.521527
##$SIOLD= 32768
##$SREGLST= <1H.CDCl3>
##$SSB= 0
##$STSI= 32768
##$STSR= 0
##$SW_p= 4401.40845070422
##$SYMM= 0
##$S_DEV= 0
##$TDeff= 16384
##$TDoff= 0
##$TI= <>
##$TILT= no
##$TM1= 0
##$TM2= 0
##$TOPLEV= 0
##$USERP1= <user>
##$USERP2= <user>
##$USERP3= <user>
##$USERP4= <user>
##$USERP5= <user>
##$WDW= 1
##$XDIM= 32768
##$YMAX_p= 447967319
##$YMIN_p= -1101288
$$ End of Bruker specific parameters
$$ ---------------------------------
##NTUPLES= NMR SPECTRUM
##VAR_NAME=  FREQUENCY,     SPECTRUM/REAL,   SPECTRUM/IMAG
##SYMBOL=    X,             R,               I
##VAR_TYPE=  INDEPENDENT,   DEPENDENT,       DEPENDENT
##VAR_FORM=  AFFN,          ASDF,            ASDF
##VAR_DIM=   32768,         32768,           32768
##UNITS=     HZ,            ARBITRARY UNITS, ARBITRARY UNITS
##FACTOR=    0.134324425510551, 1,           1
##FIRST=     4401.40845070422, 39564,        -3131985
##LAST=      0,             -358262,         -3585659
##MIN=       0,             -1101288,        0
##MAX=       4401.40845070422, 447967319,    0
$$ Real data points
##PAGE= N=1
##DATA TABLE= (X++(R..R)), XYDATA
$$ [...]
14900 8226680 8117339 8087629 8156633 8282086 8375194 8379129 8408271 8637796 8984059 9135989
14890 9135989 9017674 8929854 9055894 9155762 9023120 8916964 9153168 9536810 9663228 9588631
14880 9588631 9687706 9964180 10063046 9943492 9959083 10196202 10313773 10205143 10241442 10584126
14870 10584126 10806963 10596613 10351604 10584828 11094692 11294335 11126307 11057318 11275097
14861 11275097 11482192 11505264 11556492 11758538 11889090 11808700 11752375 11941404 12208286 12274527
14851 12274527 12171365 12129783 12240871 12467823 12814490 13212801 13402878 13245301 13052210
14842 13052210 13253525 13760662 14041217 13889989 13731909 13968484 14384153 14533133 14462530
14833 14462530 14618073 15122233 15600032 15788908 15908900 16235632 16645888 16875379 16989536
14824 16989536 17255843 17671926 17965136 18031766 18060404 18187306 18320201 18390876 18523751 18810574
14814 18810574 19112634 19250416 19263167 19336221 19556945 19857061 20128314 20306222 20397021 20480833
14804 20480833 20630823 20810049 20933248 21019466 21141315 21227131 21109199 20801097 20503876 20273841
14794 20273841 19941988 19473348 19113529 18986549 18837211 18447350 18044739 17937858 17944180 17617587
14784 17617587 16956874 16436246 16305016 16271197 15988918 15508176 15084823 14820402 14649493
14775 14649493 14471985 14181871 13767433 13454040 13491847 13716503 13636744 13121222 12665373 12709207
14765 12709207 12986434 12923134 12482199 12165390 12228526 12344964 12158955 11805357 11651418 11750974
14755 11750974 11822840 11683398 11459970 11355608 11380507 11401083 11347506 11256378 11152670 11021317
14745 11021317 10910268 10928545 11071777 11166299 11095074 10976390 10975761 11036180 10989442 10869657 10870990
14734 10870990 10999712 11037074 10910234 10835134 10964890 11132514 11117032 10975586 10916185 10983186
14724 10983186 11060461 11076349 11029244 10906261 10739608 10651552 10692580 10732797 10652655 10515235
14714 10515235 10399260 10226175 9959379 9805449 9936750 10132709 10013833 9576709 9182425
14705 9182425 9035801 8998016 8928640 8872801 8830545 8665379 8379714 8200527 8227092 8241185
14695 8241185 8052407 7808515 7743039 7794982 7727379 7508845 7331910 7305978 7350298 7377698
14685 7377698 7394458 7398841 7338515 7217658 7135090 7156059 7210512 7174265 7028396 6896129 6903993
14674 6903993 7018090 7063064 6933248 6735565 6660048 6752470 6898681 6987421 6973797 6822054
14664 6822054 6541169 6275538 6197961 6284482 6343553 6290545 6227082 6219485 6196591 6131721 6116170
14653 6116170 6150269 6074839 5852070 5704735 5787179 5909052 5823317 5634189 5637244 5847694
14643 5847694 5990343 5936274 5854227 5884656 5930757 5872844 5771342 5724571 5692536 5608989 5544219
14632 5544219 5594823 5684390 5641657 5467603 5373084 5495242 5685468 5688687 5492895 5361557
14622 5361557 5472627 5656595 5627953 5398492 5264268 5379479 5559787 5595343 5558238 5635558
14612 5635558 5802929 5873278 5804750 5761634 5876469 6107954 6343014 6514743 6612183 6678959
14602 6678959 6803885 7022790 7243408 7356536 7395143 7483758 7654848 7818788 7896391 7885459
14592 7885459 7825312 7794201 7899432 8148653 8360659 8330686 8069447 7767464 7553856 7412477
14582 7412477 7297221 7181849 7014051 6768842 6540277 6439939 6418608 6334281 6174341 6045239
14572 6045239 5963892 5852417 5734613 5718477 5757850 5669699 5458200 5375087 5526962 5651043
14562 5651043 5479655 5156747 5045030 5200436 5298677 5114328 4855895 4888485 5228990 5499065
14552 5499065 5407020 5109051 4943270 4922536 4767634 4447984 4327885 4586989 4838558 4675074
14542 4675074 4334930 4358887 4728380 4896751 4681120 4542224 4805568 5135906 5095432 4805076
14532 4805076 4678633 4801332 4943371 4974110 4927572 4833624 4777954 4940195 5277939 5385290
14522 5385290 5015221 4558237 4601478 5129637 5578370 5627924 5523593 5578110 5747376 5825862
14512 5825862 5778049 5726166 5771655 5915400 6056705 6073410 5990810 5982921 6088325 6090222 5873249
14501 5873249 5694890 5803964 5976777 5826503 5451541 5320965 5547676 5745611 5657827 5467366
14491 5467366 5371035 5283412 5137507 5079188 5148163 5118882 4886533 4685611 4685946 4689708 4505189
14480 4505189 4323711 4395570 4568329 4505499 4205988 3960225 3891974 3873149 3839865 3875680
14470 3875680 3967600 3952380 3776569 3613664 3631671 3765949 3813146 3698907 3572676 3605196
14460 3605196 3726988 3682030 3404081 3191874 3329377 3648360 3736724 3527064 3358012 3433918
14450 3433918 3563953 3526800 3371996 3227227 3097470 2995481 2999889 3058162 3007439 2887621
14440 2887621 2912555 3044526 2998041 2785936 2778541 3022224 3046173 2659418 2367092 2550945
14430 2550945 2795084 2602963 2279404 2397840 2792270 2859414 2578725 2425761 2471781 2397379
14420 2397379 2265345 2414673 2652048 2460822 2030482 2106961 2685325 2875316 2362588 1962364
14410 1962364 2225996 2495980 2062846 1408757 1413668 1954173 2236815 2099690 2037510 2176056
14400 2176056 2132346 1833286 1676941 1828166 2000916 2004977 1959615 1921648 1806514 1709367
14390 1709367 1825129 2027767 1998419 1786726 1761666 1969853 2041833 1819890 1589852 1553048
14380 1553048 1525999 1349025 1191696 1242509 1419943 1571342 1670525 1682559 1535337 1356305
14370 1356305 1420207 1710172 1842061 1597200 1237318 1105814 1190865 1281013 1303977 1303279 1283985
14359 1283985 1262158 1286175 1283816 1109448 858763 861815 1198882 1503202 1453702 1203138 1081753
14348 1081753 1120862 1141419 1110453 1121787 1172846 1220473 1323035 1491102 1548494 1390140 1221555
14337 1221555 1264746 1370315 1238885 929265 805596 1004104 1265882 1324809 1195888 1036599
14327 1036599 951134 983531 1114804 1222667 1200858 1132543 1186634 1342988 1401421 1287940
14317 1287940 1177093 1250870 1463007 1600409 1505631 1223640 976701 954948 1082583 1087451
14307 1087451 877192 694330 761149 950131 1023368 1027565 1154879 1339519 1350229 1222177
14297 1222177 1209138 1307470 1241961 995056 918549 1158662 1387783 1352646 1297810 1504665
14287 1504665 1744022 1626396 1280464 1199398 1494182 1765445 1736264 1577996 1504760 1445346
14277 1445346 1314920 1278882 1468012 1655798 1526219 1148546 901980 970693 1166596 1254255
14267 1254255 1213325 1128531 1036586 983666 1058027 1234111 1322610 1221042 1096265 1148584 1293360
14256 1293360 1287161 1112192 989341 1007511 1006283 900162 852184 971211 1072932 967097
14246 967097 803850 860191 1087064 1164923 985087 792775 811891 979139 1133828 1250099
14236 1250099 1351570 1364349 1215866 995448 883456 946615 1078403 1130043 1068238 1002729
14226 1002729 1032892 1066711 908029 598324 500161 839530 1304441 1394716 1103098 899189
14216 899189 1031789 1239664 1253729 1178361 1166547 1095742 870140 730773 898942 1149152
14206 1149152 1131557 942806 957199 1206067 1368059 1335931 1344978 1496858 1579055 1463728
14196 1463728 1304169 1196507 1012532 755005 727619 1084391 1487532 1522256 1263372 1125385
14186 1125385 1278187 1514333 1631777 1655125 1660316 1619990 1505550 1405224 1458208 1703663
14176 1703663 1997666 2084081 1842297 1498688 1444014 1749515 2036907 1984699 1780993 1823534
14166 1823534 2106320 2238977 2047784 1803136 1767865 1847142 1861389 1890711 2088679 2335491
14156 2335491 2376014 2226384 2152498 2244770 2294936 2171177 2053186 2127160 2252088 2173533
14146 2173533 1956221 1919281 2150722 2372582 2370204 2282547 2294545 2287344 2073905 1819776 1873138
14135 1873138 2213181 2428874 2307832 2104767 2091745 2171387 2154172 2125954 2239141 2360936
14125 2360936 2279053 2110472 2131983 2286041 2250648 1991746 1840804 1949279 2054555 1936633
14115 1936633 1757666 1747435 1859704 1971771 2137069 2363071 2404966 2125230 1849174 1963100
14105 1963100 2292138 2318122 1973790 1749239 1926936 2171216 2103331 1902027 1982937 2315460
14095 2315460 2462868 2245607 1997421 2068147 2337891 2417335 2206427 2029645 2181817 2511425
14085 2511425 2614434 2386858 2172183 2284796 2587471 2728619 2652444 2600699 2667873 2680419
14075 2680419 2570750 2545823 2722805 2874052 2770974 2571550 2581129 2765152 2817776 2669051
14065 2669051 2603652 2817083 3119509 3213658 3094378 3020538 3171028 3450681 3620468 3551632
14055 3551632 3338267 3174852 3152132 3220329 3327778 3469887 3569750 3483799 3243791 3128407
14045 3128407 3314869 3600776 3692398 3635911 3676319 3787820 3708928 3437604 3299950 3431798
14035 3431798 3560479 3467559 3328972 3367439 3467082 3417044 3295392 3294212 3348064 3270915 3131280
14024 3131280 3146201 3279259 3289863 3156853 3112078 3225390 3285225 3178533 3092064 3192290
14014 3192290 3343978 3324114 3149199 3012026 2996820 3020221 3009457 3004384 3066063 3152651 3139354
14003 3139354 2989099 2867092 2970312 3219707 3299428 3113088 2990898 3216591 3537347 3489046
13993 3489046 3107054 2894838 3067363 3262454 3146518 2903838 2872969 3014632 3050171 2916210
13983 2916210 2778058 2727469 2733136 2790049 2889061 2933898 2891876 2912185 3085076 3217815 3100805
13972 3100805 2879386 2871309 3084666 3218683 3122246 2958767 2898547 2923810 2985172 3092811
13962 3092811 3180834 3117209 2937502 2858648 2969357 3106557 3135684 3150732 3270376 3422712
13952 3422712 3487241 3494382 3512522 3465650 3262028 3031367 3030714 3314984 3657280 3822678 3800682
13941 3800682 3727522 3684610 3656412 3634413 3656960 3724138 3757113 3714574 3693041 3797003 3936752
13930 3936752 3919021 3764243 3730655 3919116 4066941 3926985 3666602 3621284 3780345 3835433
13920 3835433 3677854 3506404 3445252 3413032 3423712 3636621 3970738 4041477 3710147 3380115
13910 3380115 3461370 3795036 3929458 3770899 3607946 3612619 3682525 3745499 3882944 4100357
13900 4100357 4236216 4181304 4020284 3913530 3968630 4217083 4569047 4812458 4814819 4702927
13890 4702927 4690974 4784737 4844440 4880098 5036141 5292805 5450413 5460506 5524191 5773876
13880 5773876 6077525 6266184 6359818 6446133 6506850 6496824 6461398 6460386 6489977 6558122 6698392
13869 6698392 6839818 6839077 6732326 6748838 6943213 7043962 6869086 6668024 6759068 6990627
13859 6990627 6925819 6508586 6172693 6231792 6488928 6578842 6426765 6196689 5999759 5858670
13849 5858670 5816920 5877468 5911941 5801119 5610171 5485170 5440335 5391046 5333085 5326668 5347240
13838 5347240 5323409 5297753 5370678 5489546 5483265 5329847 5198733 5181495 5178644 5129101 5144724
13827 5144724 5292438 5429827 5412481 5302860 5211328 5098420 4929286 4852800 4978741 5122626
13817 5122626 5060667 4918798 4975606 5165941 5169231 4966160 4877567 4994424 5018041 4811189
13807 4811189 4663681 4774629 4880148 4707201 4444903 4409334 4541153 4615090 4673222 4830565
13797 4830565 4896285 4665551 4402096 4514421 4869127 4963269 4726742 4595824 4764186 4922139
13787 4922139 4852074 4749360 4767783 4731650 4530557 4371809 4397545 4441911 4403606 4465155 4688762
13776 4688762 4798224 4656245 4555722 4694728 4763620 4475510 4148256 4259362 4684953 4900266
13766 4900266 4762433 4594275 4608353 4723734 4875190 5054715 5107118 4913069 4710101 4798704
13756 4798704 5005591 4917304 4593663 4510948 4775936 4963247 4847316 4736566 4872720 5018838
13746 5018838 4935979 4818972 4912826 5065741 5034689 4943032 5053676 5296331 5376072 5209733
13736 5209733 4957236 4749969 4649959 4736166 4966556 5090780 4969691 4853283 5054814 5457289
13726 5457289 5656966 5540534 5402317 5479469 5660014 5720384 5625493 5498461 5446910 5498078
13716 5498078 5601241 5648576 5579284 5483433 5519142 5711771 5908637 5948255 5824712 5682151
13706 5682151 5678913 5846006 6064429 6201534 6247179 6259189 6233307 6160451 6163810 6369218 6635022
13695 6635022 6664721 6458217 6381455 6652547 7022279 7157378 7097703 7089487 7171611 7210162 7194993
13684 7194993 7218892 7266299 7276967 7319306 7462871 7598213 7629572 7701450 7947045 8164732
13674 8164732 8093766 7888862 7921314 8180905 8309486 8217338 8210025 8436080 8652094 8671281
13664 8671281 8641129 8705528 8763975 8757205 8833637 9014621 9044849 8835415 8722207 8969993 9312445
13653 9312445 9348163 9162533 9158558 9421732 9657621 9693453 9665390 9709349 9794322 9895952 10046592
13642 10046592 10154896 10034965 9710741 9486655 9599305 9930844 10160612 10113290 9896180
13633 9896180 9757351 9847826 10086693 10255697 10242956 10144299 10098319 10121453 10175640 10281921
13623 10281921 10450897 10600630 10674239 10746574 10879103 10974959 10941907 10892867 10984248 11143339
13613 11143339 11185133 11133154 11163154 11260542 11231796 11093506 11144834 11526339 11960973 12116436
13603 12116436 12043239 12052383 12273778 12538379 12654492 12628776 12598968 12662280 12809308 12972891
13593 12972891 13105610 13212817 13323707 13458602 13636497 13865514 14089507 14211809 14239660
13584 14239660 14329255 14588702 14914397 15150532 15324881 15550732 15772580 15849093 15862118 16062145
13574 16062145 16458595 16749068 16773756 16775357 17029363 17443801 17753228 17935192 18172858 18509375
13564 18509375 18803645 18994184 19175634 19406394 19627447 19793711 19940697 20109094 20320282
13555 20320282 20606017 20935920 21157234 21171113 21145963 21366243 21851942 22313169 22529063 22597409
13545 22597409 22736805 23001850 23294078 23529177 23690677 23813819 23996373 24323505 24707529
13536 24707529 24926952 24926041 24944817 25209368 25609801 25874110 25985878 26199056 26631563 27066262
13526 27066262 27244887 27201524 27182927 27330707 27564103 27740259 27829109 27919576 28105098 28383343
13516 28383343 28662267 28859554 28974463 29047375 29094680 29132560 29212857 29352043 29470005 29507623
13506 29507623 29559650 29741620 29955801 29989665 29860360 29824854 29976845 30095893 30042757 30033490
13496 30033490 30278624 30585878 30648315 30558617 30652475 30932746 31076313 31014352 31061940 31368398
13486 31368398 31665977 31758056 31866055 32211487 32579140 32643535 32499594 32498923 32696560 32819180
13476 32819180 32725244 32579070 32569792 32709545 32916449 33093732 33133894 33021349 32910700 32955305
13466 32955305 33110960 33239475 33294350 33249639 33015910 32658270 32520455 32820456 33257104 33367423
13456 33367423 33171016 33073802 33208702 33317670 33283379 33300710 33431610 33450796 33296614 33253791
13446 33253791 33476451 33705969 33702081 33615761 33673762 33794926 33798931 33743825 33783434 33895657 33987086
13435 33987086 34073702 34168294 34209170 34262828 34520189 34918091 35102021 34987078 34975389 35322922
13425 35322922 35695524 35737842 35679324 35886314 36180825 36205428 36180550 36600221 37315892 37652171
13415 37652171 37446458 37282851 37564263 37982056 38130844 38105165 38188245 38369118 38475941 38487864
13405 38487864 38461566 38377566 38236432 38105087 37973497 37788148 37649877 37682450 37701434 37396282
13395 37396282 36885192 36648787 36795690 36847220 36441932 35828024 35419821 35252016 35130727
13386 35130727 34977119 34763814 34426198 34065335 33923737 33969881 33869503 33549058 33344844
13377 33344844 33368404 33245540 32815112 32532193 32714310 32916807 32644133 32216695 32233013 32532670
13367 32532670 32477536 32043221 31814950 31969428 32054886 31842184 31660675 31728259 31792466 31652989
13357 31652989 31488921 31439963 31344175 31107468 30897174 30777282 30579471 30319787 30301876 30590677
13347 30590677 30806949 30680251 30404977 30212173 30005873 29706262 29543889 29663125 29781620
13338 29781620 29621591 29394063 29467623 29777180 29938797 29797093 29531467 29348447 29345734 29541910
13328 29541910 29790510 29825667 29633028 29574445 29873024 30205214 30157233 29889309 29913549 30308471
13318 30308471 30610709 30514702 30268948 30246510 30437341 30559113 30484710 30364437 30373509 30462471
13308 30462471 30411390 30137331 29868033 29868012 30027673 29972048 29630781 29389412 29506882 29707353
13298 29707353 29639891 29455819 29526642 29783670 29816330 29568484 29455652 29714276 30050097 30096744
13288 30096744 29903680 29771496 29833948 30005734 30197276 30396227 30594500 30750392 30815990 30788025
13278 30788025 30758643 30859372 31078100 31222218 31191890 31181847 31417828 31780456 31938076 31817710
13268 31817710 31684336 31744237 31924609 32087159 32214373 32313871 32364660 32444907 32700453 33082646
13258 33082646 33318072 33272495 33177546 33339397 33737618 34074093 34170820 34183802 34399144 34875180
13248 34875180 35346529 35534533 35521401 35672566 36146464 36680226 36994619 37192027 37515814
13239 37515814 37908549 38140292 38258644 38537802 39010233 39406826 39581332 39670308 39810456
13230 39810456 40012524 40327212 40808122 41305800 41643595 41970271 42523865 43087206 43223622
13221 43223622 43091304 43368120 44180714 44811192 44827340 44806583 45382722 46187826 46479003 46377560
13211 46377560 46639013 47405866 48037488 48172212 48192343 48492461 48924571 49191466 49293331
13202 49293331 49356222 49397827 49434935 49493274 49408268 48970399 48354985 48015994 48033421 47964861
13192 47964861 47502070 46880250 46433575 46117780 45725312 45256896 44813908 44382520 43967275
13183 43967275 43696413 43566954 43330630 42870745 42452199 42340260 42393201 42305689 42055835 41824548
13173 41824548 41647479 41449566 41290255 41275813 41321497 41266487 41136863 41050745 40970593 40811064
13163 40811064 40685089 40753668 40915710 40952840 40923012 41083284 41436069 41685012 41682996 41616821
13153 41616821 41674099 41812031 41956535 42166226 42467917 42754304 42979603 43254908 43616500
13144 43616500 43901673 44013784 44127205 44445217 44905496 45316115 45646537 45968858 46224770
13135 46224770 46308768 46336868 46570225 47043636 47492317 47708468 47780282 47903774 48141260 48469468
13125 48469468 48893365 49368620 49757757 50035028 50406603 51014489 51625032 51891516 51897282 52117718
13115 52117718 52770549 53521289 53998909 54306057 54751592 55321458 55780258 56159303 56724569
13106 56724569 57470425 58059100 58359981 58668774 59209579 59760856 60045767 60220864 60627016
13097 60627016 61213760 61592676 61637011 61681634 62046854 62632739 63124255 63408324 63613669 63842255
13087 63842255 64052498 64214435 64433185 64827382 65344465 65808807 66159126 66520282 66985557
13078 66985557 67464572 67873207 68337128 68990676 69670813 70108319 70402647 70956887 71864356
13069 71864356 72725158 73245010 73662262 74315676 75107041 75742629 76254209 76870719 77548171
13060 77548171 78070626 78524587 79220116 80154492 80986947 81582525 82163002 82844677 83453089
13051 83453089 83939450 84571865 85491984 86431267 87134525 87783977 88712976 89906230 91066458
13042 91066458 92033922 92895868 93795250 94840145 96090779 97442633 98631773 99541770 100403015
13033 100403015 101519396 102915741 104430726 106018893 107728197 109465398 111029259 112371237
13025 112371237 113655507 115071646 116700633 118503158 120317301 121946449 123381173 124851712
13017 124851712 126534072 128305877 129928578 131351121 132677882 133965024 135221519 136471267
13009 136471267 137620533 138427413 138843368 139210708 139813692 140399032 140540216 140365723 140427252
13000 140427252 140826124 141012468 140646997 140174255 140196302 140642977 140996521 141121013 141395945
12991 141395945 142071612 142924081 143654895 144310113 145118470 146124133 147205457 148362853 149752405
12982 149752405 151404425 153098686 154641648 156152795 157903565 159914904 161911204 163685674
12974 163685674 165280742 166720791 167828275 168512603 169023739 169618942 170107262 170055274 169383563
12965 169383563 168414872 167338206 165992694 164257520 162307582 160338698 158331658 156244890
12957 156244890 154173184 152151440 150065151 147942327 146074899 144629805 143379036 142059536
12949 142059536 140775168 139766691 138990027 138238707 137522522 136992875 136619016 136284119 136105615
12940 136105615 136284318 136674312 136887505 136855310 136924228 137313230 137808095 138114361 138217520
12931 138217520 138242058 138205361 138077215 137879434 137577673 137062266 136370118 135722839 135191045
12922 135191045 134532654 133565613 132508290 131692735 131078012 130346461 129431882 128652719 128281790
12913 128281790 128244763 128353946 128631725 129226065 130120022 131118924 132104312 133127616 134201692
12904 134201692 135137050 135696253 135834834 135661749 135209150 134409966 133312731 132129922 130997495
12895 130997495 129863829 128732137 127826315 127330878 127124160 127007872 127080975 127598026 128515641
12886 128515641 129487128 130309503 131079740 131880013 132618692 133259211 133907809 134574709 135147060
12877 135147060 135712898 136577296 137774381 138888396 139594117 140064668 140563829 140946708 140932927
12868 140932927 140616945 140276308 139856370 139111790 138159322 137418299 137028381 136775010 136592492
12859 136592492 136664188 136949183 137085551 136923909 136727905 136647225 136410588 135813774 135138704
12850 135138704 134747869 134558318 134292085 134029488 134116015 134641283 135384346 136225089 137262443
12841 137262443 138492806 139642208 140394964 140633928 140429879 139911928 139141631 138034150 136464882
12832 136464882 134518744 132492937 130542567 128507691 126262715 124036068 122139588 120557575
12824 120557575 119089514 117737369 116611400 115579702 114400026 113132940 112031158 111067065
12816 111067065 110000439 108896245 108080312 107519275 106775335 105735202 104840042 104323462 103753100
12807 103753100 102723723 101540664 100723358 100202314 99558287 98767536 98101546 97479996 96579764
12798 96579764 95519751 94777321 94374935 93788780 92815243 91915526 91445016 91104789 90513576
12789 90513576 89834931 89400214 89107681 88692011 88287894 88181231 88190468 87866144 87242212 86827570
12779 86827570 86791676 86684439 86143922 85423282 84923888 84553888 83922346 82971160 82023269
12770 82023269 81250413 80444116 79396886 78240354 77223089 76303400 75197681 73827746
12762 73827746 72501152 71521504 70763964 69848825 68689119 67604522 66821143 66123586 65202883
12753 65202883 64150672 63321096 62796392 62302032 61654670 60992877 60478435 60031705 59514232
12744 59514232 58979670 58568724 58278389 57991126 57650215 57282538 56919790 56596685 56349856
12735 56349856 56134552 55839409 55468260 55180984 55038353 54845230 54410891 53843380 53380477
12726 53380477 53016422 52533615 51866286 51181672 50584715 49988992 49346104 48771542 48328742
12717 48328742 47886043 47332712 46772172 46334039 45931869 45406020 44816359 44376270 44126414
12708 44126414 43878869 43498614 43057442 42671486 42360174 42129589 42022195 41972076 41759053
12699 41759053 41264531 40679530 40293107 40134352 39999279 39794774 39641165 39599162 39508768 39217795
12689 39217795 38821411 38536667 38438576 38443267 38454954 38395494 38189017 37885085 37709923 37790625
12679 37790625 37892446 37681849 37237053 37005110 37179889 37412926 37297815 36888683 36520649
12670 36520649 36321885 36175760 36034324 35973591 35982813 35960137 35910845 35923245 35951660 35848906
12660 35848906 35625065 35449030 35369481 35266822 35121463 35074515 35136439 35091874 34834089 34567573
12650 34567573 34509347 34590031 34638341 34668353 34754199 34786196 34628014 34409094 34369119 34465689 34435047
12639 34435047 34241515 34162959 34359376 34631339 34733236 34695696 34673984 34665627 34581446 34471845
12629 34471845 34462361 34516206 34467189 34296501 34195332 34287696 34427299 34380475 34145133 33965879
12619 33965879 34027415 34236061 34364506 34337962 34266289 34220904 34138083 34002885 33972579 34164791
12609 34164791 34416095 34447253 34249319 34107896 34205167 34381338 34381128 34190821 34012064 33998382
12599 33998382 34129484 34280069 34323170 34225046 34105447 34128093 34274396 34340543 34242299 34174236
12589 34174236 34316256 34518188 34492516 34239942 34036494 34018768 34039082 33973000 33921447 34001826
12579 34001826 34143397 34226991 34269265 34328296 34359321 34308017 34237534 34227237 34249381 34273293 34361865
12568 34361865 34504802 34501739 34241201 33986277 34095560 34499419 34760913 34681755 34527340 34552434
12558 34552434 34629258 34547013 34402999 34409450 34500678 34461868 34353580 34462982 34824586 35107668
12548 35107668 35075818 34902481 34885926 35042741 35154575 35094580 34938843 34816805 34788958 34840634
12538 34840634 34893884 34854981 34735750 34692995 34859250 35158783 35375392 35388050 35264174 35134942
12528 35134942 35063718 35046926 35067859 35109104 35145151 35156024 35148085 35156520 35221726 35350076 35503122
12517 35503122 35644052 35775390 35894498 35948631 35912521 35883376 35984478 36178746 36316780 36381883
12507 36381883 36507043 36698502 36771630 36695303 36757514 37149159 37586577 37678841 37540302 37636148
12497 37636148 38049108 38351723 38314429 38288118 38617800 39050164 39119517 38896353 38901349 39329285
12487 39329285 39776610 39831744 39621969 39605227 40001958 40599542 41041034 41189517 41218934 41391033
12477 41391033 41760325 42142176 42379794 42528149 42699635 42873564 43014631 43245934 43674227
12468 43674227 44129018 44346622 44380550 44539003 44910414 45272685 45529658 45879106 46400136
12459 46400136 46830856 46999984 47162705 47585634 48061222 48232675 48222583 48484307 49090156
12450 49090156 49623496 49821365 49898478 50108991 50375134 50555219 50760237 51146419 51619404
12441 51619404 51992448 52265566 52525030 52737242 52888065 53175948 53780317 54521698 55031232
12432 55031232 55224635 55356671 55628333 56001555 56415136 56910039 57455257 57879872 58108755
12423 58108755 58305246 58655281 59130386 59580016 59965784 60386350 60909931 61465606 61907301
12414 61907301 62185333 62464581 62996902 63792402 64513775 64858340 64967666 65239338 65783796
12405 65783796 66352077 66807414 67323838 68001836 68625365 69016017 69348414 69846822 70392352
12396 70392352 70730556 70905818 71185805 71668139 72243421 72841244 73430486 73887434 74173987
12387 74173987 74544236 75228000 75994781 76431330 76613462 77049048 77902223 78740618 79206662
12378 79206662 79507340 80000914 80666537 81275224 81801866 82364197 82955381 83502638 84032729
12369 84032729 84575035 85073278 85559122 86192362 86961590 87619056 88111939 88750653 89677822
12360 89677822 90529001 90996558 91387026 92136128 93059165 93661666 93997177 94565150 95430146
12351 95430146 96123247 96480280 96918409 97700781 98529443 99131544 99712016 100500362 101314930
12342 101314930 101937335 102518379 103237009 103914658 104368432 104832524 105595386 106470738 107082783
12333 107082783 107496979 108110130 109010045 109870025 110454883 110872878 111319952 111866977 112510754
12324 112510754 113209913 113885062 114540157 115280910 116064351 116641686 116975744 117445880 118300870
12315 118300870 119178964 119622249 119836913 120377255 121211456 121754722 121838516 121971177 122480752
12306 122480752 123044147 123348872 123635604 124185582 124754890 124996194 125086284 125434318 126006900
12297 126006900 126432324 126632216 126890766 127356081 127878667 128343408 128818938 129348352 129871750
12288 129871750 130390797 130982219 131628582 132231901 132793515 133394792 134012978 134540692 134980079
12279 134980079 135453677 136041404 136747992 137570149 138432922 139144951 139620598 140067617 140723283
12270 140723283 141480273 142050916 142453569 143007685 143823569 144637830 145256407 145841887 146593875
12261 146593875 147425842 148188943 148994291 150027239 151166183 152085751 152727220 153412700 154425053
12252 154425053 155660129 156808590 157762053 158683708 159706666 160735476 161637924 162514177
12244 162514177 163593848 164883896 166121027 167135064 168058987 169059088 170069460 171001346
12236 171001346 172024007 173328347 174716975 175790619 176541875 177401715 178606455 179859873
12228 179859873 180806104 181563420 182544032 183912158 185454676 186901363 188187371 189443372
12220 189443372 190850801 192473045 194175696 195786293 197341263 199029774 200884978 202754652
12212 202754652 204634180 206746232 209143464 211517960 213634154 215693727 217977141 220341301
12204 220341301 222430541 224234761 226036114 227863467 229412670 230546571 231499516 232472041
12196 232472041 233329448 233854341 234069145 234158422 234231412 234271237 234196694 233922933 233483575 233082720
12186 233082720 232861910 232673341 232335519 232054182 232221674 232776843 233209674 233351850 233697045
12177 233697045 234643088 235849308 236787470 237599585 238854003 240622598 242399905 243940782
12169 243940782 245603654 247694305 249940940 251888527 253470616 254893664 256198401 257243090
12161 257243090 257977278 258454433 258646833 258472618 257953632 257150270 255986953 254344210 252312427
12152 252312427 250159158 248007088 245701193 243059361 240142203 237203453 234445731 231886473
12144 231886473 229413755 226912468 224355025 221818902 219433260 217301535 215454039 213835068
12136 213835068 212318001 210780076 209222568 207806027 206702658 205889531 205128245 204189616
12128 204189616 203088042 202050972 201239232 200543099 199721321 198722356 197746110 196926828 196082049
12119 196082049 194928651 193475575 191995389 190603933 189094666 187272096 185238553 183203508
12111 183203508 181184633 179090577 176964040 174912666 172883879 170756794 168619242 166690022
12103 166690022 164950792 163124432 161098198 159114685 157399266 155811929 154068510 152163294
12095 152163294 150347067 148746535 147215679 145582545 143893278 142350605 141073942 139964600
12087 139964600 138810614 137530173 136272460 135205628 134251426 133185279 132000722 130964183
12079 130964183 130228926 129613221 128907722 128191919 127632330 127149211 126558695 125917897 125419471
12070 125419471 125018130 124494084 123863029 123366762 123016225 122511665 121734607 120968071 120442351
12061 120442351 119982659 119349829 118639126 118031135 117390780 116502714 115561384 114995106 114810058
12052 114810058 114507124 113749292 112788176 112074540 111702142 111431506 111080008 110662618 110229679
12043 110229679 109772424 109304022 108911662 108680544 108594611 108522972 108321785 107994759 107737554
12034 107737554 107739036 107928479 108018940 107836848 107503732 107228219 107028813 106779793 106454699 106158707
12024 106158707 105916444 105591224 105103792 104624473 104407858 104458119 104492842 104278282 103888894
12015 103888894 103557485 103367306 103225269 103086928 103035002 103105861 103184886 103149578 103023740 102928788
12005 102928788 102959886 103147583 103443722 103705389 103810315 103839197 104010489 104375921 104747217
11996 104747217 105013054 105323316 105797789 106253732 106463425 106538405 106787372 107283063 107841197
11987 107841197 108362336 108903864 109436694 109824128 110071121 110346829 110736812 111194711 111718950
11978 111718950 112322050 112864363 113229901 113634574 114380773 115304226 115920738 116204202 116706394
11969 116706394 117704627 118756966 119434238 119995364 120870020 121888879 122613164 123151688 124009639
11960 124009639 125247069 126418609 127358378 128433973 129895593 131487168 132915514 134300183
11952 134300183 135917561 137805718 139850861 142024371 144323360 146662063 149006072 151477713
11944 151477713 154195263 157125493 160169675 163245912 166220193 168923730 171317191 173482315
11936 173482315 175383097 176795076 177550799 177732987 177588803 177377290 177286781 177328878 177325645
11927 177325645 177188071 177169055 177615703 178530230 179661355 180961241 182567168 184346781 185929848
11918 185929848 187283574 188776384 190502048 192041931 193174443 194339249 196014191 198047137
11910 198047137 200056203 202132295 204603312 207337239 209845755 211979781 214008104 216026870
11902 216026870 217745882 218900709 219521274 219772821 219837579 219938971 220188828 220438873 220538689
11893 220538689 220630141 220882113 221092336 220955707 220603134 220415528 220394404 220234757 219985187
11884 219985187 220059278 220535512 221040357 221477669 222286768 223730173 225477591 227222831 229203002
11875 229203002 231690424 234395235 236845881 239046955 241281804 243492980 245337165 246734969
11867 246734969 247960800 249258897 250690398 252267096 253942559 255571515 257142909 258920033
11859 258920033 261084916 263416916 265631109 267848748 270354328 273029467 275451725 277486330
11851 277486330 279359669 281161801 282687144 283806606 284614989 285127785 285166615 284641006 283656949
11842 283656949 282275671 280453351 278290421 276041522 273777432 271310652 268552711 265668085
11834 265668085 262766100 259732593 256525538 253374161 250487559 247768222 245003683 242180314
11826 242180314 239439677 236866776 234473778 232266416 230188557 228109678 225978988 223891941
11818 223891941 221929841 220050620 218185987 216297063 214294862 212094070 209797868 207613688
11810 207613688 205514880 203226529 200644817 198009858 195527691 193090729 190549606 187993608
11802 187993608 185538496 183081709 180519080 177981699 175592959 173208630 170691642 168234693
11794 168234693 166074869 164069900 161921793 159662295 157516248 155417730 153124927 150754942
11786 150754942 148707093 147015496 145254502 143193958 141095480 139196793 137341146 135357031
11778 135357031 133415456 131709431 130091822 128348784 126574903 124953586 123390815 121716407
11770 121716407 120065660 118677578 117429849 115976967 114319327 112841668 111730890 110710239
11762 110710239 109478292 108112400 106850692 105702650 104510427 103267079 102128002 101124795
11754 101124795 100073039 98833461 97530790 96388852 95400249 94321187 93047986 91837566
11746 91837566 90975790 90318560 89432249 88212054 87051994 86252948 85568044 84623181 83547916
11737 83547916 82776551 82326820 81741419 80796169 79820213 79136985 78580689 77846614 77004909
11728 77004909 76307293 75701999 74954441 74149880 73644554 73483221 73250241 72628538 71794715
11719 71794715 71086746 70548074 70031716 69548456 69219714 68979035 68602714 68035879 67462317
11710 67462317 67019639 66639140 66223119 65806737 65454783 65132534 64779834 64413178 64059521
11701 64059521 63676569 63239697 62834070 62549408 62333558 62059139 61702862 61359587 61106051
11692 61106051 60942739 60833743 60698813 60407209 59917349 59405901 59103085 58987502 58809351
11683 58809351 58456662 58114821 57964220 57891562 57665172 57282313 56950726 56773484 56637333
11674 56637333 56421158 56158040 55941603 55778802 55596233 55341004 55042367 54793688 54660810
11665 54660810 54585934 54436301 54197371 54036521 54078957 54198036 54163965 53944876 53704142 53544953
11655 53544953 53448440 53443457 53601375 53814496 53813629 53516866 53171124 53029406 53070120 53164767 53316194
11644 53316194 53532560 53643693 53503206 53272872 53245175 53428353 53548584 53447131 53248337
11635 53248337 53127710 53120025 53168405 53171916 52988831 52598279 52242971 52165279 52206432 51973744
11625 51973744 51456748 51122018 51240958 51473272 51383907 51082624 50992310 51163429 51214923 50909535
11615 50909535 50439877 50109663 50004494 50034763 50086752 50072302 49995143 49992122 50155047 50332213
11605 50332213 50304032 50140797 50143627 50394642 50615265 50566188 50376077 50350314 50610276 51020446
11595 51020446 51333743 51346823 51079279 50860175 51037764 51519494 51817524 51659880 51318692
11586 51318692 51187284 51299108 51487295 51753898 52147299 52452903 52395631 52093765 51958477
11577 51958477 52141911 52403440 52543248 52640529 52782965 52868856 52820285 52748958 52760727 52800533
11567 52800533 52833133 52973442 53265887 53514735 53535105 53435405 53439664 53532194 53507552 53326423
11557 53326423 53194481 53265880 53451138 53577282 53604000 53604746 53618716 53604126 53514914 53376914 53280121
11546 53280121 53292497 53377553 53422293 53369973 53301312 53351611 53559564 53824101 54005758 54057971
11536 54057971 54062601 54134097 54286192 54424567 54492840 54567398 54742324 54977945 55169330 55325896
11526 55325896 55545685 55819049 56009419 56053038 56029691 56002953 55960184 55972172 56214994 56695856
11516 56695856 57116168 57190215 57008090 56910168 57063896 57336690 57558893 57739812 57987888 58330319
11506 58330319 58673092 58913764 59073682 59289329 59622585 59927749 60041297 60080862 60345108
11497 60345108 60869926 61329640 61502629 61587015 61862278 62270672 62588603 62814080 63086537
11488 63086537 63385327 63634780 63968071 64515851 65038100 65188981 65109288 65306221 65910026
11479 65910026 66504601 66796212 66992770 67342529 67737470 68034746 68384307 68919019 69433314
11470 69433314 69704438 69877842 70206396 70635754 70980654 71301848 71756164 72251533 72610281
11461 72610281 72917155 73335762 73729631 73878067 73960626 74380622 75144888 75856700 76328097
11452 76328097 76761909 77288771 77783918 78251121 78928429 79817140 80521718 80820075 81043398
11443 81043398 81592376 82366910 83001503 83440277 83930953 84587720 85288578 85945742 86610426
11434 86610426 87332722 88110091 88935864 89757107 90473773 91119355 91908029 92929560 93952523
11425 93952523 94749700 95463100 96370302 97419880 98335824 99115984 100052503 101230858 102367964
11416 102367964 103253524 104044135 104975621 106049116 107169449 108359131 109634142 110852998
11408 110852998 111903240 112907617 114052938 115326991 116607542 117898471 119273159 120673509
11400 120673509 121984648 123253240 124616627 126058392 127462412 128883203 130502682 132296465
11392 132296465 134015122 135570844 137165818 138905091 140564666 141966483 143340591 145008151
11384 145008151 146867134 148548212 150007531 151582521 153432498 155299633 156948198 158505560
11376 158505560 160176004 161907704 163592206 165350280 167313390 169292507 171001211 172517221
11368 172517221 174187855 176107398 178015318 179739300 181427874 183258571 185182995 187079482
11360 187079482 188948270 190846812 192806275 194882550 197103207 199319431 201346029 203305810
11352 203305810 205542460 208075635 210470488 212458803 214380303 216709254 219388684 221979855
11344 221979855 224297420 226534137 228865844 231287596 233779514 236307161 238710305 240911962
11336 240911962 243171727 245773336 248518199 250954011 253105342 255488128 258286369 261022048
11328 261022048 263301338 265437553 267941074 270710193 273190149 275188063 277097376 279321615
11320 279321615 281813655 284249371 286425598 288401993 290374643 292461145 294568040 296496963
11312 296496963 298197216 299805249 301401381 302900680 304265244 305612939 306973622 308158764
11304 308158764 309073232 309939647 310950659 311889027 312416238 312607714 312852063 313289426 313699011
11295 313699011 313914260 313996453 313978429 313776737 313418551 313053822 312686149 312184676 311596966
11286 311596966 311106651 310616667 309772555 308551134 307424243 306689975 305998586 304861527 303339581
11277 303339581 301863578 300599001 299386569 298163353 297019638 295879239 294513572 292920566
11269 292920566 291378799 290049895 288772781 287328988 285712763 284068562 282522628 281130636
11261 281130636 279859011 278583707 277211387 275794836 274436001 273144502 271918340 270843575
11253 270843575 269909197 268847266 267449072 265967930 264862524 264143344 263343441 262203217
11245 262203217 261003385 260074549 259342667 258580586 257784007 257017696 256158188 255108910 254067840
11236 254067840 253256084 252543570 251678934 250750719 250039612 249487427 248724603 247652244 246611064
11227 246611064 245865080 245254775 244528954 243741443 243103711 242640305 242212081 241756432 241301962
11218 241301962 240824883 240281493 239752698 239391518 239212862 239055626 238789597 238478905 238283657
11209 238283657 238229119 238136157 237816304 237297731 236764279 236253271 235543000 234439187 233058989
11200 233058989 231665444 230288017 228709176 226816952 224764160 222738451 220760387 218772156
11192 218772156 216755820 214682801 212497461 210241438 208072096 206089112 204259690 202543034
11184 202543034 200917745 199248442 197353290 195300968 193403440 191771412 190121074 188217424
11176 188217424 186263604 184576927 183080563 181449893 179633741 177872759 176253357 174592767
11168 174592767 172781023 170928932 169134533 167372219 165652646 164034290 162439969 160722023
11160 160722023 158941260 157298400 155749626 154021770 152107455 150393855 149114247 147982110
11152 147982110 146605107 145002432 143457327 142087637 140847702 139764974 138857218 137933496
11144 137933496 136779258 135473014 134263870 133205065 132156321 131074021 130031572 129004295
11136 129004295 127908297 126827168 125932069 125190471 124424339 123644548 123018349 122477816 121713204
11127 121713204 120686230 119824737 119474922 119385836 119003703 118153594 117176957 116440379 115938140
11118 115938140 115418969 114733338 113935054 113090297 112126195 110972829 109806270 108954524 108462565
11109 108462565 107929865 106984524 105797483 104865665 104354623 103962322 103422707 102796222 102187730
11100 102187730 101530861 100815003 100212039 99769500 99260681 98574042 97969908 97658970 97394306
11091 97394306 96855359 96220948 95906746 95851795 95570607 94929032 94371860 94233930 94256423 94025421
11081 94025421 93549154 93110818 92804448 92540315 92348427 92337554 92401501 92266519 91874425 91499195
11071 91499195 91399314 91497033 91497722 91254480 90926491 90777927 90867179 90984495 90916629 90706219
11061 90706219 90550925 90483812 90315379 89924862 89435900 89008831 88617260 88172443 87734104
11052 87734104 87410184 87137031 86771014 86359000 86098876 86022424 85930975 85700364 85450820 85315069
11042 85315069 85207644 84963307 84587335 84224371 83956010 83763408 83630928 83547889 83438909
11033 83438909 83224188 82940238 82686293 82458172 82152620 81740370 81313801 80940638 80587645
11024 80587645 80226069 79898952 79632419 79386164 79147391 78961255 78801454 78542093 78161757
11015 78161757 77840070 77699510 77573713 77239402 76792144 76530588 76487418 76369325 76027094
11006 76027094 75685799 75552423 75473281 75233499 74975205 74975957 75133112 75070462 74770015 74684893
10996 74684893 75060847 75505179 75528082 75262338 75251292 75621060 75900958 75751693 75478579 75570455
10986 75570455 75998735 76320151 76351152 76354826 76527356 76668191 76551238 76360866 76480917 76972476
10976 76972476 77526008 77890444 78112977 78351153 78668143 79061938 79514696 79952720 80309455
10967 80309455 80671866 81206039 81900631 82571507 83176755 83906711 84852494 85807069 86557245
10958 86557245 87176317 87839911 88543012 89228486 90016732 91016217 92029593 92771519 93319368
10949 93319368 94023568 94989355 95984736 96891621 97886142 99047869 100124947 100907358 101592640
10940 101592640 102529498 103746291 104971668 106037537 107039241 108116430 109263619 110406611
10932 110406611 111559938 112835315 114302778 115881139 117422518 118923752 120558685 122414512
10924 122414512 124306886 126026675 127693370 129634709 131931553 134329863 136642296 138987813
10916 138987813 141537804 144241451 146931119 149538539 152098219 154675011 157366267 160237172
10908 160237172 163207991 166164613 169194321 172493960 176018431 179481807 182755482 185966282
10900 185966282 189126973 192020451 194583776 197031734 199402861 201372738 202790898 204025885
10892 204025885 205436645 206860401 208049111 209310975 211216338 213848725 216835400 220015679
10884 220015679 223610277 227733611 232095288 236193122 239586465 242099391 243964227 245569170
10876 245569170 246893445 247561322 247694513 248148041 249431225 251001964 252315008 253974078
10868 253974078 256961760 261297178 266553786 273157591 281760827 291767023 302279912 314304395
10860 314304395 329588323 346631834 360360707 367417940 369860883 371552988 372461826 369203537
10852 369203537 360442217 348776312 337050575 325483956 313389090 301490484 290986231
10845 290986231 281745209 273019319 265083866 258745095 253746214 248968957 244006852 239468803
10837 239468803 235801270 232730389 229919783 227426694 225373643 223729229 222525195 221843051
10829 221843051 221504739 221152126 220692201 220352382 220284319 220415516 220685362 221106431 221555392
10820 221555392 221793922 221778043 221737008 221882044 222195283 222537621 222818874 223021881 223158024
10811 223158024 223235853 223256887 223279299 223466318 223936330 224550820 225035205 225354596 225748833 226322201
10801 226322201 226863866 227205349 227475329 227808889 228069545 228088941 227933685 227678676 227153866
10792 227153866 226206012 225002516 223776150 222467598 220936290 219327508 217875303 216508402
10784 216508402 215029040 213553041 212393149 211609592 211045563 210697327 210655280 210782195 210884286
10775 210884286 211133964 211868363 213003169 214120912 215138771 216378772 217908688 219325510
10767 219325510 220327412 221015874 221467100 221499827 221103834 220628268 220243842 219638141 218580373
10758 218580373 217399951 216513112 215800773 214883031 213757471 212726021 211873498 211054117 210268637
10749 210268637 209624868 208989163 208092644 206990569 206055135 205467828 205021164 204470509 203809724
10740 203809724 203140427 202507487 201925338 201367297 200696784 199809972 198859742 198104993 197500993
10731 197500993 196692971 195501097 194160339 192937808 191742688 190328898 188720667 187170459
10723 187170459 185747558 184226994 182437374 180517172 178711278 177047746 175364139 173577347
10715 173577347 171752421 169920455 168026086 166116949 164392218 162924339 161487934 159848100
10707 159848100 158090835 156444228 154883229 153204426 151439103 149845962 148458004 146988652
10699 146988652 145297687 143609778 142100688 140595992 138918117 137235488 135766827 134375722
10691 134375722 132792207 131065698 129464106 128046511 126655569 125235516 123849500 122470971
10683 122470971 121064368 119779200 118734067 117695797 116348591 114838266 113646494 112905096
10675 112905096 112232186 111317852 110289742 109386561 108632898 107992070 107516437 107171370 106791601
10666 106791601 106370960 106116640 106058604 105900034 105445446 104892660 104487005 104159237 103737973
10657 103737973 103249979 102746920 102097775 101257103 100496772 100026176 99595709 98871320 98038499
10648 98038499 97587843 97571697 97528313 97171837 96738482 96543949 96560761 96595515 96601218 96637137
10638 96637137 96727858 96915638 97285527 97815135 98351466 98839055 99420382 100216585 101161185
10629 101161185 102142732 103155580 104214167 105283474 106405245 107720195 109221832 110650113
10621 110650113 111804953 112828386 113972260 115185186 116150877 116685275 116880360 116873730 116693689
10612 116693689 116354112 115887342 115208972 114141391 112694001 111171399 109844776 108607252
10604 108607252 107128735 105321279 103478072 101915847 100619692 99326417 97872492 96353138
10596 96353138 94964538 93787147 92753794 91780639 90879768 90124519 89506771 88872717 88074851
10587 88074851 87193497 86499715 86121869 85845450 85381266 84769514 84322172 84158871 84030581
10578 84030581 83708079 83327243 83139524 83066368 82785959 82237266 81752425 81602731 81643898 81562911
10568 81562911 81307579 81075152 80970923 80897203 80772989 80666902 80652945 80683808 80696941 80731843
10558 80731843 80827785 80891073 80815457 80703667 80798330 81148761 81494021 81573010 81437946 81329188
10548 81329188 81322640 81284687 81166419 81135334 81310798 81508221 81416740 81011996 80653707 80711809
10538 80711809 81153843 81577490 81655841 81479560 81391943 81537107 81721735 81758675 81755663 81900673
10528 81900673 82108642 82137941 82000018 81962090 82121262 82277447 82315475 82397383 82608123 82726996
10518 82726996 82622917 82606264 83019450 83653267 83989249 83951352 83983864 84355448 84817393 85092624
10508 85092624 85318007 85756992 86356888 86880779 87307176 87822940 88509178 89268555 90021651
10499 90021651 90789524 91610829 92527449 93613160 94870347 96137120 97251753 98287622
10491 98287622 99466440 100839405 102222969 103494029 104788484 106303181 108007140 109681464
10483 109681464 111201893 112648059 114126142 115622219 117110858 118696039 120486431 122367217
10475 122367217 124092125 125663624 127441716 129732891 132395266 135032925 137521189 140158496
10467 140158496 143311654 147066434 151234108 155578404 160038960 164828255 170263348 176405949
10459 176405949 182985255 189838678 197268243 205681596 215010783 224872243 235260969 246650552
10451 246650552 259362393 273296640 288394890 304855368 322675806 341517314 361304192
10444 361304192 382248202 403574535 422713126 436754946 444766274 447967319 447595263
10437 447595263 443377696 434387928 420702329 403681180 384989614 365806544 346742825
10430 346742825 328061593 309996818 293064456 277922368 264738262 252926385 241796422
10423 241796422 231285949 221756057 213264186 205471132 198212642 191710724 186110495 181172271
10415 181172271 176613654 172482443 168947277 165896108 163010408 160164409 157498735 155092001
10407 155092001 152791612 150460614 148208278 146212774 144418686 142607882 140752709 139101950
10399 139101950 137855569 136910264 136018202 135063702 134071447 133072025 132115503 131317787 130710569
10390 130710569 130111377 129339166 128523016 127990541 127852109 127894072 127891800 127815897 127698485 127531441
10380 127531441 127386273 127419754 127630232 127782410 127715739 127584868 127651543 127958147 128350463 128725295
10370 128725295 129114550 129595542 130239044 131085812 132074360 133052247 133943552 134845115 135898284
10361 135898284 137148388 138577762 140158331 141809748 143452486 145197877 147330751 149967842
10353 149967842 152867719 155735878 158605624 161744872 165271526 169050456 172948626 177041256
10345 177041256 181541512 186582054 192053501 197674969 203333211 209334849 216122688 223711801
10337 223711801 231672301 239774853 248346485 257780396 267987635 278628880 289632953
10330 289632953 301100805 312837342 324335191 335106610 344684489 352438691 357843688
10323 357843688 360912572 361978316 361090214 358087036 353292049 347620426 341810605 335950312
10315 335950312 329954784 324123116 318949951 314677086 311290454 308723937 306825767 305321643
10307 305321643 304022965 302902923 301827636 300457268 298597385 296400567 294014013 291281742
10299 291281742 288033459 284413499 280643468 276694677 272506487 268301280 264311814 260374558
10291 260374558 256205258 251962780 248100818 244694315 241347988 237815619 234300219 231031354
10283 231031354 227917620 224788712 221667530 218590638 215408777 212003221 208522939 205168582
10275 205168582 201856930 198336173 194587630 190896726 187496681 184300370 181061705 177715244
10267 177715244 174454351 171471897 168705149 165917512 163022087 160224924 157793780 155757380
10259 155757380 153906954 152040349 150124186 148260643 146585726 145181646 144016442 142971341
10251 142971341 141948875 140918120 139870668 138849338 138021014 137520466 137144612 136442271
10243 136442271 135283031 134104804 133333650 132760918 131851835 130538404 129268151 128274559
10235 128274559 127259011 125930377 124453670 123121906 121886385 120496117 118903361 117263972
10227 117263972 115676163 114160855 112782615 111542798 110234840 108657587 106938850 105408548
10219 105408548 104146045 102883434 101409842 99855956 98458955 97208535 95897225 94442723
10211 94442723 92976722 91609325 90271529 88868385 87459821 86154510 84901374 83562917
10203 83562917 82177751 80945195 79894955 78778934 77414212 75952933 74648285 73516073
10195 73516073 72429314 71395009 70478783 69570674 68531150 67510550 66790463 66302387 65644790
10186 65644790 64654205 63640763 62925334 62421777 61849298 61139033 60450946 59938511 59623345
10177 59623345 59370338 58929300 58184047 57397388 56966473 56885828 56749767 56359368 55951319
10168 55951319 55669824 55244632 54502469 53817234 53623773 53737667 53602434 53052996 52413569
10159 52413569 51951280 51643174 51417364 51235521 50967845 50533666 50123934 49949730 49843557
10150 49843557 49487195 48968462 48678811 48672057 48585080 48246997 47906426 47740797 47581898 47289914
10140 47289914 46985824 46721814 46319518 45757391 45329946 45160172 44930624 44411650 43896520
10131 43896520 43725178 43685103 43348550 42793751 42482587 42500537 42412906 41929333 41294144 40877152
10121 40877152 40690984 40493655 40159149 39760031 39388594 39049094 38713806 38412416 38232019
10112 38232019 38200185 38183177 37998589 37662233 37395077 37307600 37219824 36923561 36496322 36188105
10102 36188105 36084158 36048285 35938398 35719651 35411524 35067240 34767638 34524573 34257747
10093 34257747 33967150 33806651 33840962 33866296 33670957 33356233 33169131 33120358 33037218 32921218
10083 32921218 32939364 33067074 33059986 32844126 32645405 32628225 32666167 32611543 32565569 32699158
10073 32699158 32964625 33170907 33254091 33319403 33461476 33654018 33798834 33828397 33774690 33733823
10063 33733823 33725453 33642689 33427550 33204812 33082903 32920170 32538196 32108643 31992350 32153683
10053 32153683 32104866 31594343 31012807 30853560 31029686 31045406 30681070 30180953 29837614 29686970
10043 29686970 29602889 29453176 29148982 28717825 28321050 28063401 27851254 27588961 27389840
10034 27389840 27361243 27301737 26934687 26393020 26103071 26150390 26146610 25853982 25554557 25550544
10024 25550544 25629083 25385031 24871964 24530981 24542171 24621899 24489520 24205382 23953555 23769466
10014 23769466 23626563 23571723 23601668 23567614 23382719 23204437 23225176 23363056 23353172 23113421
10004 23113421 22840892 22739765 22806557 22909312 22946827 22891524 22783550 22719330 22756206 22813649
9994 22813649 22772990 22680222 22706660 22871135 22965340 22847356 22662742 22640354 22778467 22888466
9984 22888466 22881305 22848797 22878503 22924466 22882769 22722972 22543545 22524038 22762422 23122745 23346173
9973 23346173 23374059 23421781 23634395 23850807 23889587 23889997 24100640 24456691 24693987 24822314
9963 24822314 25120424 25640763 26093222 26325170 26570037 27057274 27689123 28305594 28981324
9954 28981324 29814889 30677824 31453078 32303208 33378054 34414549 34971267 34975768 34722082
9945 34722082 34391105 33907057 33251410 32575603 31944723 31271480 30593825 30129797 29907395
9936 29907395 29587223 28874085 27964786 27360325 27266502 27359747 27188934 26697949 26251661 26156818
9926 26156818 26273563 26210388 25842005 25441499 25273764 25288242 25329203 25407999 25552667 25597854
9916 25597854 25419045 25232011 25333299 25640934 25844766 25943772 26223649 26697181 27018560 27068801
9906 27068801 27193748 27648734 28176640 28399275 28320413 28164456 27993529 27788406 27663476 27662861
9896 27662861 27538852 27083272 26519776 26204654 26074503 25792728 25354834 25095805 25086501 24979658
9886 24979658 24578178 24153844 24002386 24010994 23906560 23670117 23441859 23221361 22950737 22756397
9876 22756397 22804341 22970709 22940156 22645377 22365929 22334931 22456471 22506657 22443330 22386380
9866 22386380 22407990 22484151 22588966 22709880 22813300 22914991 23140759 23571272 24049926 24324994
9856 24324994 24405330 24575429 24984089 25437084 25740250 26017143 26440040 26841546 26944523 26869218
9846 26869218 26988662 27277467 27270739 26809336 26362162 26323563 26393905 26064033 25414303 24944179
9836 24944179 24782295 24588426 24191494 23805536 23547652 23234067 22820969 22600479 22695461 22729825
9826 22729825 22337238 21730870 21405663 21454982 21556901 21530700 21501789 21505436 21325403 20886933
9816 20886933 20517587 20566816 20906784 21056347 20775353 20336174 20158154 20324936 20574648 20684429
9806 20684429 20707436 20803504 20965191 21027243 20916845 20783175 20832564 21082140 21335637 21416562
9796 21416562 21390714 21497192 21839019 22221667 22385716 22332884 22271406 22274356 22210155 22045819
9786 22045819 21955672 21991207 21896636 21482786 20981141 20741702 20730763 20644422 20402829 20172266
9776 20172266 19967746 19639962 19262468 19109623 19165027 19060882 18651085 18254769 18136785 18121294
9766 18121294 17966566 17766728 17675892 17553002 17242543 16949358 16942839 17085211 17051208 16861564
9756 16861564 16787705 16837050 16758947 16512068 16310928 16213049 16060775 15861814 15829431 15967443
9746 15967443 15994236 15802312 15649257 15736641 15901321 15896371 15719748 15501813 15307312 15204124
9736 15204124 15285465 15453505 15418288 15102955 14823818 14852587 15014015 14974642 14753851 14650207
9726 14650207 14761156 14873923 14813941 14650857 14532305 14506327 14550534 14632991 14696785 14676712
9716 14676712 14563184 14403119 14248847 14143855 14117020 14145861 14172292 14181488 14191834 14153359 13981648
9705 13981648 13735331 13608263 13666099 13745890 13715677 13659976 13671252 13642725 13466481 13282146
9695 13282146 13289633 13424178 13468289 13407289 13405599 13471328 13425661 13217641 13004856 12876569 12746628
9684 12746628 12593766 12565565 12723412 12884994 12864075 12717774 12621298 12618786 12626291 12585904 12502985
9673 12502985 12405233 12346987 12368980 12390395 12260187 11998817 11848287 11954292 12129193 12099289
9663 12099289 11886233 11742643 11768240 11813276 11761678 11684546 11650271 11583457 11428730 11299549
9653 11299549 11319479 11424016 11470511 11460572 11486725 11523138 11471959 11394948 11459717 11608573 11540334
9642 11540334 11165390 10842048 10921300 11227735 11296899 11039362 10825569 10906851 11104134 11167044
9632 11167044 11110524 11027001 10869777 10661809 10655821 10979735 11313755 11258801 10904793 10686689
9622 10686689 10751951 10843650 10804059 10802082 10958621 11084747 10969955 10693901 10484328 10442185
9612 10442185 10535851 10697100 10806812 10751389 10595196 10525804 10551055 10475674 10282414 10253400
9602 10253400 10516081 10744665 10604755 10280346 10207110 10417866 10540002 10399839 10235711 10249187
9592 10249187 10298235 10186518 9988542 9899419 9939666 9984288 9968831 9924801 9895323 9920159 10022273
9581 10022273 10128807 10100526 9914423 9708984 9577766 9462797 9354021 9408057 9671380 9844086
9571 9844086 9615710 9179929 9077047 9457070 9822238 9684397 9213076 8952971 9070565 9226009
9561 9226009 9148204 8980838 8964900 9069947 9119070 9082853 9051489 9038567 8997254 8953978 8969820
9550 8969820 9029434 9092624 9176071 9262923 9239017 9062924 8877346 8785485 8669213 8450638 8359041
9539 8359041 8613730 8973266 9006595 8756809 8675025 8867489 8919955 8619008 8329103 8368874
9529 8368874 8479839 8305236 8013877 7988863 8182293 8264842 8211344 8244990 8343551 8300160 8184251
9518 8184251 8235506 8343596 8164730 7782624 7704247 8067240 8372271 8230790 7922450 7908132
9508 7908132 8155322 8291741 8175933 7984946 7891676 7923336 8031770 8109028 8041211 7884676
9498 7884676 7845037 7960455 7988049 7749970 7413737 7274812 7418610 7720719 8001322 8068113
9488 8068113 7825803 7478128 7392731 7625753 7828243 7762564 7610756 7594444 7637658 7653241
9478 7653241 7790420 8063609 8105201 7717599 7341195 7464269 7844029 7892006 7611615 7487502
9468 7487502 7572094 7434860 7051686 6970489 7376979 7704062 7522550 7211115 7294564 7618159
9458 7618159 7697107 7512375 7412002 7467179 7461481 7383129 7430116 7578047 7589368 7456907 7435409
9447 7435409 7578672 7611504 7379089 7122327 7135931 7355548 7464101 7306304 7052788 6974693
9437 6974693 7133021 7314623 7282823 7070682 6947770 7078720 7329508 7472315 7450576 7333811
9427 7333811 7137755 6851046 6568458 6437037 6488272 6623979 6730970 6738281 6638329 6531675
9417 6531675 6555253 6684797 6731541 6624323 6528479 6555759 6554780 6385481 6204284 6212101 6287790
9406 6287790 6194367 6026311 6080266 6336130 6461453 6347599 6244336 6282411 6262311 6078673
9396 6078673 5979634 6153298 6356072 6254732 5932869 5751129 5830925 5963772 5968215 5881285
9386 5881285 5806671 5772123 5752869 5711666 5630006 5581712 5698059 5955150 6103309 5957320 5663180
9375 5663180 5507177 5543036 5599804 5591878 5598079 5653373 5684345 5672862 5687086 5718600 5676421 5578194
9363 5578194 5549285 5578128 5489210 5258617 5137235 5294861 5522743 5503358 5253866 5068152
9353 5068152 5085674 5161586 5157609 5125047 5145675 5191638 5228425 5292506 5375252 5380493 5295697 5251197
9341 5251197 5292127 5263965 5096549 5029111 5295708 5703858 5844310 5683060 5593085 5749524
9331 5749524 5871489 5730626 5556866 5645400 5834512 5753664 5436757 5281666 5436438 5613835
9321 5613835 5573341 5442365 5428066 5491310 5483389 5407314 5368958 5403040 5482442 5581568 5624075
9310 5624075 5501582 5260982 5142093 5294524 5562769 5683987 5609602 5503823 5499241 5577408
9300 5577408 5639331 5597555 5447511 5314201 5357452 5572088 5767624 5795767 5691703 5550059
9290 5550059 5409356 5319263 5344850 5416268 5370456 5249555 5319904 5630191 5817725 5613642
9280 5613642 5299756 5318001 5601756 5698494 5469366 5242121 5260439 5382489 5408079 5354266
9270 5354266 5289876 5201131 5144500 5250955 5449707 5461326 5208340 4966598 4950715 5020132 4992311
9259 4992311 4979944 5154784 5388173 5425766 5286192 5195900 5206765 5154645 4971803 4793645
9249 4793645 4734970 4755335 4782620 4819345 4885512 4963981 5033713 5083200 5079877 4985254 4808194
9238 4808194 4614853 4493472 4502454 4608447 4697895 4722968 4785278 4949216 5046478 4883561 4600529
9227 4600529 4528972 4676581 4705938 4517605 4451158 4703261 4953000 4880360 4684200 4682122 4732405
9216 4732405 4557052 4370084 4578124 5000071 5042121 4646353 4408113 4625445 4863608 4715628
9206 4715628 4426472 4395937 4522038 4475162 4299073 4291418 4480568 4615670 4568204 4435216
9196 4435216 4332094 4319575 4424000 4530154 4411629 4075391 3884879 4094462 4455713 4568020
9186 4568020 4430644 4319168 4285125 4172142 4031703 4099155 4349977 4463407 4299556 4094105
9176 4094105 4086213 4221419 4322784 4331381 4279560 4204499 4160921 4177592 4181480 4109114 4060951 4158579
9164 4158579 4297271 4274775 4130422 4089844 4187906 4235670 4168664 4122322 4135890 4105287 4071708
9153 4071708 4201748 4406960 4371076 4081088 3924723 4075996 4202342 4038111 3835396 3907978
9143 3907978 4107378 4155708 4159493 4323613 4441745 4209201 3842618 3816584 4095966 4209537
9133 4209537 4041465 3950004 4063968 4077806 3891490 3861429 4163722 4435024 4365526 4188667
9123 4188667 4218714 4309952 4192492 4011905 4080857 4330561 4443919 4354602 4211654 4025658
9113 4025658 3774366 3704670 4059376 4584059 4768940 4550264 4323932 4281675 4223218 4076702
9103 4076702 4094523 4374081 4634546 4668925 4614392 4573158 4386642 4046840 3917052 4202607
9093 4202607 4560114 4606292 4484624 4510679 4576390 4418985 4227430 4381794 4727433 4747948
9083 4747948 4441027 4366806 4720898 5010675 4891414 4707429 4824356 4966941 4738579 4393707
9073 4393707 4480486 4936882 5166945 4961792 4758789 4899037 5146352 5158154 5027794 5054828
9063 5054828 5231089 5282745 5126601 5007673 5155730 5474639 5655570 5544388 5319081 5268144
9053 5268144 5441536 5630045 5692065 5725261 5821969 5854757 5707170 5554318 5632092 5828628
9043 5828628 5837828 5683293 5710242 5995690 6157837 5929046 5581488 5529400 5765208 5972425
9033 5972425 6005941 5964426 5917126 5855478 5849931 5988900 6185310 6257851 6179170 6063614 5967592
9022 5967592 5896819 5938376 6150271 6363723 6345420 6147085 6050159 6156351 6282359 6291128 6270055
9011 6270055 6308104 6337477 6306054 6305355 6408833 6545174 6630526 6679964 6718512 6740763 6806955
9000 6806955 6984534 7150112 7102096 6949560 7075996 7546226 7878541 7692371 7300480 7276173
8990 7276173 7627495 7848885 7713931 7542966 7624314 7805950 7842589 7807465 7910261 8124776
8980 8124776 8242090 8171453 8001203 7854584 7829278 7975457 8190819 8244409 8062364 7891182
8970 7891182 7996488 8280115 8411613 8305188 8222341 8357117 8556238 8585143 8491263 8502256
8960 8502256 8657407 8771237 8765677 8809286 9021293 9221326 9168469 8957503 8940690 9240799
8950 9240799 9567839 9622672 9497351 9502570 9713425 9892171 9832137 9599729 9419873 9455356
8940 9455356 9708461 10015126 10133330 9975051 9763608 9813869 10133440 10408813 10433686 10356234
8930 10356234 10394542 10500622 10496804 10414800 10461019 10677299 10857567 10844438 10734866 10703393 10743161
8919 10743161 10707923 10568018 10494224 10632592 10866158 10916922 10710690 10519656 10625465 10923662
8909 10923662 11049291 10878611 10680954 10710801 10881161 10980883 11005307 11066470 11141597 11153801
8899 11153801 11177902 11299135 11365597 11188805 10935180 10967237 11281408 11477384 11377306 11289398
8889 11289398 11468385 11684573 11630785 11460040 11531848 11809106 11924160 11770491 11626422 11680170
8879 11680170 11804297 11875745 11978164 12152519 12242409 12164786 12095743 12195063 12344416 12359071
8869 12359071 12286353 12275565 12295534 12220987 12095458 12057229 12067039 11964641 11773018 11690806 11761510
8858 11761510 11794358 11673861 11523913 11475227 11474024 11436672 11411643 11449984 11470872 11405965 11342641
8847 11342641 11366184 11384262 11284318 11154160 11142610 11184884 11095415 10892010 10787472 10852737 10922561
8836 10922561 10884750 10844963 10915538 11023788 11036809 10934256 10767222 10581597 10460211 10489647
8826 10489647 10596949 10580768 10404758 10278201 10316569 10329062 10137354 9909514 9914610 10092762
8816 10092762 10171041 10107188 10082569 10100567 9965459 9699020 9597530 9738864 9779959 9465409
8806 9465409 9055734 8966060 9168278 9261462 9049900 8760254 8673630 8765979 8791115 8605997
8796 8605997 8336323 8224624 8324699 8410852 8286169 8102070 8153920 8387484 8429391 8183581
8786 8183581 8018156 8153297 8253354 7975018 7574842 7497170 7619425 7484374 7137017 7078924
8776 7078924 7389509 7566847 7386697 7258381 7448331 7575836 7295391 6935248 6939680 7122065
8766 7122065 7056070 6849778 6880596 7023257 6857061 6505824 6521606 6925826 7109315 6823505
8756 6823505 6556407 6665317 6809549 6629782 6394138 6472297 6651212 6539700 6285219 6281157
8746 6281157 6421218 6285538 5929937 5840524 6113328 6302210 6184766 6094140 6270528 6401204
8736 6401204 6146098 5739301 5669176 5977938 6246034 6172578 5872344 5626710 5568657 5636945
8726 5636945 5710044 5753792 5852367 6044786 6168082 6028649 5735123 5629450 5811004 5978498
8716 5978498 5881813 5680711 5656136 5792610 5893892 5921390 5943398 5911855 5786200 5734928 5886835
8705 5886835 6007859 5801583 5444941 5394322 5673585 5823297 5637438 5471004 5624558 5868362
8695 5868362 5866680 5701456 5629787 5626653 5550277 5516202 5691082 5895408 5849940 5695896 5803218
8684 5803218 6110970 6154121 5803469 5497726 5580141 5833989 5910008 5840274 5827711 5829084 5701741
8673 5701741 5559085 5616680 5805042 5876101 5820799 5847606 5979424 6015483 5923850 5930557 6109740
8662 6109740 6196408 5995232 5729608 5739261 5989787 6148773 6075694 5970594 6021860 6142320
8652 6142320 6153593 6071663 6070552 6232361 6451633 6569767 6522397 6360192 6193554 6126109 6189447
8641 6189447 6324760 6455520 6568651 6679645 6743286 6699305 6625895 6720412 7033227 7319786
8631 7319786 7302336 7031741 6831013 6893146 7107813 7302062 7444762 7525846 7443357 7190019
8621 7190019 7008984 7145824 7510278 7783384 7823315 7769469 7764544 7790373 7810983 7873698 7991095
8610 7991095 8085190 8127760 8191333 8286304 8298455 8182961 8080072 8130640 8302005 8497685 8699136
8599 8699136 8880357 8939386 8876931 8893147 9100814 9273652 9138635 8834973 8782082 9098787
8589 9098787 9456957 9571659 9544832 9597481 9727088 9825807 9932271 10124809 10291451 10259838
8579 10259838 10111191 10133962 10440423 10806320 10951735 10866696 10797394 10975075 11400910 11864802
8569 11864802 12155518 12256331 12314445 12430415 12566392 12688967 12866925 13121542 13307304 13319028
8559 13319028 13336889 13639074 14180114 14596823 14698919 14723479 14962265 15331479 15529830 15515931
8549 15515931 15574124 15898682 16330978 16598842 16670874 16751845 17002388 17381275 17739938 17973646
8539 17973646 18077485 18139154 18297850 18632431 19050502 19360583 19510806 19675955 20009643 20387468
8529 20387468 20566352 20578753 20744277 21206001 21675156 21826336 21788568 21982566 22535741 23143856
8519 23143856 23537668 23805797 24141070 24513940 24801641 25084822 25571219 26262492 26901344
8510 26901344 27287659 27516138 27839416 28365549 28960489 29448873 29856096 30367307 31026724
8501 31026724 31613901 31959331 32269626 32889861 33776252 34515493 34926716 35302044 35894205
8492 35894205 36524669 36978149 37456369 38237587 39121266 39683095 39950059 40330720 40939964
8483 40939964 41519337 42033936 42767096 43692343 44345533 44594025 44982259 45916303 46979816
8474 46979816 47560477 47786700 48269105 49156141 50055780 50784749 51589716 52594925 53565901
8465 53565901 54342330 55075742 55909454 56791300 57715463 58797319 59995486 61101313 62112932
8456 62112932 63266693 64580894 65755861 66697319 67748705 69175188 70780236 72288806
8448 72288806 73748110 75252100 76641649 77859252 79263657 81135366 83144243 84815339
8440 84815339 86301781 88119651 90257330 92203560 93867944 95799929 98310307 100978498
8432 100978498 103341559 105569911 108066637 110793970 113458110 116101996 119040132 122326669
8424 122326669 125712326 129094939 132650364 136502372 140576773 144832863 149364317 154178922
8416 154178922 159099386 164007317 169045152 174465167 180351968 186549774 192797048 198900751
8408 198900751 204835050 210677404 216402862 221783642 226575785 230746703 234381708 237401377
8400 237401377 239550945 240696984 240969216 240544103 239426984 237526083 234816549 231335547
8392 231335547 227118941 222245564 216855611 211019881 204678865 197840020 190760289 183769028
8384 183769028 176938885 170102276 163203928 156460179 150100861 144105272 138311161 132687302
8376 132687302 127366673 122453958 117912254 113624606 109489431 105483999 101706964 98310083
8368 98310083 95293373 92420321 89458576 86459220 83648426 81086975 78643289 76296241
8360 76296241 74196198 72339050 70454672 68401069 66431891 64821379 63410493 61831833
8352 61831833 60064957 58430186 57080620 55845795 54586936 53357407 52148248 50828047
8344 50828047 49462694 48355050 47577797 46777237 45677628 44493024 43544573 42726105 41725412
8335 41725412 40604802 39734418 39194729 38652296 37882087 37059684 36414988 35885895 35283034
8326 35283034 34586587 33895138 33214580 32480288 31740133 31171077 30877297 30712522 30356168
8317 30356168 29633962 28760762 28139204 27870694 27645461 27227086 26798485 26577672 26334016
8308 26334016 25708234 24892328 24469083 24520708 24427942 23779139 23007289 22752564 22937213 22932764
8298 22932764 22464591 21880841 21544626 21370934 21081305 20638090 20253667 20088039 20059755 19937025
8288 19937025 19583381 19101457 18694697 18413434 18156853 17913309 17791453 17757388 17594400 17262304
8278 17262304 17033569 17057438 17048509 16710758 16246379 16057105 16094451 15955344 15564442 15283251
8268 15283251 15293966 15347021 15266510 15257676 15457697 15560088 15231818 14650198 14269364 14212176
8258 14212176 14229523 14155936 14059919 13967401 13764630 13444298 13194804 13137309 13154410 13088120 12965756
8247 12965756 12906492 12901215 12821303 12611815 12361155 12172019 12049473 11945107 11843623 11757642
8237 11757642 11687598 11646112 11671628 11731732 11667598 11380367 11050271 10967355 11106702 11121125 10878410
8226 10878410 10720723 10932161 11201797 11017812 10466562 10168027 10394920 10719479 10682594 10399653
8216 10399653 10255216 10321699 10377761 10282734 10057887 9763977 9538817 9594631 9937595 10234112
8206 10234112 10187507 9909062 9693472 9591442 9470341 9347719 9351918 9439011 9446655 9373410 9336254
8195 9336254 9315403 9211306 9084205 9052899 9029807 8865360 8678340 8683004 8738919 8493958 8003375
8184 8003375 7766171 8017968 8382472 8410234 8131075 7874848 7832682 7986180 8207642 8258458
8174 8258458 7957264 7513272 7397301 7705180 7981070 7888132 7678285 7691540 7775806 7633817
8164 7633817 7421219 7468309 7624247 7466429 7069289 6959967 7274394 7535702 7414773 7181644
8154 7181644 7169165 7259345 7218151 7150606 7240480 7322871 7132882 6809345 6739389 6967979 7139309
8143 7139309 7040123 6867393 6868795 6989823 7021987 6911537 6759422 6633842 6544839 6544182 6690006
8132 6690006 6905783 7005431 6913556 6771066 6746484 6813539 6828677 6785498 6825328 6966521 7011792
8121 7011792 6844802 6658248 6695769 6876403 6915543 6771531 6698369 6823720 6951486 6895505
8111 6895505 6763771 6739795 6781529 6748502 6678777 6705576 6798337 6829050 6832047 6936123 7056444
8100 7056444 6944437 6613118 6434948 6652319 7003835 7062481 6812170 6624986 6704518 6831371
8090 6831371 6745877 6550713 6539778 6746940 6896826 6801965 6597943 6499739 6496173 6444252 6359311
8079 6359311 6396193 6546527 6567152 6301606 5921351 5717445 5752510 5864023 5943055 6028880
8069 6028880 6129372 6133476 5983876 5807274 5759463 5816073 5830209 5747717 5642040 5563123 5498992
8058 5498992 5499699 5664973 5920655 5975858 5682713 5331770 5346985 5706459 5936348 5754356
8048 5754356 5445661 5418295 5621720 5695534 5552065 5453911 5526449 5556041 5387188 5212754
8038 5212754 5264859 5439689 5478056 5380039 5373742 5526418 5644686 5589322 5475146 5473202 5567085
8027 5567085 5617279 5576112 5522205 5515725 5523367 5501850 5479102 5500862 5537853 5520574 5458568 5429989
8015 5429989 5424249 5318533 5104634 5009480 5207167 5492022 5484339 5161039 4921070 5055610
8005 5055610 5403901 5642617 5660889 5495615 5168726 4827524 4799250 5185151 5577206 5533058
7995 5533058 5205860 5111306 5348904 5510397 5387267 5286201 5473460 5735090 5765707 5661449
7985 5661449 5694275 5828746 5817086 5644425 5543836 5614825 5715595 5739795 5760554 5856185 5970148
7974 5970148 5999877 5920013 5799068 5761652 5897106 6127403 6234262 6118331 5949959 5942237
7964 5942237 6068462 6155465 6159498 6156830 6139885 6053262 5989284 6092191 6266122 6249158 6034310
7953 6034310 5945693 6176211 6497443 6608324 6567795 6648139 6889868 7063772 7042504 6976122
7943 6976122 7049879 7230158 7334162 7272140 7153699 7171807 7395817 7678378 7803859 7744337
7933 7744337 7696005 7816010 8020803 8143075 8193560 8310307 8505555 8662883 8785982 9022503
7923 9022503 9358387 9510248 9299581 8977765 8948035 9241761 9519070 9576829 9587768 9756394
7913 9756394 9989495 10088849 10100733 10245239 10568289 10877703 11027193 11099029 11272816 11621149
7903 11621149 12050761 12372117 12460111 12434212 12607164 13118541 13702217 14009919 14085270 14246194
7893 14246194 14537252 14663240 14548606 14572944 15017477 15591614 15827150 15727934 15685764 15886485
7883 15886485 16144949 16268788 16270657 16233670 16230222 16353476 16589476 16712005 16566798 16385327
7873 16385327 16499353 16809811 16926725 16820744 16882245 17249084 17547511 17499047 17353112 17443672
7863 17443672 17701128 17933024 18239876 18748098 19205833 19304380 19231369 19445218 19990584 20483689
7853 20483689 20749025 21033434 21541939 22162150 22755586 23373286 24033170 24566552 24847739
7844 24847739 24960236 25003301 24929929 24694700 24374096 24020913 23569271 22991510 22381976 21785058
7834 21785058 21121802 20406843 19851448 19586904 19431474 19110465 18608869 18140299 17837246
7825 17837246 17631566 17413396 17178989 17008843 16957295 16963547 16876129 16621296 16329782 16197465
7815 16197465 16238655 16314444 16384260 16526860 16687590 16651774 16378824 16142509 16186416 16423164
7805 16423164 16634323 16788888 16974953 17173136 17308919 17410613 17517398 17544854 17437934 17333996
7795 17333996 17355799 17362474 17151170 16798434 16526792 16321686 15996704 15594051 15369365 15344020
7785 15344020 15210305 14783747 14257112 13870788 13586527 13249979 12867880 12551418 12336195
7776 12336195 12195451 12093845 11929175 11594241 11206240 11068486 11242353 11357801 11068184
7767 11068184 10534309 10200344 10192804 10223475 10061282 9820544 9710524 9711101 9629196 9377160 9079033
7756 9079033 8910149 8881200 8815131 8572948 8276576 8194510 8369484 8500513 8304520 7878513
7746 7878513 7552681 7469275 7485118 7447176 7371257 7330196 7325068 7314054 7259875 7123108 6906942
7735 6906942 6717488 6672634 6740274 6776519 6734998 6717664 6793426 6889724 6908978 6845174 6740247
7724 6740247 6629708 6578655 6661679 6843997 6984913 7030280 7099635 7293880 7512673 7579604
7714 7579604 7481090 7349613 7242048 7072445 6783455 6471633 6281790 6231564 6196645 6054606
7704 6054606 5805606 5542671 5324702 5118218 4886867 4694740 4642183 4697838 4690167 4518058
7694 4518058 4290430 4170352 4136014 4018173 3772370 3580773 3610489 3759521 3763532 3540125
7684 3540125 3304641 3289879 3441926 3499439 3339046 3116418 3039929 3118566 3203775 3193021 3093259
7673 3093259 2938275 2757600 2614052 2571540 2612986 2656794 2653099 2607081 2533315 2462255 2456262
7662 2456262 2517079 2509495 2312278 2039480 1955245 2132358 2344896 2362997 2213139 2060931
7652 2060931 1972562 1916520 1899424 1952912 2028834 2027811 1921201 1774143 1672377 1669211 1749735
7641 1749735 1805335 1723039 1551272 1477471 1574949 1692336 1688857 1642663 1681401 1731005 1630108
7630 1630108 1423246 1332572 1454569 1659454 1782308 1756931 1583824 1341122 1215504 1331163
7620 1331163 1531951 1520878 1252833 1009856 1033683 1252020 1435248 1467980 1385171 1270525
7610 1270525 1199251 1186282 1155160 1058348 1011260 1141048 1317100 1268018 1007609 877728 1059587
7599 1059587 1308092 1340427 1241806 1257365 1380451 1412137 1296958 1144492 1011159 894754
7589 894754 864581 972165 1104884 1137334 1136601 1196915 1192361 978532 737387 771452 992828
7578 992828 998322 689515 430507 478799 639332 673966 700030 897405 1097708 1016842 733198
7567 733198 578156 620231 601872 409804 292088 477838 800791 890455 648134 363449
7557 363449 353019 604274 844803 897819 846043 824043 788310 618814 368390 240634 328287
7546 328287 522865 685951 759425 707527 533965 383092 424001 582335 600548 434745
7536 434745 342047 451705 526614 362893 170468 255337 508329 563347 371139 254057
7526 254057 398017 626237 730527 724578 670286 522072 291341 156294 235862 388736
7516 388736 390914 228020 86489 107340 244999 349606 340171 298994 371718 541753 590480
7505 590480 396656 185101 275577 615569 804146 623426 311176 202130 303291 374463
7495 374463 283207 121572 53134 157363 360301 460787 327809 116856 139030 439732
7485 439732 682565 574346 238254 7258 -1134 87507 176290 270106 339623 324802 258121
7474 258121 219573 196559 140345 111798 191199 282384 213905 31664 -24317 129348 301478
7463 301478 331704 314076 394067 508923 497343 365109 264115 250957 235470 171554 135902
7452 135902 158264 117274 -69469 -243516 -171842 98056 249555 132979 -12661 68137
7442 68137 240976 212009 42509 74816 347205 480313 279055 67204 168788 377929
7432 377929 299288 -3736 -104966 145065 463053 585752 520883 338586 66698 -142029
7422 -142029 -69585 221627 379188 226996 -1069 -26637 103920 174722 130986 79248 92328
7411 92328 161064 239893 243670 108762 -76595 -134463 -37315 75058 153497 296773 483590
7400 483590 504065 293005 90244 97971 198121 195902 127055 110223 101155 36534 36368 200395
7388 200395 365956 341451 231840 250050 354072 379689 382662 487896 530506 281149 -37130
7377 -37130 49437 502045 710696 366184 -72856 -61346 270431 404100 215731 55084
7367 55084 154427 342335 370061 241069 128592 129809 184601 168676 38581 -89038 -39384
7356 -39384 199956 426521 452237 315289 191447 167723 194710 203753 169808 90860 -6233
7345 -6233 -57484 -29515 18849 -2908 -108774 -224772 -262684 -179178 1788 193371 302837
7334 302837 307451 250128 166295 66704 -15955 -40863 -30187 -50775 -109695 -142005 -115615 -71881
7322 -71881 -50818 -54427 -88714 -154042 -190808 -131975 -14785 58422 66227 65466 60047 10618 -36709
7309 -36709 4097 79815 46619 -76792 -98588 51888 205920 195603 41721 -142861 -253759
7298 -253759 -177067 97930 317830 195374 -145764 -280937 -120247 -38342 -214136 -303042
7288 -303042 -60891 163906 -5514 -312364 -302786 -110183 -179325 -419505 -336497 56701
7278 56701 191820 -102872 -304450 -73287 212292 138108 -87784 -95077 -19680 -202376 -526147
7267 -526147 -584697 -352320 -194018 -257640 -292324 -117726 81066 46491 -197783 -412395
7257 -412395 -431087 -292406 -151395 -121683 -194449 -293582 -370125 -397150 -334292 -207693 -160145
7246 -160145 -255224 -297642 -87265 189162 135568 -256250 -540450 -452820 -253016 -263121 -420347
7235 -420347 -520455 -570516 -618161 -538953 -310614 -210716 -391336 -531177 -307379 36357
7225 36357 41735 -247422 -408428 -333129 -282002 -326726 -270435 -122057 -140815 -351923 -479780
7214 -479780 -423569 -350349 -267164 3381 328828 282805 -160619 -459853 -285625 4050
7204 4050 -31666 -275772 -370943 -294892 -229216 -169430 -60917 -59816 -268986 -440769 -321635
7193 -321635 -85935 -52193 -171349 -193834 -156764 -266553 -432877 -377173 -138533 -35270
7183 -35270 -146688 -243485 -231578 -262534 -370260 -381412 -252943 -155506 -155342 -134085 -76936 -111360
7171 -111360 -202167 -151969 16255 28975 -178920 -327102 -249589 -144118 -190819 -261504 -221438
7160 -221438 -202093 -320905 -411280 -310722 -179000 -240574 -409552 -455812 -371821 -300659 -266892
7149 -266892 -253419 -366553 -615376 -702169 -400829 -12587 -27449 -391874 -561449 -313975
7139 -313975 -55552 -169850 -467146 -529471 -303761 -64996 9533 -55680 -222698 -444306
7129 -444306 -531903 -294048 147229 382761 161377 -300704 -553388 -404202 -87269 50342
7119 50342 -64783 -228058 -279111 -280854 -332369 -357118 -230592 -36304 1243 -164450 -333082
7108 -333082 -346892 -280443 -271618 -318330 -346769 -354943 -367149 -344403 -268406 -236587 -333590 -456754
7096 -456754 -415310 -195629 -935 -8861 -189615 -389535 -503509 -517421 -449449 -325932 -204098
7085 -204098 -153974 -178430 -177359 -58793 97983 80616 -174248 -420964 -377716 -118206 10196
7074 10196 -122881 -261873 -188400 -61384 -123493 -273173 -233835 -42073 -19939 -255336 -446337
7063 -446337 -365293 -186414 -175540 -279966 -256317 -75277 35652 -80265 -313872 -433936
7053 -433936 -326151 -89808 48732 -50071 -277525 -394872 -338342 -288316 -377096 -482236
7043 -482236 -432182 -274281 -170064 -139346 -105153 -103168 -218149 -358709 -337460 -175592 -92761
7032 -92761 -162817 -212198 -126171 -30347 -61987 -160616 -215390 -246491 -297942 -309312 -256516 -278933
7020 -278933 -474491 -670870 -611253 -323462 -110534 -174761 -405366 -549881 -470176 -220142
7010 -220142 18247 65018 -93787 -261458 -230764 -28112 117875 41514 -203100 -434450
7000 -434450 -509318 -406119 -225044 -109127 -112551 -163754 -190716 -210128 -226269 -147005 66144
6989 66144 246597 197413 -17525 -136306 -47360 101414 153642 121625 72182 14883 -22373
6978 -22373 38678 196333 334867 394571 441543 491932 426201 204616 25345 90554 296701
6967 296701 345488 144623 -72288 -64449 104664 158781 -38941 -314076 -392620 -237092 -81307
6956 -81307 -107089 -202446 -153845 12184 67093 -60647 -177682 -133138 -41200 -86707 -254709
6945 -254709 -381042 -373156 -270021 -159448 -123276 -192168 -290771 -307631 -255276 -244699 -273050
6934 -273050 -207742 -44758 21009 -98567 -209581 -126791 44354 103094 60204 39253 29048
6923 29048 -30301 -55876 24846 53145 -144285 -415670 -467338 -320003 -259223 -364018 -427629
6912 -427629 -363045 -337183 -424652 -455984 -335995 -224760 -248454 -278656 -169287 -7393 44141
6901 44141 -12377 -86035 -175778 -317357 -447542 -446932 -270162 7800 209339 153918 -118208
6890 -118208 -278928 -86021 224079 207255 -139608 -365739 -261158 -146490 -293789 -468356
6880 -468356 -343007 -39837 92323 2377 -112161 -194604 -317781 -410891 -332140 -140268
6870 -140268 -15058 17345 37114 18354 -80647 -132590 -19582 114234 67015 -78711 -112968
6859 -112968 -74787 -137349 -222683 -111193 116165 138348 -95837 -286300 -245543 -100461 12736
6848 12736 118460 206797 190189 122180 159120 258853 233323 130219 195727 400299 411574
6837 411574 157745 -6489 116353 230492 54813 -202380 -195818 22312 155407 130746
6827 130746 98608 129531 190639 284138 377012 342381 177290 102198 234854 364114 277196
6816 277196 102244 65026 108350 47930 -65949 -50032 82930 182239 221142 240906 183961
6805 183961 47883 28113 214733 345391 195593 1113 86039 271998 150363 -197559
6795 -197559 -308433 -110224 2716 -92153 -44341 268991 428122 152838 -188672 -124846
6785 -124846 230901 421625 314648 161090 159724 275570 382037 351583 119433 -168010
6775 -168010 -222192 7410 210430 148259 -6441 22704 187166 257288 212613 198402 227348
6764 227348 213028 199246 276314 349616 269332 132166 173719 383320 494086 371785 179417
6753 179417 117649 193319 286779 301708 222339 125177 114574 168811 144758 36885 61754
6742 61754 301535 464664 295196 47099 152011 508151 577791 222887 -62264 79796
6732 79796 349384 337962 183684 257673 485303 482242 242418 181804 460912 713526 608195
6721 608195 324709 237388 374354 466716 394468 304036 318692 375543 393164 419924 532365
6710 532365 698763 822534 849101 775016 628933 508814 559152 811473 1087498 1159746
6700 1159746 999934 794862 730401 830092 985597 1063182 991830 827602 718630 732079
6690 732079 759299 700290 678790 890265 1251992 1429699 1268428 981669 821394 784619
6680 784619 788970 906830 1191839 1441370 1410348 1177781 1039812 1088067 1152902 1142259 1160507
6669 1160507 1253736 1296794 1224635 1164231 1229553 1360120 1466863 1573064 1692305 1720832 1601596
6658 1601596 1481460 1541976 1738792 1861707 1824321 1754078 1787214 1893741 1955193 1942393 1943321
6647 1943321 2027406 2146216 2205707 2199251 2200207 2234636 2259405 2286667 2405144 2611163 2755949
6636 2755949 2778936 2851996 3106173 3336203 3246307 2951945 2926553 3368930 3897628 4038087
6626 4038087 3807702 3604739 3646746 3770268 3777133 3754334 3933203 4329511 4671933 4720652
6616 4720652 4559522 4471369 4571223 4716372 4789393 4870302 5029049 5146782 5122529 5095949 5243826
6605 5243826 5483610 5622600 5688218 5835086 6020693 6087778 6104552 6280222 6572785 6744773
6595 6744773 6807623 7020157 7409174 7705627 7837780 8055740 8437529 8719400 8804684 8990490
6585 8990490 9436402 9843508 9973349 10079716 10463680 10967287 11305152 11567536 11966210 12369934
6575 12369934 12548523 12652530 13004544 13589172 14150224 14617709 15068790 15471211 15834796
6566 15834796 16384487 17210828 18024038 18640080 19359121 20406945 21418607 22055002 22701941
6557 22701941 23854457 25225400 26295185 27350289 28990444 30937600 32485896 33915868
6549 33915868 36160662 39146108 41913692 44485535 47986924 52587501 57136195 61538975
6541 61538975 67485807 75417301 82550309 85940385 86323674 86676455 87665150 86988514 83195965
6532 83195965 77743030 72600601 67826130 62580834 57064911 52169358 48112019 44534874
6524 44534874 41386971 38819714 36620747 34461340 32377709 30503217 28722104 27024779
6516 27024779 25736697 24942110 24163228 23071704 22017804 21366288 20828820 20011823 19131623
6507 19131623 18569784 18157469 17538639 16837334 16302706 15687636 14708903 13770505 13421312
6498 13421312 13364833 12879105 12053100 11673320 11890060 11932406 11323009 10530353 10117869 9973176
6488 9973176 9745735 9438075 9171735 8869178 8540913 8450598 8643028 8710629 8374542 7923006
6478 7923006 7726701 7676570 7471199 7140217 6895393 6732942 6560138 6470866 6520445 6458434
6468 6458434 6077788 5626361 5466419 5505674 5397068 5152581 5078817 5177163 5109758 4790994
6458 4790994 4544084 4562887 4634518 4552866 4435969 4427206 4397081 4190246 3931908 3835821 3879566
6447 3879566 3903929 3892642 3919927 3932469 3825228 3661985 3583336 3545562 3408343 3266412 3386167
6436 3386167 3723176 3813604 3376348 2800509 2708498 3128546 3462225 3303430 2917422 2739122
6426 2739122 2740832 2623258 2403014 2380944 2590775 2710328 2580537 2414116 2353819 2217869
6416 2217869 1919399 1770233 2014019 2341482 2302201 2011351 1960040 2207120 2296838 2039338
6406 2039338 1833779 1993193 2213788 2067464 1683705 1524526 1682708 1830609 1787764 1739914
6396 1739914 1863314 2053722 2117353 2007110 1801528 1628845 1640584 1868597 2085262 2018472
6386 2018472 1742537 1619065 1778863 1921569 1767383 1463670 1337293 1432201 1533018 1519647
6376 1519647 1449178 1357626 1220676 1092060 1080178 1187902 1326873 1452568 1531414 1455354
6366 1455354 1204053 1020871 1150906 1424555 1415847 1061808 795213 936110 1265043 1398998
6356 1398998 1316813 1250253 1261621 1225893 1110830 1001684 919996 848114 858274 995039 1110321
6345 1110321 1048711 919023 931959 1043308 1042268 940071 946331 1061250 1034797 795365 591797
6334 591797 598100 677266 674613 658887 703623 697542 573697 491675 579007 705451 731738 765562
6322 765562 920865 1031610 902898 676228 615418 658075 538321 278300 173628 293401
6312 293401 374373 278327 196967 273786 346095 251932 126974 167271 297143 323140 284667
6301 284667 387647 635811 768145 602739 278892 86092 144465 325326 445365 461400
6291 461400 443516 407076 279521 75044 -16247 151312 431818 531663 391386 245912
6281 245912 275501 382532 391326 296062 192775 110215 49577 74834 204128 298928 232218
6270 232218 107640 128348 276714 327036 200855 99606 183657 301146 214480 -14066
6260 -14066 -92608 60385 192639 122294 30933 150685 338946 278696 34481 25701 367024
6249 367024 625309 457455 145763 152054 404503 471023 280763 162493 203411 115234 -160680
6238 -160680 -246826 41487 329560 264197 61409 91716 255565 223533 54805 82710 312804
6227 312804 410672 244218 10521 -157564 -297414 -331622 -108811 216029 262484 -9598
6217 -9598 -205998 -91304 112080 164028 143205 146653 57603 -128238 -135986 112033 233492
6206 233492 -12326 -227803 22047 423928 351257 -102978 -239089 116378 334426 28871
6196 28871 -326340 -209385 111413 91779 -163099 -128061 212919 332766 36937 -230728
6186 -230728 -94355 234066 360422 246213 82991 -61718 -185021 -168234 39140 209414
6176 209414 102826 -157260 -245872 -94231 87312 186843 288532 388272 321041 63173
6166 63173 -147743 -125806 23863 106028 108229 136019 209871 265701 269193 228699 174123 178110
6154 178110 282097 360475 228044 -50784 -170724 -19277 129707 33882 -139928 -110993
6144 -110993 41890 28809 -152318 -222797 -94399 8815 -65260 -188108 -196621 -104136 3172
6133 3172 74595 55009 -68591 -165946 -115081 -37974 -132071 -288880 -201736 122990 323840
6122 323840 234594 98790 98982 68026 -115864 -228196 -81516 123091 150979 136199 269233
6111 269233 370108 202408 -14303 110455 475507 600906 351745 82423 54920 158531
6101 158531 259377 403962 572009 604438 501784 463640 522835 470034 255136 122950
6091 122950 206257 316660 305018 295158 359111 297665 10894 -209197 -74273 235822 328783
6080 328783 152974 -23743 -61090 -49848 -41203 15828 77072 11983 -159149 -244973 -141904
6069 -141904 36833 115462 26862 -167135 -329410 -339380 -209718 -77794 -33210 -35006 -43299
6058 -43299 -91834 -147704 -72075 144291 277140 172580 -4874 -28935 31426 -55675 -310757
6047 -310757 -540813 -623079 -565979 -382572 -137865 -23171 -132444 -264724 -212788 -121344
6037 -121344 -232405 -398667 -271618 70935 158045 -148900 -424792 -329906 -69790 14380
6027 14380 -55058 -75826 -48011 -79015 -133496 -150227 -217001 -381091 -471172 -352628 -178242
6016 -178242 -138335 -152098 -79371 -42406 -203471 -377915 -253568 80787 220745 61074
6006 61074 -57777 98341 300970 220319 -106430 -365742 -383587 -276960 -248236 -345899 -433907
5995 -433907 -375421 -235625 -223885 -382996 -466501 -266405 58181 187828 90891 7626 24175
5984 24175 -39735 -269565 -467665 -450781 -310453 -224242 -181572 -65043 111795 209700 155888
5973 155888 22756 -61625 -36297 27706 -4181 -133832 -166293 20566 217300 122443 -187603
5962 -187603 -320310 -145477 10966 -111269 -308227 -265660 -49360 48261 -36396 -141149
5952 -141149 -202310 -265658 -265329 -111074 48386 -30358 -275641 -351540 -170268 -45419 -215935
5941 -215935 -488654 -535134 -345423 -177056 -167458 -203806 -154334 -70535 -108847 -308678 -505118
5930 -505118 -501308 -320709 -194298 -240968 -285195 -128788 112263 154859 -34480 -221284 -282027
5919 -282027 -321937 -381853 -329810 -150731 -57243 -152208 -241051 -172203 -115469 -261784 -467417
5908 -467417 -482042 -355190 -307931 -340618 -300020 -230141 -292257 -393775 -288814 -53006 -48309
5897 -48309 -333064 -513489 -347453 -118516 -166790 -372032 -407324 -256101 -142720 -130428
5887 -130428 -132589 -195620 -411160 -612648 -523678 -210456 -39054 -129924 -194820 -32245 137807
5876 137807 34350 -241619 -373279 -274625 -122903 -44298 -9709 -3141 -67731 -167351 -186410
5865 -186410 -112089 -71367 -134012 -204953 -183466 -125665 -152826 -258132 -307039 -222959 -96919
5854 -96919 -87016 -241671 -445699 -533843 -446257 -270805 -139978 -102949 -111661 -115986 -129921 -182091
5842 -182091 -236209 -220494 -141606 -102209 -158787 -221958 -184944 -109564 -152711 -308014 -386832
5831 -386832 -313903 -255866 -327888 -364689 -201398 -16645 -80965 -259945 -167586 169782 254100
5820 254100 -117478 -467465 -330155 44612 108563 -137045 -231091 -52661 35380 -137987
5810 -137987 -279223 -183972 -77951 -160374 -222853 -42002 179757 131182 -89441 -150414 -20105
5799 -20105 49628 -21784 -72414 -56185 -132563 -354755 -543119 -541559 -400123 -255007 -190820
5788 -190820 -237034 -348986 -405463 -367928 -374696 -500472 -541522 -308575 -23463 -59369 -333063
5777 -333063 -389904 -135542 1372 -203043 -378016 -203947 5582 -179172 -542941 -534002
5767 -534002 -155711 33816 -202202 -457998 -366727 -121320 -74540 -193619 -226961 -165563
5757 -165563 -195762 -309541 -288818 -86804 35882 -138633 -453105 -541630 -290953 4455
5747 4455 8025 -241660 -419081 -369180 -262245 -246358 -203570 -27446 89177 -70712 -341711
5736 -341711 -385798 -222854 -171943 -285028 -268074 -46187 38232 -206902 -459309 -378342 -133030
5725 -133030 -85472 -210199 -221448 -94133 -46607 -111537 -124963 -88728 -157784 -290631 -300287
5714 -300287 -252787 -394159 -625384 -512290 8589 374432 140662 -368674 -519355 -228238
5704 -228238 36183 -24439 -231473 -332813 -340591 -364458 -379167 -311735 -204425 -154576 -170249
5693 -170249 -179048 -138525 -77633 -46097 -53160 -62205 -56535 -94037 -231551 -388403 -391217 -210687
5681 -210687 -46221 -82671 -257141 -378236 -388068 -369931 -366250 -343224 -296561 -247315 -165741
5670 -165741 -40207 21336 -76928 -219618 -203462 -53116 -6243 -152138 -297772 -272249 -171136
5659 -171136 -182289 -324644 -486368 -594089 -614820 -500999 -275979 -96739 -95864 -209144 -271153
5648 -271153 -236519 -201141 -237977 -308724 -326418 -246098 -112511 -40712 -95726 -187206 -187865 -164524
5636 -164524 -317923 -624783 -749448 -472496 -29628 188790 132930 39269 -1176 -108198
5626 -108198 -282974 -344846 -253309 -200280 -280350 -332496 -242905 -160518 -237342 -366874 -387311
5615 -387311 -367365 -452359 -559859 -494519 -295877 -204486 -291639 -371580 -317424 -236638 -253833
5604 -253833 -312685 -302961 -233254 -162534 -88157 -24517 -74244 -269117 -431582 -374694 -188990
5593 -188990 -131018 -236019 -269322 -122188 -12523 -131634 -302768 -249835 -68838 -95111
5583 -95111 -329910 -382978 -96383 151103 12421 -270808 -246720 26106 89507 -162382
5573 -162382 -329902 -174849 19120 -56200 -264977 -322437 -247607 -217726 -218819 -166956 -175451
5562 -175451 -349311 -470950 -275676 54995 78453 -256020 -536815 -505421 -354029 -316881
$$ [...]
##END NTUPLES=NMR SPECTRUM
##END=
