##TITLE=1H ikalashn
CG-1214-A
22.10.2024
##JCAMPDX= 6.0         $$ Bruker NMR JCAMP-DX V2.0
##DATA TYPE= NMR SPECTRUM
##DATA CLASS= NTUPLES
##ORIGIN= UXNMR, Bruker Analytische Messtechnik GmbH
##OWNER= root
$$ TOPSPIN		Version 1.3
$$ 2024-10-22 13:40:31.312 +0400  Irina@DPX200
$$ Compression mode = diff/dup
##.OBSERVE FREQUENCY= 200.131300845
##.OBSERVE NUCLEUS= ^1H
##.ACQUISITION MODE= SIMULTANEOUS
##.ACQUISITION SCHEME= undefined
##.AVERAGES= 16
##.DIGITISER RES= 18
##SPECTROMETER/DATA SYSTEM= spect
##.PULSE SEQUENCE= zg
##.SOLVENT NAME= D2O
##.SHIFT REFERENCE= INTERNAL, D2O, 1, 17.49637
##AUDIT TRAIL= $$ (NUMBER, WHEN, WHO, WHERE, WHAT)
$$ ##TITLE= Audit trail, TOPSPIN		Version 1.3
$$ ##JCAMPDX= 5.01
$$ ##ORIGIN= Bruker BioSpin GmbH
$$ ##OWNER= Irina
$$ $$ F:/spectra/data/iren/nmr/1H/4/pdata/1/auditp.txt
$$ ##AUDIT TRAIL=  $$ (NUMBER, WHEN, WHO, WHERE, VERSION, WHAT)
(   1,<2024-10-22 13:39:06.812 +0400>,<Irina>,<DPX200>,<TOPSPIN 1.3>,
      <acquisition in progress>)
(   2,<2024-10-22 13:40:13.578 +0400>,<Irina>,<DPX200>,<TOPSPIN 1.3>,
      <Start of raw data processing
       efp BC_mod = 2 LB = 0.01 FT_mod = 6 PKNL = 1 PHC0 = -46.44487 PHC1 = 14.20711 SI = 32K 
       data hash MD5: 32K
       6F 1E BA 58 C5 73 38 7D DA 7A 83 B7 E7 70 F4 96>)
(   3,<2024-10-22 13:40:17.875 +0400>,<Irina>,<DPX200>,<TOPSPIN 1.3>,
      <apk 
       data hash MD5: 32K
       09 52 3F B0 62 F1 EA 9E B0 25 5C D7 FB 0B 06 45>)
(   4,<2024-10-22 13:40:20.203 +0400>,<Irina>,<DPX200>,<TOPSPIN 1.3>,
      <abs n ABSG = 5 
       data hash MD5: 32K
       59 81 B0 84 92 AE AC 4A 80 9B D2 FE 4B D2 75 6F>)
$$ ##END=
$$ 
$$ $$ hash MD5
$$ $$ 7A 60 96 81 BF 1F 01 C6 D3 7D 1E 41 33 7D 7E 4F
##$RELAX= 
##$RELAX= 
##$RELAX= 
##$RELAX= 
##$RELAX= 
##$RELAX= 
##$RELAX= 
##$RELAX= 
##$RELAX= 
$$ Bruker specific parameters
$$ --------------------------
##$DU= <F:/spectra>
##$EXPNO= 4
##$NAME= <1H>
##$PROCNO= 1
##$TYPE= <nmr>
##$USER= <iren>
##$AMP= (0..31)
100 100 100 100 100 100 100 100 100 100 100 100 100 100 100 100 100 100 
100 100 100 100 100 100 100 100 100 100 100 100 100 100 
##$ANAVPT= -1
##$AQSEQ= 0
##$AQ_mod= 1
##$AUNM= <au_zg>
##$AUTOPOS= <>
##$BF1= 200.13
##$BF2= 200.13
##$BF3= 200.13
##$BF4= 200.13
##$BF5= 200.13
##$BF6= 200.13
##$BF7= 200.13
##$BF8= 200.13
##$BYTORDA= 1
##$CFDGTYP= 0
##$CFRGTYP= 5
##$CHEMSTR= <none>
##$CNST= (0..63)
1 1 145 1 1 1 1 1 1 1 1 1 1 1 1 1 1 1 1 1 1 1 1 1 1 1 1 1 1 1 1 1 1 1 
1 1 1 1 1 1 1 1 1 1 1 1 1 1 1 1 1 1 1 1 1 1 1 1 1 1 1 1 1 1 
##$CPDPRG= <>
##$CPDPRG1= <>
##$CPDPRG2= <>
##$CPDPRG3= <>
##$CPDPRG4= <mlev>
##$CPDPRG5= <mlev>
##$CPDPRG6= <mlev>
##$CPDPRG7= <mlev>
##$CPDPRG8= <mlev>
##$CPDPRGB= <>
##$CPDPRGT= <>
##$D= (0..63)
0 2 0 0 0 0 0 0 0 0.06 0 0.03 0 0 0 0 0.0002 0 0 0 0 0 0 0 0 0 0 0 0 0 
0 0 0 0 0 0 0 0 0 0 0 0 0 0 0 0 0 0 0 0 0 0 0 0 0 0 0 0 0 0 0 0 0 0 
##$DATE= 1729590011
##$DBL= (0..7)
120 120 120 120 120 120 120 120 
##$DBP= (0..7)
150 150 150 150 150 150 150 150 
##$DBP07= 0
##$DBPNAM0= <>
##$DBPNAM1= <>
$$ [...]
##$SW_h= 4401.40845070422
##$TD= 16384
##$TD0= 1
##$TE= 300
##$TE2= 300
##$TE3= 300
##$TEG= 300
##$TL= (0..7)
0 120 120 120 120 120 120 120 
##$TP= (0..7)
150 150 150 150 150 150 150 150 
##$TP07= 0
##$TPNAME0= <>
##$TPNAME1= <>
##$TPNAME2= <>
##$TPNAME3= <>
##$TPNAME4= <>
##$TPNAME5= <>
##$TPNAME6= <>
##$TPNAME7= <>
##$TPOAL= (0..7)
0.5 0.5 0.5 0.5 0.5 0.5 0.5 0.5 
##$TPOFFS= (0..7)
0 0 0 0 0 0 0 0 
##$TUNHIN= 0
##$TUNHOUT= 0
##$TUNXOUT= 0
##$USERA1= <user>
##$USERA2= <user>
##$USERA3= <user>
##$USERA4= <user>
##$USERA5= <user>
##$V9= 5
##$VALIST= <valist>
##$VCLIST= <CCCCCCCCCCCCCCC>
##$VD= 0
##$VDLIST= <DDDDDDDDDDDDDDD>
##$VPLIST= <PPPPPPPPPPPPPPP>
##$VTLIST= <TTTTTTTTTTTTTTT>
##$WBST= 1024
##$WBSW= 25
##$XGAIN= (0..3)
0 0 0 0 
##$XL= 0
##$YL= 0
##$YMAX_a= 645986
##$YMIN_a= -1277875
##$ZGOPTNS= <>
##$ZL1= 120
##$ZL2= 120
##$ZL3= 120
##$ZL4= 120
##$ABSF1= 17.49637
##$ABSF2= -4.496376
##$ABSG= 5
##$ABSL= 3
##$ALPHA= 0
##$AQORDER= 0
##$ASSFAC= 0
##$ASSFACI= 0
##$ASSFACX= 0
##$ASSWID= 0
##$AUNMP= <proc_1d>
##$AXLEFT= 0
##$AXRIGHT= 0
##$AXTYPE= 0
##$AXUNIT= <>
##$AZFE= 0.1
##$AZFW= 0.1
##$BCFW= 0
##$BC_mod= 2
##$BYTORDP= 0
##$COROFFS= 0
##$CY= 7568.61572265625
##$DATMOD= 1
##$DC= 0
##$DFILT= <>
##$DTYPP= 0
##$F1P= 17.9538593292236
##$F2P= -4.03888763876832
##$FCOR= 0.5
##$FTSIZE= 32768
##$FT_mod= 6
##$GAMMA= 0
##$GB= 0
##$INTBC= 0
##$INTSCL= 1.936888e-010
##$ISEN= 128
##$LB= 0.01
##$LEV0= 0
##$LPBIN= 0
##$MAXI= 945.577
##$MC2= 0
##$MEAN= 0
##$ME_mod= 0
##$MI= -402.1523
##$NCOEF= 0
##$NC_proc= -5
##$NLEV= 6
##$NOISF1= 8.587773
##$NOISF2= 6.764455
##$NSP= 0
##$NTH_PI= 0
##$NZP= 0
##$OFFSET= 17.49637
##$PC= 1
##$PHC0= -40.02401
##$PHC1= 3.795192
##$PH_mod= 1
##$PKNL= yes
##$PPARMOD= 0
##$PPDIAG= 0
##$PPIPTYP= 0
##$PPMPNUM= 100
##$PPRESOL= 1
##$PSCAL= 0
##$PSIGN= 0
##$REVERSE= no
##$SF= 200.13
##$SI= 32768
##$SIGF1= 16.12182
##$SIGF2= -4.496377
##$SINO= 3.521527
##$SIOLD= 32768
##$SREGLST= <1H.CDCl3>
##$SSB= 0
##$STSI= 32768
##$STSR= 0
##$SW_p= 4401.40845070422
##$SYMM= 0
##$S_DEV= 0
##$TDeff= 16384
##$TDoff= 0
##$TI= <>
##$TILT= no
##$TM1= 0
##$TM2= 0
##$TOPLEV= 0
##$USERP1= <user>
##$USERP2= <user>
##$USERP3= <user>
##$USERP4= <user>
##$USERP5= <user>
##$WDW= 1
##$XDIM= 32768
##$YMAX_p= 280870670
##$YMIN_p= -257051
$$ End of Bruker specific parameters
$$ ---------------------------------
##NTUPLES= NMR SPECTRUM
##VAR_NAME=  FREQUENCY,     SPECTRUM/REAL,   SPECTRUM/IMAG
##SYMBOL=    X,             R,               I
##VAR_TYPE=  INDEPENDENT,   DEPENDENT,       DEPENDENT
##VAR_FORM=  AFFN,          ASDF,            ASDF
##VAR_DIM=   32768,         32768,           32768
##UNITS=     HZ,            ARBITRARY UNITS, ARBITRARY UNITS
##FACTOR=    0.134324425510551, 1,           1
##FIRST=     4401.40845070422, 82142,        -850235
##LAST=      0,             -202512,         -983732
##MIN=       0,             -257051,         0
##MAX=       4401.40845070422, 280870670,    0
$$ Real data points
##PAGE= N=1
##DATA TABLE= (X++(R..R)), XYDATA
$$ [...]
$$ plain form
14063 3910632 4039808 4164911 4332225 4483166 4557033 4604302 4706211 4836236 4901791 4887971
14053 4887971 4857890 4832780 4776908 4694170 4634110 4592546 4504174 4353343 4201922 4083877 3960295
14042 3960295 3807988 3664838 3549399 3421029 3266912 3146728 3093057 3042042 2929293 2789206
14032 2789206 2687405 2613534 2521374 2426961 2378329 2359213 2311397 2235817 2185639 2163616 2110321
14021 2110321 2006493 1912889 1882186 1888764 1877782 1841209 1809223 1790815 1758243 1689078 1604826
14010 1604826 1556752 1569875 1608758 1614421 1570681 1509559 1455195 1402094 1355236 1343004 1368408
13999 1368408 1391927 1388176 1375315 1364323 1333536 1284510 1259055 1258047 1216066 1116981 1055310 1095681
13987 1095681 1146237 1087911 972102 948758 1026102 1058075 980034 901755 919746 976072 978011
$$ packed form
14063C910632J29176J25103J67314J50941P3867M7269J01909J30025O5555j3820
14053D887971l0081k5110n5872q2738o0060m1564q8372j50831j51421j18045j23582
14042C960295j52307j43150j15439j28370j54117j20184n3671n1015j12749j40087
14032B789206j01801p3871r2160r4413m8632j9116m7816p5580n0178k2023n3295
14021B110321j03828r3604l0703O578j0982l6573l1986j8408l2572o9165q4252
14010A604826m8074J3123L8883N663m3740o1122n4364n3101m6858j2232K5404
13999A368408K3519l751j2861j0992l0787m9026k5455j008m1981r9085o1671M0371
13987A095681N0556n8326j15809k3344P7344L1973p8041p8279J7991N6326J939
$$ plain form
13976 978011 944430 942749 964594 957106 919855 887654 862059 833922 833485 884611 940552 936632
13964 936632 886405 860305 880973 900019 878303 840116 834824 869033 889115 836759 731486
13953 731486 675718 736780 844943 877572 833053 823505 882476 900730 808656 705442 712883
13942 712883 793016 822672 780782 743880 746059 762671 794768 848891 864171 787148 696483 715087
13930 715087 807950 819360 722778 668215 734413 800948 756259 683245 709696 790079 791417 724510
13918 724510 723043 815585 877715 832420 762356 769614 828317 847632 809183 764891 743076 734165
13906 734165 747808 806314 876990 881971 804847 732921 747094 807332 808020 730204 668252 694492
13894 694492 765024 794550 769775 739716 734381 749287 783115 832565 866116 856758 827898 817437
$$ packed form
13976I78011l3581j681K1845p488l7251l2201k5595k8137m37N1126N5941l920
13964I36632n0227k6100K0668J9046k1716l8187n292L4209K0082n2356j05273
13953G31486n5768O1062J08163L2629m4519r548N8971J8254r2074j03214P441
13942G12883Q0133K9656m1890l6902K179J6612L2097N4123J5280p7023r0665J8604
13930G15087R2863J1410r6582n4563O6198O6535m4689p3014K6451Q0383J338o6907
13918G24510j467R2542O2130m5295p0064P258N8703J9315l8449m4292k1815q911
13906G34165J3643N8506P0676M981p7124p1926J4173O0238O88p7816o1952K6240
13894F94492P0532K9526k4775l0059n335J4906L3828M9450L3551r358k8860j0461
$$ plain form
13882 817437 815846 796943 786663 826721 883521 880796 826627 815986 885333 954643 951091 906211
13870 906211 881213 874450 865454 882047 947475 1010224 1004822 951904 927217 952344 980327 975816
13858 975816 952028 934504 932733 942138 945725 930873 922784 961752 1022831 1018966 931265 868348
13846 868348 921757 1023021 1042489 986113 976331 1053759 1122440 1108019 1056384 1037332 1047859
13835 1047859 1061828 1094301 1157429 1214366 1233819 1241231 1265864 1284790 1271378 1255014 1274713
13824 1274713 1308433 1309069 1285993 1289217 1325808 1352428 1350068 1349899 1372331 1389047 1372762 1352071
13812 1352071 1379537 1453889 1508914 1493882 1443468 1438507 1500064 1557948 1542006 1472881 1428823
13801 1428823 1445210 1490227 1527644 1553734 1571429 1577237 1584366 1614434 1652494 1653889 1613640 1584967
$$ packed form
13882H17437j591j8903j0280M0058N6800k725n4169j0641O9347O9310l552m4880
13870I06211k4998o763q996J6593O5428O2749n402n2918k4687K5127K7983m511
13858I75816k3788j7524j771R405L587j4852q089L8968O1079l865q7701o2917
13846H68348N3409J01264J9468n6376r782P7428O8681j4421n1635j9052J0527
13835A047859J3969L2473O3128N6937J9453P412K4633J8926j3412j6364J9699
13824A274713L3720O36k3076L224L6591K6620k360j69K2432J6716j6285k0691
13812A352071K7466P4352N5025j5032n0414m961O1557N7884j5942o9125m4058
13801A428823J6387M5017L7417K6090J7695N808P129L0068L8060J395m0249k8673
$$ plain form
13789 1584967 1603440 1633592 1624560 1586161 1571182 1601967 1649942 1678492 1679360 1669787 1667990 1668601 1643874
13776 1643874 1584358 1529770 1528228 1569383 1598892 1598372 1600367 1619710 1632016 1635277 1661412 1697486
13764 1697486 1675868 1594715 1567382 1671303 1812758 1842160 1760618 1700975 1725399 1761795 1748261
13753 1748261 1722292 1728838 1740692 1725475 1710362 1718204 1708878 1655002 1617557 1662419 1741391 1749529
13741 1749529 1684629 1652823 1705177 1763988 1753496 1722138 1760614 1848772 1877085 1811196 1744406
13730 1744406 1761427 1827043 1859675 1854119 1860250 1879784 1871447 1847439 1873483 1956278 2014647 1998727
13718 1998727 1964607 1981864 2032297 2061377 2073656 2103263 2132947 2125616 2109508 2146117 2226210
13707 2226210 2283325 2307905 2358515 2447096 2503864 2490512 2468663 2506291 2580216 2629675 2657525
$$ packed form
13789A584967J8473L0152r032l8399j4979L0785M7975K8550Q68r573j797O11k4727
13776A643874n9516n4588j542M1155K9509n20J995J9343J2306L261K6135L6074
13764A697486k1618q1153k7333J03921J41455K9402q1542n9643K4424L6396j3534
13753A748261k5969O546J1854j5217j5113P842r326n3876l7445M4862P8972Q138
13741A749529o4900l1806N2354N8811j0492l1358L8476Q8158K8313o5889o6790
13730A744406J7021O5616L2632n556O131J9534q337k4008K6044Q2795N8369j5920
13718A998727l4120J7257N0433K9080J2279K9607K9684p331j6108L6609Q0093
13707B226210N7115K4580N0610Q8581N6768j3352k1849L7628P3925M9459K7850
$$ plain form
13696 2657525 2711614 2792341 2843936 2835383 2801800 2796707 2833641 2885911 2926160 2951643 2970555 2974707
13684 2974707 2946323 2898260 2878199 2908081 2948847 2963413 2981369 3041299 3098163 3076296 3008890
13673 3008890 3020342 3143263 3257456 3265647 3231952 3262455 3331306 3339050 3294729 3311766 3427338
13662 3427338 3542629 3570161 3546004 3549303 3582659 3594305 3578115 3586762 3649510 3720946 3728955 3660942
13650 3660942 3585746 3579359 3634668 3668506 3625427 3543898 3497723 3502548 3516149 3507733 3482825 3453634
13638 3453634 3431018 3438352 3485262 3528403 3508255 3433958 3384735 3409235 3464072 3477348 3441871
13627 3441871 3415127 3442998 3509854 3561348 3562344 3529501 3507147 3513373 3523970 3516318 3505783 3517066
13615 3517066 3541469 3555394 3565350 3595467 3638730 3662230 3659602 3657786 3668556 3673011 3662467 3657345
$$ packed form
13696B657525N4089Q0727N1595q553l3583n093L6934N2270M0249K5483J8912M152
13684B974707k8384m8063k0061K9882M0766J4566J7956N9930N6864k1867o7406
13673C008890J1452J22921J14193Q191l3695L0503O8851P744m4321J7037J15572
13662C427338J15291K7532k4157L299L3356J1646j6190Q647O2748P1436Q009o8013
13650C660942p5196o387N5309L3838m3079q1529m6175M825J3601q416k4908k9191
13638C453634k2616P334M6910M3141k0148p4297m9223K4500N4837J3276l5477
13627C441871k6744K7871O6856N1494R96l2843k2354O226J0597p652j0535J1283
13615C517066K4403J3925R956L0117M3263K3500k628j816J0770M455j0544n122
$$ plain form
13603 3657345 3671237 3685794 3677243 3649665 3633225 3658676 3725768 3785228 3776894 3710610 3673833 3716545
13591 3716545 3770865 3752007 3698888 3717041 3802999 3845915 3812559 3799234 3858048 3904980 3878058
13580 3878058 3862520 3945393 4047148 4040599 3969941 3992042 4127053 4228538 4212042 4162107 4171293
13569 4171293 4208991 4217352 4222554 4263735 4299996 4284367 4264747 4309768 4379279 4376216 4307183 4282718
13557 4282718 4349546 4423617 4425657 4398549 4430132 4517344 4580533 4586467 4583496 4611745 4642350 4633942
13545 4633942 4606831 4620593 4695125 4789932 4859132 4898801 4935373 4988337 5053168 5110058 5145846
13534 5145846 5173977 5226034 5310154 5388920 5421452 5416733 5413373 5416193 5398592 5366343 5359112 5372460
13522 5372460 5345735 5266395 5219823 5272039 5358333 5371999 5324717 5317975 5372216 5399819 5364037
$$ packed form
13603C657345J3892J4557q551k7578j6440K5451O7092N9460q334o6284l6777M2712
13591C716545N4320j8858n3119J8153Q5958M2916l3356j3325N8814M6932k6922
13580C878058j5538Q2873J01755o549p0658K2101J35011J01485j6496m9935R186
13569D171293L7698Q361N202M1181L6261j5629j9620M5021O9511l063o9033k4465
13557D282718O6828P4071K040k7108L1583Q7212O3189N934k971K8249L0605q408
13545D633942k7111J3762P4532R4807O9200L9669L6572N2964O4831N6890L5788
13534E145846K8131N2057Q4120P8766L2532m719l360K820j7601l2249p231J3348
13522E372460k6725p9340m6572N2216Q6294J3666m7282o742N4241K7603l5782
$$ plain form
13511 5364037 5348608 5418005 5509538 5541640 5549144 5614317 5719372 5779331 5797007 5868361 6023038
13500 6023038 6167607 6228702 6264600 6373034 6552650 6728228 6870151 7007116 7137764 7214033
13490 7214033 7225757 7231406 7271812 7306313 7278726 7209549 7169031 7174819 7169687 7103848 6995418 6896574
13478 6896574 6834540 6801673 6773522 6718590 6620250 6513596 6472483 6526172 6610251 6640657 6621318
13467 6621318 6627880 6687831 6739510 6735071 6725739 6789440 6907646 6986097 6995800 7018872 7123170 7255411
13455 7255411 7320617 7327678 7371976 7478792 7556344 7539259 7496815 7529672 7616132 7650955 7609346
13444 7609346 7573156 7590769 7607950 7569643 7507793 7478096 7473067 7454384 7424264 7409018 7406752 7400076
13432 7400076 7389409 7373227 7334192 7287017 7292938 7374087 7461881 7492225 7502726 7561740 7649349
$$ packed form
13511E364037j5429O9397R1533L2102P504O5173J05055N9959J7676P1354J54677
13500F023038J44569O1095L5898J08434J79616J75578J41923J36965J30648P6269
13490G214033J1724N649M0406L4501k7587o9177m0518N788n132o5839j08430r8844
13478F896574o2034l2867k8151n4932r8340j06654m1113N3689Q4079L0406j9339
13467F621318O562N9951N1679m439r332O3701J18206P8451R703K3072J04298J32241
13455G255411O5206P061M4298J06816P7552j7085m2444L2857Q6460L4823m1609
13444G609346l6190J7613J7181l8307o1850k9697n029j8683l0120j5246k266o676
13432G400076j0667j6182l9035m7175N921Q1149Q7794L0344J0501N9014Q7609
$$ plain form
13421 7649349 7699571 7722298 7779104 7861120 7902903 7911249 7965798 8081269 8179783 8222263 8260958
13410 8260958 8330230 8388708 8412563 8451474 8542574 8650583 8737359 8813447 8886214 8941652 9007419
13399 9007419 9135544 9290831 9372680 9389641 9476251 9672695 9839937 9891601 9952936 10149544
13389 10149544 10382385 10491031 10524876 10648526 10860822 11026911 11139160 11317117 11562293
13380 11562293 11741531 11833792 11975093 12213780 12429611 12561384 12714927 12956400 13184805
13371 13184805 13319631 13448519 13666486 13917051 14121625 14328974 14597462 14855632 15033271
13362 15033271 15222370 15544523 15945293 16284457 16556828 16854611 17172342 17430462 17655180
13353 17655180 17950257 18301374 18587469 18794993 19046250 19384106 19695162 19902022 20082852
$$ packed form
13421G649349N0222K2727N6806Q2016M1783Q346N4549J15471R8514M2480L8695
13410H260958O9272N8478K3855L8911R1100J08009Q6776P6088P2767N5438O5767
13399I007419J28125J55287Q1849J6961Q6610J96444J67242N1664O1335J96608
13389A0149544K32841J08646L3845J23650K12296J66089J12249J77957K45176
13380A1562293J79238R2261J41301K38687K15831J31773J53543K41473K28405
13371A3184805J34826J28888K17967K50565K04574K07349K68488K58170J77639
13362A5033271J89099L22153M00770L39164K72371K97783L17731K58120K24718
13353A7655180K95077L51117K86095K07524K51257L37856L11056K06860J80830
$$ plain form
13344 20082852 20325842 20590375 20796920 20954442 21114197 21276719 21424116 21580715 21770201
13335 21770201 21965221 22139397 22318401 22526736 22739004 22939956 23179212 23504957 23888025
13326 23888025 24270138 24645263 25035106 25426476 25798305 26177740 26604419 27065738 27530868
13317 27530868 28023480 28590744 29215618 29831890 30422173 31029955 31667555 32282519 32838921
13308 32838921 33371774 33925153 34482840 35002824 35487966 35975245 36471816 36949560 37402120
13299 37402120 37863702 38357429 38860092 39343243 39826566 40361202 40972772 41650060 42381139
13290 42381139 43167835 44009014 44906800 45890411 46995488 48222690 49570956 51113731 52962756
13281 52962756 55129363 57519622 60133038 63151622 66674925 70400616 73739884 76303332
$$ packed form
13344B0082852K42990K64533K06545J57522J59755J62522J47397J56599J89486
13335B1770201J95020J74176J79004K08335K12268K00952K39256L25745L83068
13326B3888025L82113L75125L89843L91370L71829L79435M26679M61319M65130
13317B7530868M92612N67264O24874O16272N90283O07782O37600O14964N56402
13308C2838921N32853N53379N57687N19984M85142M87279M96571M77744M52560
13299C7402120M61582M93727N02663M83151M83323N34636O11570O77288P31079
13290D2381139P86696Q41179Q97786R83611J105077J227202J348266J542775J849025
13281E2962756K166607K390259K613416L018584L523303L725691L339268K563448
$$ plain form
13273 76303332 78172199 79661391 80943847 81987962 82751018 83280414 83620331 83714069 83446978
13264 83446978 82780302 81848465 80930777 80309505 80148675 80508680 81404336 82735480 84177329
13255 84177329 85311382 85977743 86425683 87028754 87916405 88972265 90109953 91396204 92907901
13246 92907901 94597163 96325874 97938020 99270850 100192762 100697546 100916262 100986587 100935159
13237 100935159 100715029 100318750 99800571 99193567 98464389 97602871 96746796 96133142 95845036
13228 95845036 95643765 95172532 94350897 93450770 92732003 92142788 91493861 90795165 90221571
13219 90221571 89801104 89362856 88831275 88393762 88316781 88752511 89789909 91497414 93729843
13210 93729843 95982264 97637464 98404014 98447477 98114618 97614660 96953780 96062910 94909054
$$ packed form
13273G6303332J868867J489192J282456J044115P63056N29396L39917R3738k67091
13264H3446978o66676r31837r17688o21272j60830L60005Q95656J331144J441849
13255H4177329J134053O66361M47940O03071Q87651J055860J137688J286251J511697
13246I2907901J689262J728711J612146J332830R21912N04784K18716P0325n1428
13237A00935159k20130l96279n18179o07004p29178q61518q56075o13654k88106
13228I5845036k01271m71233q21635r00127p18767n89215o48927o98696n73594
13219I0221571m20467m38248n31581m37513p6981M35730J037398J707505K232429
13210I3729843K252421J655200P66550M3463l32859m99958o60880q90870j153856
$$ plain form
13201 94909054 93486533 91741836 89573478 86976785 84182934 81564405 79359727 77552160
13193 77552160 76041269 74824631 73928789 73258938 72656325 72079198 71613944 71317196 71149607
13184 71149607 71061851 71038641 71038433 70984803 70850548 70672896 70454340 70124600 69641804 69062916
13174 69062916 68463426 67842726 67163054 66436908 65716761 65028236 64370819 63766850 63255839
13165 63255839 62846226 62518704 62276213 62148378 62142235 62231697 62414202 62742117 63264698 63958422
13155 63958422 64758011 65659928 66750517 68099827 69656589 71297831 72972017 74727766
13147 74727766 76580038 78414119 80080877 81549719 82897989 84162352 85269987 86120607
13139 86120607 86667114 86891460 86765652 86287799 85521750 84549286 83396579 82049585 80533610
$$ packed form
13201I4909054j422521j744697k168358k596693k793851k618529k204678j807567
13193G7552160j510891j216638q95842o69851o02613n77127m65254k96748j67589
13184G1149607q7756k3210k08n3630j34255j77652k18556l29740m82796n78888
13174F9062916n99490o20700o79672p26146p20147o88525o57417o03969n11011
13165F3255839m09613l27522k42491j27835o143Q9462J82505L27915N22581O93724
13155F3958422P99589R01917J090589J349310J556762J641242J674186J755749
13147G4727766J852272J834081J666758J468842J348270J264363J107635Q50620
13139H6120607N46507K24346j25808m77853p66049r72464j152707j346994j515975
$$ plain form
13130 80533610 78931442 77311255 75672853 73992652 72303691 70696949 69241426 67935135
13122 67935135 66753899 65720250 64884147 64245587 63745196 63342931 63063973 62949311 63004721
13113 63004721 63224454 63617861 64170562 64819634 65517347 66284169 67143251 68039550 68896629
13104 68896629 69726595 70596558 71494040 72316955 73005912 73594497 74102724 74471539 74652746
13095 74652746 74694257 74683180 74659710 74635837 74645983 74726943 74893661 75185086 75688099 76459159
13085 76459159 77454265 78575673 79735959 80824375 81677097 82178683 82374236 82403072 82333564
13076 82333564 82131191 81766989 81265313 80635305 79840470 78878575 77851453 76927909 76254754
13067 76254754 75901190 75858059 76083438 76550860 77220107 77952200 78538834 78898750 79192608
$$ packed form
13130H0533610j602168j620187j638402j680201j688961j606742j455523j306291
13122F7935135j181236j033649q36103o38560n00391m02265k78958j14662N5410
13113F3004721K19733L93407N52701O49072O97713P66822Q59082Q96299Q57079
13104F8896629Q29966Q69963Q97482Q22915O88957N88585N08227L68815J81207
13095G4652746M1511j1077k3470k3873J0146Q0960J66718K91425N03013P71060
13085G6459159R95106J121408J160286J088416Q52722N01586J95553K8836o9508
13076H2333564k02373l64202n01676o30008p94835r61895j027122r23544o73155
13067G6254754l53564m3131K25379M67422O69247P32093N86634L59916K93858
$$ plain form
13058 79192608 79643340 80277880 80958969 81640707 82434880 83395436 84384348 85219877 85841873
13049 85841873 86259227 86452708 86432919 86298292 86113764 85797147 85245433 84521655 83791659
13040 83791659 83115423 82437001 81757570 81160256 80639554 80052672 79302630 78457173 77617779
13031 77617779 76773065 75871395 74957869 74126621 73371476 72586291 71714971 70833056 70081278
13022 70081278 69577215 69393818 69562433 70060179 70797756 71612845 72276544 72565366 72394527
13013 72394527 71868685 71147222 70268058 69153605 67763860 66151402 64351461 62314701
13005 62314701 60009782 57533524 55054185 52680929 50444577 48367787 46476347 44749682
12997 44749682 43130213 41592780 40156151 38823763 37568148 36384724 35305650 34338474
$$ packed form
13058G9192608M50732O34540O81089O81738P94173R60556R88912Q35529O21996
13049H5841873M17354J93481j9789j34627j84528l16617n51714p23778p29996
13040H3791659o76236o78422o79431n97314n20702n86882p50042q45457q39394
13031G7617779q44714r01670r13526q31248p55145p85185q71320q81915p51778
13022G0081278n04063j83397J68615M97746P37577Q15089O63699K88822j70839
13013G2394527n25842p21463q79164j114453j389745j612458j799941k036760
13005F2314701k304919k476258k479339k373256k236352k076790j891440j726665
12997D4749682j619469j537433j436629j332388j255615j183424j079074r67176
$$ plain form
12989 34338474 33439801 32576397 31766212 31024926 30314856 29593080 28881317 28238533 27677144
12980 27677144 27147148 26596104 26013572 25427471 24886204 24429150 24041586 23654797 23227038
12971 23227038 22805611 22463321 22188944 21896540 21539107 21154913 20797362 20480324 20207531
12962 20207531 19992481 19817877 19629392 19409195 19210698 19077044 18965244 18803435 18594921
12953 18594921 18408014 18275302 18157938 18011911 17843388 17684250 17542458 17391960 17198457
12944 17198457 16950467 16674140 16415288 16199475 16016363 15845391 15676924 15499815 15296191
12935 15296191 15068977 14849874 14656160 14463866 14250762 14040284 13868733 13730607 13593569
12926 13593569 13449361 13311868 13181994 13054529 12943750 12860683 12781246 12680241 12577550 12501525
$$ packed form
12989C4338474q98673q63404q10185p41286p10070p21776p11763o42784n61389
12980B7677144n29996n51044n82532n86101n41267m57054l87564l86789m27759
12971B3227038m21427l42290k74377k92404l57433l84194l57551l17038k72793
12962B0207531k15050j74604j88485k20197j98497j33654j11800j61809k08514
12953A8594921j86907j32712j17364j46027j68523j59138j41792j50498j93503
12944A7198457k47990k76327k58852k15813j83112j70972j68467j77109k03624
12935A5296191k27214k19103j93714j92294k13104k10478j71551j38126j37038
12926A3593569j44208j37493j29874j27465j10779q3067p9437j01005j02691p6025
$$ plain form
12916 12501525 12429474 12325392 12214660 12145007 12088804 11979152 11844480 11795053 11842042 11843569
12906 11843569 11699342 11501447 11397292 11377614 11314730 11166823 11020049 10935283 10869620 10773272
12896 10773272 10667345 10583314 10499234 10386017 10264933 10170926 10096183 10013650 9926614 9851620
12886 9851620 9774436 9668777 9550150 9468238 9439562 9419034 9352869 9241916 9136239 9073045
12876 9073045 9035298 8977507 8883271 8782867 8712925 8675302 8645618 8606631 8555160 8487416 8401900
12865 8401900 8314691 8249394 8209018 8175659 8139661 8109987 8091900 8073355 8040900 7993516 7934069
12854 7934069 7863103 7790195 7736230 7710202 7692218 7653691 7592039 7533360 7497535 7469956 7419673
12843 7419673 7346335 7292707 7293607 7322161 7314710 7250718 7175279 7130525 7101566 7056906 7007750 6984933
$$ packed form
12916A2501525p2051j04082j10732o9653n6203j09652j34672m9427M6989J527
12906A1843569j44227j97895j04155j9678o2884j47907j46774q4766o5663r6348
12896A0773272j05927q4031q4080j13217j21084r4007p4743q2533q7036p4994
12886I851620p7184j05659j18627q1912k8676k0528o6165j10953j05677o3194
12876I073045l7747n7791r4236j00404o9942l7623k9684l8987n1471o7744q5516
12865H401900q7209o5297m0376l3359l5998k9674j8087j8545l2455m7384n9447
12854G934069p0966p2908n3965k6028j7984l8527o1652n8679l5825k7579n0283
12843G419673p3338n3628R00K8554p451o3992p5439m4754k8959m4660m9156k2817
$$ plain form
12831 6984933 6979495 6955098 6910146 6879820 6878079 6883179 6882568 6884922 6880275 6837700 6760504 6698888 6682898
12818 6682898 6681005 6653687 6615373 6609878 6645705 6686238 6692814 6657396 6602775 6562264 6548523 6541313
12806 6541313 6523351 6517322 6549941 6588141 6568872 6499307 6459888 6483738 6505602 6473950 6440402
12795 6440402 6468733 6515112 6488656 6397106 6338544 6358724 6403944 6419582 6414159 6407334 6385236 6338733
12783 6338733 6295520 6283590 6294330 6298354 6273257 6215900 6156776 6149251 6202102 6240503 6191432 6091623
12771 6091623 6038179 6042668 6025409 5961289 5925693 5958961 5987182 5941398 5870201 5854693 5878468
12760 5878468 5869781 5824393 5795339 5790980 5772844 5741854 5744294 5790308 5834420 5843568 5829498 5809746
12748 5809746 5786213 5766942 5766852 5783986 5807233 5838280 5873253 5883602 5857850 5837892 5861503 5893472
$$ packed form
12831F984933n438k4397m4952l0326j741N100o11K354m647m2575p7196o1616j5990
12818F682898j893k7318l8314n495L5827M0533O576l5418n4621m0511j3741p210
12806F541313j7962o029L2619L8200j9269o9565l9419K3850K1864l1652l3548
12795F440402K8331M6379k6456r1550n8562K0180M5220J5638n423o825k2098m6503
12783F338733m3213j1930J0740M024k5097n7357n9124p525N2851L8401m9071r9809
12771F091623n3444M489j7259o4120l5596L3268K8221m5784p1197j5508K3775
12760E878468q687m5388k9054m359j8136l0990K440M6014M4112R148j4070j9752
12748E809746k3533j9271r0J7134K3247L1047L4973J0349k5752j9958K3611L1969
$$ plain form
12736 5893472 5877279 5834100 5833924 5876435 5883944 5822643 5753251 5739856 5775928 5823685 5863783 5881387
12724 5881387 5863439 5836865 5853822 5914017 5956910 5952838 5940841 5952141 5964809 5967393 5995289 6058285
12712 6058285 6100688 6087851 6068086 6088283 6111461 6090581 6066897 6108494 6191594 6232830 6214926
12701 6214926 6194464 6200418 6208729 6211466 6231405 6264803 6280209 6279465 6297192 6337520 6371627 6395958
12689 6395958 6429166 6454791 6437953 6400518 6404156 6450224 6474364 6455953 6451745 6494826 6541284 6555761
12677 6555761 6573529 6627166 6677790 6676789 6643326 6625394 6630723 6649209 6695770 6770960 6821843 6809150
12665 6809150 6781225 6812735 6892633 6941994 6930550 6908212 6922214 6963812 7004436 7033104 7045833
12654 7045833 7038929 7025806 7031099 7061091 7101983 7143788 7182106 7206718 7218039 7243088 7301322 7366354
$$ packed form
12736E893472j6193m3179j76M2511P509o1301o9392j3395L6072M7757M0098J7604
12724E881387j7948k6574J6957O0195M2893m072j1997J1300J2668K584K7896O2996
12712F058285M2403j2837j9765K0197K3178k0880k3684M1597Q3100M1236j7904
12701F214926k0462N954Q311K737J9939L3398J5406p44J7727M0328L4107K4331
12689F395958L3208K5625j6838l7435L638M6068K4140j8411m208M3081M6458J4477
12677F555761J7768N3637N0624j001l3463j7932N329J8486M6561P5190N0883j2693
12665F809150k7925L1510P9898M9361j1444k2338J4002M1598M0624K8668J2729
12654G045833o904j3123N293K9992M0892M1805L8318K4612J1321K5049N8234O5032
$$ plain form
12642 7366354 7398222 7400235 7401265 7396815 7364383 7332211 7364359 7460177 7533006 7524865 7490207 7516856
12630 7516856 7601207 7662385 7665114 7662904 7704197 7751769 7741039 7691598 7699988 7810099 7943169
12619 7943169 7995346 7969186 7954085 7997265 8062573 8113394 8155852 8181304 8153442 8096708 8110314
12608 8110314 8223002 8312883 8269106 8170219 8181111 8311315 8412483 8406938 8373976 8385040 8396374
12597 8396374 8365341 8348500 8398413 8459915 8462048 8436595 8449958 8480714 8466701 8427777 8437569 8499201
12585 8499201 8545948 8551328 8549987 8558419 8560917 8571209 8622780 8692254 8715027 8691631 8699432 8774064
12573 8774064 8852919 8872749 8860660 8881830 8942490 8995032 9015736 9034965 9094282 9194623 9287494
12562 9287494 9319139 9294167 9283740 9347516 9461047 9552161 9594448 9623926 9676097 9755324 9857833
$$ packed form
12642G366354L1868K013J030m450l2432l2172L2148R5818P2829q141l4658K6649
12630G516856Q4351O1178K729k210M1293M7572j0730m9441Q390J10111J33070
12619G943169N2177k6160j5101M3180O5308N0821M2458K5452k7862n6734J3606
12608H110314J12688Q9881m3777r8887J0892J30204J01168n545l2962J1064J1334
12597H396374l1033j6841M9913O1502K133k5453J3363L0756j4013l8924R792O1632
12585H499201M6747N380j341Q432K498J0292N1571O9474K2773k3396P801P4632
12573H774064P8855J9830j2089K1170O0660N2542K0704J9229N9317J00341R2871
12562I287494L1645k4972j0427O3776J13531R1114M2287K9478N2171P9227J02509
$$ plain form
12551 9857833 9970546 10051817 10072906 10077865 10137786 10243703 10318756 10345396 10394187 10499853 10599174
12540 10599174 10639023 10661583 10720284 10788336 10825259 10864500 10947293 11029609 11056372 11081446 11197492
12529 11197492 11371382 11474835 11481566 11509122 11633744 11780068 11854529 11892610 11991255 12157608
12519 12157608 12311976 12410340 12486954 12584317 12702612 12823033 12938054 13050577 13169221 13305911
12509 13305911 13459640 13608917 13738673 13864638 14010172 14168897 14314685 14444386 14587578
12500 14587578 14771170 14988087 15202496 15379294 15513165 15634285 15777515 15942018 16094844
12491 16094844 16219625 16341716 16493172 16673814 16865555 17065970 17282342 17504834 17712836
12482 17712836 17903945 18094897 18296811 18508740 18732288 18972628 19224439 19472345 19707187
$$ packed form
12551I857833J12713Q1271K1089M959N9921J05917P5053K6640M8791J05666R9321
12540A0599174L9849K2560N8701O8052L6923L9241Q2793Q2316K6763K5074J16046
12529A1197492J73890J03453O731K7556J24622J46324P4461L8081R8645J66353
12519A2157608J54368R8364P6614R7363J18295J20421J15021J12523J18644J36690
12509A3305911J53729J49277J29756J25965J45534J58725J45788J29701J43192
12500A4587578J83592K16917K14409J76798J33871J21120J43230J64503J52826
12491A6094844J24781J22091J51456J80642J91741K00415K16372K22492K08002
12482A7712836J91109J90952K01914K11929K23548K40340K51811K47906K34842
$$ plain form
12473 19707187 19933635 20165401 20417516 20690925 20958955 21191930 21409232 21676787 22024581
12464 22024581 22396110 22721297 23014172 23341759 23710614 24055536 24349723 24654016 25023800
12455 25023800 25425745 25793060 26121933 26465303 26860247 27305936 27788785 28284730 28756076
12446 28756076 29190384 29628539 30115130 30637814 31156683 31673986 32225372 32815919 33417896
12437 33417896 34024513 34653585 35303255 35956891 36624990 37323372 38016980 38657030 39276599
12428 39276599 39969314 40757237 41563133 42340755 43143802 44021461 44935651 45849057 46817723
12419 46817723 47915276 49125838 50393463 51722792 53145632 54640082 56175815 57792625
12411 57792625 59536131 61363653 63225941 65197877 67398460 69816421 72364564 75089318
$$ packed form
12473A9707187K26448K31766K52115K73409K68030K32975K17302K67555L47794
12464B2024581L71529L25187K92875L27587L68855L44922K94187L04293L69784
12455B5023800M01945L67315L28873L43370L94944M45689M82849M95945M71346
12446B8756076M34308M38155M86591N22684N18869N17303N51386N90547O01977
12437C3417896O06617O29072O49670O53636O68099O98382O93608O40050O19569
12428C9276599O92715P87923Q05896P77622Q03047Q77659R14190R13406R68666
12419D6817723J097553J210562J267625J329329J422840J494450J535733J616810
12411E7792625J743506J827522J862288J971936K200583K417961K548143K724754
$$ plain form
12403 75089318 78163797 81675843 85597471 89952390 94752379 99673990 104062401 107475497
12395 107475497 110083755 112346527 114438388 116222318 117658381 118911992 120042016 120868191
12387 120868191 121257607 121356842 121446676 121735299 122399984 123656331 125584660 127930192 130226617
12378 130226617 132145901 133683788 135040238 136392403 137774381 139115146 140362831 141557949
12370 141557949 142768227 143988176 145176863 146379284 147695610 149087789 150312866 151119217
12362 151119217 151453635 151432163 151186175 150804841 150357789 149883418 149385454 148898164 148502811
12353 148502811 148208040 147864666 147293966 146492419 145652047 145000952 144673656 144693065 144992754
12344 144992754 145453665 145963817 146440940 146805151 147017688 147198802 147617239 148474547 149763127
$$ packed form
12403G5089318L074479L512046L921628M354919M799989M921611M388411L413096
12395A07475497K608258K262772K091861J783930J436063J253611J130024Q26175
12387A20868191L89416R9235Q9834K88623O64685J256347J928329K345532K296425
12378A30226617J919284J537887J356450J352165J381978J340765J247685J195118
12370A41557949J210278J219949J188687J202421J316326J392179J225077Q06351
12362A51119217L34418k1472k45988l81334m47052m74371m97964m87290l95353
12353A48502811k94771l43374n70700q01547q40372o51095l27296J9409K99689
12344A44992754M60911N10152M77123L64211K12537J81114M18437Q57308J288580
$$ plain form
12335 149763127 151394200 153316172 155330976 156903409 157431246 156761486 155264319 153359590
12327 153359590 151151634 148574362 145652765 142440410 138841507 134706559 130075030 125188650
12319 125188650 120297086 115569194 111155979 107187960 103676621 100509599 97574886 94840584
12311 94840584 92321401 90041150 88038555 86346292 84944515 83773994 82794089 81982381
12303 81982381 81283548 80618105 79953465 79318012 78730084 78152622 77531139 76839848 76073593
12294 76073593 75222666 74272658 73213107 72039666 70761494 69405027 67994985 66537130
12286 66537130 65033653 63500418 61948062 60365401 58751091 57143270 55582404 54063180
12278 54063180 52567968 51133740 49828857 48659937 47555523 46457528 45383476 44379640
$$ packed form
12335A49763127J631073J921972K014804J572433N27837o69760j497167j904729
12327A53359590k207956k577272k921597l212355l598903m134948m631529m886380
12319A25188650m891564m727892m413215l968019l511339l167022k934713k734302
12311I4840584k519183k280251k002595j692263j401777j170521r79905q11708
12303H1982381o98833o65443o64640o35453n87928n77462o21483o91291p66255
12294G6073593q50927r50008j059551j173441j278172j356467j410042j457855
12286F6537130j503477j533235j552356j582661j614310j607821j560866j519224
12278E4063180j495212j434228j304883j168920j104414j097995j074052j003836
$$ plain form
12270 44379640 43456737 42600600 41810059 41086196 40403881 39730613 39068593 38451652 37900441
12261 37900441 37399693 36921902 36458455 36021055 35621350 35258623 34925608 34614969 34313121
12252 34313121 33998668 33664669 33339402 33063703 32843791 32646214 32443325 32239468 32044792
12243 32044792 31851274 31649177 31442264 31232711 31016418 30803911 30612523 30426656 30210999
12234 30210999 29981852 29806698 29695163 29553037 29306031 29016342 28799654 28667445 28539944
12225 28539944 28386980 28254507 28156651 28043020 27890126 27737231 27607511 27473409 27327324
12216 27327324 27211730 27148891 27110044 27080820 27082862 27101499 27075758 27003483 26971558 27022484 27071358
12205 27071358 27032369 26961351 26982095 27113512 27258599 27341609 27377471 27417609 27494492 27615764
$$ packed form
12270D4379640r22903q56137p90541p23863o82315o73268o62020o16941n51211
12261C7900441n00748m77791m63447m37400l99705l62727l33015l10639l01848
12252C4313121l14453l33999l25267k75699k19912j97577k02889k03857j94676
12243C2044792j93518k02097k06913k09553k16293k12507j91388j85867k15657
12234C0210999k29147j75154j11535j42126k47006k89689k16688j32209j27501
12225B8539944j52964j32473r7856j13631j52894j52895j29720j34102j46085
12216B7327324j15594o2839l8847k9224K042J8637k5741p2275l1925N0926M8874
12205B7071358l8989p1018K0744J31417J45087Q3010L5862M0138P6883J21272
$$ plain form
12195 27615764 27763594 27907575 28049435 28225333 28432257 28605996 28724999 28874067 29125708
12186 29125708 29414287 29632218 29814004 30100989 30526123 30954629 31264727 31483410 31701218
12177 31701218 31940043 32160485 32338060 32478872 32598450 32720256 32861822 33001948 33098225
12168 33098225 33148504 33192293 33246514 33294483 33345978 33444035 33595077 33756862 33917942 34124280
12158 34124280 34400909 34712443 35030315 35371763 35739688 36096613 36440783 36835344 37310553
12149 37310553 37808129 38283491 38795329 39421452 40142382 40882187 41613586 42347830 43070848
12140 43070848 43771770 44491699 45260387 46023969 46720497 47387617 48106427 48882130 49681144
12131 49681144 50539443 51507550 52520073 53466334 54383158 55421706 56607752 57803293 58956009
$$ packed form
12195B7615764J47830J43981J41860J75898K06924J73739J19003J49068K51641
12186B9125708K88579K17931J81786K86985M25134M28506L10098K18683K17808
12177C1701218K38825K20442J77575J40812J19578J21806J41566J40126R6277
12168C3098225N0279M3789N4221M7969N1495R8057J51042J61785J61080K06338
12158C4124280K76629L11534L17872L41448L67925L56925L44170L94561M75209
12149C7310553M97576M75362N11838O26123P20930P39805P31399P34244P23018
12140D3070848P00922P19929P68688P63582O96528O67120P18810P75703P99014
12131D9681144Q58299R68107J012523R46261R16824J038548J186046J195541J152716
$$ plain form
12122 58956009 60213656 61691341 63274447 64790747 66271528 67889175 69703997 71633309
12114 71633309 73644996 75820134 78185644 80589371 82791437 84631808 86095492 87265074
12106 87265074 88227704 89002383 89557598 89901172 90095763 90147928 89960492 89488035 88892215
12097 88892215 88435136 88240796 88264210 88466764 88878462 89465410 90074037 90575398 90976618
12088 90976618 91338989 91679113 92016061 92429205 92979670 93624610 94286024 94969059 95749341
12079 95749341 96673828 97721868 98822051 99856071 100692897 101282612 101686219 101968882 102114569
12070 102114569 102099568 101984312 101846905 101669955 101377917 100944611 100374262 99626502 98684287
12061 98684287 97676986 96804651 96126087 95532978 94944397 94401780 93939612 93497696 93043622
$$ packed form
12122E8956009J257647J477685J583106J516300J480781J617647J814822J929312
12114G1633309K011687K175138K365510K403727K202066J840371J463684J169582
12106H7265074R62630P74679N55215L43574J94591N2165j87436m72457n95820
12097H8892215m57079j94340K3414K02554M11698N86948O08627N01361M01220
12088I0976618L62371L40124L36948M13144N50465O44940O61414O83035P80282
12079I5749341R24487J048040J100183J034020Q36826N89715M03607K82663J45687
12070A02114569j5001j15256j37407j76950k92038m33306n70349p47760r42215
12061I8684287j007301q72335o78564n93109n88581n42617m62168m41916m54074
$$ plain form
12052 93043622 92689103 92597292 92834382 93381589 94231074 95382631 96768761 98244517 99646816
12043 99646816 100854904 101843546 102699073 103523796 104303422 104943078 105451041 105969448 106564859
12034 106564859 107119651 107544261 107989695 108702116 109739280 110990641 112425703 114132429
12026 114132429 116109328 118210174 120353656 122636016 125154102 127833146 130518730 133150360
12018 133150360 135749915 138292401 140667655 142741312 144407250 145616547 146391560 146774882
12010 146774882 146745984 146242465 145275581 143941557 142283886 140233935 137744723 134900792
12002 134900792 131825838 128558862 125104709 121536120 117941858 114318688 110618159 106873295
11994 106873295 103181103 99576304 96017677 92495141 89062795 85762221 82591705 79557546
$$ packed form
12052I3043622l54519r1811K37090N47207Q49485J151557J386130J475756J402299
12043I9646816J208088R88642Q55527Q24723P79626O39656N07963N18407N95411
12034A06564859N54792M24610M45434P12421J037164J251361J435062J706726
12026A14132429J976899K100846K143482K282360K518086K679044K685584K631630
12018A33150360K599555K542486K375254K073657J665938J209297P75013L83322
12010A46774882k8898n03519r66884j334024j657671k049951k489212k843931
12002A34900792l074954l266976l454153l568589l594262l623170l700529l744864
11994A06873295l692192l604799l558627l522536l432346l300574l170516l034159
$$ plain form
11986 79557546 76682632 73955506 71338304 68833131 66476450 64263285 62146338 60119156
11978 60119156 58226682 56474181 54797850 53157560 51596527 50169615 48860171 47606108
11970 47606108 46372860 45169921 44025646 42969573 42010707 41113689 40222573 39319993 38435600
11961 38435600 37593892 36791323 36026525 35305851 34611131 33911453 33217639 32573222 31979117
11952 31979117 31384083 30765945 30159747 29583311 29004564 28416975 27874435 27400603 26932032
11943 26932032 26416060 25904772 25473936 25096934 24687955 24239430 23822657 23464123 23114788
11934 23114788 22748892 22405511 22107926 21817842 21506395 21209001 20964983 20747717 20500961
11925 20500961 20215053 19926595 19665825 19443605 19271537 19148401 19027811 18841797 18574687
$$ packed form
11986G9557546k874914k727126k617202k505173k356681k213165k116947k027182
11978F0119156j892474j752501j676331j640290j561033j426912j309444j254063
11970D7606108j233248j202939j144275j056073r58866q97018q91116r02580q84393
11961C8435600q41708q02569p64798p20674o94720o99678o93814o44417n94105
11952C1979117n95034o18138o06198n76436n78747n87589n42540m73832m68571
11943B6932032n15972n11288m30836l77002m08979m48525m16773l58534l49335
11934B3114788l65896l43381k97585k90084l11447k97394k44018k17266k46756
11925B0500961k85908k88458k60770k22220j72068j23136j20590j86014k67110
$$ plain form
11916 18574687 18291153 18071781 17930173 17808164 17646370 17441892 17235136 17059145 16915579
11907 16915579 16788543 16661691 16523223 16371706 16219675 16078181 15938310 15784444 15625260
11898 15625260 15489377 15383426 15274696 15127264 14942346 14754155 14595206 14468160 14342149
11889 14342149 14181817 13994260 13833677 13732970 13647356 13509417 13329628 13182761 13090579 12988724
11879 12988724 12836229 12687025 12603577 12558636 12487059 12392305 12328452 12299632 12250145 12151444 12039670
11868 12039670 11961717 11927925 11919463 11906147 11861539 11793403 11746492 11740303 11726627 11656153 11563197
11857 11563197 11519440 11514533 11458291 11314477 11164092 11104073 11130538 11155782 11110685 11004339 10902294
11846 10902294 10861543 10872936 10866707 10792626 10684024 10613756 10601721 10607196 10599895 10585346 10563371
$$ packed form
11916A8574687k83534k19372j41608j22009j61794k04478k06756j75991j43566
11907A6915579j27036j26852j38468j51517j52031j41494j39871j53866j59184
11898A5625260j35883j05951j08730j47432j84918j88191j58949j27046j26011
11889A4342149j60332j87557j60583j00707q5614j37939j79789j46867r2182j01855
11879A2988724j52495j49204q3448m4941p1577r4754o3853k8820m9487r8701j11774
11868A2039670p7953l3792q462j3316m4608o8136m6911o189j3676p0474r2956
11857A1563197m3757m907n6242j43814j50385o0019K6465K5244m5097j06346j02045
11846A0902294m0751J1393o229p4081j08602p0268j2035N475p301j4549k1975
$$ plain form
11835 10563371 10521405 10478814 10479708 10521602 10543170 10509082 10461990 10459733 10497119 10522292 10505889 10466103
11823 10466103 10439234 10442217 10455937 10445100 10406910 10386708 10421695 10489460 10546724 10592671 10645665
11812 10645665 10688112 10703576 10743519 10868027 11028784 11110039 11093972 11082009 11130473 11174991 11158703
11801 11158703 11124550 11116701 11090504 10999649 10888570 10814706 10753482 10665543 10585897 10551921 10508857
11790 10508857 10392146 10250775 10179104 10166928 10128852 10051905 9999849 9989175 9973952 9947180 9948374
11779 9948374 9969258 9956942 9918222 9918428 9963293 9982382 9949848 9923061 9933733 9937236 9907522 9890665
11767 9890665 9914943 9928298 9882236 9812739 9779653 9775997 9751496 9689577 9617712 9569230 9560629 9574296
11755 9574296 9550495 9442853 9295403 9207715 9203938 9199743 9127583 9027393 8970040 8951234 8914577
$$ packed form
11835A0563371m1966m2591Q94M1894K1568l4088m7092k257L7386K5173j6403l9786
11823A0466103k6869K983J3720j0837l8190k0202L4987O7765N7264M5947N2994
11812A0645665M2447J5464L9943J24508J60757Q1255j6067j1963M8464M4518j6288
11801A1158703l4153p849k6197r0855j11079p3864o1224q7939p9646l3976m3064
11790A0508857j16711j41371p1671j2176l8076p6947n2056j0674j5223k6772J194
11779I948374K0884j2316l8720K06M4865J9089l2534k6787J0672L503k9714j6857
11767I890665K4278J3355m6062o9497l3086l656k4501o1919p1865m8482q601J3667
11755I574296k3801j07642j47450q7688l777m195p2160j00190n7353j8806l6657
$$ plain form
11744 8914577 8833406 8718103 8580709 8440961 8333827 8264489 8184703 8056716 7914531 7820768
11734 7820768 7783083 7747844 7660993 7514934 7358566 7272070 7292221 7347081 7314967 7173922 7038929
11723 7038929 7015761 7072614 7102618 7062607 6992899 6939012 6915287 6922136 6944869 6949218 6917490 6873363
11711 6873363 6844727 6831126 6831914 6862257 6907955 6915546 6871266 6837369 6858080 6885309 6862279 6825130
11699 6825130 6839118 6878787 6866655 6802555 6754874 6736747 6693747 6618721 6577356 6594009 6600165
11688 6600165 6535694 6432469 6356885 6325734 6318680 6325043 6334880 6321418 6277140 6243611 6263818 6314984
11676 6314984 6324232 6255652 6159336 6118278 6151586 6191809 6173073 6118093 6097113 6115209 6107961 6058920
11664 6058920 6038199 6080858 6108650 6046837 5952681 5934358 5989393 6027493 6023303 6033541 6071643
$$ packed form
11744H914577q1171j15303j37394j39748j07134o9338p9786j27987j42185r3763
11734G820768l7685l5239q6851j46059j56368q6496K0151N4860l2114j41045j34993
11723G038929k3168N6853L0004m0011o9708n3887k3725O849K2733M349l1728m4127
11711F873363k8636j3601P88L0343M5698P591m4280l3897K0711K7229k3030l7149
11699F825130J3988L9669j2132o4100m7681j8127m3000p5026m1365J6653O156
11688F600165o4471j03225p5584l1151p054O363R837j3462m4278l3529K0207N1166
11676F314984R248o8580r6316m1058L3308M0223j8736n4980k0980J8096p248m9041
11664F058920k0721M2659K7792o1813r4156j8323N5035L8100m190J0238L8102
$$ plain form
11653 6071643 6080031 6041043 6012439 6026703 6045161 6040072 6037702 6049243 6040402 6004685 5990508 6018602
11641 6018602 6045274 6044768 6054829 6099615 6140110 6147070 6153247 6184292 6207737 6204674 6221415 6285771
11629 6285771 6338751 6324103 6286922 6298961 6333980 6312299 6240566 6208218 6247907 6288064 6261140
11618 6261140 6189354 6136102 6121922 6118941 6100344 6069694 6049572 6051520 6059275 6049983 6030357 6029220
11606 6029220 6049563 6059858 6047286 6045757 6087981 6157895 6213570 6232673 6218665 6191987 6190233 6240596
11594 6240596 6315311 6355061 6351458 6353740 6374691 6361010 6299204 6275667 6360282 6488827 6547876
11583 6547876 6537917 6558262 6649057 6746042 6797261 6831934 6883141 6917871 6894328 6842067 6830347
11572 6830347 6874438 6918700 6913980 6876610 6852762 6847569 6825532 6779520 6753200 6770801 6790259 6772207
$$ packed form
11653F071643Q388l8988k8604J4264J8458n089k370J1541q841l5717j4177K8094
11641F018602K6672n06J0061M4786M0495O960O177L1045K3445l063J6741O4356
11629F285771N2980j4648l7181J2039L5019k1681p1733l2348L9689M0157k6924
11618F261140p1786n3252j4180k981j8597l0650k0122J948P755r292j9626j137
11606F029220K0343J0295j2572j529M2224O9914N5675J9103j4008k6678j754N0363
11594F240596P4715L9750l603K282K0951j3681o1806k3537Q4615J28545N9049
11583F547876r959K0345R0795R6985N1219L4673N1207L4730k3543n2261j1720
11572F830347M4091M4262m720l7370k3848n193k2037m6012k6320J7601J9458j8052
$$ plain form
11560 6772207 6753158 6781739 6816606 6780500 6701492 6693481 6787387 6891685 6944793 6991037 7064052
11549 7064052 7116116 7129745 7185306 7332052 7490458 7571955 7603413 7643070 7671350 7667080 7690498
11538 7690498 7770785 7809118 7729753 7634132 7649559 7710130 7666279 7544420 7499386 7549472 7566935
11527 7566935 7519664 7512606 7574212 7605009 7574048 7572340 7621778 7620835 7545912 7522387 7611705 7701043
11515 7701043 7702116 7696141 7768368 7849596 7851959 7832197 7880061 7949811 7944293 7885969 7870433 7911019
11503 7911019 7949463 7970032 7996145 8018289 8018778 8025167 8060277 8089061 8084883 8086431 8118978 8132897
11491 8132897 8098589 8082920 8140584 8206182 8194433 8138097 8121826 8143386 8150323 8157019 8209131 8274810
11479 8274810 8285337 8254989 8257910 8308784 8356601 8374189 8375876 8374066 8385489 8441597 8531620 8589007
$$ packed form
11560F772207j9049K8581L4867l6106p9008q011R3906J04298N3108M6244P3015
11549G064052N2064J3629N5561J46746J58406Q1497L1458L9657K8280m270K3418
11538G690498Q0287L8333p9365r5621J5427O0571m3851j21859m5034N0086J7463
11527G566935m7271p058O1606L0797l0961j708M9438r43p4923k3525Q9318Q9338
11515G701043J073n975P2227Q1228K363j9762M7864O9750n518n8324j5536M0586
11503G911019L8444K0569K6113K2144M89O389L5110K8784m178J548L2547J3919
11491H132897l4308j5669N7664O5598j1749n6336j6271K1560O937O696N2112O5679
11479H274810J0527l0348K921N0874M7817J7588J687j810J1423N6108R0023N7387
$$ plain form
11467 8589007 8594136 8618011 8697670 8762376 8771430 8818273 8977435 9148044 9194852 9161744 9186924
11456 9186924 9275894 9330368 9350411 9425911 9554716 9647144 9699698 9792510 9916749 9976303 9972728
11445 9972728 10021564 10157937 10280901 10327185 10360739 10451768 10591075 10755188 10940258 11110612
11435 11110612 11227640 11338805 11519418 11730319 11870205 11963812 12137907 12399353 12609603
11426 12609603 12713294 12819610 13004225 13198726 13347663 13517898 13764577 14025045 14235971
11417 14235971 14436751 14671380 14897594 15077081 15257590 15486881 15731490 15947847 16154386
11408 16154386 16379786 16615937 16858419 17114160 17352227 17539678 17727904 17990929 18285563
11399 18285563 18510230 18692577 18951107 19271234 19516868 19686628 19938349 20300368 20580299
$$ packed form
11467H589007N129K3875P9659O4706R054M6843J59162J70609M6808l3108K5180
11456I186924Q8970N4474K0043P5500J28805R2428N2554R2812J24239N9554l575
11445I972728M8836J36373J22964M6284L3554R1029J39307J64113J85070J70354
11435A1110612J17028J11165J80613K10901J39886R3607J74095K61446K10250
11426A2609603J03691J06316J84615J94501J48937J70235K46679K60468K10926
11417A4235971K00780K34629K26214J79487J80509K29291K44609K16357K06539
11408A6154386K25400K36151K42482K55741K38067J87451J88226K63025K94634
11399A8285563K24667J82347K58530L20127K45634J69760K51721L62019K79931
$$ plain form
11390 20580299 20652063 20629563 20656979 20727098 20813144 20975256 21210351 21390191 21479721 21630404
11380 21630404 21929564 22251165 22485312 22706138 22966898 23153310 23215514 23322539 23585952
11371 23585952 23845338 23946705 24020423 24237184 24491872 24606381 24668148 24871350 25169029 25384047
11361 25384047 25543415 25800772 26127391 26380541 26601283 26953810 27425967 27857516 28212534
11352 28212534 28581010 28980165 29388270 29885210 30523326 31169464 31718033 32320900 33135172
11343 33135172 34002492 34690657 35293073 36038433 36859159 37541173 38169360 38999753 39989302
11334 39989302 40887423 41713327 42698405 43825990 44886041 45922310 47151554 48503511
11326 48503511 49741564 50976615 52527351 54335427 56101125 57932460 60194439 62737329
$$ packed form
11390B0580299P1764k2500K7416P0119Q6046J62112K35095J79840Q9530J50683
11380B1630404K99160L21601K34147K20826K60760J86412O2204J07025K63413
11371B3585952K59386J01367P3718K16761K54688J14509O1767K03202K97679K15018
11361B5384047J59368K57357L26619K53150K20742L52527M72157M31549L55018
11352B8212534L68476L99155M08105M96940O38116O46138N48569O02867Q14272
11343C3135172Q67320O88165O02416P45360Q20726O82014O28187Q30393R89549
11334C9989302Q98121Q25904R85078J127585J060051J036269J229244J351957
11326D8503511J238053J235051J550736J808076J765698J831335K261979K542890
$$ plain form
11318 62737329 65011644 67000657 69270249 71990956 74723058 77336748 80294955 83788531
11310 83788531 87451339 91185280 95343755 99834055 104116541 108457972 113939561 120689140
11302 120689140 127551234 134349645 142873500 154341654 167596002 181749135 198967481
11295 198967481 221486035 246233958 265761449 275573899 278260198 279250507 280648258 280870670
11287 280870670 278527683 274116407 268188747 259812440 247475948 230897474 211839401
11280 211839401 193401915 178103248 166152672 155876006 146000978 136825318 128866586
11273 128866586 121510977 113948059 106615022 100538571 95716840 91278349 86926493 83101002
11265 83101002 79865713 76741636 73662069 71091259 69076813 67082444 64921220 63013177
$$ packed form
11318F2737329K274315J989013K269592K720707K732102K613690K958207L493576
11310H3788531L662808L733941M158475M490300M282486M341431N481589O749579
11302A20689140O862094O798411Q523855J1468154J3254348J4153133J7218346
11295A98967481K2518554K4747923J9527491R812450K686299R90309J397751K22412
11287B80870670k342987m411276n927660q376307j2336492j6578474j9058073
11280B11839401j8437486j5298667j1950576j0276666r875028r175660p958732
11273A28866586p355609p562918p333037o076451m821731m438491m351856l825491
11265H3101002l235289l124077l079567k570810k014446j994369k161224j908043
$$ plain form
11257 63013177 61504329 59925010 58011514 56157898 54718156 53476432 52157816 50922663
11249 50922663 49990693 49224001 48416535 47609649 46834716 45917355 44812728 43788715 43021359
11240 43021359 42336772 41581228 40902528 40422900 39971076 39401057 38867794 38524656 38235477
11231 38235477 37847424 37478709 37272053 37107572 36812972 36431693 36048779 35581608 34979323
11222 34979323 34405181 33982971 33576471 33050935 32532652 32165312 31824187 31334410 30779936
11213 30779936 30330177 29935781 29465905 28991097 28657702 28410505 28099763 27751909 27488779
11204 27488779 27279834 27009612 26703865 26473929 26318694 26171519 26049995 25983755 25904429 25777093
11194 25777093 25709632 25757788 25776628 25660663 25563546 25654342 25821589 25872875 25872976 26002354 26212419
$$ packed form
11257F3013177j508848j579319j913496j853616j439742j241724j318616j235153
11249E0922663r31970p66692q07466q06886p74933r17361j104627j024013p67356
11240D3021359o84587p55544o78700m79628m51824n70019n33263l43138k89179
11231C8235477l88053l68715k06656j64481k94600l81279l82914m67171o02285
11222C4979323n74142m22210m06500n25536n18283l67340l41125m89777n54474
11213C0779936m49759l94396m69876m74808l33395k47197l10742l47854k63130
11204B7488779k08945k70222l05747k29936j55235j47175j21524o6240p9326j27336
11194B5777093o7461M8156J8840j15965r7117R0796J67247N1286J01J29378K10065
$$ plain form
11183 26212419 26323306 26363383 26504204 26730279 26877129 26946008 27081170 27268167 27350488 27329289
11173 27329289 27357629 27441272 27431393 27324036 27280678 27320129 27267789 27065136 26872075 26795962 26755058
11162 26755058 26678419 26619168 26599254 26548757 26467719 26457030 26531740 26588999 26604013 26665782 26783409
11151 26783409 26864156 26923248 27093820 27373877 27591601 27694766 27845951 28139560 28451141 28680845
11141 28680845 28930193 29303453 29731423 30139388 30609890 31215854 31840749 32328033 32693079
11132 32693079 33042900 33392935 33702086 33996482 34325054 34658966 34937505 35149369 35295854
11123 35295854 35358125 35369789 35427902 35564656 35705957 35817255 35977231 36237297 36523422 36755544
11113 36755544 36957189 37172858 37384926 37586658 37832431 38143865 38465962 38775181 39124914
$$ packed form
11183B6212419J10887M0077J40821K26075J46850O8879J35162J86997Q2321k1199
11173B7329289K8340Q3643r879j07357m3358L9451n2340k02653j93061p6113m0904
11162B6755058p6639n9251j9914n0497q1038j0689P4710N7259J5014O1769J17627
11151B6783409Q0747N9092J70572K80057K17724J03165J51185K93609L11581K29704
11141B8680845K49348L73260M27970M07965M70502O05964O24895M87284L65046
11132C2693079L49821L50035L09151K94396L28572L33912K78539K11864J46485
11123C5295854O2271J1664N8113J36754J41301J11298J59976K60066K86125K32122
11113C6755544K01645K15669K12068K01732K45773L11434L22097L09219L49733
$$ plain form
11104 39124914 39534008 39948572 40363420 40854651 41443933 42063963 42699560 43412888 44189003
11095 44189003 44929033 45647334 46486866 47476217 48475982 49445391 50542939 51861121 53290781
11086 53290781 54773694 56445640 58354671 60260253 61920032 63397173 64884722 66393792
11078 66393792 67821190 69177976 70544617 71910819 73224712 74492852 75723674 76931492
11070 76931492 78285719 80035999 82195887 84581867 87256315 90506737 94149797 97322694
11062 97322694 99389495 100706805 102042054 103560189 104905522 105989621 107053044 108076950
11054 108076950 108752960 109019153 109120117 109197119 109320765 109827145 111054115 112811099 114676474
11045 114676474 116711166 119237102 122061027 124744526 127585924 131369380 136068453 140898805
$$ packed form
11104C9124914M09094M14564M14848M91231N89282O20030O35597P13328P76115
11095D4189003P40030P18301Q39532R89351R99765R69409J097548J318182J429660
11086E3290781J482913J671946J909031J905582J659779J477141J487549J509070
11078F6393792J427398J356786J366641J366202J313893J268140J230822J207818
11070G6931492J354227J750280K159888K385980K674448L250422L643060L172897
11062I7322694K066801J317310J335249J518135J345333J084099J063423J023906
11054A08076950O76010K66193J00964P7002J23646N06380J226970J756984J865375
11045A14676474K034692K525936K823925K683499K841398L783456M699073M830352
$$ plain form
11037 140898805 145910941 152292622 160560628 169805563 179691591 191820609 207348980 223886945
11029 223886945 236743547 243521792 246082879 247638559 249272039 250005216 249063981 246755382
11021 246755382 243390341 238386398 230791114 220464453 208659991 197418114 188172562
11014 188172562 180857727 174499444 168523218 163083064 158245405 153583717 148851095 144464124
11006 144464124 140893736 137987140 135312637 132823958 130724653 128947916 127260298 125715169
10998 125715169 124539573 123663642 122788655 121875018 121161384 120702451 120266209 119739442 119299455
10989 119299455 119093127 119023741 118960007 118927309 118985936 119104173 119241433 119394935 119488256 119371467
10979 119371467 119018414 118593287 118243730 117942561 117599436 117210012 116814052 116406389 115978621
$$ packed form
11037A40898805N012136O381681Q268006R244935R886028J2129018J5528371J6537965
11029B23886945J2856602O778245K561087J555680J633480P33177r41235k308599
11021B46755382l365041n003943p595284j0326661j1804462j1241877r245552
11014A88172562p314835o358283n976226n440154m837659m661688m732622m386971
11006A44464124l570388k906596k674503k488679k099305j776737j687618j545129
10998A25715169j175596q75931q74987r13637p13634m58933m36242n26767m39987
10989A19299455k06328o9386o3734l2698N8627J18237J37260J53502R3321j16789
10979A19371467l53053m25127l49557l01169l43125l89424l95960m07663m27768
$$ plain form
10970 115978621 115581455 115272450 115052236 114905896 114858578 114942603 115147503 115433295 115754719
10961 115754719 116057757 116306403 116531157 116788392 117042004 117147844 117000093 116640756 116165345
10952 116165345 115551972 114654866 113378429 111809647 110139831 108466448 106716431 104788524
10944 104788524 102730910 100715659 98850190 97098095 95409460 93840222 92480319 91335261
10936 91335261 90366084 89602583 89119971 88915901 88897085 88991664 89197766 89499299 89791520 89923992
10926 89923992 89796985 89406102 88807334 88038137 87068644 85847175 84387146 82757783 80980169
10917 80980169 79008909 76857835 74664824 72562301 70549183 68571893 66668496 64928098
10909 64928098 63350291 61858846 60434760 59126229 57936404 56812949 55757096 54838973
$$ packed form
10970A15978621l97166l09005k20214j46340m7318Q4025K04900K85792L21424
10961A15754719L03038K48646K24754K57235K53612J05840j47751l59337m75411
10952A16165345o13373q97106j276437j568782j669816j673383j750017j927907
10944A04788524k057614k015251j865469j752095j688635j569238j359903j145058
10936I1335261r69177p63501m82612k04070j8816R4579K06102L01533K92221J32472
10926H9923992j27007l90883n98768p69197r69493j221469j460029j629363j777614
10917H0980169j971260k151074k193011k102523k013118j977290j903397j740398
10909F4928098j577807j491445j424086j308531j189825j123455j055853r18123
$$ plain form
10901 54838973 54081776 53416962 52777383 52162957 51601477 51113694 50719456 50403595 50080549
10892 50080549 49678694 49251924 48904809 48609645 48221260 47690951 47130639 46620334 46089149
10883 46089149 45462692 44802307 44193666 43597490 42930913 42226025 41583531 41012089 40432551
10874 40432551 39821774 39243133 38733999 38255340 37767111 37282689 36830973 36415261 36021979
10865 36021979 35634159 35234694 34824558 34426985 34045733 33641274 33183224 32700443 32238331
10856 32238331 31794662 31346139 30910016 30519185 30154743 29768206 29363777 28996015 28685538
10847 28685538 28397549 28110573 27846710 27617582 27395397 27163600 26951076 26784657 26641788
10838 26641788 26483591 26311360 26157462 26034078 25922813 25812236 25716995 25649079 25588242 25500974
$$ packed form
10901E4838973p57197o64814o39579o14426n61480m87783l94238l15861l23046
10892E0080549m01855m26770l47115k95164l88385n30309n60312n10305n31185
10883D6089149o26457o60385o08641n96176o66577p04888o42494n71442n79538
10874D0432551o10777n78641n09134m78659m88229m84422m51716m15712l93282
10865C6021979l87820l99465m10136l97573l81252m04459m58050m82781m62112
10856C2238331m43669m48523m36123l90831l64442l86537m04429l67762l10477
10847B8685538k87989k86976k63863k29128k22185k31797k12524j66419j42869
10838B6641788j58197j72231j53898j23384j11265j10577r5241o7916o0837q7268
$$ plain form
10828 25500974 25386913 25287210 25237790 25231012 25240234 25265315 25324138 25407906 25483482 25545174 25628806
10817 25628806 25763130 25938366 26134517 26350413 26593237 26869238 27192958 27571998 27979131
10808 27979131 28383809 28815045 29333452 29928790 30520621 31093049 31747318 32563742 33485387
10799 33485387 34408000 35308126 36184268 36937144 37443447 37731626 37957320 38193229 38354694
10790 38354694 38352658 38206154 37959069 37588422 37065002 36434090 35767567 35086989 34393531 33726392
10780 33726392 33126173 32572713 32021043 31478439 30991602 30573407 30194217 29836717 29509824
10771 29509824 29208266 28903539 28587858 28296923 28072441 27915121 27783620 27633226 27451692
10762 27451692 27261257 27091973 26962282 26886312 26876257 26913755 26938646 26907782 26860941 26883334
$$ packed form
10828B5500974j14061r9703m9420o778R222K5081N8823Q3768P5576O1692Q3632
10817B5628806J34324J75236J96151K15896K42824K76001L23720L79040M07133
10808B7979131M04678M31236N18407N95338N91831N72428O54269Q16424R21645
10799C3485387R22613R00126Q76142P52876N06303K88179K25694K35909J61465
10790C8354694k036j46504k47085l70647n23420o30912o66523o80578o93458o67139
10780C3726392o00219n53460n51670n42604m86837m18195l79190l57500l26893
10771B9509824l01558l04727l15681k90935k24482j57320j31501j50394j81534
10762B7451692j90435j69284j29691p5970j0055L7498K4891l0864m6841K2393
$$ plain form
10752 26883334 26996259 27130780 27222589 27281462 27338746 27376037 27353513 27277637 27188620 27093869 26959098
10741 26959098 26762068 26518397 26253715 25981085 25709287 25448134 25198821 24953997 24709346
10732 24709346 24465405 24223362 23990582 23782195 23603847 23441364 23280678 23126894 22987684
10723 22987684 22850959 22702938 22562161 22468709 22434456 22423664 22393134 22340320 22300134 22297322 22313930
10712 22313930 22312499 22286588 22270810 22292817 22333557 22353573 22342229 22312495 22258979 22160104 22021273
10701 22021273 21874272 21724448 21539525 21308833 21075764 20885825 20732340 20578703 20406146
10692 20406146 20212987 19995170 19761629 19549490 19390526 19272653 19157427 19021710 18863572
10683 18863572 18689255 18519365 18386563 18297727 18213739 18092221 17936219 17781865 17658715 17578898
$$ packed form
10752B6883334J12925J34521R1809N8873N7284L7291k2524p5876q9017r4751j34771
10741B6959098j97030k43671k64682k72630k71798k61153k49313k44824k44651
10732B4709346k43941k42043k32780k08387j78348j62483j60686j53784j39210
10723B2987684j36725j48021j40777r3452l4253j0792l0530n2814m0186k812J6608
10712B2313930j431k5911j5778K2007M0740K0016j1344k9734n3516r8875j38831
10701B2021273j47001j49824j84923k30692k33069j89939j53485j53637j72557
10692B0406146j93159k17817k33541k12139j58964j17873j15226j35717j58138
10683A8863572j74317j69890j32802q8836q3988j21518j56002j54354j23150p9817
$$ plain form
10673 17578898 17534102 17480972 17368674 17212503 17096449 17061059 17037851 16953632 16850386 16817938
10663 16817938 16841378 16818721 16726645 16664654 16709790 16816518 16899190 16938725 16961849 16978356 16991425
10652 16991425 17022060 17073635 17110515 17116013 17135602 17217606 17339321 17432378 17459408 17437490 17415093
10641 17415093 17449385 17564835 17704281 17769108 17745178 17733944 17810662 17916412 17964288 17991753
10631 17991753 18103102 18295547 18462021 18563199 18676712 18851977 19029709 19153950 19265532
10622 19265532 19420148 19595891 19754811 19925618 20143646 20368180 20550438 20736348 21000937
10613 21000937 21313484 21579541 21803224 22086208 22450759 22785831 23015953 23215785 23484723
10604 23484723 23793475 24043306 24218115 24385282 24581491 24784794 24979598 25171521 25352885
$$ packed form
10673A7578898m4796n3130j12298j56171j16054l5390k3208q4219j03246l2448
10663A6817938K3440k2657r2076o1991M5136J06728Q2672L9535K3124J6507J3069
10652A6991425L0635N1575L6880N498J9589Q2004J21715R3057K7030k1918k2397
10641A7415093L4292J15450J39446O4827k3930j1234P6718J05750M7876K7465
10631A7991753J11349J92445J66474J01178J13513J75265J77732J24241J11582
10622A9265532J54616J75743J58920J70807K18028K24534J82258J85910K64589
10613B1000937L12547K66057K23683K82984L64551L35072K30122J99832K68938
10604B3484723L08752K49831J74809J67167J96209K03303J94804J91923J81364
$$ plain form
10595 25352885 25525405 25739367 26033768 26356323 26632870 26904278 27285039 27773783 28223610
10586 28223610 28545598 28830780 29197015 29609160 29948320 30193713 30429074 30704258 30992307
10577 30992307 31269818 31548142 31823668 32075494 32321843 32616107 32980007 33393682 33848538
10568 33848538 34349788 34866856 35344750 35773862 36194166 36625708 37050625 37466959 37899119
10559 37899119 38346731 38783746 39218194 39691025 40204482 40716594 41221035 41763942 42362349
10550 42362349 42977306 43592851 44248901 44967112 45721720 46518396 47414777 48411376 49410844
10541 49410844 50357137 51335529 52450584 53677361 54931747 56225625 57636707 59165947
10533 59165947 60748796 62391595 64177857 66139376 68232767 70450089 72837019 75379954
$$ packed form
10595B5352885J72520K13962K94401L22555K76547K71408L80761M88744M49827
10586B8223610L21988K85182L66235M12145L39160K45393K35361K75184K88049
10577C0992307K77511K78324K75526K51826K46349K94264L63900M13675M54856
10568C3848538N01250N17068M77894M29112M20304M31542M24917M16334M32160
10559C7899119M47612M37015M34448M72831N13457N12112N04441N42907N98407
10550D2362349O14957O15545O56050P18211P54608P96676Q96381R96599R99468
10541D9410844R46293R78392J115055J226777J254386J293878J411082J529240
10533E9165947J582849J642799J786262J961519K093391K217322K386930K542935
$$ plain form
10525 75379954 77995158 80680106 83571671 86785173 90275029 93925671 97715846 101720943
10517 101720943 106007700 110606403 115553514 120890190 126642858 132870363 139710234 147314273
10509 147314273 155743885 164953270 174789001 184865659 194448071 202639009 208843585 213055596
10501 213055596 215646587 216917879 216915940 215600654 213003857 209145901 203931391 197306088
10493 197306088 189535875 181219622 172967241 165103628 157689567 150724690 144238548 138231639
10485 138231639 132640524 127393088 122457205 117829654 113516000 109525531 105853265 102465382
10477 102465382 99326129 96424909 93744408 91224553 88808907 86514104 84396476 82453018
10469 82453018 80611266 78816055 77066929 75369282 73718821 72149358 70725768 69461060
$$ packed form
10525G5379954K615204K684948K891565L213502L489856L650642L790175M005097
10517A01720943M286757M598703M947111N336676N752668O227505O839871P604039
10509A47314273Q429612R209385R835731J0076658R582412Q190938O204576M212011
10501B13055596K590991J271292j939j315286k596797l857956n214510o625303
10493A97306088p770213q316253q252381p863613p414061o964877o486142o006909
10485A38231639n591115n247436m935883m627551m313654l990469l672266l387883
10477A02465382l139253k901220k680501k519855k415646k294803k117628j943458
10469H2453018j841752j795211j749126j697647j650461j569463j423590j264708
$$ plain form
10461 69461060 68299361 67205072 66203519 65303212 64451071 63612494 62828125 62132469 61480413
10452 61480413 60828462 60233951 59782153 59447577 59124484 58784414 58508123 58351347 58269264
10443 58269264 58207282 58192121 58281306 58471384 58713257 58995276 59359435 59837681 60411969 61049802
10433 61049802 61756126 62570147 63512996 64546321 65577610 66494327 67198790 67640234 67833752
10424 67833752 67831047 67651501 67259380 66629201 65798848 64813798 63654682 62293309 60801540
10415 60801540 59313005 57872712 56422263 54953414 53565087 52320024 51156060 50013876
10407 50013876 48946520 48002213 47095740 46126450 45151702 44295846 43533288 42720386 41824213
10398 41824213 40957195 40176159 39407983 38607560 37831465 37095377 36308341 35436927 34604563
$$ packed form
10461F9461060j161699j094289j001553r00307q52141q38577p84369o95656o52056
10452F1480413o51951n94511m51798l34576l23093l40070k76291j56776q2083
10443E8269264o1982j5161Q9185J90078K41873K82019L64159M78246N74288O37833
10433F1049802P06324Q14021R42849J033325J031289R16717P04463M41444J93518
10424F7833752k705j79546l92121o30179q30353r85050j159116j361373j491769
10415F0801540j488535j440293j450449j468849j388327j245063j163964j142184
10407E0013876j067356r44307r06473r69290r74748q55856p62558q12902q96173
10398D1824213q67018p81036p68176q00423p76095p36088p87036q71414q32364
$$ plain form
10389 34604563 33918513 33303513 32627776 31909424 31263336 30700038 30121775 29500528 28923770
10380 28923770 28444870 27999200 27510262 26999804 26543024 26161375 25802985 25408191 24969340
10371 24969340 24536250 24171082 23887956 23637416 23358707 23038395 22708672 22405687 22144070
10362 22144070 21912797 21678427 21411321 21124700 20866967 20662166 20484199 20301379 20110941
10353 20110941 19913985 19699583 19477176 19278692 19100103 18891486 18639955 18405111 18224650
10344 18224650 18044832 17808633 17556759 17360367 17198082 16992817 16742670 16517479 16337915
10335 16337915 16156404 15959855 15794056 15667938 15522082 15322780 15114582 14949138 14824539
10326 14824539 14718916 14620462 14501432 14330324 14137812 14001332 13930400 13838292 13671419 13496198
$$ packed form
10389C4604563o86050o15000o75737p18352o46088n63298n78263o21247n76758
10380B8923770m78900m45670m88938n10458m56780l81649l58390l94794m38851
10371B4969340m33090l65168k83126k50540k78709l20312l29723l02985k61617
10362B2144070k31273k34370k67106k86621k57733k04801j77967j82820j90438
10353B0110941j96956k14402k22407j98484j78589k08617k51531k34844j80461
10344A8224650j79818k36199k51874j96392j62285k05265k50147k25191j79564
10335A6337915j81511j96549j65799j26118j45856j99302k08198j65444j24599
10326A4824539j05623r8454j19030j71108j92512j36480p0932r2108j66873j75221
$$ plain form
10316 13496198 13398599 13358454 13295035 13193224 13106961 13059845 13013500 12929602 12807978 12664762
10306 12664762 12517912 12393699 12309742 12250514 12185555 12104679 12012797 11908284 11796432 11703780
10296 11703780 11640961 11569314 11449930 11313539 11227446 11192411 11131343 11001084 10861839 10793822
10286 10793822 10781343 10735753 10621483 10497591 10418868 10355145 10255597 10150176 10111807 10127721
10276 10127721 10095387 9972885 9850976 9819280 9831025 9782343 9675549 9605116 9607937 9632076 9647611
10265 9647611 9682154 9735701 9764515 9772526 9817336 9897449 9942310 9953912 10038953 10236740 10433614
10254 10433614 10533240 10596436 10705036 10800260 10796594 10761376 10810118 10884039 10819061 10613713 10438719
10243 10438719 10367609 10282782 10094637 9880385 9727478 9588617 9391003 9170419 8993819 8845589
$$ packed form
10316A3496198r7599m0145o3419j01811q6263m7116m6345q3898j21624j43216
10306A2664762j46850j24213q3957n9228o4959q0876r1882j04513j11852r2652
10296A1703780o2819p1647j19384j36391q6093l5035o1068j30259j39245o8017
10286A0793822j2479m5590j14270j23892p8723o3723r9548j05421l8369J5914
10276A0127721l2334j22502j21909l1696J1745m8682j06794p0433K821K4139J5535
10265I647611L4543N3547K8814Q011M4810Q0113M4861J1602Q5041J97787J96874
10254A0433614R9626O3196J08600R5224l666l5218M8742P3921o4978k05348j74994
10243A0438719p1110q4827j88145k14252j52907j38861j97614k20584j76600j48230
$$ plain form
10233 8845589 8689837 8558351 8475299 8374474 8199079 8013386 7901133 7815612 7658326 7460004
10223 7460004 7341727 7314004 7257792 7117231 6976523 6906241 6851731 6737501 6591794 6492362
10213 6492362 6446420 6393626 6294816 6165684 6047190 5979273 5975838 5993738 5958173 5851711 5745137
10202 5745137 5704190 5701530 5667811 5598379 5546927 5525614 5478737 5369598 5239891 5154792 5125729
10191 5125729 5118742 5112175 5107671 5096425 5056421 4990674 4935687 4913838 4900465 4862591 4813570 4794641
10179 4794641 4804918 4789824 4716865 4630229 4597422 4619883 4635486 4605503 4557912 4533425 4526732
10168 4526732 4508126 4476337 4452647 4435000 4399453 4349665 4322815 4328836 4323618 4277136 4235626 4262449
10156 4262449 4332044 4350108 4290368 4241109 4276485 4343321 4340790 4270804 4227838 4255296 4297760
$$ packed form
10233H845589j55752j31486q3052j00825j75395j85693j12253q5521j57286j98322
10223G460004j18277k7723n6212j40561j40708p0282n4510j14230j45707r9432
10213F492362m5942n2794r8810j29132j18494o7917l435J7900l5565j06462j06574
10202E745137m0947k660l3719o9432n1452k1313m6877j09139j29707q5099k9063
10191E125729o987o567m504j1246m0004o5747n4987k1849j3373l7874m9021j8929
10179D794641J0277j5094p2959q6636l2807K2461J5603k9983m7591k4487o693
10168D526732j8606l1789k3690j7647l5547m9788k6850O021n218m6482m1510K6823
10156D262449O9595J8064n9740m9259L5376O6836k531o9986m2966K7458M2464
$$ plain form
10145 4297760 4303590 4292841 4296313 4301324 4299974 4327462 4398993 4459322 4453773 4410085 4390098 4394596
10133 4394596 4382360 4357614 4363196 4394030 4388951 4317010 4214178 4125516 4063055 4027844 4018383 4004550
10121 4004550 3947716 3864682 3818553 3824558 3821508 3769946 3722156 3741677 3794689 3788740 3705200 3627611
10109 3627611 3626717 3668178 3664552 3590675 3509531 3486339 3511612 3530173 3524319 3528207 3559720 3585793
10097 3585793 3579502 3567518 3578978 3585134 3548177 3502257 3513138 3569474 3594619 3568431 3550233 3563833
10085 3563833 3554570 3499874 3466971 3495572 3509560 3433993 3331512 3316510 3378789 3406971 3364567
10074 3364567 3323579 3322008 3308210 3256528 3228878 3267217 3312483 3296282 3246538 3234324 3268440
10063 3268440 3311507 3356695 3413784 3450702 3429998 3389270 3403575 3464360 3475792 3395395 3306242
$$ packed form
10145D297760N830j0749L472N011j350K7488P1531O0329n549m3688j9987M498
10133D394596j2236k4746N582L0834n079p1941j02832q8662o2461l5211r461j3833
10121D004550n6834q3034m6129O005l050n1562m7790J9521N3012n949q3540p7589
10109C627611q94M1461l626p3877q1144k3192K5273J8561n854L888L1513K6073
10097C585793o291j1984J1460O156l6957m5920J0881N6336K5145k6188j8198J3600
10085C563833r263n4696l2903K8601J3988p5567j02481j5002O2279K8182m2404
10074C364567m0988j571j3798n1682k7650L8339M5266j6201m9744j2214L4116
10063C268440M3067M5188N7089L6918k0704m0728J4305O0785J1432q0397q9153
$$ plain form
10052 3306242 3304642 3370993 3411270 3392531 3368009 3375740 3383783 3360265 3341109 3378666 3450529 3475244
10040 3475244 3419427 3342895 3321035 3357068 3394979 3393445 3357345 3312150 3279943 3277105 3307385 3352118
10028 3352118 3384382 3395369 3395930 3397882 3408031 3431148 3458911 3465831 3442694 3427151 3467801 3556259
10016 3556259 3629054 3646376 3637348 3652889 3704394 3771640 3846933 3940696 4051888 4157671 4234041
10005 4234041 4275803 4298391 4325762 4370740 4423079 4462720 4482641 4486518 4468978 4421201 4357928
9994 4357928 4312787 4297822 4290557 4269957 4240803 4213025 4184993 4160933 4155199 4161999 4152814 4125986
9982 4125986 4123936 4170278 4224476 4239525 4233274 4251702 4287454 4298954 4298240 4345445 4444644 4517029
9970 4517029 4512367 4491120 4548669 4696292 4869882 5034554 5223594 5471580 5754335 6012263
$$ packed form
10052C306242j600O6351M0277j8739k4522P731Q043k3518j9156L7557P1863K4715
10040C475244n5817p6532k1860L6033L7911j534l6100m5195l2207k838L0280M4733
10028C352118L2264J0987N61J952J0149K3117K7763O920k3137j5543M0650Q8458
10016C556259P2795J7322r028J5541N1505O7246P5293R3763J11192J05783P6370
10005D234041M1762K2588K7371M4978N2339L9641J9921L877j7540m7777o3273
9994D357928m5141j4965p265k0600k9154k7778k8032k4060n734O800r185k6828
9982D125986k050M6342N4198J5049o251J8428L5752J1500p14M7205R9199P2385
9970D517029m662k1247N7549J47623J73590J64672J89040K47986K82755K57928
$$ plain form
9960 6012263 6205361 6326008 6376120 6358953 6295852 6231097 6200800 6194022 6155116 6031752 5817675
9949 5817675 5549910 5279416 5050870 4889373 4784023 4694749 4596074 4502903 4430517 4348272
9939 4348272 4215398 4056457 3948948 3921609 3911524 3848409 3743005 3658922 3627454 3627669 3627899
9928 3627899 3607165 3551257 3468546 3402074 3387450 3401598 3388967 3336335 3282835 3253283 3225291
9917 3225291 3178494 3136444 3129617 3142751 3133676 3093465 3055253 3042086 3033417 2996415 2934720 2886718
9905 2886718 2876347 2882674 2868064 2824357 2773889 2733442 2704814 2700727 2740781 2802918 2818484 2754891
9893 2754891 2676247 2672438 2741470 2794746 2775540 2717389 2679568 2681563 2716323 2769873 2801751 2764027
9881 2764027 2678170 2639807 2699360 2786784 2811461 2789966 2802016 2855817 2885630 2868740 2852745
$$ packed form
9960F012263J93098J20647N0112j7167o3101o4755l0297o778l8906j23364k14077
9949E817675k67765k70494k28546j61497j05350q9274r8675r3171p2386q2245
9939D348272j32874j58941j07509k7339j0085o3115j05404q4083l1468K15K30
9928C627899k0734n5908q2711o6472j4624J4148j2631n2632n3500k9552k7992
9917C225291m6797m2050o827J3134r075m0211l8212j3167q669l7002o1695m8002
9905B886718j0371O327j4610m3707n0468m0447k8628m087M0054O2137J5566o3593
9893B754891p8644l809O9032N3276j9206n8151l7821J995L4760N3550L1878l7724
9881B764027q5857l8363N9553Q7424K4677k1495J2050N3801K9813j6890j5995
$$ plain form
9870 2852745 2860523 2855468 2821513 2795551 2789459 2758484 2689456 2645137 2663697 2680265 2619061 2511722
9858 2511722 2445713 2432405 2410212 2357859 2318837 2314349 2309063 2276530 2237218 2216973 2217483 2235200
9846 2235200 2259633 2250221 2172757 2066626 2013901 2026620 2029228 1977196 1926596 1945901 2015676 2065134
9834 2065134 2065009 2035028 1994147 1952246 1925635 1918715 1912321 1901669 1912899 1947555 1953435 1898958
9822 1898958 1835369 1825038 1844253 1828903 1788698 1789826 1831925 1833637 1758696 1676199 1660387 1694499
9810 1694499 1716830 1712078 1707707 1712105 1706495 1686104 1668864 1660922 1640189 1586980 1523331 1505131
9798 1505131 1558970 1634736 1655844 1623054 1617785 1673720 1707037 1637309 1524351 1491830 1545057
9787 1545057 1574434 1535229 1504805 1535929 1568988 1542300 1489525 1461725 1439217 1393719 1360561
$$ packed form
9870B852745P778n055l3955k5962o092l0975o9028m4319J8560J6568o1204j07339
9858B511722o6009j3308k2193n2353l9022m488n286l2533l9312k0245N10J7717
9846B235200K4433r412p7464j06131n2725J2719K608n2032n0600J9305O9775M9458
9834B065134j25k9981m0881m1901k6611o920o394j0652J1230L4656N880n4477
9822A898958o3589j0331J9215j5350m0205J128M2099J712p4941q2497j5812L4112
9810A694499K2331m752m371M398n610k0391j7240p942k0733n3209o3649j8200
9798A505131N3839P5766K1108l2790n269N5935L3317o9728j12958l2521N3227
9787A545057K9377l9205l0424L1124L3059k6688n2775k7800k2508m5498l3158
$$ plain form
9776 1360561 1369440 1372806 1328143 1287370 1310971 1351895 1330914 1280929 1298635 1379773 1423371 1391852
9764 1391852 1349377 1334809 1311561 1266144 1248594 1276636 1292213 1257762 1217015 1215735 1232066 1230322
9752 1230322 1221622 1226737 1232269 1223651 1214765 1214135 1208804 1202631 1215025 1225349 1187802 1122189 1108274
9739 1108274 1157988 1182906 1134939 1084468 1094767 1115072 1085372 1058712 1108401 1181424 1169060
9728 1169060 1082155 1031818 1057722 1095532 1106144 1119202 1142086 1137956 1112869 1121577 1161740 1160133
9716 1160133 1095014 1037860 1034863 1038521 1006450 981723 1011271 1056393 1055763 1022391 1007264 1010691
9704 1010691 1001263 990296 1014720 1062087 1078769 1050832 1023756 1036703 1076515 1103299 1093800 1054301
9692 1054301 1008220 973532 947542 922107 911187 937447 987234 1012979 994010 961449 946957
$$ packed form
9776A360561Q879L366m4663m0773K3601M0924k0981m9985J7706Q1138M3598l1519
9764A391852m2475j4568k3248m5417j7550K8042J5577l4451m0747j280J6331j744
9752A230322q700N115N532q618q886o30n331o173J2394J0324l7547o5613j3915
9739A108274M9714K4918m7967n0471J0299K0305k9700k6660M9689P3023j2364
9728A169060q6905n0337K5904L7810J0612J3058K2884m130k5087Q708M0163j607
9716A160133o5119n7154k997L658l2071k4727K9548M5122o30l3372j5127L427
9704A010691r428j0967K4424M7367J6682k7937k7076J2947L9812K6784r499l9499
9692A054301m6081l4688k5990k5435j0920K6260M9787K5745j8969l2561j4492
$$ plain form
9681 946957 943592 937476 938635 954050 967618 973565 989042 1005857 981186 917099 892911 956421
9669 956421 1030779 1009194 912526 864652 919866 1002414 1027845 1003022 978420 970597 972466 989561
9657 989561 1022069 1042791 1029970 1001403 989799 1002641 1025691 1046492 1056905 1051257 1037805 1035561
9645 1035561 1048981 1063931 1075067 1092476 1112777 1113662 1092546 1080748 1097337 1116162 1107813 1093289
9633 1093289 1119292 1186111 1234237 1211882 1135779 1072388 1067299 1104636 1136446 1141405 1141375 1160409
9621 1160409 1186742 1190274 1166342 1143847 1154179 1204315 1272099 1316282 1307326 1266986 1258105 1308226
9609 1308226 1363610 1356302 1300198 1273473 1312870 1376073 1409295 1400280 1358937 1301312 1267323 1298519
9597 1298519 1374622 1422337 1411822 1393633 1413797 1449370 1465058 1475555 1502512 1523421 1522045 1540719
$$ packed form
9681I46957l365o116J159J5415J3568N947J5477J6815k4671o4087k4188O3510
9669I56421P4358k1585r6668m7874N5214Q2548K5431k4823k4602p823J869J7095
9657I89561L2508K0722j2821k8567j1604J2842K3050K0801J0413n648j3452k244
9645A035561J3420J4950J1136J7409K0301Q85k1116j1798J6589J8825q349j4524
9633A093289K6003O6819M8126k2355p6103o3391n089L7337L1810M959l0J9034
9621A160409K6333L532k3932k2495J0332N0136O7784M4183q956m0340q881N0121
9609A308226N5384p308n6104k6725L9397O3203L3222r015m1343n7625l3989L1196
9597A298519P6103M7715j0515j8189K0164L5573J5688J0497K6957K0909j376J8674
$$ plain form
9585 1540719 1613028 1684825 1680551 1619279 1582735 1590084 1595826 1600138 1654365 1741498 1760963 1681368
9573 1681368 1615383 1669841 1789805 1838060 1787291 1738520 1759244 1797122 1781625 1738913 1749156
9562 1749156 1823098 1883582 1874845 1841260 1865754 1956679 2041853 2072129 2079903 2114152 2166160 2203099
9550 2203099 2237992 2305409 2387148 2431868 2448357 2507504 2632865 2755378 2810087 2822910 2863340
9539 2863340 2960101 3104223 3284447 3465783 3578736 3598394 3603656 3684507 3810539 3873078 3851140
9528 3851140 3841661 3903063 3962294 3933470 3855765 3832746 3877166 3907373 3888744 3888450 3965921 4084095
9516 4084095 4176562 4247495 4342340 4453455 4529139 4568418 4630768 4735201 4821201 4847881 4868283
9505 4868283 4945341 5042104 5072835 5038216 5025380 5076628 5142570 5180842 5217749 5277048 5325203
$$ packed form
9585A540719P2309P1797m274o1272l6544P349N742M312N4227Q7133J9465p9595
9573A681368o5985N4458J19964M8255n0769m8771K0724L7878j5497m2712J0243
9562A749156P3942O0484q737l3585K4494R0925Q5174L0276P774L4249N2008L6939
9550B203099L4893O7417Q1739M4720J6489N9147J25361J22513N4709J2823M0430
9539B863340R6761J44122J80224J81336J12953J9658N262Q0851J26032O2539k1938
9528C851140r479O1402N9231k8824p7705k3019M4420L0207j8629k94P7471J18174
9516D084095R2467P0933R4845J11115P5684L9279O2350J04433Q6000K6680K0402
9505D868283P7058R6763L0731l4619j2836N1248O5942L8272L6907N9299M8155
$$ plain form
9494 5325203 5342289 5385411 5516709 5714075 5917548 6120794 6341252 6536152 6642447 6688802
9484 6688802 6769963 6896057 6960292 6893353 6768553 6695142 6667360 6591391 6427769 6229699 6045191
9473 6045191 5854311 5632066 5424379 5309637 5292353 5281054 5194712 5063094 4981524 4977386 4978496
9462 4978496 4929714 4876935 4884533 4920641 4902128 4827736 4776714 4774328 4748993 4646418 4502974
9451 4502974 4367511 4228949 4075990 3958879 3920169 3914758 3873651 3808962 3778416 3775925 3743535
9440 3743535 3679625 3648766 3677128 3713458 3709170 3671408 3619206 3549295 3467792 3399071 3339260 3254248
9428 3254248 3146251 3063916 3017317 2945772 2813255 2676200 2598992 2552834 2468755 2354239 2277425
9417 2277425 2252727 2222659 2153655 2074730 2008627 1936175 1854017 1801862 1794278 1780745 1719612 1645935
$$ packed form
9494E325203J7086M3122J31298J97366K03473K03246K20458J94900J06295M6355
9484F688802Q1161J26094O4235o6939j24800p3411k7782p5969j63622j98070j84508
9473F045191j90880k22245k07687j14742j7284j1299q6342j31618q1570m138J110
9462D978496m8782n2779P598L6108j8513p4392n1022k386k5335j02575j43444
9451D502974j35463j38562j52959j17111l8710n411m1107o4689l0546k491l2390
9440C743535o3910l0859K8362L6330m288l7762n2202o9911q1503o8721n9811q5012
9428C254248j07997q2335m6599p1545j32517j37055p7208m6158q4079j14516p6814
9417B277425k4698l0068o9004p8925o6103p2452q2158n2155p584j3533o1133p3677
$$ plain form
9405 1645935 1613467 1607791 1578542 1529624 1505664 1501429 1464376 1395800 1367904 1407088 1434565 1379107
9393 1379107 1289844 1263563 1300071 1315927 1283638 1262131 1280477 1287837 1256586 1247696 1308127 1370017
9381 1370017 1336177 1227343 1156222 1169806 1202079 1186515 1136637 1096954 1083513 1099446 1146336
9370 1146336 1186946 1155898 1051049 963619 966910 1017217 1021153 966436 920960 923460 944768 953891
9358 953891 956280 954994 930970 884003 849483 850164 865190 868776 868665 881875 898167 895131 874163
9345 874163 858436 863764 885416 903468 892889 844849 788453 771769 805894 845422 842117 802338
9333 802338 771299 773556 792725 804611 808018 818660 843664 866288 857128 807740 750829 730339
9321 730339 749997 773376 778696 782373 795298 793468 761437 732284 743602 777425 789679 781591
$$ packed form
9405A645935l2468n676k9249m8918k3960m235l7053o8576k7896L9184K7477n5458
9393A379107q9263k6281L6508J5856l2289k1507J8346P360l1251q890O0431O1890
9381A370017l3840j08834p1121J3584L2273j5564m9878l9683j3441J5933M6890
9370A146336M0610l1048j04849q7430L291N0307L936n4717m5476K500K1308R123
9358I53891K389j286k4024m6967l4520O81J5026L586j11J3210J6292l036k0968
9345H74163j5727N328K1652J8052j0579m8040n6396j6684L4125L9528l305l9779
9333H02338l1039K257J9169J1886L407J0642K5004K2624r160m9388n6911k0490
9321G30339J9658K3379N320L677J2925j830l2031k9153J1318L3823J2254q088
$$ plain form
9309 781591 789493 813409 814644 786812 768894 774090 765775 728996 707107 729410 754902 737062
9297 737062 701122 699625 724117 724215 693536 672102 674999 683710 703097 756778 818691 820915 752386
9284 752386 685681 675178 688620 678270 662349 683343 730151 759354 762062 755708 739155 711843
9272 711843 707790 746421 775668 738818 678973 687942 754828 767783 689179 623014 653692 714832
9260 714832 703443 648257 653804 720614 745447 695728 660999 698145 734259 689381 614394 618876
9248 618876 706870 775650 763902 717688 701263 717035 740626 772110 808273 809415 748549 670000
9236 670000 645569 681908 721268 730940 737069 759641 772233 757777 755390 803889 870544 889369
9224 889369 853084 814238 804023 805176 805427 818779 839290 829378 781270 743919 756670 795061
$$ packed form
9309G81591P902K3916J235k7832j7918N196q315l6779k1889K2303K5492j7840
9297G37062l5940j497K4492R8l0679k1434K897Q711J9387N3681O1913K224o8529
9284G52386o6705j0503J3442j0350j5921K0994M6808K9203K708o354j6553k7312
9272G11843m053L8631K9247l6850n9845Q969O6886J2955p8604o6165L0678O1140
9260G14832j1389n5186N547O6810K4833m9719l4729L7146L6114m4878p4987M482
9248F18876Q7994O8780j1748m6214j6425J5772K3591L1484L6163J142o0866p8549
9236F70000k4431L6339L9360R672O129K2572J2592j4456k387M8499O6655J8825
9224H89369l6285l8846j0215J153K51J3352K0511r912m8108l7351J2751L8391
$$ plain form
9212 795061 815897 819276 827684 837313 834712 834671 854160 870709 857121 839964 867381 926915 953478
9199 953478 921741 875289 853878 845489 830867 827171 855060 894853 908603 889738 867842 873367
9187 873367 908982 946715 950908 915611 874593 860181 867726 884365 926391 1002082 1059317 1036363
9175 1036363 960374 923264 951385 977331 963344 966652 1033552 1105184 1098493 1026738 966897 946775
9163 946775 937148 928252 941988 980337 1019968 1047811 1057028 1030122 973723 941083 966021 1005791
9151 1005791 1008306 998226 1023982 1058039 1040642 993977 988403 1010524 980797 905213 885661 951723
9139 951723 1002047 962571 895517 887991 925628 945913 935270 904312 844959 783698 798483 901686
9127 901686 981533 949473 873203 862610 894627 873789 811506 805130 866868 915045 926698 956169
$$ packed form
9212G95061K0836L379Q408R629k601m1J9489J6549j3588j7157K7417N9534K6563
9199I53478l1737m6452k1411q389j4622l696K7889L9793J3750j8865k1896N525
9187H73367L5615L7733M193l5297m1018j4412P545J6639M2026P5691N7235k2954
9175A036363p5989l7110K8121K5946j3987L308O6900P1632o691p1755n9841k0122
9163I46775r627q896J3736L8349L9631K7843R217k6906n6399l2640K4938L9770
9151A005791K515j0080K5756L4057j7397m6665n574K2121k9727p5584j9552O6062
9139I51723N0324l9476o7054p526L7637K0285j0643l0958n9353o1261J4785J03203
9127I01686P9847l2060p6270j0593L2017k0838o2283o376O1738M8177J1653K9471
$$ plain form
9115 956169 994050 956935 853654 816251 898453 971694 912659 789138 750871 812485 863183
9104 863183 847639 820209 831669 863949 887401 902166 903438 870559 816940 800586 851751 921503
9092 921503 935704 886148 837963 843647 875009 865411 812554 796313 867329 956854 955110 862081
9080 862081 788767 803567 853808 865385 844371 832946 830800 822025 827664 863417 886674 857211
9068 857211 816509 830017 876881 880925 836517 813652 836265 847191 815916 795955 833156 884231
9056 884231 879342 822069 777765 788707 838740 883779 890399 860561 835202 854259 903973 930639
9044 930639 913463 887053 879809 874156 851605 835040 851677 885744 903198 899526 891781 885479 879183
9031 879183 880524 888267 878875 840990 805809 813914 864322 918222 939295 917136 874778 864433
$$ packed form
9115I56169L7881l7115j03281l7403Q2202P3241n9035j23521l8267O1614N0698
9104H63183j5544k7430J1460L2280K3452J4765J272l2879n3619j6354N1165O9752
9092I21503J4201m9556m8185N684L1362r598n2857j6241P1016Q9525j744r3029
9080H62081p3314J4800N0241J1577k1014j1425k146q775N639L5753K3257k9463
9068H57211m0702J3508M6864M044m4408k2865K2613J0926l1275j9961L7201N1075
9056H84231m889n7273m4304J0942N0033M5039O620k9838k5359J9057M9714K6666
9044I30639j7176k6410p244n653k2551j6565J6637L4067J7454l672p745o302o296
9031H79183J341P743r392l7885l5181Q105N0408N3900K1073k2159m2358j0345
$$ plain form
9019 864433 919030 991744 992876 914492 858039 890990 941338 908898 824484 797539 840308 862137
9007 862137 832535 825551 876904 915896 891519 860962 881801 908220 883197 857149 906425 985249
8995 985249 980310 894025 851633 911906 981567 960557 882467 847110 874488 898186 875536 839217
8983 839217 840803 886378 936005 944931 902589 843346 816577 839165 884093 917485 930830 932172
8971 932172 927418 922421 924492 929657 927159 925504 946500 978750 973019 913975 861886 876415 924314
8958 924314 924217 875069 867897 949577 1041135 1038288 948871 872723 868081 898890 912342 909176 915342
8945 915342 927611 923358 904436 897780 915977 940786 948396 936028 920532 920984 943769 973797 978368
8932 978368 934478 863694 828578 872471 960550 1004370 960806 886383 864679 894292 896646 841494
$$ packed form
9019H64433N4597P2714J132p8384n6453L2951N0348l2440q4414k6945M2769K1829
9007H62137k9602o984N1353L8992k4377l0557K0839K6419k5023k6048M9276P8824
8995I85249m939q6285m2392O0273O9661k1010p8090l5357K7378K3698k2650l6319
8983H39217J586M5575M9627Q926m2342n9243k6769K2588M4928L3392J3345J342
8971I32172m754m997K071N165k498j655K0996L2250n731n9044n2089J4529M7899
8958I24314r7m9148p172Q1680R1558k847q9417p6148m642L0809J3452l166O166
8945I15342J2269m253j8922o656J8197K4809P610j2368j5496M52K2785L0028M571
8932I78368m3890p0784l5116M3893Q8079M3820m3564p4423k1704K9613K354n5152
$$ plain form
8920 841494 805196 861020 956179 968771 874844 783531 790114 861966 906423 895937 874823 880813
8908 880813 916296 973241 1031682 1049188 1005268 945482 929527 947032 942228 910486 899217 914987
8896 914987 913761 898588 933282 1018670 1050045 968249 872204 887626 984888 1036943 1017575 1015378
8884 1015378 1059991 1068877 998337 928312 937150 986813 1005020 1005614 1043686 1104546 1124809 1094032
8872 1094032 1057070 1034985 1016588 1014483 1054486 1110322 1119261 1072716 1029487 1024960 1026159 1000093
8860 1000093 974237 994758 1059425 1123569 1151170 1138716 1107485 1087691 1093221 1103820 1090835 1060769
8848 1060769 1045911 1052713 1057012 1055267 1076463 1127729 1170934 1175745 1157807 1141681 1126415 1114883
8836 1114883 1133521 1185222 1221946 1209181 1184593 1203334 1252890 1276501 1260889 1244051 1248205 1260571
$$ packed form
8920H41494l6298N5824R5159J2592r3927r1313O583P1852M4457j0486k1114N990
8908H80813L5483N6945N8441J7506m3920n9786j5955J7505m804l1742j1269J5770
8896I14987j226j5173L4694Q5388L1375q1796r6045J5422R7262N2055j9368k197
8884A015378M4613Q886p0540p0025Q838M9663J8207N94L8072O0860K0263l0777
8872A094032l6962k2085j8397k105M0003N5836Q939m6545m3229m527J199k6066
8860A000093k5856K0521O4667O4144K7601j2454l1231j9794N530J0599j2985l0066
8848A060769j4858O802M299j745K1196N1266M3205M811j7938j6126j5266j1532
8836A114883J8638N1701L6724j2765k4588J8741M9556K3611j5612j6838M154J2366
$$ plain form
8824 1260571 1273301 1288032 1286351 1252439 1221973 1246782 1307974 1330395 1294384 1262740 1276057 1297746
8812 1297746 1300602 1328952 1411038 1475822 1443024 1355609 1329160 1386353 1437051 1427961 1415770 1456914
8800 1456914 1508184 1498753 1446449 1430904 1476491 1528799 1541978 1530564 1525847 1530877 1538803 1556277
8788 1556277 1581420 1587386 1558882 1526229 1532084 1576598 1625881 1664025 1700285 1729311 1728928 1708469
8776 1708469 1716419 1774528 1837274 1848392 1813537 1783929 1787460 1811622 1840374 1869684 1892692 1903151
8764 1903151 1909604 1919731 1924947 1932678 1988626 2112462 2228018 2230873 2132626 2064111 2109671 2206804
8752 2206804 2249248 2226933 2209528 2239303 2301416 2369620 2424462 2447078 2444393 2461772 2526493 2600673
8740 2600673 2635306 2645773 2681363 2741129 2777905 2774308 2761332 2770343 2813588 2895540 2991711 3038452
$$ packed form
8824A260571J2730J4731j681l3912l0466K4809O1192K2421l6011l1644J3317K1689
8812A297746K856K8350Q2086O4784l2798q7415k6449N7193N0698r090j2191M1144
8800A456914N1270r431n2304j5545M5587N2308J3179j1414m717N030P926J7474
8788A556277K5143N966k8504l2653N855M4514M9283L8144L6260K9026l83k0459
8776A708469P950N8109O2746J1118l4855k9608L531K4162K8752K9310K3008J0459
8764A903151O453J0127N216P731N5948J23836J15556K855r8247o8515M5560R7133
8752B206804M2444k2315j7405K9775O2113O8204N4842K2616k685J7379O4721P4180
8740B600673L4633J0467L5590N9766L6776l597j2976R011M3245Q1952R6171M6741
$$ plain form
8728 3038452 3008003 2974913 3032931 3156445 3227364 3199812 3150177 3150949 3184586 3209202 3223810 3231106
8716 3231106 3214250 3191941 3221042 3300979 3352522 3339739 3330449 3376163 3419926 3404000 3386074 3445052
8704 3445052 3537373 3565033 3541278 3563493 3646377 3709941 3727010 3753940 3802105 3807992 3767954 3782317
8692 3782317 3905362 4052020 4123993 4143317 4182365 4235144 4251299 4247960 4289632 4379056 4456029
8681 4456029 4498724 4548278 4626698 4698980 4734469 4750870 4774709 4801300 4818193 4833405 4854149
8670 4854149 4864514 4851664 4833755 4832920 4836072 4818013 4798464 4833535 4934411 5031823 5056669 5033309
8658 5033309 5046683 5124136 5203928 5233139 5242568 5292485 5387784 5488159 5568897 5629091 5670943
8647 5670943 5715723 5805205 5933278 6015447 5999328 5971372 6059232 6245428 6388614 6434772 6483923
$$ packed form
8728C038452l0449l3090N8018J23514P0919k7552m9635P72L3637K4616J4608P296
8716C231106j6856k2309K9101P9937N1543j2783r290M5714M3763j5926j7926N8978
8704C445052R2321K7660k3755K2215Q2884O3564J7069K6930M8165N887m0038J4363
8692C782317J23045J46658P1973J9324L9048N2779J6155l339M1672Q9424P6973
8681D456029M2695M9554P8420P2282L5489J6401K3839K6591J6893J5212K0744
8670D854149J0365j2850j7909q35L152j8059j9549L5071J00876R7412K4846k3360
8658E033309J3374P7453P9792K9211R429M9917R5299J00375Q0738O0194M1852
8647E670943M4780Q9482J28073Q2169j6119k7956Q7860J86196J43186M6158M9151
$$ plain form
8636 6483923 6610469 6743445 6802323 6845553 6976422 7172135 7324291 7412474 7523269 7705054
8626 7705054 7905502 8066952 8202825 8354991 8533811 8724813 8916469 9107093 9309306 9544046
8616 9544046 9804618 10045739 10244842 10449850 10717779 11029622 11324545 11597687 11893624 12213785
8606 12213785 12509692 12773423 13054987 13367713 13647739 13840837 13971447 14090347 14203115
8597 14203115 14285627 14327672 14326388 14273185 14179726 14083802 13999204 13891757 13734877 13556843 13398611
8586 13398611 13251773 13076807 12867134 12659531 12485275 12336440 12182593 12008325 11831514
8577 11831514 11683594 11569656 11459391 11326915 11179926 11032921 10882176 10737745 10641353 10601298
8567 10601298 10548038 10426191 10297602 10259458 10280319 10232649 10091636 9974259 9950661 9949774 9911557
$$ packed form
8636F483923J26546J32976N8878M3230J30869J95713J52156Q8183J10795J81785
8626G705054K00448J61450J35873J52166J78820J91002J91656J90624K02213K34740
8616I544046K60572K41121J99103K05008K67929L11843K94923K73142K95937L20161
8606A2213785K95907K63731K81564L12726K80026J93098J30610J18900J12768
8597A4203115Q2512M2045j284n3203r3459r5924q4598j07447j56880j78034j58232
8586A3398611j46838j74966k09673k07603j74256j48835j53847j74268j76811
8577A1831514j47920j13938j10265j32476j46989j47005j50745j44431r6392m0055
8567A0601298n3260j21847j28589l8144K0861m7670j41013j17377k3598q87l8217
$$ plain form
8556 9911557 9900874 9978150 10075658 10122309 10194096 10397058 10665388 10827550 10840878 10815212 10817013
8545 10817013 10795671 10716971 10633217 10581305 10519565 10408540 10266205 10109098 9923334 9726363
8535 9726363 9573805 9470780 9358068 9220045 9118827 9077769 9021083 8891201 8748254 8679576
8525 8679576 8669938 8634945 8537968 8406028 8267471 8138412 8041034 7977536 7911498 7822661 7747750
8514 7747750 7718862 7699635 7639971 7561162 7525583 7547765 7594960 7652181 7726691 7809659 7895293
8503 7895293 8020281 8224162 8490135 8786783 9137700 9561746 9960053 10173471 10178755 10131384
8493 10131384 10166380 10239184 10227965 10122726 10019391 9956059 9851158 9617701 9269141 8882660
8483 8882660 8509580 8165744 7877679 7677022 7542254 7394602 7184481 6958266 6802872 6733999
$$ packed form
8556I911557j0683P7276R7508M6651P1787K02962K68330J62162J3328k5666J801
8545A0817013k1342p8700q3754n1912o1740j11025j42335j57107j85764j96971
8535I726363j52558j03025j12712j38023j01218m1058n6686j29882j42947o8678
8525H679576r638l4993r6977j31940j38557j29059r7378o3498o6038q8837p4911
8514G747750k8888j9227n9664p8809l5579K2182M7195N7221P4510Q2968Q5634
8503G895293J24988K03881K65973K96648L50917M24046L98307K13418N284m7371
8493A0131384L4996P2804j1219j05239j03335o3332j04901k33457l48560l86481
8483H882660l73080l43836k88065k00657j34768j47652k10121k26215j55394o8873
$$ plain form
8473 6733999 6678151 6567333 6412644 6270855 6172823 6105564 6037028 5937113 5799651 5663923
8463 5663923 5586101 5566007 5533546 5437655 5317574 5249458 5251335 5283036 5313109 5335902 5342962 5332581
8451 5332581 5337419 5391930 5481979 5576474 5692982 5867046 6061927 6183109 6197162 6170260 6167172
8440 6167172 6174730 6154372 6108900 6052704 5962437 5807803 5604413 5395459 5200846 5016136 4841749
8429 4841749 4683458 4539237 4407270 4290498 4179113 4053049 3917346 3807417 3742506 3702686
8419 3702686 3665786 3630484 3585632 3501895 3383232 3283755 3237585 3212039 3169048 3129318 3124959
8408 3124959 3127629 3086114 3009585 2950061 2919027 2883875 2835475 2795425 2761186 2708093 2646827 2614656
8396 2614656 2603045 2561022 2487018 2449745 2486301 2538103 2529510 2464772 2404044 2379742 2380158 2386597
$$ packed form
8473F733999n5848j10818j54689j41789r8032o7259o8536r9915j37462j35728
8463E663923p7822k0094l2461r5891j20081o8116J877L1701L0073K2793P060j0381
8451E332581M838N4511R0049R4495J16508J74064J94881J21182J4053k6902l088
8440F167172P558k0358m5472n6196r0267j54634k03390k08954j94613j84710j74387
8429D841749j58291j44221j31967j16772j11385j26064j35703j09929o4911l9820
8419C702686l6900l5302m4852q3737j18663r9477m6170k5546m2991l9730m359
8408C124959K670m1515p6529n9524l1034l5152m8400m0050l4239n3093o1266l2171
8396B614656j1611m2023p4004l7273L6556N1802q593o4738o0728k4302M16O439
$$ plain form
8384 2386597 2382926 2350666 2296597 2266400 2288983 2323886 2309390 2250755 2209570 2208646 2204070 2164288
8372 2164288 2121698 2115344 2127215 2117650 2091249 2076786 2062175 2009851 1935068 1905051 1940594 1976635
$$ packed form
8384B386597l671l2260n4069l0197K2583L4903j4496n8635m1185r24m576l9782
8372B164288m2590o354J1871r565k6401j4463j4611n2324p4783l0017L5543L6041
$$ [...]
##END NTUPLES=NMR SPECTRUM
##END=
