##TITLE=1H ikalashn
CG-1214-4
17.10.2024
##JCAMPDX= 6.0         $$ Bruker NMR JCAMP-DX V2.0
##DATA TYPE= NMR SPECTRUM
##DATA CLASS= NTUPLES
##ORIGIN= UXNMR, Bruker Analytische Messtechnik GmbH
##OWNER= root
$$ TOPSPIN		Version 1.3
$$ 2024-10-17 10:56:34.562 +0400  Irina@DPX200
$$ Compression mode = diff/dup
##.OBSERVE FREQUENCY= 200.131392401
##.OBSERVE NUCLEUS= ^1H
##.ACQUISITION MODE= SIMULTANEOUS
##.ACQUISITION SCHEME= undefined
##.AVERAGES= 32
##.DIGITISER RES= 18
##SPECTROMETER/DATA SYSTEM= spect
##.PULSE SEQUENCE= zg
##.SOLVENT NAME= CDCl3
##.SHIFT REFERENCE= INTERNAL, CDCl3, 1, 17.95386
##AUDIT TRAIL= $$ (NUMBER, WHEN, WHO, WHERE, WHAT)
$$ ##TITLE= Audit trail, TOPSPIN		Version 1.3
$$ ##JCAMPDX= 5.01
$$ ##ORIGIN= Bruker BioSpin GmbH
$$ ##OWNER= Irina
$$ $$ F:/spectra/data/iren/nmr/1H/4/pdata/1/auditp.txt
$$ ##AUDIT TRAIL=  $$ (NUMBER, WHEN, WHO, WHERE, VERSION, WHAT)
(   1,<2024-10-17 10:56:19.578 +0400>,<Irina>,<DPX200>,<TOPSPIN 1.3>,
      <created by zg
	started at 2024-10-17 10:54:09.578 +0400,
	POWCHK disabled, PULCHK disabled
       terminated by command 'halt'
       configuration hash MD5:
       BE 6D 3F 07 2A EA 11 49 91 17 2B D3 AF B3 58 0D
       data hash MD5: 16K
       7A 40 5E 1C F7 0B 7B 28 0C BB 91 57 E9 20 57 CB>)
(   2,<2024-10-17 10:56:19.593 +0400>,<Irina>,<DPX200>,<TOPSPIN 1.3>,
      <Start of raw data processing
       efp BC_mod = 2 LB = 0.01 FT_mod = 6 PKNL = 1 PHC0 = 210.8902 PHC1 = -1.657925 SI = 32K 
       data hash MD5: 32K
       DA 70 DA 87 03 BD A4 76 EA E7 E1 C2 77 A9 AF 96>)
(   3,<2024-10-17 10:56:21.734 +0400>,<Irina>,<DPX200>,<TOPSPIN 1.3>,
      <apk 
       data hash MD5: 32K
       1C 7D B7 BF E7 B9 EA D9 A0 44 7B 1A 98 5F 05 F9>)
(   4,<2024-10-17 10:56:26.312 +0400>,<Irina>,<DPX200>,<TOPSPIN 1.3>,
      <abs n ABSG = 5 
       data hash MD5: 32K
       6A 03 DA BA 11 48 9B 96 24 AA 17 02 94 01 B5 51>)
$$ ##END=
$$ 
$$ $$ hash MD5
$$ $$ 15 0D 2C E8 BB 6E A8 A5 06 5E 39 DB 36 5F 9E 32
##$RELAX= 
##$RELAX= 
##$RELAX= 
##$RELAX= 
##$RELAX= 
##$RELAX= 
##$RELAX= 
##$RELAX= 
##$RELAX= 
$$ Bruker specific parameters
$$ --------------------------
##$DU= <F:/spectra>
##$EXPNO= 4
##$NAME= <1H>
##$PROCNO= 1
##$TYPE= <nmr>
##$USER= <iren>
##$AMP= (0..31)
100 100 100 100 100 100 100 100 100 100 100 100 100 100 100 100 100 100 
100 100 100 100 100 100 100 100 100 100 100 100 100 100 
##$ANAVPT= -1
##$AQSEQ= 0
##$AQ_mod= 1
##$AUNM= <au_zg>
##$AUTOPOS= <>
##$BF1= 200.13
##$BF2= 200.13
##$BF3= 200.13
##$BF4= 200.13
##$BF5= 200.13
##$BF6= 200.13
##$BF7= 200.13
##$BF8= 200.13
##$BYTORDA= 1
##$CFDGTYP= 0
##$CFRGTYP= 5
##$CHEMSTR= <none>
##$CNST= (0..63)
1 1 145 1 1 1 1 1 1 1 1 1 1 1 1 1 1 1 1 1 1 1 1 1 1 1 1 1 1 1 1 1 1 1 
1 1 1 1 1 1 1 1 1 1 1 1 1 1 1 1 1 1 1 1 1 1 1 1 1 1 1 1 1 1 
##$CPDPRG= <>
##$CPDPRG1= <>
##$CPDPRG2= <>
##$CPDPRG3= <>
##$CPDPRG4= <mlev>
##$CPDPRG5= <mlev>
##$CPDPRG6= <mlev>
##$CPDPRG7= <mlev>
##$CPDPRG8= <mlev>
##$CPDPRGB= <>
##$CPDPRGT= <>
##$D= (0..63)
$$ [...]
##$SW_h= 4401.40845070422
##$TD= 16384
##$TD0= 1
##$TE= 300
##$TE2= 300
##$TE3= 300
##$TEG= 300
##$TL= (0..7)
0 120 120 120 120 120 120 120 
##$TP= (0..7)
150 150 150 150 150 150 150 150 
##$TP07= 0
##$TPNAME0= <>
##$TPNAME1= <>
##$TPNAME2= <>
##$TPNAME3= <>
##$TPNAME4= <>
##$TPNAME5= <>
##$TPNAME6= <>
##$TPNAME7= <>
##$TPOAL= (0..7)
0.5 0.5 0.5 0.5 0.5 0.5 0.5 0.5 
##$TPOFFS= (0..7)
0 0 0 0 0 0 0 0 
##$TUNHIN= 0
##$TUNHOUT= 0
##$TUNXOUT= 0
##$USERA1= <user>
##$USERA2= <user>
##$USERA3= <user>
##$USERA4= <user>
##$USERA5= <user>
##$V9= 5
##$VALIST= <valist>
##$VCLIST= <CCCCCCCCCCCCCCC>
##$VD= 0
##$VDLIST= <DDDDDDDDDDDDDDD>
##$VPLIST= <PPPPPPPPPPPPPPP>
##$VTLIST= <TTTTTTTTTTTTTTT>
##$WBST= 1024
##$WBSW= 25
##$XGAIN= (0..3)
0 0 0 0 
##$XL= 0
##$YL= 0
##$YMAX_a= 964225
##$YMIN_a= -1708214
##$ZGOPTNS= <>
##$ZL1= 120
##$ZL2= 120
##$ZL3= 120
##$ZL4= 120
##$ABSF1= 17.95386
##$ABSF2= -4.038887
##$ABSG= 5
##$ABSL= 3
##$ALPHA= 0
##$AQORDER= 0
##$ASSFAC= 0
##$ASSFACI= 0
##$ASSFACX= 0
##$ASSWID= 0
##$AUNMP= <proc_1d>
##$AXLEFT= 0
##$AXRIGHT= 0
##$AXTYPE= 0
##$AXUNIT= <>
##$AZFE= 0.1
##$AZFW= 0.1
##$BCFW= 0
##$BC_mod= 2
##$BYTORDP= 0
##$COROFFS= 0
##$CY= 7568.61572265625
##$DATMOD= 1
##$DC= 0
##$DFILT= <>
##$DTYPP= 0
##$F1P= 17.9538593292236
##$F2P= -4.03888763876832
##$FCOR= 0.5
##$FTSIZE= 32768
##$FT_mod= 6
##$GAMMA= 0
##$GB= 0
##$INTBC= 0
##$INTSCL= 1.483618e-010
##$ISEN= 128
##$LB= 0.01
##$LEV0= 0
##$LPBIN= 0
##$MAXI= 945.577
##$MC2= 0
##$MEAN= 0
##$ME_mod= 0
##$MI= -402.1523
##$NCOEF= 0
##$NC_proc= -6
##$NLEV= 6
##$NOISF1= 8.587773
##$NOISF2= 6.764455
##$NSP= 0
##$NTH_PI= 0
##$NZP= 0
##$OFFSET= 17.95386
##$PC= 1
##$PHC0= 314.4813
##$PHC1= 10.96945
##$PH_mod= 1
##$PKNL= yes
##$PPARMOD= 0
##$PPDIAG= 0
##$PPIPTYP= 0
##$PPMPNUM= 100
##$PPRESOL= 1
##$PSCAL= 0
##$PSIGN= 0
##$REVERSE= no
##$SF= 200.13
##$SI= 32768
##$SIGF1= 16.12182
##$SIGF2= -4.496377
##$SINO= 3.521527
##$SIOLD= 32768
##$SREGLST= <1H.CDCl3>
##$SSB= 0
##$STSI= 32768
##$STSR= 0
##$SW_p= 4401.40845070423
##$SYMM= 0
##$S_DEV= 0
##$TDeff= 16384
##$TDoff= 0
##$TI= <>
##$TILT= no
##$TM1= 0
##$TM2= 0
##$TOPLEV= 0
##$USERP1= <user>
##$USERP2= <user>
##$USERP3= <user>
##$USERP4= <user>
##$USERP5= <user>
##$WDW= 1
##$XDIM= 32768
##$YMAX_p= 510579018
##$YMIN_p= -524351
$$ End of Bruker specific parameters
$$ ---------------------------------
##NTUPLES= NMR SPECTRUM
##VAR_NAME=  FREQUENCY,     SPECTRUM/REAL,   SPECTRUM/IMAG
##SYMBOL=    X,             R,               I
##VAR_TYPE=  INDEPENDENT,   DEPENDENT,       DEPENDENT
##VAR_FORM=  AFFN,          ASDF,            ASDF
##VAR_DIM=   32768,         32768,           32768
##UNITS=     HZ,            ARBITRARY UNITS, ARBITRARY UNITS
##FACTOR=    0.134324425510551, 1,           1
##FIRST=     4401.40845070423, 59291,        -2600557
##LAST=      0,             149801,          -3179577
##MIN=       0,             -524351,         0
##MAX=       4401.40845070423, 510579018,    0
$$ Real data points
##PAGE= N=1
##DATA TABLE= (X++(R..R)), XYDATA
$$ [...]
14373 6654133 6743489 6874839 7043795 7139774 7084280 6981015 7003933 7168921 7328212 7376955
14363 7376955 7361580 7380605 7473679 7628956 7815557 7971548 8029235 8005905 8026039 8196163
14353 8196163 8473333 8701168 8770589 8713154 8646004 8667952 8813118 9052779 9304170 9471499
14343 9471499 9534341 9585679 9725221 9918093 10035719 10054858 10115333 10312110 10529080 10604804
14333 10604804 10595934 10702705 10943457 11102361 11063554 11007481 11144348 11403422 11562915 11584275
14323 11584275 11611265 11688590 11706574 11638571 11616858 11702454 11766912 11709680 11633775 11666948 11734675
14312 11734675 11678917 11522953 11437948 11475940 11510262 11453420 11373417 11341961 11302406 11173598 10992454
14301 10992454 10859832 10799242 10753797 10689353 10620650 10550719 10460622 10364917 10310793 10296833 10244704
14290 10244704 10096338 9911746 9813490 9829007 9843983 9750813 9599573 9527037 9547938 9519568
14280 9519568 9357054 9183338 9164592 9261791 9281993 9158418 9028169 8999321 8990954 8889925
14270 8889925 8740813 8653415 8607954 8505133 8370816 8346804 8458787 8537779 8437377 8227514
14260 8227514 8090463 8086082 8104238 8026980 7867146 7734573 7701320 7725968 7716588 7652895 7605246
14249 7605246 7619517 7644463 7624608 7599428 7618034 7612564 7494933 7354745 7385148 7580157 7689523
14238 7689523 7561871 7362513 7319190 7403190 7437980 7404248 7420415 7485410 7473829 7381695 7357283
14227 7357283 7450230 7526001 7490350 7422225 7408943 7413882 7395647 7401126 7436045 7394612 7244603
14216 7244603 7143665 7221283 7362075 7372742 7270024 7221251 7267598 7301845 7288119 7307139 7377897
14205 7377897 7413754 7384253 7361380 7368166 7332870 7245011 7213835 7299443 7404680 7412578 7334421
14194 7334421 7250881 7196357 7172862 7195566 7249369 7268312 7224967 7177093 7168321 7153850 7087722
14183 7087722 7010493 6974550 6943948 6848276 6691494 6539656 6440830 6408454 6428637 6430247 6316139
14172 6316139 6093494 5908070 5871409 5914419 5893015 5777109 5643892 5540935 5457122 5385619
14162 5385619 5317753 5213137 5065622 4949410 4906054 4851770 4712996 4580038 4573010 4616221
14152 4616221 4536430 4359762 4297158 4411189 4511033 4448375 4321100 4277021 4286337 4243858 4163103
14141 4163103 4123035 4118799 4101926 4091097 4116263 4124200 4065964 4011651 4045572 4106291 4075572 3984110
14129 3984110 3973116 4067475 4144981 4144573 4153776 4242694 4340113 4346470 4277904 4222920 4217146 4229079
14117 4229079 4231478 4227827 4223346 4210255 4184368 4166847 4205359 4328515 4481040 4547798 4492502
14106 4492502 4432114 4499056 4660253 4769119 4783104 4810191 4917558 5020185 5029195 5008803 5081675
14095 5081675 5236280 5340486 5331297 5289873 5310876 5380564 5429064 5445674 5473823 5509571 5481901
14084 5481901 5364218 5246029 5227018 5269575 5246319 5136075 5062066 5085898 5077762 4901324 4649193
14073 4649193 4548017 4654672 4793577 4806362 4722014 4638864 4572955 4501008 4448369 4437386 4414886
14062 4414886 4321421 4192603 4117684 4123001 4149489 4122944 4016917 3882566 3830624 3920399 4049953
14051 4049953 4046423 3897614 3780748 3802311 3843302 3769138 3659011 3661779 3724779 3676395 3534824
14040 3534824 3503971 3637493 3726967 3611038 3413547 3346769 3412556 3448100 3385217 3309552 3291392
14029 3291392 3294081 3266359 3229097 3234663 3292172 3361069 3395580 3385531 3365309 3379232 3432686 3493649
14017 3493649 3544562 3599872 3662594 3706494 3724040 3748365 3796598 3836771 3854015 3903744 4032656
14006 4032656 4171875 4187053 4044845 3868565 3802830 3864130 3951755 3971257 3910027 3813064 3731938
13995 3731938 3698250 3699758 3661891 3499795 3236743 3035883 3037799 3171623 3215864 3070044 2871751
13984 2871751 2792015 2812775 2799436 2712284 2621818 2565924 2527199 2521691 2568411 2589975 2500382
13973 2500382 2384267 2405778 2521483 2499114 2290847 2156506 2276278 2455410 2418285 2224153
13963 2224153 2138315 2205799 2236555 2165834 2136901 2203890 2226721 2139699 2084269 2158897 2242084
13952 2242084 2205765 2132420 2155361 2218758 2180229 2063404 2020702 2084289 2126310 2066110 1970620
13941 1970620 1924956 1923545 1931843 1963471 2038658 2119370 2138461 2076264 1981683 1923414 1927334 1957665
13929 1957665 1962309 1934025 1908292 1902923 1894493 1863839 1827506 1808546 1810932 1834250 1872619 1889527
13917 1889527 1845426 1764854 1718457 1721153 1714596 1672456 1645096 1667169 1706213 1744129 1810606 1876313
13905 1876313 1826779 1639112 1478959 1492953 1590302 1583393 1482532 1469669 1594616 1684261 1597403
13894 1597403 1419976 1335764 1405941 1542795 1628623 1607628 1513394 1440548 1449940 1494476 1480938
13883 1480938 1387519 1264100 1154897 1101210 1165902 1334090 1438711 1344385 1177136 1180311
13873 1180311 1342571 1394818 1228629 1075371 1147088 1319558 1351914 1248651 1193166 1238654
13863 1238654 1277141 1245805 1175567 1087839 1012007 1046432 1227889 1397559 1382435 1259553 1239459
13852 1239459 1329925 1346584 1247348 1202109 1285359 1346552 1280886 1210631 1268699 1382714 1416962
13841 1416962 1381451 1354613 1322694 1243704 1169873 1163932 1178814 1152366 1134397 1182290 1219731
13830 1219731 1159003 1090352 1168948 1354799 1449997 1382874 1273642 1207900 1132967 1028059 996756
13819 996756 1092153 1189680 1155018 1044459 1017088 1109003 1211548 1239365 1210338 1170324 1139265
13808 1139265 1139563 1186153 1224122 1162688 1019090 952950 1079318 1294593 1383597 1283860 1140889
13797 1140889 1092669 1119238 1155065 1218878 1318546 1335496 1175402 980278 991902 1200412 1332470
13786 1332470 1240400 1098717 1111473 1218404 1249428 1211959 1228021 1295020 1314678 1288143 1282147
13775 1282147 1258966 1149085 1047822 1108161 1254376 1250510 1073682 961766 1031915 1117739
13765 1117739 1093148 1092877 1238283 1374799 1307637 1128644 1067666 1138789 1175928 1136337 1125436
13754 1125436 1165624 1174213 1152795 1176331 1199412 1102304 949898 965613 1180487 1336046 1250965
13743 1250965 1086357 1092629 1249055 1340289 1292409 1235163 1260756 1301624 1280128 1244305 1281802
13732 1281802 1372131 1407497 1347649 1285603 1323859 1425565 1463402 1417275 1420235 1548838 1675848
13721 1675848 1655946 1576397 1643339 1847958 1957509 1874989 1791225 1875177 2007317 1984806 1846360
13710 1846360 1792753 1865956 1912357 1842766 1746039 1724801 1763062 1791922 1778056 1718487 1635809
13699 1635809 1593553 1633013 1689892 1660944 1554320 1477769 1473711 1473842 1436074 1413471 1445094 1479197
13687 1479197 1461488 1418840 1399864 1402480 1413303 1453919 1533249 1608185 1639425 1637515 1618300 1572787
13675 1572787 1518385 1512659 1571390 1639229 1682818 1731416 1774270 1721216 1555202 1427802 1477463
13664 1477463 1620752 1666752 1595927 1565927 1648955 1732990 1723638 1689851 1729468 1811105 1848814
13653 1848814 1845466 1856946 1877920 1872120 1873581 1943850 2046742 2080852 2043579 2047215 2133473 2181991
13641 2181991 2084632 1931348 1909387 2048074 2183948 2194788 2153645 2188522 2281172 2310430 2251804
13630 2251804 2213775 2268004 2351649 2380692 2371068 2381543 2405861 2407747 2420757 2515538 2675066
13619 2675066 2791764 2805571 2772716 2771938 2806934 2839581 2865641 2904460 2943735 2947320 2910134 2867382
13607 2867382 2850606 2862161 2891996 2933404 2974552 2991166 2960904 2886163 2801705 2756406 2778488
13596 2778488 2851803 2926401 2955357 2928457 2881083 2869552 2918861 2985961 2995318 2926831 2847792
13585 2847792 2836570 2896664 2973239 3028511 3059221 3059815 3022528 2970423 2940496 2932574 2921045 2914750
13573 2914750 2951154 3029142 3106567 3169186 3234713 3280083 3249769 3164940 3130005 3174097 3179462
13562 3179462 3057875 2922601 2962259 3176993 3366858 3388180 3309892 3286422 3370646 3499879
13552 3499879 3592753 3603421 3533512 3449944 3455990 3585475 3741228 3790393 3719943 3655548 3715993
13541 3715993 3881679 4029562 4079291 4070891 4093592 4172995 4258958 4304159 4310971 4306998 4322124
13530 4322124 4387898 4500687 4583337 4565272 4521023 4621138 4881318 5073269 5003969 4800799
13520 4800799 4765398 4984219 5250288 5370273 5378064 5398798 5455399 5496494 5511181 5531775 5588887
13509 5588887 5709853 5886253 6019207 6006085 5915199 5937647 6105377 6213411 6125863 6002785
13499 6002785 6067866 6277404 6409531 6398753 6377898 6425085 6468107 6447593 6410601 6422179 6510858
13488 6510858 6693548 6922392 7035066 6921891 6726472 6697956 6847696 6958540 6950991 6997460
13478 6997460 7197049 7381192 7384590 7305231 7322175 7420959 7489135 7549453 7692640 7872925 7974157
13467 7974157 8019017 8123592 8288123 8413938 8496500 8622678 8790639 8904266 8948749 9015917
13457 9015917 9149417 9309209 9489305 9721761 9960915 10117659 10220223 10387797 10632469
13448 10632469 10851191 11035011 11305470 11693057 12055451 12289546 12467371 12687458 12948776
13439 12948776 13251492 13655269 14135345 14543991 14833145 15153964 15601951 16035827 16325335
13430 16325335 16617074 17127032 17784150 18330136 18708185 19098796 19591522 20071532 20454965
13421 20454965 20807644 21175911 21499460 21756573 22014091 22264713 22392813 22384071 22394262 22505458
13411 22505458 22577354 22467355 22253221 22091941 21981277 21822381 21619427 21440138 21243418
13402 21243418 20927049 20517990 20147664 19846062 19518588 19134066 18777960 18488214 18189377
13393 18189377 17845298 17537489 17311915 17073127 16737988 16393503 16170302 16028511 15820454
13384 15820454 15535854 15318044 15215343 15087540 14847097 14644346 14654895 14770694 14707111 14417413
13374 14417413 14191235 14251181 14426043 14387907 14108734 13882162 13914797 14086760 14162110 14086053
13364 14086053 13993271 14019290 14177653 14359567 14411191 14282588 14130082 14175878 14427826 14656710
13354 14656710 14714753 14736727 14907819 15161323 15285635 15262437 15301291 15539110 15875937 16146114
13344 16146114 16318740 16477879 16703644 17020081 17390142 17736442 18026129 18330037 18723014
13335 18723014 19150570 19505276 19819977 20243876 20811479 21385315 21873430 22357152 22931877
13326 22931877 23556690 24154131 24742860 25371099 26017773 26656947 27324853 28025589 28669475
13317 28669475 29210495 29742429 30341224 30920836 31384460 31805221 32281216 32713840 32947901
13308 32947901 33061897 33266842 33536877 33611253 33404743 33152270 33049679 32991612 32804003 32519987
13298 32519987 32241579 31901441 31379448 30744057 30162697 29640291 29049693 28379710 27751819
13289 27751819 27200542 26628021 25994870 25380563 24814790 24211267 23532592 22880197 22340086
13280 22340086 21853727 21327696 20776116 20263960 19787084 19304725 18835840 18429609 18075112
13271 18075112 17723424 17374900 17067546 16792680 16493060 16143365 15777136 15434877 15130759
13262 15130759 14864313 14620522 14366307 14092003 13845293 13671044 13526706 13325508 13071467
13253 13071467 12872853 12782236 12694819 12480444 12174557 11941571 11850767 11793455 11666705 11537248
13243 11537248 11516353 11533218 11390698 11065636 10794970 10769849 10870231 10846599 10676592 10550539
13233 10550539 10534683 10477168 10305108 10192585 10286840 10436833 10396982 10200249 10099917 10173005
13223 10173005 10219394 10097635 9942920 9940022 10046045 10088997 10035671 9999905 10034727 10068734 10045660
13212 10045660 10002521 9986890 9990363 9993195 10002328 10015336 10005636 9974455 9970684 10027533 10111948 10161923
13200 10161923 10151133 10101854 10054474 10031369 10013403 9960069 9878512 9848677 9925709 10033352 10033751
13189 10033751 9913931 9816946 9850549 9947560 9978252 9929962 9889825 9898074 9915565 9912599 9892935
13178 9892935 9838963 9734259 9647473 9684072 9819152 9885192 9794680 9685783 9748379 9959571
13168 9959571 10103916 10045953 9883213 9806944 9883275 10008819 10042844 9952397 9840291 9836405 9953603
13157 9953603 10070481 10076130 9993886 9919289 9883963 9860312 9866186 9952444 10084165 10151477 10130466
13146 10130466 10121725 10180496 10225064 10190632 10159838 10227524 10328831 10340725 10290280 10308366 10411706
13135 10411706 10493052 10519996 10574340 10669020 10695637 10618627 10570831 10662542 10817363 10901499 10914568
13124 10914568 10940675 10994766 11038526 11087292 11180707 11288805 11358544 11419042 11532341 11670381
13114 11670381 11754327 11796830 11889514 12052324 12202827 12279551 12297184 12279117 12241878 12255099 12401459
13103 12401459 12644120 12835763 12902205 12929313 13024157 13173607 13294915 13359870 13413634 13514392
13093 13514392 13688377 13901754 14060166 14091370 14044397 14049860 14173147 14368501 14573198 14761886
13083 14761886 14906456 14982321 15030681 15121019 15248453 15373273 15543243 15821725 16100966 16193626
13073 16193626 16147186 16228830 16508583 16721173 16702643 16693855 16957359 17324836 17459054 17409552
13063 17409552 17527394 17891460 18206075 18290078 18309695 18449065 18671557 18913214 19212883 19520126
13053 19520126 19658921 19640202 19743238 20104252 20477727 20617210 20653171 20842272 21152445 21385153
13043 21385153 21545293 21781142 22071817 22286137 22477164 22807846 23225634 23520209 23692218
13034 23692218 23952947 24339305 24650721 24834109 25111196 25598319 26091751 26402234 26651885
13025 26651885 27040462 27532610 27998679 28481071 29066997 29634299 30003856 30275608 30736705
13016 30736705 31440415 32125923 32597512 32964403 33425240 33997030 34569033 35093564 35600754
13007 35600754 36103654 36596591 37100974 37626873 38124198 38546435 38934804 39369240 39858347
12998 39858347 40350397 40838269 41366517 41922070 42409089 42785572 43156666 43653764 44260645
12989 44260645 44850890 45380816 45934908 46557659 47154355 47626310 48012938 48408430 48809954
12980 48809954 49157719 49468609 49795264 50075602 50165552 50034591 49803045 49564731 49298940
12971 49298940 48986425 48670060 48339083 47889962 47291926 46671446 46126912 45569892 44879509
12962 44879509 44122046 43461586 42908173 42321374 41651843 41019607 40521075 40089330 39606677
12953 39606677 39067873 38565734 38162114 37825044 37475989 37073047 36652421 36289892 36020075
12944 36020075 35812335 35626114 35445987 35253151 35029948 34823746 34729133 34754371 34783017 34732900
12934 34732900 34670591 34688128 34756992 34810775 34884569 35038177 35214877 35330232 35443311 35671418
12924 35671418 35978831 36234403 36448835 36748502 37120959 37417481 37641038 37986744 38510298
12915 38510298 38992076 39267590 39487792 39880381 40421274 40933256 41374709 41822349 42263749
12906 42263749 42625143 42959038 43399536 43934699 44394204 44679510 44870963 45089912 45365032
12897 45365032 45644967 45850536 45916006 45860634 45803754 45833638 45897323 45900123 45853766 45820693 45781186
12886 45781186 45695031 45636402 45699865 45806400 45786115 45648512 45583223 45671669 45783747 45804278
12876 45804278 45780580 45779190 45768235 45728206 45722135 45756284 45712775 45524825 45286063 45078199 44823709
12865 44823709 44431413 43959390 43496314 43003704 42428711 41854283 41358524 40832635 40149499
12856 40149499 39430097 38897534 38505543 37979878 37246850 36546677 36038909 35557792 34912786
12847 34912786 34212473 33679342 33293500 32856553 32329999 31873002 31556150 31252484 30852537
12838 30852537 30409771 30005015 29615578 29211413 28863195 28639509 28470971 28233457 27928311
12829 27928311 27671430 27515547 27382855 27187241 26941214 26711654 26530082 26382816 26250012
12820 26250012 26123187 26010158 25938428 25920343 25902521 25799723 25611772 25458834 25444230 25509433
12810 25509433 25492147 25328008 25130750 25044954 25065930 25055577 24924100 24741044 24637743 24633984
12800 24633984 24619916 24512548 24360321 24249000 24170432 24071802 23990447 24012418 24095162 24073183
12790 24073183 23891112 23698146 23626708 23604584 23508223 23387449 23369731 23415761 23363919 23192966
12780 23192966 23048126 22997841 22955002 22876151 22846204 22890711 22885507 22764946 22664380 22717086 22831865
12769 22831865 22825043 22687460 22569612 22558808 22612072 22673322 22728441 22765147 22787484 22851410 22992131
12758 22992131 23141364 23203174 23178931 23136798 23109000 23111399 23200639 23394246 23587943 23678534 23718762
12747 23718762 23817827 23948833 24018213 24073789 24243680 24487866 24631548 24666981 24793772 25092822
12737 25092822 25380903 25498506 25544214 25681617 25883660 26038358 26177164 26412255 26727402
12728 26727402 27003950 27210138 27420372 27679846 27972081 28286385 28608384 28883850 29095603
12719 29095603 29328498 29654299 30011733 30316915 30624420 31034556 31498508 31886391 32218542
12710 32218542 32644441 33189020 33707506 34129569 34567976 35112566 35677062 36152515 36584824
12701 36584824 37082548 37640811 38175004 38668932 39180397 39733937 40297518 40842480 41354030
12692 41354030 41804737 42184898 42544017 42942579 43368385 43743624 44007880 44164938 44262554
12683 44262554 44349116 44429585 44448986 44351478 44166206 43984216 43834372 43652177 43404146 43154443
12673 43154443 42940619 42674070 42277945 41861324 41608592 41509517 41355053 41035802 40695651
12664 40695651 40505507 40410510 40235659 39969266 39780791 39760660 39792169 39736233 39627592 39595495
12654 39595495 39662274 39733259 39763402 39822631 39972751 40164951 40306645 40377936 40438923 40559549
12644 40559549 40775816 41072736 41372674 41588114 41734702 41939848 42270741 42606624 42785672
12635 42785672 42852026 43027588 43419104 43880903 44228739 44477804 44771740 45157210 45552743
12626 45552743 45906964 46264859 46671253 47112394 47580452 48108838 48700246 49288684 49827409
12617 49827409 50365896 50982610 51675923 52382359 53083698 53831871 54666698 55568414 56512302
12608 56512302 57523276 58638733 59838644 61048042 62211401 63353886 64571794 65959877
12600 65959877 67528831 69191964 70855315 72516364 74233467 76003567 77749372 79458692
12592 79458692 81238106 83141292 85027410 86721719 88262456 89821828 91404770 92837100
12584 92837100 94095373 95415815 96943357 98475034 99748977 100832596 101983187 103230155
12576 103230155 104375280 105365676 106366175 107427931 108377656 109138233 109897153 110804211 111728220
12567 111728220 112505776 113243961 114147592 115180287 116142879 117005545 117905916 118840942 119611447
12558 119611447 120118449 120512310 120972030 121494934 121993492 122474118 123009643 123601669 124166478
12549 124166478 124641802 125058463 125509189 126055804 126657754 127209103 127663982 128082963 128518927
12540 128518927 128922448 129235390 129520936 129901359 130405584 130981792 131625591 132376782 133205815
12531 133205815 134020075 134777692 135494843 136162971 136765976 137337401 137867980 138212599 138272114
12522 138272114 138231522 138390987 138751295 139010907 139022499 138990983 139116894 139303512 139374225 139342338
12512 139342338 139270762 139082513 138744355 138449670 138355730 138301495 138077697 137833212 137866841 138108123
12502 138108123 138203150 138113100 138213069 138697020 139273856 139643757 139938199 140422042 141021963 141472041
12492 141472041 141768132 142150677 142705894 143289949 143849434 144536581 145429280 146354482 147115119
12483 147115119 147760721 148510293 149473439 150544465 151544504 152397438 153161407 153922901 154686224
12474 154686224 155386117 155999629 156587595 157190432 157737663 158125163 158347693 158483014 158564196
12465 158564196 158541193 158365140 158046283 157626097 157144741 156633694 156090850 155469298 154738258
12456 154738258 153941786 153148693 152370635 151592314 150848387 150180188 149536815 148828031 148078292
12447 148078292 147416437 146894544 146434387 145986858 145614767 145352363 145110551 144821453 144567248
12438 144567248 144441186 144370338 144221136 144012456 143856356 143725169 143464678 143044970 142608591
12429 142608591 142221281 141759383 141135693 140463821 139853747 139178116 138227330 137028583 135824729
12420 135824729 134752581 133709542 132553788 131284310 129978029 128674753 127386082 126124446
12412 126124446 124868696 123580157 122293948 121107188 120032479 118961825 117840740 116781716
12404 116781716 115917055 115218029 114557180 113885221 113245014 112668966 112176431 111825983 111640905
12395 111640905 111504796 111262804 110928477 110666910 110559261 110506527 110396313 110243481 110110437
12386 110110437 109991562 109849032 109691286 109551828 109442803 109371860 109346838 109330533 109260297 109148418
12376 109148418 109089731 109138468 109266655 109475361 109821280 110263297 110621695 110815149 111027368
12367 111027368 111485585 112157501 112840074 113487078 114244520 115170689 116129954 117011968 117875491
12358 117875491 118795026 119713998 120546906 121310271 122054923 122765349 123421226 124071905 124749205
12349 124749205 125377370 125872272 126279607 126724893 127267848 127876364 128488424 129030009 129442423
12340 129442423 129772018 130151941 130604326 130964826 131131146 131270501 131590741 131998148 132231874
12331 132231874 132299782 132486788 132887698 133238527 133345317 133397606 133640739 133965547 134096894
12322 134096894 134031004 133983640 134001735 133955073 133892043 134068060 134550752 135086371 135472553 135813115
12312 135813115 136264784 136766189 137201523 137634867 138160626 138664408 138967025 139116856 139314549
12303 139314549 139601494 139835299 139943791 139999309 140047947 140051501 139998662 139897313 139662144 139199276
12293 139199276 138605318 138075515 137590232 136913398 135953601 134892348 133862132 132737762 131396851
12284 131396851 129971784 128646515 127372037 125995652 124535773 123101532 121648117 120059790
12276 120059790 118410767 116891337 115500515 114062218 112554752 111169960 109986061 108820431
12268 108820431 107519574 106200077 105058803 104089357 103140362 102154808 101196672 100294176 99399717
12259 99399717 98496516 97634416 96839951 96059104 95217128 94308146 93409255 92605253 91896943
12250 91896943 91197175 90431094 89612541 88795628 87997664 87221068 86495368 85815111 85086512
12241 85086512 84240924 83357414 82544869 81740044 80785123 79695565 78662396 77754465 76809265
12232 76809265 75693020 74489759 73328593 72187604 71000452 69818583 68718926 67657087
12224 67657087 66557027 65457942 64433779 63448749 62431458 61419649 60496324 59652824
12216 59652824 58847858 58123917 57518336 56933924 56260492 55564419 54991911 54538188 54083943
12207 54083943 53608847 53182462 52784853 52338325 51895228 51585456 51381542 51125469 50792999
12198 50792999 50511811 50302888 50044481 49733636 49527192 49445465 49296376 49009402 48781534
12189 48781534 48728432 48645918 48341793 47988168 47871746 47947276 47929207 47735198 47551739 47498150
12179 47498150 47494980 47467816 47436785 47376040 47208964 46993631 46911968 47008595 47117442 47117593 47093727
12168 47093727 47159192 47278129 47369226 47451854 47568575 47667794 47691286 47705396 47820383 48021036
12158 48021036 48188070 48269579 48339726 48488721 48722206 48975464 49185728 49350226 49533341 49799280
12148 49799280 50124923 50417515 50640420 50870093 51185046 51544016 51837242 52038238 52243917
12139 52243917 52562859 53008032 53507939 53990448 54439056 54882608 55350880 55851970 56389325
12130 56389325 56975046 57605651 58245265 58865596 59489307 60158775 60876064 61613096 62360799
12121 62360799 63116361 63847537 64545793 65298370 66206464 67221922 68174778 68996973 69804970
12112 69804970 70702909 71626732 72484942 73345878 74338509 75429315 76459509 77386495 78328741
12103 78328741 79352677 80371118 81313673 82262743 83322820 84450412 85526291 86538656
12095 86538656 87579294 88682404 89780634 90835165 91915780 93106628 94387636 95658418
12087 95658418 96856062 98012283 99202688 100466326 101775131 103061024 104260380 105343577
12079 105343577 106330439 107292796 108312399 109389270 110401554 111222844 111895800 112608981 113446895
12070 113446895 114241983 114773803 115062294 115331704 115699199 116053418 116275470 116420560 116589339
12061 116589339 116755931 116856646 116946877 117110602 117279296 117313649 117236317 117210569 117295548 117404542
12051 117404542 117520336 117749408 118101304 118415328 118612459 118834551 119194353 119564673 119802590
12042 119802590 120030414 120452314 120985430 121344959 121478218 121649686 122045597 122523317 122843478
12033 122843478 122962847 122986465 122981007 122958713 122934918 122883197 122709428 122363373 121912197 121437650
12023 121437650 120936523 120379224 119771631 119092818 118276819 117338685 116413216 115572537 114709364
12014 114709364 113710601 112641029 111622249 110627245 109554286 108430052 107364373 106351542
12006 106351542 105298426 104224403 103243605 102345850 101389238 100350360 99399133 98649202 97986512
11997 97986512 97238938 96397011 95575877 94858663 94263549 93775772 93325562 92810927 92221229
11988 92221229 91666741 91218335 90803571 90337691 89858764 89428204 88988879 88456725 87889949
11979 87889949 87419992 87046699 86646123 86168246 85682333 85220533 84723872 84176132 83652073
11970 83652073 83178291 82674579 82104917 81564160 81117830 80664450 80082419 79434540 78885357
11961 78885357 78462483 78046093 77573537 77101584 76658556 76192211 75708221 75311275 75031798
11952 75031798 74743911 74357169 73974093 73731256 73580178 73377626 73125142 72945823 72854311
11943 72854311 72733954 72554186 72431100 72421941 72422773 72350528 72286612 72338931 72472530 72582393 72645319
11932 72645319 72700197 72759279 72839644 73007791 73289726 73600896 73859879 74103202 74396514 74716886
11922 74716886 75029527 75387168 75824924 76253459 76610627 77022249 77620977 78285485 78787877
11913 78787877 79155765 79638846 80324070 81048854 81727157 82480194 83353340 84175042 84843196
11904 84843196 85513237 86321339 87129306 87760006 88322214 89063548 90004542 90942201 91749171
11895 91749171 92468072 93161361 93857378 94609501 95438326 96248074 96951287 97622149 98364618
11886 98364618 99099103 99679095 100164722 100749704 101434987 102019880 102439381 102860861 103376108
11877 103376108 103833509 104093538 104252667 104471412 104738673 104957348 105137217 105346970 105568121
11868 105568121 105747564 105928984 106189946 106491268 106717848 106845171 106956162 107112368 107308648
11859 107308648 107540884 107820262 108119322 108389314 108642221 108945437 109321084 109711922 110068679
11850 110068679 110420579 110825106 111275784 111699029 112044163 112347039 112678662 113045251 113387393
11841 113387393 113686923 114007328 114382584 114734440 114980610 115167456 115386219 115601690 115705636
11832 115705636 115726499 115821562 116030821 116202839 116231304 116210487 116260584 116342589 116373038 116399412
11822 116399412 116506187 116634835 116667574 116641983 116713144 116913943 117109973 117212408 117300938 117492729
11812 117492729 117792586 118121599 118418627 118669801 118895536 119148752 119488047 119922991 120406575
11803 120406575 120888773 121354818 121814506 122281902 122764471 123255071 123744455 124246536 124779480
11794 124779480 125316345 125808546 126273027 126781053 127326822 127798625 128144945 128478268 128919703
11785 128919703 129415666 129820139 130102051 130351076 130616352 130862855 131071016 131268822 131471148
11776 131471148 131674927 131893180 132113114 132265418 132327732 132395140 132534946 132654456 132667014 132701216
11766 132701216 132930836 133251972 133389944 133328898 133354543 133609277 133891287 134022207 134142801
11757 134142801 134447495 134847265 135136444 135337661 135629888 136033964 136412503 136726249 137068356
11748 137068356 137473895 137895837 138348746 138882968 139427972 139854443 140197127 140629619 141203437
11739 141203437 141800800 142373696 143027196 143798942 144549103 145176092 145782405 146505171 147317533
11730 147317533 148132633 148988973 149974089 151039088 152054330 153021551 154083622 155323610
11722 155323610 156682577 158093497 159576107 161153704 162777189 164407222 166112092 168003065
11714 168003065 170094316 172295606 174540119 176852029 179266329 181745871 184234838 186755296
11706 186755296 189369290 192048858 194673181 197184800 199659995 202162621 204613564 206908473
11698 206908473 209104725 211354703 213670838 215906391 217996643 220070501 222248190 224454701
11690 224454701 226544689 228521631 230505231 232537929 234557124 236529085 238467964 240317502
11682 240317502 241959761 243394870 244796304 246312186 247902313 249458857 251004545 252640453
11674 252640453 254329643 255881005 257190624 258391762 259690859 261121146 262542678 263847305
11666 263847305 265064373 266259469 267424337 268519987 269571307 270647348 271762826 272860013
11658 272860013 273892517 274870503 275798947 276625531 277311530 277934391 278637936 279445063 280180617
11649 280180617 280651175 280875887 281055406 281311538 281561174 281694894 281772335 281925596 282127979
11640 282127979 282203173 282062460 281793090 281477208 281061103 280480080 279791621 279071562 278268959
11631 278268959 277299871 276226199 275188167 274179161 273044464 271719948 270318489 268928722
11623 268928722 267477002 265885209 264240897 262669704 261108542 259359084 257351973 255220911
11615 255220911 253100874 250986050 248840596 246731419 244747749 242849537 240900625 238835356
11607 238835356 236711320 234608681 232557734 230563251 228613331 226648697 224608269 222530373
11599 222530373 220518190 218569331 216551329 214419425 212340562 210473443 208715059 206829001
11591 206829001 204772725 202712393 200729151 198716470 196605082 194486815 192430665 190354820
11583 190354820 188190142 186009088 183865886 181662670 179327472 176987725 174789584 172659040
11575 172659040 170434201 168138007 165910292 163747745 161546018 159356463 157351147 155529044
11567 155529044 153694107 151756166 149828672 147980712 146119529 144200882 142346439 140643982
11559 140643982 139008798 137352755 135727980 134190151 132672725 131119081 129605027 128208397
11551 128208397 126873163 125513061 124145492 122837068 121631381 120593876 119777527 119081416
11543 119081416 118340976 117645716 117310509 117355044 117262812 116520557 115214660 113819385 112565876
11534 112565876 111349487 110135324 109064276 108167853 107334765 106607674 106189149 106060595 105877549
11525 105877549 105365609 104593451 103750965 102893005 102042089 101329719 100840673 100433185 99863188
11516 99863188 99012959 97918285 96685328 95472157 94439197 93612781 92870762 92119594 91391917
11507 91391917 90736141 90149748 89682988 89454104 89460014 89500663 89406797 89251758 89245752 89503280
11497 89503280 89986074 90590833 91240109 91971745 92955620 94317760 95993586 97947929 100446435
11488 100446435 103685744 107041785 109168423 109241388 107855338 106326814 105338983 104683605
11480 104683605 104093834 103699468 103644445 103869553 104482349 105806936 107700056 109217175 109443355
11471 109443355 108490266 107275810 106457281 106016748 105810190 105926134 106253997 106146130 104973993
11462 104973993 102900662 100741618 99087178 97874572 96827702 95936750 95318017 94893688
11454 94893688 94507873 94216638 94182884 94363644 94572793 94809446 95244183 95886406 96555347
11445 96555347 97212493 98026258 99045231 100124397 101282599 102804305 104840474 107259275
11437 107259275 110062882 113475183 117221744 120149575 121188717 120545823 119407125 118582582
11429 118582582 118027354 117608759 117574763 118059233 118806902 119762088 121355703 123701376 125939076
11420 125939076 126993668 126793198 126211644 125954644 126058364 126424408 127180881 128251945 129027501
11411 129027501 128865807 127787089 126431493 125427789 124977249 124953289 125180955 125582101 126171255
11402 126171255 126988133 128037021 129290031 130729939 132342494 134067023 135822976 137621088
11394 137621088 139595221 141862629 144366134 146913424 149394593 151916792 154670715 157689486
11386 157689486 160833600 164025851 167349408 170788190 173995405 176552029 178450426 180109385
11378 180109385 181879441 183757293 185654117 187673235 189936774 192354542 194813469 197443296
11370 197443296 200402177 203470285 206165833 208300564 210177316 212178216 214376558 216644838
11362 216644838 218931238 221246081 223476007 225397244 226890691 228055646 229082914 230050985
11354 230050985 230872911 231438580 231767865 231968092 232059259 231946715 231600461 231142513 230674371
11345 230674371 230126771 229393332 228514205 227584122 226557203 225309852 223852088 222311164
11337 222311164 220732592 219059187 217289967 215497238 213690293 211813777 209871866 207904587
11329 207904587 205870324 203730354 201619622 199712594 197916747 195939764 193698712 191414182
11321 191414182 189234874 187040668 184735482 182456046 180295361 178060001 175556382 172943827
11313 172943827 170522687 168274641 165891965 163223690 160435705 157718111 155061178 152378332
11305 152378332 149676483 147023422 144452268 141957467 139522094 137127468 134783519 132532995
11297 132532995 130371011 128208091 125994507 123824864 121809319 119890523 117922604 115899305
11289 115899305 113947721 112096205 110214548 108230197 106256692 104426873 102708447 100976370
11281 100976370 99189540 97402014 95650995 93928606 92244156 90630080 89080539 87550870
11273 87550870 86040489 84623162 83351604 82164737 80954037 79721571 78595929 77650414
11265 77650414 76777462 75826911 74820649 73916387 73172328 72475365 71723639 70950547 70214193
11256 70214193 69486343 68736782 68031331 67446771 66953494 66467925 65963493 65455659 64941703
11247 64941703 64431439 63971076 63560756 63122904 62634075 62202072 61909783 61666201 61334565
11238 61334565 60936486 60592336 60314291 60005373 59634822 59274959 58972459 58699258 58421339
11229 58421339 58118365 57762156 57371555 57043101 56820033 56588166 56226657 55798154 55440740
11220 55440740 55135046 54760767 54341753 54026147 53823302 53565625 53164927 52723826 52350883
11211 52350883 52035150 51748470 51507004 51279903 50991643 50662761 50397200 50192167 49925753
11202 49925753 49574235 49259899 49027632 48769113 48447870 48197623 48085353 47968385 47724744
11193 47724744 47452237 47284347 47165568 46981211 46773860 46643069 46537212 46340805 46097703
11184 46097703 45959430 45950192 45948721 45881266 45787460 45707035 45629089 45553542 45502491 45470127 45430665
11173 45430665 45379226 45316055 45234513 45170627 45196372 45309866 45415157 45472977 45572770 45774614
11163 45774614 45982354 46074171 46069986 46070888 46121359 46227908 46417010 46670549 46902171 47099496
11153 47099496 47374757 47760958 48093872 48246686 48352613 48614676 49005396 49354462 49643557
11144 49643557 49996814 50437595 50875864 51310948 51835370 52432202 52952460 53316461 53598637
11135 53598637 53911202 54321883 54855632 55451560 55965080 56346635 56755438 57347246 58027319
11126 58027319 58594240 59057868 59607022 60308253 61053468 61785182 62560204 63386257 64187663
11117 64187663 64948196 65732859 66576735 67488420 68511954 69633236 70703238 71630035 72553768
11108 72553768 73635157 74784964 75833842 76843309 77973588 79167344 80280844 81416707
11100 81416707 82773208 84257129 85627836 86944277 88453853 90104034 91618761 93017880
11092 93017880 94571780 96259169 97802772 99263176 101026856 103134169 105203370 107119599
11084 107119599 109189559 111497861 113775946 116067508 118803840 122008944 125202434 128344370
11076 128344370 132020230 136378010 140871290 145485136 151064670 157787326 164619802 171259389
11068 171259389 179205968 189548283 201277065 213970084 230664580 254368583 281326142
11061 281326142 301326650 306934279 300685951 291422005 285156968 281732635 279055876 277172328
11053 277172328 277270773 279086090 281500784 285331660 293620852 307907389 324579876 336451812
11045 336451812 339066286 334911888 330311631 328756112 329101334 329954170 332568956 337496626
11037 337496626 340800003 337001218 325475076 311232367 299110791 289549765 280670844
11030 280670844 272002613 264437545 258034520 251853653 245511856 239466202 233907440 228439667
11022 228439667 222815055 217174894 211573811 205891148 200185697 194641723 189241199 183913852
11014 183913852 178864841 174315754 170071361 165786198 161521400 157593342 154002720 150487010
11006 150487010 147056733 143996647 141340134 138785642 136182555 133715582 131538409 129561521
10998 129561521 127686237 125958826 124402459 122933263 121516152 120206270 118996372 117813975
10990 117813975 116693229 115756928 114999391 114264573 113469618 112698807 112059851 111576711 111214180
10981 111214180 110886651 110480384 109990871 109574031 109330463 109137162 108854491 108580674 108490509
10972 108490509 108527118 108494894 108374819 108293605 108252902 108161068 108073184 108106301 108158951 108030988
10962 108030988 107807020 107785639 108005628 108184862 108187036 108200488 108354063 108502649 108544989 108630345
10952 108630345 108857875 109061573 109113675 109184960 109459863 109809122 110004750 110092279 110291318 110646344
10942 110646344 111012860 111305570 111560957 111828087 112158790 112613381 113130451 113511034 113686097
10933 113686097 113860172 114216342 114635752 114921596 115140699 115469799 115822512 115946152 115844842
10924 115844842 115794770 115922944 116052315 116015481 115865705 115695075 115468832 115151028 114819381
10915 114819381 114542295 114267431 113916321 113484173 112994898 112470086 111976463 111572335 111171432
10906 111171432 110609769 109900624 109265372 108833826 108469006 107992717 107440082 106954000 106541016
10897 106541016 106091491 105579564 105093210 104689394 104344038 104039790 103794187 103583507 103321834
10888 103321834 102951658 102515626 102114199 101805417 101553201 101273864 100935414 100589704 100281255
10879 100281255 99961832 99560603 99110034 98700089 98306891 97792707 97124409 96471639 95993369
10870 95993369 95611714 95113116 94431126 93713013 93108529 92591219 92021385 91325876 90569649
10861 90569649 89862543 89226269 88576853 87843637 87070717 86357201 85719443 85078632 84381200
10852 84381200 83656601 82945484 82252444 81595684 81018411 80506066 79968335 79358660 78748641
10843 78748641 78230229 77800747 77392187 76955836 76476857 75975519 75536288 75248188 75060414
10834 75060414 74796508 74386666 73977871 73714835 73528795 73284003 73026485 72896414 72854345
10825 72854345 72709697 72420617 72163127 72063238 72041442 71986856 71921977 71905222 71904787 71870701 71828197
10814 71828197 71805251 71760190 71676354 71643235 71736470 71880148 71935380 71886283 71844985 71902992 72060319
10803 72060319 72271869 72480094 72622184 72687384 72762291 72950577 73245956 73536680 73733336 73849622
10793 73849622 73965546 74149688 74406541 74670347 74874076 75051322 75323250 75735039 76158092
10784 76158092 76437453 76605908 76850965 77264574 77725062 78070290 78312314 78609022 79055523
10775 79055523 79579555 80056668 80470518 80907588 81415188 81938069 82421211 82904411 83448190
10766 83448190 84021028 84559624 85108419 85770629 86519329 87202413 87774495 88374327 89098573
10757 89098573 89850659 90528110 91216658 92040364 92932910 93744678 94499123 95343481 96293474
10748 96293474 97234093 98149923 99139159 100199036 101224191 102247908 103447864 104842059
10740 104842059 106212822 107441633 108696656 110144160 111684015 113156156 114626684 116249475
10732 116249475 117986718 119705231 121445788 123348282 125379147 127388365 129400561 131587011
10724 131587011 133947831 136288736 138559895 140958096 143595009 146295496 148860699 151336487
10716 151336487 153858299 156381314 158740756 160875946 162826566 164577030 166058167 167258875
10708 167258875 168207572 168883844 169261179 169384360 169282951 168863467 168032565 166893132 165657760
10699 165657760 164366096 162844067 160977465 158884800 156755464 154629936 152424082 150098753
10691 150098753 147724132 145407810 143208090 141098395 139003333 136904130 134899628 133096626
10683 133096626 131448222 129803074 128133004 126587305 125261712 124040480 122773734 121502888
10675 121502888 120362780 119334186 118275582 117183200 116229149 115496718 114842634 114102533
10667 114102533 113295424 112524007 111796158 111076920 110419037 109879947 109366616 108738293 108045876
10658 108045876 107487168 107100792 106688095 106112292 105507785 105071453 104776717 104446824 104026661
10649 104026661 103616943 103279322 102970559 102669045 102417254 102207736 101953179 101620982 101301088
10640 101301088 101087433 100967300 100872125 100766848 100644909 100501946 100363287 100280610 100254418 100209035
10630 100209035 100087265 99927672 99815012 99795493 99861279 99967305 100049355 100088756 100165951 100364898
10620 100364898 100620324 100784357 100873037 101086421 101504931 101940492 102231707 102522150 103031822
10611 103031822 103669930 104144441 104419870 104786186 105435224 106232322 107003332 107806554 108768177
10602 108768177 109846543 110949417 112136833 113501550 114958864 116380975 117874025 119684495
10594 119684495 121853632 124214697 126761681 129761760 133409871 137627576 142358260 147773583
10586 147773583 153850960 159904557 164994636 168916284 172487148 176750544 182193769 188862053
10578 188862053 196766686 205745853 215277148 225121914 236083730 249276511 264203011
10571 264203011 278102332 287828553 292290674 292854240 291847518 291197758 291907768 293579406
10563 293579406 294190432 291407230 284905720 276931703 269919536 263875629 256722700 246932963
10555 246932963 235054546 222726716 211074559 200393809 190714595 182024938 174141962
10548 174141962 166847465 160152211 154175137 148821354 143824036 139083835 134750751 130945172
10540 130945172 127564145 124416629 121440517 118721523 116341621 114248182 112273979 110292438
10532 110292438 108340967 106549075 104956401 103479559 102067743 100789581 99717245 98812951
10524 98812951 97998362 97269065 96667967 96186551 95741664 95211460 94475558 93494901 92386146
10515 92386146 91333602 90385993 89429551 88398065 87380675 86441755 85467070 84320184 83058072
10506 83058072 81849224 80739786 79636264 78473984 77275856 76083418 74947485 73943601
10498 73943601 73080058 72242988 71356403 70530091 69899437 69388303 68817957 68200209 67703709
10489 67703709 67349846 66986458 66584417 66299130 66162478 65972478 65621120 65299444 65202953
10480 65202953 65231246 65183618 65090095 65118217 65265897 65385494 65448583 65564955 65772960 66010747
10470 66010747 66270417 66590787 66916760 67153097 67343118 67607638 67924755 68173804 68385204
10461 68385204 68712968 69142635 69479540 69679681 69925032 70275265 70526291 70575822 70660381 70998650
10451 70998650 71424246 71651432 71731838 71932141 72275738 72552912 72740565 73049088 73509778
10442 73509778 73859354 73959935 74045517 74375509 74869986 75290151 75610682 75994945 76506408
10433 76506408 77054059 77574818 78091748 78609542 79101589 79603503 80199631 80901124 81625807
10424 81625807 82316604 83019615 83831727 84805330 85908791 87074054 88295804 89654585 91181142
10415 91181142 92737365 94148370 95427758 96707015 97949351 98976171 99852563 100967734
10407 100967734 102539154 104267962 105742894 107002821 108396896 110025322 111674575 113251994
10399 113251994 114916290 116745540 118611036 120466695 122480367 124781324 127325648 130093162
10391 130093162 133165953 136528727 140050917 143753398 147816743 152236350 156794570 161513555
10383 161513555 166787595 172872969 179613279 186936813 195259068 205040106 216266871 228734779
10375 228734779 242392506 256727212 270023773 280075870 285913222 288486914 289670962
10368 289670962 291012671 293244762 296059571 297964845 297125025 293103918 287523297 282429841
10360 282429841 278145740 273190005 266173347 257240897 247669530 238629396 230605210 223642002
10352 223642002 217700215 212733907 208635977 205255331 202510490 200479138 199330502 199147703
10344 199147703 199861844 201385780 203769680 207215357 211962681 218048821 224958572 231500669
10336 231500669 236305225 238668103 238917783 238020295 237003404 236630776 237086405 237659488 237088163
10327 237088163 234683337 231069654 227553485 224834727 222518350 219666725 215500101 209746427
10319 209746427 202797463 195598848 189080774 183606475 179076458 175348980 172203872 169097224
10311 169097224 165538610 161774363 158587575 156266972 154221414 151800334 149049340 146391569
10303 146391569 143982551 141750451 139764215 138154067 136843956 135699381 134790586 134209985
10295 134209985 133787240 133303421 132860874 132722401 132882382 133112019 133351676 133735121 134264578
10286 134264578 134781111 135265115 135882065 136701543 137617430 138569957 139616335 140763422 141956267
10277 141956267 143249226 144761718 146443312 148109831 149736014 151476774 153365059 155238166
10269 155238166 157024417 158854902 160803243 162748810 164597949 166407091 168162701 169668831
10261 169668831 170814152 171750444 172626222 173316806 173616328 173557284 173328418 172968745 172343815
10252 172343815 171372276 170103528 168603932 166909054 165061563 163080022 160922960 158578855
10244 158578855 156138873 153688357 151197642 148622787 146030338 143497905 140975113 138393583
10236 138393583 135845514 133479587 131258682 129003436 126670670 124408021 122304370 120258989
10228 120258989 118171488 116126689 114289234 112688272 111193569 109671303 108104347 106571198
10220 106571198 105139852 103788814 102440021 101068480 99735804 98492060 97306388 96143475
10212 96143475 95032823 93977113 92866226 91610332 90314617 89171321 88184729 87158870
10204 87158870 85985025 84784957 83700623 82681812 81592124 80427555 79300996 78257587
10196 78257587 77227009 76151102 75058827 73997574 72966110 71947813 70957287 70010967
10188 70010967 69079125 68113561 67120066 66160495 65266130 64389688 63484093 62595954 61810666
10179 61810666 61111705 60381580 59569220 58770796 58091621 57505341 56921952 56327012 55762089
10170 55762089 55216997 54641511 54037288 53451071 52903189 52400558 51974613 51610710 51194372
10161 51194372 50653220 50108634 49737431 49507934 49218170 48788454 48333654 47932084 47530035
10152 47530035 47130606 46859666 46734630 46565262 46229951 45876558 45676490 45534816 45253599
10143 45253599 44867037 44583447 44461415 44370533 44237969 44110499 43983291 43792930 43597669
10134 43597669 43540106 43586466 43529875 43332376 43234836 43392172 43603990 43595609 43412460 43315552
10124 43315552 43382261 43448576 43417020 43387756 43446328 43523801 43556550 43626738 43819857 44047926 44155980
10113 44155980 44155515 44213627 44410336 44632057 44750492 44805623 44922355 45100678 45203448 45162448
10103 45162448 45094492 45150614 45312481 45423315 45398747 45318575 45296201 45337063 45371047 45366945 45348333
10092 45348333 45320765 45253775 45146266 45056246 45032303 45044250 45022909 44960086 44921422 44944501 44975220
10081 44975220 44955582 44938350 45031989 45235332 45424319 45532348 45638371 45812477 45987719 46099746
10071 46099746 46251650 46567835 46944366 47159927 47236463 47454022 47934774 48443069 48741860
10062 48741860 48946707 49321346 49870303 50381256 50793301 51265941 51890560 52561847 53162632
10053 53162632 53680317 54112267 54450080 54791547 55262984 55782525 56126646 56308349 56635193
10044 56635193 57255589 57909024 58337969 58704361 59301343 60037609 60577110 60904828 61359360
10035 61359360 62085274 62832032 63402693 63960405 64709505 65554299 66302337 66995861 67801266
10026 67801266 68724647 69674484 70686600 71844456 73057491 74158521 75177469 76295198
10018 76295198 77553748 78834619 80116235 81523991 83093219 84691706 86231727 87773418
10010 87773418 89359248 90924354 92439111 93968991 95520300 97005293 98451490 100058582
10002 100058582 101918089 103847644 105662411 107460828 109455395 111643261 113858976 116078377
9994 116078377 118450911 121059738 123853727 126818460 130028641 133507476 137198169 141108946
9986 141108946 145344225 149967053 154978635 160466195 166609820 173475405 180942778 188923097
9978 188923097 197527146 206932145 217201844 228362540 240596917 254264356 269753250
9971 269753250 287344102 307164982 329295291 353995344 381620281 411686618 441624488
9964 441624488 466930624 483581645 490902406 491943238 490868132 490183240 490537505 492384048
9956 492384048 496589392 502963683 508915030 510579018 505718627 495445194 483030822 471039021
9948 471039021 459389186 445821023 428099254 406012357 381546647 357271938 334611126
9941 334611126 313605763 293979928 275915027 259716735 245236659 232042419 219957519
9934 219957519 209050635 199201264 190082178 181583577 173885801 167024768 160713493 154732408
9926 154732408 149197883 144247380 139710594 135340491 131185729 127457205 124127840 120930784
9918 120930784 117718542 114594187 111687635 109000863 106498734 104182188 102020958 99938403
9910 99938403 97914010 96017219 94306812 92754672 91278522 89808846 88344694 86981271
9902 86981271 85826127 84833910 83806458 82640290 81481679 80523863 79746633 79002003 78266087
9893 78266087 77620326 77046819 76452387 75867681 75408369 75046271 74644350 74234467 74015647
9884 74015647 74014672 73990376 73784266 73549522 73493213 73582092 73666902 73737978 73877304 74078630 74293586
9873 74293586 74563559 74937445 75335472 75658447 75969732 76409069 76974369 77545334 78091123
9864 78091123 78705542 79450670 80296082 81206068 82178531 83210343 84315175 85546055 86919173
9855 86919173 88375365 89910374 91650962 93664304 95788842 97847381 99962918 102431880
9847 102431880 105301475 108327486 111396089 114727410 118531230 122671824 126860121 131043290
9839 131043290 135400543 140009204 144704153 149287886 153745252 158182680 162603119 166793013
9831 166793013 170444157 173387636 175695256 177539580 178989457 179987437 180487825 180529286 180174696
9822 180174696 179462631 178427591 177089032 175400883 173276516 170679465 167646376 164248105
9814 164248105 160602820 156886137 153212213 149527529 145749681 141980170 138405159 134990922
9806 134990922 131499493 127867870 124346398 121136755 118096584 114982299 111828785 108882101
9798 108882101 106258877 103877794 101660388 99594216 97625997 95682182 93798810 92076816
9790 92076816 90507792 88983936 87474439 86047815 84718093 83414312 82118528 80897540
9782 80897540 79773424 78687640 77617240 76604278 75643256 74660432 73638263 72646197 71714470
9773 71714470 70790476 69855335 68966630 68139907 67300957 66411115 65537447 64741591 63990810
9764 63990810 63226821 62427442 61558728 60578956 59547598 58614781 57827617 57051772 56161288
9755 56161288 55199471 54269316 53379766 52504982 51686162 50949328 50215692 49426405 48669458
9746 48669458 48037524 47442886 46745163 45998601 45373856 44863660 44284164 43589260 42965511
9737 42965511 42539491 42184975 41738967 41248866 40851754 40523083 40124104 39647025 39239384
9728 39239384 38979788 38772213 38499118 38166406 37842414 37544216 37258644 37012104 36828185
9719 36828185 36644977 36372728 36042430 35802268 35718328 35654645 35429552 35043329 34655862 34363002
9709 34363002 34109353 33831438 33557741 33305500 32992715 32559445 32104149 31777741 31574205
9700 31574205 31340858 30987018 30574878 30196154 29860928 29534510 29194884 28817215 28379541
9691 28379541 27928286 27569613 27338658 27124517 26783268 26301904 25807520 25430986 25193032
9682 25193032 25006900 24758951 24390277 23925878 23441789 23012236 22679757 22439442 22229735
9673 22229735 21972244 21655785 21352086 21115059 20908517 20680405 20450047 20247555 20027915
9664 20027915 19750275 19489390 19333977 19213718 18994250 18729044 18612326 18645417 18572835 18253843
9654 18253843 17891259 17733375 17722547 17636568 17441534 17272780 17152451 16977037 16758705 16635625
9644 16635625 16619788 16553486 16366056 16173621 16056824 15936575 15769915 15680490 15745238 15799510
9634 15799510 15637226 15315660 15074703 14995278 14926522 14766121 14633737 14674806 14806919 14796101
9624 14796101 14564925 14306880 14243401 14342165 14375707 14240021 14083001 14059253 14085391 13976228
9614 13976228 13746630 13594668 13594179 13594228 13471820 13308069 13222578 13185876 13117380 13044400 13023515
9603 13023515 12999434 12888718 12732203 12619362 12523555 12366304 12195019 12127053 12141928 12104236
9593 12104236 11992926 11931340 11963808 11975259 11883923 11752305 11639339 11500331 11325070 11225234
9583 11225234 11261645 11308498 11228924 11086477 11030841 11051511 11014231 10897492 10813720 10798167 10750452
9572 10750452 10624247 10520895 10521472 10547236 10479428 10332090 10209119 10146428 10093392 10020972 9956400
9561 9956400 9912921 9861245 9788228 9730942 9727144 9760381 9773472 9725166 9629945 9550940 9544874 9598897
9549 9598897 9635742 9603160 9541222 9529815 9586151 9656367 9694662 9693576 9640411 9520518 9387137
9538 9387137 9347829 9429182 9524185 9542456 9545173 9634119 9763674 9798158 9738174 9736541 9859848
9527 9859848 9983787 9994055 9954389 9972407 10015452 9992083 9930738 9929103 9978827 9989769 9957443
9516 9957443 9956517 9980693 9940401 9827304 9736244 9704721 9670175 9607342 9560677 9514395 9396117
9505 9396117 9253753 9242134 9353846 9359940 9145340 8914573 8890350 8974551 8927136 8752226 8651037
9494 8651037 8667189 8651701 8562402 8526845 8571728 8544665 8387813 8264670 8299982 8383769 8365972
9483 8365972 8284158 8252356 8258934 8232959 8207335 8253818 8329226 8343566 8331268 8402362 8549264
9472 8549264 8644806 8630250 8583804 8594754 8672209 8787080 8912881 9015357 9082220 9166419 9320060
9461 9320060 9486329 9547138 9489564 9433538 9466570 9536361 9552384 9522435 9524471 9582261 9632486
9450 9632486 9610947 9530752 9460535 9436840 9418960 9352274 9265683 9252896 9334585 9401676 9356499
9439 9356499 9266043 9292405 9484936 9718954 9840999 9804269 9655796 9466099 9300135 9201417
9429 9201417 9165964 9150005 9108165 9007236 8831932 8625129 8488085 8462547 8432756 8241578
9419 8241578 7904959 7606578 7459760 7385585 7270644 7131223 7040228 6983984 6898773 6795267
9409 6795267 6739464 6734330 6715448 6656677 6596154 6553012 6494074 6403126 6324885 6310971 6355034 6400801
9397 6400801 6394269 6322848 6226233 6172640 6200974 6277855 6325800 6300058 6232459 6201145 6259954 6391323
9385 6391323 6527874 6626326 6707662 6804636 6890261 6904299 6845183 6780455 6758107 6763776 6777549
9374 6777549 6805755 6829826 6796111 6703413 6636482 6653736 6694772 6661892 6547921 6419920 6318446
9363 6318446 6238068 6167810 6085313 5952952 5789045 5695272 5730966 5805076 5786964 5685927 5618570
9352 5618570 5632991 5679324 5725996 5776392 5786068 5704368 5599714 5597951 5683309 5713706 5654101 5619118
9340 5619118 5641127 5598733 5467163 5427825 5574225 5700103 5591496 5380905 5357758 5521249
9330 5521249 5602899 5502623 5408257 5438600 5449033 5310190 5146592 5131355 5213773 5232445 5180096
9319 5180096 5171323 5220293 5226656 5150335 5050953 4970458 4906406 4885587 4934638 4984253 4933413 4815756
9307 4815756 4771069 4830310 4865257 4798536 4727765 4756737 4819140 4790134 4699853 4698632 4827211
9296 4827211 4944091 4910508 4765517 4670055 4715410 4828494 4864793 4778605 4682476 4715440 4863090
9285 4863090 4962120 4902378 4762851 4697521 4737801 4781443 4749839 4675602 4633794 4651816 4697571
9274 4697571 4710813 4647278 4533389 4460224 4470994 4483968 4404109 4283080 4259273 4343557 4394106
9263 4394106 4333946 4260049 4273712 4331200 4356131 4382030 4457229 4503445 4422748 4287938 4266581
9252 4266581 4381461 4501019 4555388 4596464 4631918 4580032 4448443 4389807 4480469 4583095 4551114
9241 4551114 4452879 4444864 4509927 4500633 4409396 4404844 4560918 4710619 4663766 4468305 4341947
9230 4341947 4391686 4512837 4563890 4537765 4512531 4505200 4461141 4372652 4319408 4357213 4427916
9219 4427916 4433177 4360320 4278951 4240662 4243615 4274092 4309390 4289328 4168383 4007035 3931503
9208 3931503 3977837 4046672 4040338 3975153 3923909 3914653 3927725 3934676 3903421 3823116 3753090 3775198
9196 3775198 3863188 3884826 3783669 3667670 3650109 3694435 3702226 3665668 3626663 3565721 3461219
9185 3461219 3399971 3484237 3654796 3742758 3689493 3591349 3531730 3498905 3483458 3530026 3649600
9174 3649600 3771941 3822790 3786481 3687379 3579668 3544987 3614817 3706118 3721726 3688474 3687210
9163 3687210 3681498 3567380 3387131 3322156 3437529 3590037 3639562 3601871 3535693 3437477 3332417
9152 3332417 3321510 3429484 3523731 3488560 3379058 3313136 3316687 3360230 3432567 3487498 3441752
9141 3441752 3324492 3295241 3403362 3478694 3396782 3293102 3336572 3440784 3420068 3310701
9131 3310701 3286363 3339089 3316012 3232239 3265110 3426207 3508959 3416898 3302418 3301462 3346887
9120 3346887 3339128 3310332 3315557 3325581 3324599 3363836 3432144 3426894 3339354 3308518 3395106 3468506
9108 3468506 3431006 3383360 3425029 3453349 3341371 3184152 3164256 3258701 3286639 3203879 3150331
9097 3150331 3205319 3270369 3233875 3128760 3078072 3151387 3298413 3391090 3344397 3215627 3134459
9086 3134459 3120057 3067256 2952303 2906782 2990967 3049572 2951416 2836446 2912550 3099698 3124135
9075 3124135 2934581 2770388 2789136 2865932 2840890 2759819 2750462 2809138 2834348 2777730 2669544
9064 2669544 2569803 2552493 2651182 2772613 2765610 2627144 2528967 2578985 2675586 2679333 2611629
9053 2611629 2578261 2596151 2615793 2638818 2688799 2718024 2661995 2553763 2481415 2460298 2439373
9042 2439373 2402239 2368584 2326675 2262911 2233341 2301766 2419039 2466648 2419217 2366486 2371265
9031 2371265 2405003 2434821 2469018 2488092 2435665 2327633 2273749 2320590 2357311 2271303 2136007
9020 2136007 2126365 2267375 2388215 2350405 2214758 2124962 2115587 2127284 2150996 2231586 2336364
9009 2336364 2349586 2240113 2126315 2107988 2131075 2108367 2079823 2122923 2175305 2116145 1997259
8998 1997259 2002207 2149557 2231990 2131666 2014459 2074342 2227766 2237442 2054959 1861797 1807895
8987 1807895 1871612 1965033 2027271 2007689 1895342 1787360 1808673 1940983 2040830 2041986 2018855
8976 2018855 2027002 2017816 1962564 1927847 1950586 1956334 1894284 1845451 1885999 1939424 1899780 1827868
8964 1827868 1864117 1980710 1994824 1847551 1708042 1734523 1861576 1919472 1869554 1806586 1784373
8953 1784373 1766238 1740667 1768737 1879422 1999463 2039234 1996486 1926415 1853561 1774116 1717534
8942 1717534 1733732 1815855 1892444 1909873 1880822 1844534 1826005 1843514 1901319 1954673 1939899
8931 1939899 1869881 1838952 1888788 1933130 1882017 1784961 1761746 1825612 1876039 1856897 1818533
8920 1818533 1809616 1806462 1786117 1783962 1824903 1861599 1840542 1785931 1762684 1785843 1816079 1827017
8908 1827017 1835929 1873178 1942150 2002281 1991756 1894112 1780820 1744902 1786794 1816740 1780835
8897 1780835 1723791 1704271 1713605 1715975 1708409 1695174 1659292 1610640 1608107 1676073 1748864 1759425
8885 1759425 1733968 1732774 1749808 1750163 1755262 1793427 1808770 1736431 1644453 1666953 1789833 1841506
8873 1841506 1736480 1596985 1563081 1601478 1605820 1591498 1653027 1772660 1818493 1745150 1671332
8862 1671332 1707065 1797818 1815375 1744381 1689940 1721516 1797314 1852883 1881005 1884890 1829841 1718160
8850 1718160 1659213 1757530 1941994 2020580 1928899 1811071 1802337 1850709 1849575 1837811 1919432
8839 1919432 2048125 2066857 1954270 1862064 1877479 1909790 1874185 1835443 1870041 1913080 1867018
8828 1867018 1768554 1717153 1712292 1699865 1717758 1832734 1962706 1941803 1782345 1700309 1815635
8817 1815635 1975736 1975644 1835888 1736152 1750630 1789531 1772755 1725548 1688459 1646564 1591448 1569676
8805 1569676 1613429 1680158 1718936 1753530 1832297 1920520 1922742 1821251 1717402 1695386 1705492
8794 1705492 1651815 1560808 1565360 1704321 1829949 1781579 1597673 1471841 1516556 1653467 1744586
8783 1744586 1750909 1725698 1715145 1720827 1726083 1711673 1667017 1620844 1631467 1707754 1773966 1763633
8771 1763633 1715005 1708811 1741740 1748183 1731221 1760435 1822148 1797362 1655742 1558270 1650658 1827346
8759 1827346 1845451 1655882 1478629 1518050 1722103 1885634 1903124 1836802 1784526 1766024 1738991
8748 1738991 1679232 1628249 1657811 1772955 1872275 1857905 1772738 1748908 1815248 1857933 1805824
8737 1805824 1740655 1752923 1798747 1802866 1805221 1871505 1937279 1903016 1833097 1875134 1995970 2000329
8725 2000329 1845272 1731427 1793849 1887882 1820487 1649937 1583805 1668515 1761641 1778365 1792869
8714 1792869 1873097 1950078 1913606 1769295 1646069 1662062 1797188 1904016 1871976 1774644 1785234
8703 1785234 1930219 2028200 1934265 1742880 1648161 1687043 1746632 1766255 1789821 1842554 1889802
8692 1889802 1915085 1926592 1895110 1795413 1695734 1690952 1760477 1810033 1831112 1881566 1931784 1897429
8680 1897429 1821312 1836861 1930633 1940351 1834018 1777216 1842994 1876516 1772619 1674353 1727736
8669 1727736 1830884 1829765 1798381 1888170 2024048 2008035 1850733 1747796 1767974 1805214 1816543
8658 1816543 1865493 1929511 1900719 1798158 1756574 1785429 1769204 1725272 1797696 1947018 1940917
8647 1940917 1756972 1690035 1888082 2073152 1965755 1734915 1722565 1908520 1993921 1906061
8637 1906061 1860585 1951001 2022490 1993242 1985260 2044744 2016634 1836715 1707236 1800618 1970571
8626 1970571 1960861 1783869 1687811 1800637 1985706 2048544 1950594 1795966 1701532 1712930 1794224
8615 1794224 1868920 1882996 1833528 1749481 1679456 1690773 1817870 1993931 2093404 2068444 1990292
8604 1990292 1936505 1902191 1852343 1797420 1777120 1815501 1910925 2016276 2031648 1907175 1760827
8593 1760827 1774782 1940713 2041435 1947988 1794635 1765148 1845236 1915814 1963282 2031648 2063894
8582 2063894 1977536 1839645 1787546 1817481 1825875 1815873 1867842 1935387 1892075 1784185 1802120
8571 1802120 1956825 2022011 1886725 1739753 1771666 1893557 1921195 1877465 1914810 2041570
8561 2041570 2119278 2079029 1979695 1885511 1818188 1798697 1823906 1836768 1812263 1815250 1879138 1910360
8549 1910360 1835439 1756558 1805691 1911757 1891907 1739923 1639734 1693326 1807176 1869262 1882393
8538 1882393 1887200 1889323 1901935 1945058 1975322 1923926 1817329 1750223 1739773 1729783 1726764 1780433
8526 1780433 1837210 1795780 1721114 1792823 1991272 2062612 1896712 1718727 1755895 1911898 1961125
8515 1961125 1901126 1887644 1934288 1918364 1831484 1796355 1840087 1847604 1761939 1667525 1641870 1660382
8503 1660382 1685070 1733109 1813485 1879120 1880341 1818434 1740204 1715123 1788116 1908260 1953978
8492 1953978 1886962 1813258 1818969 1835607 1775916 1709192 1753044 1861339 1889004 1825504 1792028
8481 1792028 1829594 1859020 1840140 1808419 1766461 1704309 1706326 1851417 2022406 2023324 1885359
8470 1885359 1827817 1901340 1929475 1853149 1845881 1977649 2048107 1921239 1771678 1796427 1907062
8459 1907062 1932638 1920651 1980790 2013822 1888917 1749464 1825388 2031174 2073717 1915690 1809365
8448 1809365 1872168 1946909 1925432 1905792 1944059 1931750 1837494 1817282 1941992 2039807 1971870
8437 1971870 1868540 1911468 2044631 2095250 2054436 2039353 2065231 2047022 1976251 1927677 1921551
8426 1921551 1920322 1929184 1970452 1996906 1962027 1935533 2007036 2111198 2109905 2029197 2030223 2126256
8414 2126256 2127905 1949246 1785602 1844975 2034693 2095325 1976724 1881341 1932333 1999000 1937574
8403 1937574 1842592 1898195 2063536 2101606 1929522 1755360 1781032 1917287 1939525 1833839
8393 1833839 1800080 1925012 2044233 1996317 1863946 1843732 1963750 2062969 2024579 1913592
8383 1913592 1864430 1912880 1980542 1986163 1931487 1881367 1883153 1922209 1954888 1961117 1947788 1926169
8371 1926169 1917754 1955393 2030123 2062017 1992552 1892177 1890150 1991736 2060832 2014215 1937340
8360 1937340 1951381 2048564 2133684 2165075 2170383 2164776 2139697 2114776 2125045 2155977 2149279 2085187
8348 2085187 2022899 2040624 2139131 2213671 2152383 1986864 1896599 1997158 2172429 2225903 2159375
8337 2159375 2142365 2212655 2217900 2114908 2095471 2270500 2438554 2381219 2223794 2240068 2409272
8326 2409272 2468397 2364940 2336631 2493255 2620373 2526912 2345352 2313975 2435347 2534569
8316 2534569 2539173 2521516 2528857 2531288 2516350 2514255 2530801 2535151 2512888 2484914 2484598 2532632 2601688
8303 2601688 2611944 2530504 2465257 2550889 2734061 2810798 2713677 2603704 2607961 2639171 2590702
8292 2590702 2538999 2586926 2653943 2624728 2586856 2684473 2822480 2790931 2648932 2676969 2903287
8281 2903287 2993182 2752448 2466413 2510133 2814541 2993009 2894115 2739422 2725430 2770241
8271 2770241 2739856 2695359 2755188 2857891 2850473 2748498 2724902 2840503 2948773 2916122 2801424
8260 2801424 2736000 2735029 2738118 2756459 2842105 2948202 2964760 2897780 2879159 2970678 3081640 3122690
8248 3122690 3119227 3113733 3077912 3003579 2967301 3006170 3034497 2994877 2984051 3088727 3195788
8237 3195788 3141754 2981466 2911605 2966245 3000779 2969401 2985434 3066466 3058908 2914400 2822325
8226 2822325 2920969 3062245 3044590 2929570 2913502 2988984 2975088 2845223 2783583 2886764 3019826
8215 3019826 3042456 3004413 3013157 3046614 3029457 3002669 3067262 3191748 3215418 3065287 2866789
8204 2866789 2791153 2863008 2979516 3071067 3157009 3246065 3273615 3191745 3065773 3004819 3017951
8193 3017951 3019234 2973775 2949380 2997384 3071058 3115114 3155868 3226819 3272111 3222255 3122824 3081174
8181 3081174 3107488 3118058 3087089 3075697 3098747 3090636 3043029 3048798 3137668 3185950 3092314 2948317
8169 2948317 2911632 2981393 3035284 3035322 3039726 3038966 2961534 2858389 2889782 3059669 3146917 3021588
8157 3021588 2868313 2924233 3117548 3181202 3061799 2975505 3048775 3138887 3091544 2978372 2951811
8146 2951811 3012961 3067374 3100450 3145598 3160453 3095637 3034855 3100856 3242588 3282532 3188673
8135 3188673 3136628 3246921 3400868 3409080 3267217 3141572 3151603 3260478 3364197 3411345
8125 3411345 3420310 3424084 3429348 3426582 3419494 3419790 3416114 3388606 3364941 3402587 3482868 3498835 3416289
8112 3416289 3367864 3478002 3655882 3704482 3604902 3531214 3579241 3650621 3648307 3623769 3653807
8101 3653807 3711756 3751679 3799271 3866078 3887839 3845629 3834693 3905147 3949156 3873347 3772822
8090 3772822 3782468 3851661 3843327 3786545 3833230 3992414 4104042 4085625 4025197 4000435 3976831
8079 3976831 3939983 3971878 4109681 4248321 4278729 4241010 4252933 4340301 4414635 4395987 4311143
8068 4311143 4275341 4377487 4563673 4666632 4602929 4496362 4518766 4651631 4729824 4698081
8058 4698081 4667966 4705327 4731274 4697738 4702909 4825472 4967153 4986481 4905750 4862605 4916163
8047 4916163 5019011 5136551 5270883 5381993 5400043 5332721 5278152 5307935 5393487 5466279 5506453
8036 5506453 5549618 5629346 5731093 5803733 5819594 5814890 5848793 5928875 6011026 6069218 6120073
8025 6120073 6175230 6220325 6252169 6288049 6327659 6355392 6386792 6455731 6548293 6612633 6643149
8014 6643149 6685736 6750718 6800496 6838372 6919278 7043108 7127639 7129101 7110548 7151852 7264881
8003 7264881 7421616 7580630 7670363 7656099 7644570 7787787 8044836 8193667 8143597 8069328
7993 8069328 8141374 8298035 8413205 8514844 8664286 8775757 8765850 8759331 8916980 9149800
7983 9149800 9243768 9204264 9228139 9372639 9511539 9611981 9785919 10031287 10181227 10183618
7973 10183618 10197373 10322840 10458692 10531882 10651262 10892763 11126127 11221755 11271438 11427250
7963 11427250 11648964 11793560 11858557 11954945 12105771 12244285 12367002 12525258 12692074 12793760
7953 12793760 12864729 13021598 13271719 13487412 13605564 13725991 13946661 14202135 14362246 14440296
7943 14440296 14593824 14904453 15245536 15438951 15502048 15634384 15939981 16275283 16455627 16521877
7933 16521877 16671138 16973441 17312418 17595947 17859298 18131816 18368481 18581097 18886813
7924 18886813 19331059 19786663 20132202 20421492 20766308 21153213 21506287 21852476 22281675
7915 22281675 22783016 23251078 23644494 24040591 24537575 25168386 25887465 26587310 27173467
7906 27173467 27686771 28297204 29104461 30005266 30845489 31643014 32547974 33617341 34746740
7897 34746740 35824225 36854405 37913236 39046545 40231398 41402237 42512703 43585203
7889 43585203 44675715 45782347 46835124 47783012 48624737 49346379 49918870 50373976 50774007
7880 50774007 51081636 51190889 51124336 51039989 50978588 50787663 50400232 49990094 49691905 49357258
7870 49357258 48801815 48138803 47617601 47242175 46815619 46295621 45834770 45490242 45150436
7861 45150436 44764115 44417394 44157595 43938038 43758709 43680910 43690797 43718271 43784110 43956209
7851 43956209 44189910 44406335 44689568 45183742 45836010 46497418 47243536 48299762 49674227
7842 49674227 51228654 53136908 55805192 59099197 62002342 63387517 63014073 61604385
7834 61604385 60125345 59152437 58703618 58437595 58114946 57998885 58622680 60012540 61375494
7825 61375494 61799863 61105611 59806481 58470508 57430535 56910318 56934768 57040207 56449774
7816 56449774 54765476 52366841 50019510 48186262 46793751 45563572 44407629 43444474
7808 43444474 42722446 42105136 41505491 41074097 40974682 41084209 41156491 41213227 41490171 42033380
7798 42033380 42666972 43345173 44181221 45140492 46133295 47419560 49400706 51976025 54790127
7789 54790127 58261237 63418082 70100626 76090053 78934511 78294670 75813386 73157962
7781 73157962 71034353 69646764 68961925 68604600 68501609 69536119 72436376 75980557 77596152
7772 77596152 76165049 73176760 70689015 69284873 68608037 68571783 68843457 68047718 64960052
7763 64960052 60226291 55731152 52394296 49625274 46842256 44359769 42537495 41049879
7755 41049879 39483377 37994286 36910374 36144340 35408693 34679353 34104584 33692587 33359423
7746 33359423 33112933 32994175 32973692 33028529 33198195 33507527 33968577 34675011 35759030 37279930
7736 37279930 39263029 41677803 44126149 45741079 45826965 44611370 43033541 41794286
7728 41794286 40923475 40218865 39685106 39475345 39740229 40564506 41713820 42465410 42132064
7719 42132064 40838352 39401294 38405585 37808323 37431611 37224675 36859420 35700036 33573082
7710 33573082 31131782 29085513 27449499 25902527 24461271 23331799 22414475 21462802
7702 21462802 20539279 19866235 19375675 18815246 18171671 17612138 17130744 16615854 16143384
7693 16143384 15841002 15580041 15164446 14707100 14444792 14295111 13996049 13588406 13334986
7684 13334986 13226417 13010410 12682580 12489147 12427240 12213128 11817859 11567634 11583015 11566379
7674 11566379 11326135 11084917 11031211 10960732 10664592 10340842 10270713 10333855 10211959 9911578
7664 9911578 9722368 9732951 9723263 9544608 9331068 9261536 9298896 9264107 9080466 8864054 8777856
7653 8777856 8824580 8830529 8673245 8457472 8359361 8360223 8304709 8186752 8153788 8209918 8165627
7642 8165627 7962717 7804370 7831478 7892860 7804291 7641381 7581944 7616109 7616041 7567828 7533037
7631 7533037 7481665 7359475 7240468 7227875 7273331 7265475 7223306 7225737 7224702 7122519 6980401
7620 6980401 6950265 7027796 7063255 7003752 6943256 6933072 6915493 6858728 6802516 6753841 6676963
7609 6676963 6596027 6574002 6589651 6572761 6554332 6626668 6749941 6765645 6630754 6478133 6404463
7598 6404463 6357795 6290416 6261671 6303168 6322089 6242725 6134452 6095995 6105226 6088632 6061592
7587 6061592 6085754 6136158 6119474 6006276 5862327 5758020 5710799 5708089 5729015 5741045 5718008
7576 5718008 5672153 5647705 5675122 5735167 5768439 5728384 5630193 5530075 5453568 5386837 5351781
7565 5351781 5412333 5550110 5618597 5524247 5386633 5383122 5479129 5479704 5339917 5233285 5268329
7554 5268329 5326996 5280878 5202546 5226803 5327756 5384038 5373406 5350593 5306111 5210139 5143127
7543 5143127 5203022 5303147 5252529 5058127 4955055 5064430 5198651 5134464 4942978 4875753
7533 4875753 4993909 5098103 5027544 4858277 4747409 4715581 4680632 4617878 4571462 4546718 4501592
7522 4501592 4440943 4426959 4481032 4548087 4575038 4559701 4508118 4415278 4312699 4263413 4274633
7511 4274633 4280758 4248079 4226052 4252881 4285740 4278314 4252368 4231839 4187079 4117797 4102907 4172796
7499 4172796 4220631 4161424 4096560 4167053 4302923 4299496 4125984 3974440 3978594 4051827 4056031
7488 4056031 3990106 3945169 3978353 4082278 4194151 4214956 4113932 4010623 4032826 4108345 4059580
7477 4059580 3901312 3839277 3936848 4012840 3957154 3912368 3999324 4081931 3998398 3846438 3817853
7466 3817853 3887960 3898649 3841382 3820682 3817233 3731383 3613799 3612764 3714417 3766517 3751662
7455 3751662 3802397 3931131 3982629 3903109 3835406 3875890 3937968 3939267 3936057 3977112 3998630 3967803
7443 3967803 3966858 4023967 4022818 3910011 3837133 3937270 4090680 4095491 3976525 3928071 4003430
7432 4003430 4062893 4027002 3993763 4057436 4161078 4207611 4212690 4253349 4321499 4324125 4224755 4113365
7420 4113365 4104815 4203397 4309793 4350136 4346606 4349792 4361965 4367667 4385114 4426793 4456773 4459083
7408 4459083 4499503 4629247 4775916 4843235 4872829 4962136 5056375 5010598 4866542 4853162 5042383
7397 5042383 5211149 5167046 5030386 5034664 5194736 5357274 5470346 5600183 5742182 5815057
7387 5815057 5828120 5883286 6003082 6097713 6116719 6116127 6163948 6275848 6439822 6611987 6707308
7376 6707308 6696019 6686086 6801041 7003056 7158709 7249844 7368492 7511731 7556709 7479677 7438195
7365 7438195 7556271 7752329 7871435 7895844 7930606 8037974 8168420 8233629 8204652 8153448
7355 8153448 8198418 8368516 8538751 8571651 8506584 8511968 8654429 8833326 8960686 9073525
7345 9073525 9217797 9348512 9425827 9506164 9645262 9793729 9884779 9957917 10094958 10282966
7335 10282966 10443732 10573137 10754148 11030133 11338242 11584506 11744335 11876156 12050089
7326 12050089 12265553 12451979 12573606 12700738 12910230 13138634 13238641 13189958 13135932 13172317
7316 13172317 13220610 13176245 13063868 12952141 12820155 12626880 12434042 12333248 12304565 12264581
7306 12264581 12204873 12162621 12103669 11974917 11843983 11837131 11940740 12010732 11993957 11990453 12057070
7295 12057070 12105436 12079731 12098109 12282570 12532465 12627070 12539625 12500541 12698531 13028676
7285 13028676 13229929 13214059 13141775 13174589 13275461 13319366 13299784 13305623 13344375 13331591 13255543
7274 13255543 13208673 13216280 13166970 12983205 12749669 12590372 12511431 12443767 12347726 12195368 11952617
7263 11952617 11671999 11492431 11437407 11332612 11058780 10761330 10635705 10619578 10511925 10311796
7253 10311796 10196158 10206528 10207417 10141119 10074410 9993972 9822172 9657344 9707957 9925112 10000289
7242 10000289 9832735 9690163 9749548 9793375 9594026 9315026 9227138 9247425 9107309 8831635
7232 8831635 8684640 8706239 8655596 8417470 8148262 7976364 7836731 7667231 7519981 7398354
7222 7398354 7204924 6936085 6727039 6619322 6479127 6239152 6028851 5952033 5914414 5801873
7212 5801873 5668005 5599754 5539100 5398709 5240185 5169132 5136765 5013574 4808457 4659015
7202 4659015 4629794 4653068 4653429 4613410 4527562 4402100 4298895 4281237 4308272 4266862 4120955
7191 4120955 3961485 3892205 3914725 3939573 3883018 3750705 3633204 3599222 3600274 3535730 3407617
7180 3407617 3317644 3292827 3238894 3124368 3068393 3134398 3172237 3032117 2833708 2815702 2968698
7169 2968698 3042246 2918224 2750932 2685008 2653624 2562963 2485405 2514108 2565805 2505584 2379091
7158 2379091 2340034 2394274 2397644 2303629 2237714 2283265 2346412 2315676 2237119 2220970 2254441 2237647
7146 2237647 2169998 2158409 2221172 2221056 2071940 1906331 1911419 2052947 2113139 2004453 1885093
7135 1885093 1900503 1962025 1911122 1792356 1783582 1899804 1963748 1893739 1831064 1895450 1975009
7124 1975009 1899484 1714377 1613574 1646975 1669255 1587724 1496794 1502402 1546526 1514141 1429334
7113 1429334 1414591 1486788 1525981 1465539 1395708 1417399 1483327 1477165 1398596 1360617 1410666 1458470
7101 1458470 1411075 1298512 1219145 1217934 1266265 1317884 1337839 1308834 1249298 1200925 1177055
7090 1177055 1160284 1160570 1209119 1273089 1265987 1188173 1153951 1206730 1222793 1111791 999329 1048562
7078 1048562 1186377 1202828 1073948 971343 966645 958392 916238 953007 1079674 1126276 1024370
7067 1024370 947575 1020322 1094317 1005232 867352 880564 986981 980306 864945 831970 912291
7056 912291 921696 774321 620206 615981 739325 877845 946131 886062 707849 554226 566269
7045 566269 672196 681072 589673 581901 692758 724316 589568 490450 596640 761194 754810
7034 754810 618143 563360 640519 718563 724492 699197 660221 590987 537631 556366 594491 573868
7022 573868 552554 639312 778777 801807 686758 595299 627210 700508 711629 669691 624185
7011 624185 582430 545639 525788 498801 439782 411340 496668 637034 675506 583892 496521
7000 496521 485298 467592 396770 367835 435472 491818 454698 432819 548986 716252 760801
6989 760801 680510 605937 570574 507308 436853 464513 583707 660533 641717 612533 604937 518010
6977 518010 315903 159263 212624 410140 538676 504916 408036 372712 413995 470094 486282
6966 486282 447124 380867 348402 387251 455451 467211 396534 315607 316171 410731 517037 526569
6954 526569 398924 218409 147107 273049 496333 616325 551544 417856 357164 360372 332608
6943 332608 272082 266384 327921 362917 328454 296283 311414 313100 275007 295518 426751 526836
6931 526836 446528 282062 247947 341703 355442 226152 139611 219735 337890 349473 322804
6920 322804 372749 429898 369775 256462 248215 326223 323532 202760 117691 184712 342689
6909 342689 458579 452104 314732 124659 38415 144768 330205 407356 358243 314376 320859
6898 320859 294032 218460 197950 266787 323199 308517 289129 299137 270949 196422 180939 244754
6886 244754 252946 158725 125963 256970 387460 351632 277789 365225 498198 390767 69573
6875 69573 -104472 61101 340048 431486 325433 203169 161127 183068 252276 334607 329484
6864 329484 179632 -4561 -39591 119373 329194 416801 347122 239041 229355 317619 371836
6853 371836 313809 234189 244014 285675 234056 136827 158415 282342 296003 140503 44756
6842 44756 172643 343235 302312 115967 53723 170802 257995 183536 55658 23097 104265
6831 104265 248238 398891 463804 376882 229464 187270 244237 227327 91541 15920 113945
6820 113945 239673 223360 135630 139968 211193 204812 122846 96538 144866 161978 138039 181493
6808 181493 292072 317926 209019 124042 179442 259092 213544 112183 124621 239992 291398
6797 291398 223733 157160 176748 220159 212440 173330 133464 66755 -17641 -23577 91501 205003
6785 205003 176175 56790 27101 131591 209151 125109 -34861 -79581 43622 208551 286973
6774 286973 274278 227468 164318 83572 35859 87009 203967 253244 159190 17145 -12607
6763 -12607 98635 225811 262260 237399 233303 253616 238135 170159 98975 63685 56215 68726
6751 68726 123881 229509 334823 366159 302163 196581 125147 117364 144682 171172 195314
6740 195314 222144 215864 133551 12885 -38209 21131 94262 76547 11738 33586 167665
6729 167665 285130 269373 146905 20924 -52647 -76149 -57461 -8778 34117 47204 56322
6718 56322 95637 142436 138599 74646 11886 7805 43430 47242 -7240 -46687 27141 198896
6706 198896 321062 278879 139280 65869 105642 153421 134301 110453 155890 223120 217719
6695 217719 138559 55193 -4378 -50639 -55242 19826 128247 172366 136443 101989 117976 137860
6683 137860 111652 68178 65108 105469 140663 128568 70701 17071 34419 131996 223049 210643
6671 210643 112971 45097 67399 116880 111760 60358 25723 30597 44732 39868 20463 13220
6659 13220 40642 85364 83125 -6469 -119959 -139297 -40439 66206 74530 6534 -40574 -19985
6647 -19985 35770 67767 32050 -65642 -136598 -69893 115108 237108 156393 -33973 -117824
6636 -117824 -32096 75561 68237 -14478 -53948 -23436 7752 -11727 -63636 -96852 -67291 34706
6624 34706 150765 172453 51268 -115603 -169254 -71493 51028 71947 19573 9690 62442
6613 62442 76438 -5206 -95858 -89890 -18078 7353 -35469 -63861 -41104 -29646 -64689 -81819
6601 -81819 -34618 6212 -36853 -104438 -79836 18882 48770 -46256 -147041 -129461 -34462 5199
6589 5199 -45480 -94560 -74402 -41076 -83378 -175696 -187102 -50907 125723 174187 68886
6578 68886 -47277 -53412 7061 21425 -20694 -34420 12298 52806 30660 -28027 -77081 -114377
6566 -114377 -143014 -127746 -48894 34319 37589 -37707 -98343 -70622 22339 107947 148718 147225
6554 147225 98309 -2235 -98738 -98261 636 61556 -23580 -157307 -140782 40471 169360
6543 169360 93059 -63434 -87749 21091 95964 79751 77496 134359 147042 55878 -29818
6532 -29818 2348 89129 95064 23626 5104 101161 221894 238671 114649 -72889 -191150
6521 -191150 -149662 6590 116604 70390 -57170 -98325 -6462 96322 95640 27721 -1890
6510 -1890 19381 12404 -45892 -66964 16806 127858 128389 9548 -88840 -63859 26028 67722
6498 67722 52354 51063 79883 83532 41635 3053 2037 6961 -28916 -107652 -180063 -170981 -44153
6485 -44153 113162 131746 -27529 -167715 -90828 111045 169724 27617 -93551 -42561 61200
6474 61200 68622 35463 73444 139342 143738 131814 173701 192791 100154 439 47273 167558
6462 167558 164588 52484 34597 147969 192166 73518 -23382 75199 264710 325817 218901
6451 218901 81144 28489 76976 183514 266485 251745 174000 158605 237814 282119 199913
6440 199913 103067 151137 301797 354827 220210 22169 -68205 -12400 97812 153007 111792
6429 111792 12220 -77071 -114948 -95588 -25173 64229 97494 27604 -76783 -98962 -36006
6418 -36006 5122 -13341 -7949 59007 97858 53118 14066 58379 108089 74335 37031 115542
6406 115542 237435 221629 59128 -71439 -69239 -20260 -13374 -9095 46388 107973 113176 84286
6394 84286 74083 78188 66670 48092 43167 37448 12234 -10276 1745 36025 50870 30243
6382 30243 -1804 -14429 -1954 17745 35204 70775 138377 189551 146758 17705 -83589
6371 -83589 -77985 -25758 -26511 -73123 -90190 -66945 -46762 -19584 55422 135025 127132 47696 15266
6358 15266 64074 91075 36842 -7436 46276 128221 117432 35228 14688 98994 176987 141626
6346 141626 39505 11084 103999 200404 161434 14864 -68053 9061 155296 239184 250626
6335 250626 232362 151814 -15141 -143405 -86797 74896 115713 8318 -21075 150881 341808
6324 341808 340410 208842 144570 171553 153644 39579 -79682 -123182 -87851 8135 127552
6313 127552 189705 157421 113430 139196 167250 87978 -40526 -51870 70953 166883 148524
6302 148524 117273 169058 234453 207058 120243 84714 117227 138819 113432 95629 137615 210396
6290 210396 236171 175959 75876 25209 58225 107778 87019 10226 -17526 55653 148043
6279 148043 147956 64625 20462 92183 208465 239115 163212 95323 130270 216582 236406 172782
6267 172782 116828 119393 130699 107023 81812 86069 85658 58115 52282 100700 146295 134964 109373
6254 109373 121890 127487 72433 24008 79147 186317 204008 123604 88250 173167 279143
6243 279143 283747 192328 94976 57500 93086 172736 233547 230339 189358 162366 146623 117578
6231 117578 105782 145532 180124 136772 70263 92246 171784 170975 89385 86815 210598 289179
6219 289179 197549 63325 72308 194729 258020 211584 168535 216812 308723 335640 245319
6208 245319 97567 30009 119631 262924 279832 160435 88992 172932 288551 285872 207032
6197 207032 172762 173735 133333 87845 130983 230797 267433 226764 206192 243245 279995 291357
6185 291357 312285 331649 287672 190004 136473 180874 270614 334201 355283 348352 328269 313164
6173 313164 310093 308330 320677 382969 464576 457760 337634 246818 307184 427528 438126 346643
6161 346643 295531 316275 312289 264907 263333 320915 346684 325157 345615 416801 432325 371784
6149 371784 357142 438331 495747 446002 383495 410840 472829 476204 449230 461769 495097 508209
6137 508209 534385 597330 626793 574774 524979 565061 636029 638508 609967 652847 745349 773196
6125 773196 718082 676163 702852 760745 814023 864530 897935 893501 885291 925759 996838 1041522
6113 1041522 1067276 1125135 1198908 1216199 1170686 1135919 1147696 1167160 1178601 1228019 1326102
6102 1326102 1395783 1373613 1308331 1298761 1362463 1421099 1413643 1382649 1423487 1556245 1680376
6091 1680376 1685973 1594907 1542050 1609634 1736905 1821775 1856062 1907422 2001702 2083886 2093250 2040968
6079 2040968 2008206 2074549 2235623 2393071 2453475 2433560 2429775 2492443 2585520 2667776 2744073
6068 2744073 2824439 2899063 2968687 3039562 3088497 3105109 3156060 3307749 3493697 3583556 3589121
6057 3589121 3657226 3836393 4013264 4122844 4240220 4390967 4465404 4438113 4488197 4746868
6047 4746868 5079905 5286879 5382561 5509994 5696229 5874960 6053343 6284225 6552675 6829929
6037 6829929 7142202 7469479 7722368 7947867 8359800 8989458 9536109 9804677 10055770 10615374
6027 10615374 11363444 11983133 12520647 13264895 14226078 15215705 16339064 17893690 19855817
6018 19855817 22043546 24741749 28426820 32668714 35980107 37163382 36434372 35027758
6010 35027758 34161999 34494461 35822456 36883467 36168802 33618360 31009778 29965318 29996202
6001 29996202 29290566 27069272 24223989 21791882 19854610 18127809 16694512 15676767
5993 15676767 14804021 13805173 12841708 12164065 11657534 11073334 10442736 9940914 9549304
5984 9549304 9137052 8712040 8352043 8026766 7679934 7351728 7068445 6763223 6434876 6205850
5974 6205850 6091066 5907691 5564318 5239885 5107636 5071775 4956817 4778655 4639838 4521419
5964 4521419 4371313 4248823 4191738 4083132 3840829 3602627 3528976 3546896 3482456 3330396
5954 3330396 3203196 3125040 3060318 3032043 3031539 2937630 2715339 2554413 2597384 2677290 2573777
5943 2573777 2387010 2361409 2450662 2397541 2190688 2083173 2147132 2164573 2031874 1936759 2002119
5932 2002119 2051975 1914880 1722703 1697379 1809541 1857117 1770886 1653221 1586646 1570917 1604679
5921 1604679 1681832 1727100 1661233 1531555 1477679 1551347 1644115 1621161 1481487 1351962 1335726
5910 1335726 1397313 1418635 1354733 1285981 1298137 1362922 1381710 1310228 1194177 1110947 1107987
5899 1107987 1156601 1147667 1010776 864451 923482 1184426 1351030 1207928 931465 840681
5889 840681 951798 1019859 957594 931321 1025855 1090859 1010572 898014 894538 950637 938395
5878 938395 851819 775477 753299 783344 852921 905345 864975 755035 689954 703884 708534 669366
5866 669366 675152 759468 811636 769068 744988 832296 917070 846259 678774 604096 674625 765402
5854 765402 755961 633536 464039 363221 432982 623488 733999 659153 543528 562689 653132
5843 653132 632728 509210 457932 520071 538891 426011 303410 313719 431482 535336 559301
5832 559301 507227 408193 323329 327318 420814 506560 499810 431252 405320 472953 566195 562463
5820 562463 425707 275558 265244 383383 460084 406491 341518 397621 506673 510372 408585
5809 408585 341659 363358 391294 376260 367140 389490 397972 381180 391634 435826 445781 397958
5797 397958 357534 365677 379234 361138 337370 322841 280957 204323 154131 168021 197101 183541
5785 183541 145300 141683 196357 280289 336885 321525 254880 217046 237856 238157 161545 104687
5773 104687 186761 331810 347818 214579 109482 121578 135116 64882 15979 94901 219974
5762 219974 256467 219211 205377 224797 228928 224530 231365 201763 106339 29941 56880 125102
5750 125102 124569 82941 112675 212683 267936 235183 198246 230572 307936 366336 362180 279182
5738 279182 155272 89432 138851 223937 220290 129774 69853 101633 162135 174328 141830 117022
5726 117022 135423 192874 246346 245096 195458 164185 178388 175468 110536 47949 61030 102306
5714 102306 79385 9808 -19706 -10420 -34195 -77583 -45556 68458 148618 123897 57711 34999
5702 34999 56943 84725 103471 106512 84452 55185 48150 54561 52572 65089 115227 148611 96745
5689 96745 -3571 -61574 -78321 -115126 -142164 -76964 29997 28762 -82728 -131487 -46350
5678 -46350 29030 -10588 -55488 12259 105737 92281 28865 50832 123517 103872 -5607 -60894
5666 -60894 -18552 8149 -45742 -93974 -49360 45351 98453 96852 91326 103625 100950 51002
5654 51002 -20975 -40528 31918 130063 142967 57734 -23244 -29157 -2359 6344 24451 68939
5642 68939 70979 -8129 -71182 -18803 76788 67846 -43116 -114068 -74950 11359 88672 164993
5630 164993 218961 185599 72431 -19780 -30650 -6075 -5493 -29188 -58638 -84882 -79067 -16736
5618 -16736 57399 73477 48971 62168 110774 108093 36241 -13180 17680 79387 118848 146006
5606 146006 159031 115897 26316 -36271 -54905 -83375 -104560 -24183 130034 171511 27861
5595 27861 -106841 -41106 127947 174260 80099 10560 20026 3551 -75260 -117206 -75019 -28233
5583 -28233 -25185 -6645 57104 93134 55762 7743 2752 -2595 -45647 -68793 -17215 61629
5571 61629 104622 145026 242552 355692 381162 294786 176558 112646 126691 181980 206267
5560 206267 151506 69049 67774 148499 164625 35378 -89519 -16950 192848 287172 170640
5549 170640 13817 -23472 6899 4168 8792 84573 143339 70744 -51057 -40287 99241
5538 99241 183568 136125 69547 49186 -12385 -139689 -179852 -49826 73026 -4239 -181968
5527 -181968 -218325 -101192 -32817 -82631 -110337 -55426 -49321 -155202 -222827 -133716 -5430
5516 -5430 2975 -62693 -69155 -33590 -56331 -108073 -84264 -16754 -29941 -108579 -108051 -3912 62201
5503 62201 24155 -4896 57908 114716 49435 -85047 -158113 -151678 -144542 -162487 -150617 -74154
5491 -74154 29188 89937 61379 -42916 -142887 -163084 -125480 -113119 -129795 -86528 36471
5480 36471 121881 82946 1394 -3441 35895 -763 -116310 -185375 -135024 -25820 48330 50462
5468 50462 -6313 -71634 -70541 14488 86856 47874 -54499 -92052 -52839 -44621 -102794 -140089
5456 -140089 -116880 -110339 -153157 -151773 -58615 10227 -46915 -134692 -101930 19988 78441 39236
5444 39236 -2845 -16935 -60516 -117522 -97441 -23901 -40904 -171472 -249449 -184677 -120426 -188645
5432 -188645 -267497 -176798 -4229 -773 -187166 -305948 -202523 -35555 -12859 -98038 -120465
5421 -120465 -50818 -1925 -18920 -29863 2361 12087 -56392 -157792 -203476 -159384 -70358 -25747
5409 -25747 -97197 -261940 -390970 -365581 -207482 -47836 24027 24622 -12 -37656 -82782
5398 -82782 -115948 -136592 -160920 -168763 -114824 -16206 38293 604 -76688 -126400 -144282 -140516
5386 -140516 -93374 -13031 23850 -18775 -62628 -35325 6310 -19377 -62433 -33621 -1186 -110161
5374 -110161 -307975 -354925 -168670 31878 33671 -86822 -131110 -85508 -71646 -89742 -34134
5363 -34134 68333 60818 -75428 -160611 -95292 -19319 -83151 -209054 -221786 -114730 -32581
5352 -32581 -47029 -97705 -131245 -159516 -174781 -131503 -43332 -440 -50018 -131673 -166417 -149221
5340 -149221 -122548 -112669 -122424 -141583 -141267 -100602 -52491 -53843 -100197 -128006 -112482 -93072 -84560
5327 -84560 -47498 17571 36672 -20076 -72990 -57497 -33509 -81090 -160497 -182506 -155580 -141703
5315 -141703 -118779 -30684 58453 24815 -99525 -143490 -63449 -19341 -114574 -228334 -218898
5304 -218898 -146795 -147320 -193723 -161452 -61164 -27935 -100090 -171588 -167150 -118959 -58993 20107
5292 20107 73106 18781 -105942 -150726 -73186 -12554 -56913 -87690 8439 105285 7573 -217770
5280 -217770 -299518 -147919 29385 49097 -8646 8688 66028 37312 -50160 -64343 -14314
5269 -14314 -45267 -175531 -234160 -131434 -19015 -58944 -168719 -158901 -37416 13877 -62178
5258 -62178 -121917 -75691 -29910 -82706 -137368 -64339 57234 35203 -137983 -254881 -178310
5247 -178310 -13522 57569 2646 -74131 -93019 -62377 -22252 76 -10754 -51970 -96946
5236 -96946 -121084 -120554 -92149 -30688 27580 8149 -101791 -196164 -167303 -60811 -25102 -100686
5224 -100686 -158256 -91131 22036 33690 -52891 -94834 -27650 48101 32545 -25684 -20641 42426
5212 42426 60376 -18279 -138352 -217885 -214897 -130608 -18119 24110 -56043 -184236 -244447
5201 -244447 -228507 -211459 -200555 -138295 -56718 -67107 -151224 -136478 28867 148124 64310
5190 64310 -80978 -65164 65186 91021 -14937 -79018 -51702 -67622 -152007 -141650 10264
5179 10264 102747 1667 -131045 -100236 9148 -9990 -144435 -201540 -124215 -51151 -79945
5168 -79945 -151079 -179004 -157392 -117430 -87657 -96584 -127897 -98021 28190 140874 116133 1142
5156 1142 -59718 -43962 -46396 -81143 -61385 12845 20299 -82950 -184030 -192046 -158754 -153361
5144 -153361 -146076 -97367 -50159 -46144 -47301 -24579 -30852 -96058 -140332 -95997 -40604 -92254
5132 -92254 -222819 -291294 -237942 -141716 -94285 -107827 -150004 -192173 -207402 -176875 -117452 -72362
5120 -72362 -67027 -90306 -113305 -116066 -108370 -123013 -163109 -170961 -101244 -9967 9352 -27781 -22954
5107 -22954 18555 -31566 -196081 -294565 -194398 -34240 -33743 -164060 -198646 -63192 60006
5096 60006 7483 -150652 -239298 -200880 -110680 -51028 -44684 -67982 -78661 -56777 -36066 -59593
5084 -59593 -105213 -111152 -77741 -75060 -133969 -195408 -191466 -121828 -32281 28961 22529 -54228 -136596
5071 -136596 -147197 -90295 -35206 -14628 -17791 -68619 -192191 -294404 -223069 -6296 117871
5060 117871 11866 -153095 -140363 5389 37070 -119166 -265887 -230947 -87736 -11599
5050 -11599 -48000 -114933 -149821 -158239 -157386 -146623 -123197 -90939 -68223 -92870 -175226 -244021
5038 -244021 -212985 -120239 -104010 -189868 -215765 -70416 96460 59559 -143402 -248933 -146218
5027 -146218 -19469 -49185 -159397 -184608 -134291 -126896 -168007 -176010 -159862 -183357 -197142 -109654
5015 -109654 -6841 -73269 -267843 -322201 -147867 -2895 -101714 -277987 -254540 -83490
5005 -83490 -47854 -207951 -325618 -239876 -69163 14308 5088 -25024 -74023 -162277 -242943
4994 -242943 -250232 -180245 -82718 -27103 -77105 -216431 -311591 -255969 -136069 -121446 -203161
4983 -203161 -212240 -107511 -41979 -89511 -120862 -53698 -15137 -104998 -187548 -112123 13869
4972 13869 -5531 -127455 -153279 -68118 -45311 -131427 -174335 -98898 -32064 -77992 -151714 -136383
4960 -136383 -66426 -45487 -78649 -90532 -56322 -33473 -83904 -202211 -303114 -282707 -135068
4949 -135068 7174 12452 -86194 -146537 -119337 -92951 -133796 -193010 -200764 -158634 -103880 -62738
4937 -62738 -65023 -123837 -181041 -162550 -106704 -131930 -243708 -291580 -181527 -24606 11707
4926 11707 -81613 -178724 -193365 -138557 -58337 9528 27096 -10046 -44782 -25663 9498 -24625
4914 -24625 -137247 -231811 -216648 -114962 -37956 -51248 -97703 -85159 -29208 -33420 -115499 -159658
4902 -159658 -104786 -62920 -132428 -203444 -124568 18239 13117 -123563 -162252 -48985 -1171
4891 -1171 -129083 -238089 -162182 -44599 -77476 -172206 -139513 -37520 -62835 -195923 -235681
4880 -235681 -139940 -67045 -89188 -108695 -74398 -58897 -90146 -105018 -99299 -134276 -172376 -107781
4868 -107781 9480 -524 -141619 -190840 -50296 73925 -12060 -189220 -221580 -106269
4858 -106269 -32644 -87999 -191216 -260503 -275604 -209188 -57706 71581 51412 -78547 -143036
4847 -143036 -71426 8509 -40174 -175239 -242974 -180109 -76262 -45703 -95956 -150271 -165885
4836 -165885 -171913 -184577 -157961 -73646 -17810 -76373 -187228 -208001 -123339 -65717 -114904 -198728
4824 -198728 -229751 -221485 -214274 -197043 -168310 -171517 -200020 -170934 -70214 -14512 -75174 -150514
4812 -150514 -129066 -76616 -116615 -204781 -189919 -60444 34245 6918 -65682 -83109 -46831
4801 -46831 -18338 -39176 -110451 -183362 -173696 -56877 66881 81305 6510 -46674 -50193 -75263
4789 -75263 -140970 -167565 -109576 -36448 -37305 -111312 -182595 -176095 -71871 67029 129650 73493
4777 73493 -16470 -43228 -27270 -38727 -58758 -31438 -8849 -88101 -216570 -230455 -109040
$$ [...]
##END NTUPLES=NMR SPECTRUM
##END=
