##TITLE=1H ikalashn
CG-1214-3
17.10.2024
##JCAMPDX= 6.0         $$ Bruker NMR JCAMP-DX V2.0
##DATA TYPE= NMR SPECTRUM
##DATA CLASS= NTUPLES
##ORIGIN= UXNMR, Bruker Analytische Messtechnik GmbH
##OWNER= root
$$ TOPSPIN		Version 1.3
$$ 2024-10-17 10:04:22.000 +0400  Irina@DPX200
$$ Compression mode = diff/dup
##.OBSERVE FREQUENCY= 200.131392401
##.OBSERVE NUCLEUS= ^1H
##.ACQUISITION MODE= SIMULTANEOUS
##.ACQUISITION SCHEME= undefined
##.AVERAGES= 16
##.DIGITISER RES= 18
##SPECTROMETER/DATA SYSTEM= spect
##.PULSE SEQUENCE= zg
##.SOLVENT NAME= CDCl3
##.SHIFT REFERENCE= INTERNAL, CDCl3, 1, 17.95386
##AUDIT TRAIL= $$ (NUMBER, WHEN, WHO, WHERE, WHAT)
$$ ##TITLE= Audit trail, TOPSPIN		Version 1.3
$$ ##JCAMPDX= 5.01
$$ ##ORIGIN= Bruker BioSpin GmbH
$$ ##OWNER= Irina
$$ $$ F:/spectra/data/iren/nmr/1H/4/pdata/1/auditp.txt
$$ ##AUDIT TRAIL=  $$ (NUMBER, WHEN, WHO, WHERE, VERSION, WHAT)
(   1,<2024-10-17 10:03:52.859 +0400>,<Irina>,<DPX200>,<TOPSPIN 1.3>,
      <created by zg
	started at 2024-10-17 10:02:44.796 +0400,
	POWCHK disabled, PULCHK disabled
       configuration hash MD5:
       BE 6D 3F 07 2A EA 11 49 91 17 2B D3 AF B3 58 0D
       data hash MD5: 16K
       32 6F 1F 6F B4 C1 ED 74 15 AF 53 C6 8E 47 1C 79>)
(   2,<2024-10-17 10:03:53.000 +0400>,<Irina>,<DPX200>,<TOPSPIN 1.3>,
      <Start of raw data processing
       efp BC_mod = 2 LB = 0.02 FT_mod = 6 PKNL = 1 PHC0 = 108.4072 PHC1 = 21.53094 SI = 32K 
       data hash MD5: 32K
       22 FC A0 AA 1A DE D5 2F A6 0B C5 96 93 00 F3 EC>)
(   3,<2024-10-17 10:03:55.203 +0400>,<Irina>,<DPX200>,<TOPSPIN 1.3>,
      <apk 
       data hash MD5: 32K
       6D 08 83 BF 3B 0B E9 94 54 8D AF E2 80 92 70 D1>)
(   4,<2024-10-17 10:03:57.812 +0400>,<Irina>,<DPX200>,<TOPSPIN 1.3>,
      <abs n ABSG = 5 
       data hash MD5: 32K
       44 0F C3 0F 90 B6 DA 2F 44 01 1A A3 16 6D 5D 5D>)
(   5,<2024-10-17 10:04:09.093 +0400>,<Irina>,<DPX200>,<TOPSPIN 1.3>,
      <pk fgphup PHC0 = 0.7 PHC1 = 0 
       data hash MD5: 32K
       4C A5 21 E7 67 44 2E 99 69 B4 AF E8 05 C5 CB DD>)
(   6,<2024-10-17 10:04:10.765 +0400>,<Irina>,<DPX200>,<TOPSPIN 1.3>,
      <abs n ABSG = 5 
       data hash MD5: 32K
       9D 0D DE 31 B5 1B 38 C4 F5 9C FA 46 A7 DC D5 EB>)
$$ ##END=
$$ 
$$ $$ hash MD5
$$ $$ F8 6C 23 D5 13 D9 3F 45 20 9D D8 20 A9 7E 62 DE
##$RELAX= 
##$RELAX= 
##$RELAX= 
##$RELAX= 
##$RELAX= 
##$RELAX= 
##$RELAX= 
##$RELAX= 
##$RELAX= 
$$ Bruker specific parameters
$$ --------------------------
##$DU= <F:/spectra>
##$EXPNO= 4
##$NAME= <1H>
##$PROCNO= 1
##$TYPE= <nmr>
##$USER= <iren>
##$AMP= (0..31)
100 100 100 100 100 100 100 100 100 100 100 100 100 100 100 100 100 100 
100 100 100 100 100 100 100 100 100 100 100 100 100 100 
##$ANAVPT= -1
##$AQSEQ= 0
##$AQ_mod= 1
##$AUNM= <au_zg>
##$AUTOPOS= <>
##$BF1= 200.13
##$BF2= 200.13
##$BF3= 200.13
##$BF4= 200.13
##$BF5= 200.13
##$BF6= 200.13
##$BF7= 200.13
##$BF8= 200.13
##$BYTORDA= 1
##$CFDGTYP= 0
##$CFRGTYP= 5
##$CHEMSTR= <none>
##$CNST= (0..63)
$$ [...]
##$SW_h= 4401.40845070422
##$TD= 16384
##$TD0= 1
##$TE= 300
##$TE2= 300
##$TE3= 300
##$TEG= 300
##$TL= (0..7)
0 120 120 120 120 120 120 120 
##$TP= (0..7)
150 150 150 150 150 150 150 150 
##$TP07= 0
##$TPNAME0= <>
##$TPNAME1= <>
##$TPNAME2= <>
##$TPNAME3= <>
##$TPNAME4= <>
##$TPNAME5= <>
##$TPNAME6= <>
##$TPNAME7= <>
##$TPOAL= (0..7)
0.5 0.5 0.5 0.5 0.5 0.5 0.5 0.5 
##$TPOFFS= (0..7)
0 0 0 0 0 0 0 0 
##$TUNHIN= 0
##$TUNHOUT= 0
##$TUNXOUT= 0
##$USERA1= <user>
##$USERA2= <user>
##$USERA3= <user>
##$USERA4= <user>
##$USERA5= <user>
##$V9= 5
##$VALIST= <valist>
##$VCLIST= <CCCCCCCCCCCCCCC>
##$VD= 0
##$VDLIST= <DDDDDDDDDDDDDDD>
##$VPLIST= <PPPPPPPPPPPPPPP>
##$VTLIST= <TTTTTTTTTTTTTTT>
##$WBST= 1024
##$WBSW= 25
##$XGAIN= (0..3)
0 0 0 0 
##$XL= 0
##$YL= 0
##$YMAX_a= 393900
##$YMIN_a= -1097283
##$ZGOPTNS= <>
##$ZL1= 120
##$ZL2= 120
##$ZL3= 120
##$ZL4= 120
##$ABSF1= 17.95386
##$ABSF2= -4.038887
##$ABSG= 5
##$ABSL= 3
##$ALPHA= 0
##$AQORDER= 0
##$ASSFAC= 0
##$ASSFACI= 0
##$ASSFACX= 0
##$ASSWID= 0
##$AUNMP= <proc_1d>
##$AXLEFT= 0
##$AXRIGHT= 0
##$AXTYPE= 0
##$AXUNIT= <>
##$AZFE= 0.1
##$AZFW= 0.1
##$BCFW= 0
##$BC_mod= 2
##$BYTORDP= 0
##$COROFFS= 0
##$CY= 7568.61572265625
##$DATMOD= 1
##$DC= 0
##$DFILT= <>
##$DTYPP= 0
##$F1P= 17.9538593292236
##$F2P= -4.03888763876832
##$FCOR= 0.5
##$FTSIZE= 32768
##$FT_mod= 6
##$GAMMA= 0
##$GB= 0
##$INTBC= 0
##$INTSCL= 1.483618e-010
##$ISEN= 128
##$LB= 0.02
##$LEV0= 0
##$LPBIN= 0
##$MAXI= 945.577
##$MC2= 0
##$MEAN= 0
##$ME_mod= 0
##$MI= -402.1523
##$NCOEF= 0
##$NC_proc= -7
##$NLEV= 6
##$NOISF1= 8.587773
##$NOISF2= 6.764455
##$NSP= 0
##$NTH_PI= 0
##$NZP= 0
##$OFFSET= 17.95386
##$PC= 1
##$PHC0= 305.8409
##$PHC1= 25.52124
##$PH_mod= 1
##$PKNL= yes
##$PPARMOD= 0
##$PPDIAG= 0
##$PPIPTYP= 0
##$PPMPNUM= 100
##$PPRESOL= 1
##$PSCAL= 0
##$PSIGN= 0
##$REVERSE= no
##$SF= 200.13
##$SI= 32768
##$SIGF1= 16.12182
##$SIGF2= -4.496377
##$SINO= 3.521527
##$SIOLD= 32768
##$SREGLST= <1H.CDCl3>
##$SSB= 0
##$STSI= 32768
##$STSR= 0
##$SW_p= 4401.40845070423
##$SYMM= 0
##$S_DEV= 0
##$TDeff= 16384
##$TDoff= 0
##$TI= <>
##$TILT= no
##$TM1= 0
##$TM2= 0
##$TOPLEV= 0
##$USERP1= <user>
##$USERP2= <user>
##$USERP3= <user>
##$USERP4= <user>
##$USERP5= <user>
##$WDW= 1
##$XDIM= 32768
##$YMAX_p= 507360599
##$YMIN_p= -565831
$$ End of Bruker specific parameters
$$ ---------------------------------
##NTUPLES= NMR SPECTRUM
##VAR_NAME=  FREQUENCY,     SPECTRUM/REAL,   SPECTRUM/IMAG
##SYMBOL=    X,             R,               I
##VAR_TYPE=  INDEPENDENT,   DEPENDENT,       DEPENDENT
##VAR_FORM=  AFFN,          ASDF,            ASDF
##VAR_DIM=   32768,         32768,           32768
##UNITS=     HZ,            ARBITRARY UNITS, ARBITRARY UNITS
##FACTOR=    0.134324425510551, 1,           1
##FIRST=     4401.40845070423, -267780,      -3458093
##LAST=      0,             231379,          -4944815
##MIN=       0,             -565831,         0
##MAX=       4401.40845070423, 507360599,    0
$$ Real data points
##PAGE= N=1
##DATA TABLE= (X++(R..R)), XYDATA
$$ [...]
12793B5783403P3748K09853J50968P872j3647O9492Q8272J2618k0207N5372J27131
12782B6544875P3946n9799j20144l9689P5926P8361l1715j02070l4607Q3105J14039
12771B6582228O4061L5218M7209M2786L6344R3846J66252J22891j2734m6867Q7667
12760B7218901K01457J36162J5156M1968J80984K37047J68429J10871J30072J55841
12750B8596888J55308J72549J81350R9636j0966K8455K12322K92263J47343K550
12740B9877698R0819K82406L02990J85330J90612L34101L39024J16152m8871O4253
12730C1734514K73799L10733K26836K24543K71907K05281R7624J74891L95769
12721C3915897M59216K73276R5403J12178J81124J36529P6761J46708K58852K62082
$$ plain form
12793 25783403 25857151 26067004 26217972 26225844 26212197 26281689 26369961 26382579 26362372 26417744 26544875
12782 26544875 26618821 26559022 26438878 26399189 26475115 26553476 26521761 26419691 26385084 26468189 26582228
12771 26582228 26646289 26681507 26728716 26771502 26807846 26901692 27067944 27190835 27178101 27131234 27218901
12760 27218901 27420358 27556520 27571676 27613644 27794628 28031675 28200104 28310975 28441047 28596888
12750 28596888 28752196 28924745 29106095 29205731 29194765 29223220 29435542 29727805 29875148 29877698
12740 29877698 29968517 30250923 30553913 30739243 30929855 31263956 31602980 31719132 31670261 31734514
12730 31734514 32008313 32319046 32545882 32770425 33042332 33247613 33345237 33520128 33915897
12721 33915897 34375113 34648389 34743792 34855970 35037094 35173623 35250384 35397092 35655944 35918026
12711C5918026K16960K61519L33521K78626J51585J55603L10982M15326L47717
12702C8389865K21532J97921K90490L92794M04019L13387K19941K39717L50105
12693D1019771M10686L87587M06001M86788M40166K02917O0675K55674N56006
12684D4226271N64299L23102K09298L01972L18147J90300K09077M59440N92456
12675D7394362L92403J51740J84841L33492L06944K05923K98340M89583M53595
12666E0211223J88563L5400J58975L54060L97197L13186K40980K47852L24100
12657E2471536M11584M24861L54963L11226L56872L97322L56196L29091L98968
12648E5812619M48730L61998K60329L02503L94011L65519K96399L51129M26854
$$ plain form
12711 35918026 36134986 36396505 36730026 37008652 37160237 37315840 37626822 38042148 38389865
12702 38389865 38611397 38809318 39099808 39492602 39896621 40210008 40429949 40669666 41019771
12693 41019771 41430457 41818044 42224045 42710833 43150999 43353916 43414591 43670265 44226271
12684 44226271 44790570 45113672 45322970 45624942 45943089 46133389 46342466 46801906 47394362
12675 47394362 47786765 47938505 48123346 48456838 48763782 48969705 49268045 49757628 50211223
12666 50211223 50399786 50435186 50594161 50948221 51345418 51658604 51899584 52147436 52471536
12657 52471536 52883120 53307981 53662944 53974170 54331042 54728364 55084560 55413651 55812619
12648 55812619 56261349 56623347 56883676 57186179 57580190 57945709 58242108 58593237 59020091
12639E9020091L21621J51457K00659M14480M68585L31762L04659M53350M82107
12630F2148771K93871K05778M01248N98387N26692L56199L58105M69104N06201
12621F5864356N23039O24630O82506N71547M69488N82729P73519Q01816P47126
12612G1640756Q22246R39553Q70451P12410P62230R84325J046514Q91252Q37020
12603G9506757J033051J216455J157991J006391J002066J120203J196932J203843
12595H8443689J210017J224129J232042J270723J343645J378523J367892J428805
12587I8899465J626788J864600K046694K232952K512443K827226L057508L227469
12579A18295145L496028L923707M299295M235825L504212K339517J360351J053258
$$ plain form
12639 59020091 59341712 59493169 59693828 60108308 60576893 60908655 61213314 61666664 62148771
12630 62148771 62442642 62648420 63049668 63648055 64174747 64530946 64889051 65358155 65864356
12621 65864356 66387395 67012025 67694531 68266078 68735566 69318295 70091814 70893630 71640756
12612 71640756 72463002 73402555 74273006 74985416 75747646 76731971 77778485 78669737 79506757
12603 79506757 80539808 81756263 82914254 83920645 84922711 86042914 87239846 88443689
12595 88443689 89653706 90877835 92109877 93380600 94724245 96102768 97470660 98899465
12587 98899465 100526253 102390853 104437547 106670499 109182942 112010168 115067676 118295145
12579 118295145 121791173 125714880 130014175 134250000 137754212 140093729 141454080 142507338
12571A42507338J325688J649749J606141J170649N46982m8773m20426m52334k50647
12562A47634367o4008L6736K61271P83097J437928J839186J725313J167130N52432
12553A55373452L77715Q58119J650942K132736K055946J776532J736509J919532
12545A67881483J977917J712474J205170O09061N9794k65698k51417k0231J60635
12536A73069188J53406n870k74352n97391p54470m94048N1978L08912j60781j094452
12526A70202120j742823j642364j019005m19228j46303j70204l83357o62721p44235
12517A63271880l83633K58593P11136Q59551J183231J973443K605501K156952
12509A72636654O96075o36693r65385n66327k07755j63738k99367o64820j386531
$$ plain form
12571 142507338 143833026 145482775 147088916 148259565 148806547 148757774 148337348 147885014 147634367
12562 147634367 147570359 147607095 147868366 148651463 150089391 151928577 153653890 154821020 155373452
12553 155373452 155751167 156609286 158260228 160392964 162448910 164225442 165961951 167881483
12545 167881483 169859400 171571874 172777044 173386105 173445899 173180201 172928784 172908553 173069188
12536 173069188 173222594 173216724 172942372 172344981 171590511 171096463 171148441 171457353 171296572 170202120
12526 170202120 168459297 166816933 165797928 165378700 165232397 165062193 164678836 164016115 163271880
12517 163271880 162888247 163146840 163857976 164717527 165900758 167874201 170479702 172636654
12509 172636654 173332729 172696036 171730651 171164324 170956569 170792831 170493464 169828644 168442113
12500A68442113k168500k491444k291472j985831j828346j664289j347778r79328
12492A53685125o40436k65666J10161L16040L72463N25827Q21123R70333Q21904
12483A56716874O42614P03253Q63306Q36933O42656M89621L86779J84291q7698
12474A61378629k27127j89737j58029k58578m07455m70911m25161l18054j88420
12465A58735157o1794M5667J38295K24993L17660M63083P02032R67757J139342
12456A62672192J248780J481562J871749K177678K237067K272968K580501L017443
12448A79559940L138521K837067K511511K480905K543127K335032J903252J603989
12440A98913344J520203J309546P06047q5299o70105r83492j297741j760052k177533
$$ plain form
12500 168442113 166273613 163782169 161490697 159504866 157676520 156012231 154664453 153685125
12492 153685125 153044689 152779023 152889184 153205224 153577687 154103514 154924637 155894970 156716874
12483 156716874 157359488 158062741 158926047 159762980 160405636 160895257 161282036 161466327 161378629
12474 161378629 161151502 160961765 160803736 160545158 160137703 159666792 159241631 158923577 158735157
12465 158735157 158673363 158719030 158857325 159082318 159399978 159863061 160565093 161532850 162672192
12456 162672192 163920972 165402534 167274283 169451961 171689028 173961996 176542497 179559940
12448 179559940 182698461 185535528 188047039 190527944 193071071 195406103 197309355 198913344
12440 198913344 200433547 201743093 202449140 202363841 201693736 200710244 199412503 197652451 195474918
12431A95474918k344692k369621k488596k688877k756676k654766k583904k617125
12423A74970661k533265k162649j695413j437983j390682j292347j016915o94108
12415A62747299m43718k15546M5501K59020L42769L70077M78193O77337Q44733
12406A65105665Q84913Q26264P60595P30921O92830N79998M01974K52073J88045
12397A70423278J26945p6601m29279p38232q11863o95271o22416p12455q07762
12388A65656344p04268m66503l37402l34137j65740L27185Q76016J157765J284603
12379A67293863J582597J966587J952006J362271O36724K58971K08790K04135
12371A75465944J72286J66036N4107l19203p71955r30196p11396l92958k17809
$$ plain form
12431 195474918 193130226 190760605 188272009 185583132 182826456 180171690 177587786 174970661
12423 174970661 172437396 170274747 168579334 167141351 165750669 164458322 163441407 162747299
12415 162747299 162303581 162088035 162133536 162392556 162735325 163105402 163583595 164260932 165105665
12406 165105665 165990578 166816842 167577437 168308358 169001188 169581186 169983160 170235233 170423278
12397 170423278 170550223 170473622 170044343 169306111 168494248 167798977 167176561 166464106 165656344
12388 165656344 164952076 164485573 164148171 163814034 163648294 163975479 164851495 166009260 167293863
12379 167293863 168876460 170843047 172795053 174157324 174794048 175053019 175261809 175465944
12371 175465944 175638230 175804266 175858373 175539170 174767215 173837019 173125623 172732665 172514856
12362A72514856j58365m4679K66890P92703J304822J424388J053313N90537M73197
12353A78217662O54178Q25859R63858J228670J477143J399322J104479J009554
12345A86880725J090003Q34399J12047n08102n93438m52961n23724o57727n23762
12336A85657460l19505m83590r23359j114780q87938o10680o16448q82786j262875
12327A78555499j624117j743599j459213r84608p42168q29387r47313q80720p26682
12318A68617692n98467m28922j62194J39146M62906Q50853J147408J026531M04544
12309A71459497l93683r89806j276957j336976j298015j377449j791095k448345
12301A60547171k950966l060583k978895l010784l147558l171133l004288k750711
$$ plain form
12362 172514856 172356491 172311812 172578702 173371405 174676227 176100615 177153928 177744465 178217662
12353 178217662 178871840 179697699 180661557 181890227 183367370 184766692 185871171 186880725
12345 186880725 187970728 188805127 188917174 188409072 187815634 187362673 186838949 186181222 185657460
12336 185657460 185337955 184854365 183931006 182816226 181928288 181317608 180701160 179818374 178555499
12327 178555499 176931382 175187783 173728570 172743962 172001794 171172407 170225094 169344374 168617692
12318 168617692 168019225 167590303 167428109 167567255 168030161 168881014 170028422 171054953 171459497
12309 171459497 171065814 170076008 168799051 167462075 166164060 164786611 162995516 160547171
12301 160547171 157596205 154535622 151556727 148545943 145398385 142227252 139222964 136472253
12293A36472253k501246k288066k151581k094429k027774j882097j709450j589542
12285A20228068j518469j467027j448918j457345j442188j410690j420521j422433
12277A08640477j285200j053273r71602j128007j278116j192967r85495q90978
12269I9854839r02597q64162p80086p66580p89178p15987n79376n30640n60500
12260I3365733n10368l63239k86513l46952l93993k98071j39803p5855j26604
12251I0824335j73809j14217K5593J13545O6551k5592j7109N0479j4061k19896
12241I0515819l24307k25596j75383l79039o32079o63768o20325q03290j091409
12232H5600623j111071r11678r24339j202872j284123r87571p84065j029911j332697
$$ plain form
12293 136472253 133971007 131682941 129531360 127436931 125409157 123527060 121817610 120228068
12285 120228068 118709599 117242572 115793654 114336309 112894121 111483431 110062910 108640477
12277 108640477 107355277 106302004 105330402 104202395 102924279 101731312 100745817 99854839
12269 99854839 98952242 98088080 97307994 96541414 95752236 95036249 94456873 93926233 93365733
12260 93365733 92855365 92492126 92205613 91858661 91464668 91166597 91026794 90950939 90824335
12251 90824335 90650526 90536309 90561902 90675447 90741998 90716406 90699297 90749776 90735715 90515819
12241 90515819 90191512 89965916 89790533 89411494 88779415 88115647 87495322 86692032 85600623
12232 85600623 84489552 83577874 82653535 81450663 80166540 79178969 78394904 77364993 76032296
12223G6032296j156505o91209n55955q41326j031759q39121n60204n02028n29164
12214F9325025m06994k40736k78038m76284n52377l87828j59245p2014j30094
12205F6621415k08606k42787k65659k94850k72422j66307p9831j55960l62725
12196F4572268m91790m30956l24896l63924n13828n96909n70625n55512o10765
12187F0113063o54722o24249n56915m78471l58530k37954k56386m52129o41504
12178E5852203o18244m13073k43686k41119l32618l85606l60576k93242k13599
12169E2750440j45765j37493k08901k79392k27675n9767M9926m3268k51111l37811
12159E1109183k07312j2912M7149m2888j44436j48194o2264L5438O8717J9311
$$ plain form
12223 76032296 74875791 74184582 73628627 72787301 71755542 70916421 70356217 69854189 69325025
12214 69325025 68918031 68677295 68399257 67922973 67370596 66982768 66823523 66751509 66621415
12205 66621415 66412809 66170022 65904363 65609513 65337091 65170784 65090953 64934993 64572268
12196 64572268 64080478 63649522 63324626 62960702 62446874 61849965 61279340 60723828 60113063
12187 60113063 59458341 58834092 58277177 57798706 57440176 57202222 56945836 56493707 55852203
12178 55852203 55233959 54820886 54577200 54336081 54003463 53617857 53257281 52964039 52750440
12169 52750440 52604675 52467182 52258281 51978889 51751214 51691447 51741373 51698105 51446994 51109183
12159 51109183 50901871 50888959 50936108 50893220 50748784 50600590 50538326 50573764 50642481 50661792
12149E0661792m1076j3487R3959J51750Q1701k3108k7032O0236J20392J07357
12139E1172484Q3884R7695J28139J58860K07763K64249K73669K16040J52141J63258
12129E2918182K61811L66703L71210K65076J78906K37035L69115L83900K56300
12120E5608238J84412K83066L99124L72366L02256L49932M33646L88803L08777
12111E8630620M00459N66383N06459K49736J81784M32977O39322N20927L31465
12102F2460132M24041O61897O46323L55532J54722K34125M06406M75755M81444
12093F6300377N01711M85999L95685L16509L21583L61821L72246L67529L69944
12084F9793404L52333L05370K64153K32095J74911J14031J21537J98375K61625
$$ plain form
12149 50661792 50620716 50607229 50701188 50852938 50934639 50911531 50884499 50944735 51065127 51172484
12139 51172484 51256368 51354063 51482202 51641062 51848825 52113074 52386743 52602783 52754924 52918182
12129 52918182 53179993 53546696 53917906 54182982 54361888 54598923 54968038 55351938 55608238
12120 55608238 55792650 56075716 56474840 56847206 57149462 57499394 57933040 58321843 58630620
12111 58630620 59031079 59597462 60103921 60353657 60535441 60968418 61607740 62128667 62460132
12102 62460132 62884173 63546070 64192393 64547925 64702647 64936772 65343178 65818933 66300377
12093 66300377 66802088 67288087 67683772 68000281 68321864 68683685 69055931 69423460 69793404
12084 69793404 70145737 70451107 70715260 70947355 71122266 71236297 71357834 71556209 71817834
12075G1817834K71566K63724K43601J75105R4056R6526J77320K17596J80521J75912
12065G3713761K64286L42455L18503K68172K97543L56746L28123K32867K13456
12056G6335912L30668M79030N06258L67805J78118J21327K56752M10490L58368
12047G9344728J28202k4964R707M0611r5489k42374j77631j3684o3636l53829
12037G8551641n64068m99565l55767l93431n66093o47880n91415n56497o34793
12028G3742132p26400p08257n99599n13354n14188n70225o09393n87617n15301
12019F8397798m43833m26742m70745n09664m51954k98405j95868k88441m92713
12010F4819433n35559l03551m5817p2019l18059m26843k59971p8719j21678k47734
$$ plain form
12075 71817834 72089400 72353124 72596725 72771830 72865886 72962412 73139732 73357328 73537849 73713761
12065 73713761 73978047 74320502 74639005 74907177 75204720 75561466 75889589 76122456 76335912
12056 76335912 76666580 77145610 77651868 78019673 78197791 78319118 78575870 78986360 79344728
12047 79344728 79472930 79447966 79457673 79498284 79402795 79160421 78982790 78969106 78905470 78551641
12037 78551641 77987573 77488008 77132241 76738810 76172717 75524837 74933422 74376925 73742132
12028 73742132 73015732 72307475 71707876 71194522 70680334 70110109 69500716 68913099 68397798
12019 68397798 67953965 67527223 67056478 66546814 66094860 65796455 65600587 65312146 64819433
12010 64819433 64283874 63980323 63934506 63862487 63544428 63117585 62857614 62778895 62657217 62409483
12000F2409483j99856m0100m1129k25270l19335j95658o8365j33255k58584k26798
11990F0701133j04744j26642k95770l61550j99125J1902N0425p9306k24724k84773
11980E9086826k42158j23406k7790p9341k36788k67599n2835J90730J73529o2005
11970E8359163k12667j48910l7124j5865n795P4522J35349R1679K4226K1460L0884
11959E8316922J6769Q5165K64594L43318J72164k1571P4834L52567M12020J76775
11949F0193557N424J20037K84587K21878M5835L7575K04859L23446K88424J91811
11939F1917433J28790J20634J71210K41336K32309J33187R3885K03148L06023
11930F3547955K30150Q7819J17742K91842L43152J81728K4849N9578J97611K53238
$$ plain form
12000 62409483 62209627 62169527 62128398 61903128 61583793 61388135 61319770 61186515 60927931 60701133
11990 60701133 60596389 60469747 60173977 59812427 59613302 59625204 59675629 59596323 59371599 59086826
11980 59086826 58844668 58721262 58693472 58614131 58377343 58109744 58056909 58247639 58421168 58359163
11970 58359163 58146496 57997586 57960462 57944597 57938802 58013324 58148673 58240352 58264578 58286038 58316922
11959 58316922 58333691 58418856 58683450 59026768 59198932 59177361 59252195 59604762 60016782 60193557
11949 60193557 60198981 60319018 60603605 60825483 60871318 60908893 61113752 61437198 61725622 61917433
11939 61917433 62046223 62166857 62338067 62579403 62811712 62944899 63038784 63241932 63547955
11930 63547955 63778105 63865924 63983666 64275508 64618660 64800388 64825237 64884815 65082426 65335664
11920F5335664J90836J04383Q1645J55547K77065L04456J50723m2027m1331J34787
11910F6651748K13902P0582q4877m0713R5821R1159n2637j35132p1596K4617M0646
11899F6803520j1738o3489o8601k5192J4560r859o5323m5041N6893J01710J6715
11888F6704155p5484m6016M9020R2805R1138Q6978L7617m5476N819K45260L90985
11877F7536801J79077j69811j97593J16621L23617J87753n129L8541J85481J86568
11867F8381926R9536J09149J68108J29614O1919J15662K04840J39069o627K0151
11857F9423347K15421K93363J36975j6136N8324K51192L08923J83147M5981M4195
11847G0944732J56298K61877K83144K54919K56394K79539K38913J49312J66306
$$ plain form
11920 65335664 65526500 65630883 65712528 65868075 66145140 66449596 66600319 66558292 66516961 66651748
11910 66651748 66865650 66936232 66851355 66810642 66906463 66997622 66944985 66809853 66738257 66762874 66803520
11899 66803520 66791782 66728293 66659692 66634500 66649060 66639201 66573878 66528837 66585730 66687440 66704155
11888 66704155 66628671 66582655 66631675 66724480 66815618 66902596 66940213 66894737 66900556 67145816 67536801
11877 67536801 67715878 67546067 67348474 67465095 67788712 67976465 67971336 68009877 68195358 68381926
11867 68381926 68481462 68590611 68758719 68888333 68950252 69065914 69270754 69409823 69403196 69423347
11857 69423347 69638768 69932131 70069106 70052970 70111294 70362486 70671409 70854556 70900537 70944732
11847 70944732 71101030 71362907 71646051 71900970 72157364 72436903 72675816 72825128 72991434
11838G2991434L38448M56714L37137J36663J38393L00680L26769J67898J09057
11829G5303193K79694M28962L51572K22653K76885M15690M11449L06016L09123
11820G8305237M33251N14025M97968M45958L43308J78458J22029L26109O06199
11811H1772542O43005M64960L85655M71364M65320L00717K62901M77266O39469
11802H5883199N07927L12352L57372N18581N02061L69456L90386N30483N23775
11793H9895592L76108L55483M87917M97811L14107K19568L66546N25234M91579
11784I3529945L99284M11428M22213L23207K79104M36777O00879N31152L67221
11775I7301210M00079N73603O00301M74257M56790N85069O18441N11251N16408
$$ plain form
11838 72991434 73329882 73786596 74123733 74260396 74398789 74699469 75026238 75194136 75303193
11829 75303193 75582887 76011849 76363421 76586074 76862959 77278649 77690098 77996114 78305237
11820 78305237 78738488 79252513 79750481 80196439 80539747 80718205 80840234 81166343 81772542
11811 81772542 82415547 82880507 83266162 83737526 84202846 84503563 84766464 85243730 85883199
11802 85883199 86391126 86703478 87060850 87579431 88081492 88450948 88841334 89371817 89895592
11793 89895592 90271700 90627183 91115100 91612911 91927018 92146586 92513132 93038366 93529945
11784 93529945 93929229 94340657 94762870 95086077 95365181 95801958 96402837 96933989 97301210
11775 97301210 97701289 98274892 98875193 99349450 99806240 100391309 101009750 101521001 102037409
11766A02037409P04930P85667N93328L97720M78860O95830P63091P04246P12722
11757A07873803P58160O81189N55772O02374P92774Q72869P71855O79372O94186
11748A14282354O99958O50877O82610Q25303Q78616P37950O18681P53066J030177
11739A21159592J152724J042838Q84073Q29083Q69231R66458J117580J263557
11731A29285136J297884J222550J177159J250633J357852J375386J325463J331651
11723A39623714J427666J515333J528269J542885J659801J834647J929211J920309
11715A52981835J943278K089299K267418K350053K370818K465706K667370K877944
11707A72013721L030031L171302L393988L757083M248624M750219N109545N353324
$$ plain form
11766 102037409 102742339 103528006 104121334 104519054 104997914 105693744 106456835 107161081 107873803
11757 107873803 108631963 109313152 109868924 110471298 111264072 112136941 112908796 113588168 114282354
11748 114282354 114982312 115633189 116315799 117141102 118019718 118757668 119376349 120129415 121159592
11739 121159592 122312316 123355154 124239227 125068310 125937541 126903999 128021579 129285136
11731 129285136 130583020 131805570 132982729 134233362 135591214 136966600 138292063 139623714
11723 139623714 141051380 142566713 144094982 145637867 147297668 149132315 151061526 152981835
11715 152981835 154925113 157014412 159281830 161631883 164002701 166468407 169135777 172013721
11707 172013721 175043752 178215054 181609042 185366125 189614749 194364968 199474513 204827837
11699B04827837N708628O208648O384984N691486M280517L027471K626357K916485
11691B41672413L266276L332570L167709K828321K299586J758086J527780J684815
11683B61537556J962293K140499K315178K648368L010378L043911K565953J822506
11675B81046642J317312J364556J785874K086432J960539J561533J248512J197611
11667B93569011J344273J543133J615387J374383Q27159K71721j5357j01218j82832
11658C00245660j79439J23518N84167P71223N89156M40580O05968Q16899O80943
11649C04678675K51814p6962k9101M29833J189727J939608K213108J824029J170736
11640C13591467Q38947R72043J251548J379113J315668J146192R84799R27933
$$ plain form
11699 204827837 210536465 216745113 223130097 228821583 233102100 236129571 238755928 241672413
11691 241672413 244938689 248271259 251438968 254267289 256566875 258324961 259852741 261537556
11683 261537556 263499849 265640348 267955526 270603894 273614272 276658183 279224136 281046642
11675 281046642 282363954 283728510 285514384 287600816 289561355 291122888 292371400 293569011
11667 293569011 294913284 296456417 298071804 299446187 300273346 300545067 300529710 300428492 300245660
11658 300245660 300066221 300189739 300773906 301545129 302134285 302574865 303180833 303997732 304678675
11649 304678675 304930489 304853527 304824426 305254259 306443986 308383594 310596702 312420731 313591467
11640 313591467 314430414 315402457 316654005 318033118 319348786 320494978 321479777 322407710
11632C22407710Q26341K22084j127078k719106l705040l844246l692594l806452
11624C04561619m192902m664171n242415n899474o279627o103764n635497n349013
11616B61194756n269335n026580m482954l902017l484618l123942k724379k422238
11608B30758693k305021k177728j848168j470598j346540j470395j531180j366224
11600B17242839j179711j225075j443562j565918j492385j411490j530233j807963
11592B05586502k027864k074490k057427k157971k408268k652263k711921k574202
11584A86922096k406781k385015k511524k629367k609972k481128k345860k234234
11576A67318215k107668j983061j952724k045545k138752k078821j874457j706439
$$ plain form
11632 322407710 323234051 323456135 322329057 319609951 315904911 312060665 308368071 304561619
11624 304561619 300368717 295704546 290462131 284562657 278283030 272179266 266543769 261194756
11616 261194756 255925421 250898841 246415887 242513870 239029252 235905310 233180931 230758693
11608 230758693 228453672 226275944 224427776 222957178 221610638 220140243 218609063 217242839
11600 217242839 216063128 214838053 213394491 211828573 210336188 208924698 207394465 205586502
11592 205586502 203558638 201484148 199426721 197268750 194860482 192208219 189496298 186922096
11584 186922096 184515315 182130300 179618776 176989409 174379437 171898309 169552449 167318215
11576 167318215 165210547 163227486 161274762 159229217 157090465 155011644 153137187 151430748
11568A51430748j720160j845548j878020j740254j589169j600568j709401j691681
11560A37655947j498124j341657j379327j464309j364560j119679r82488j043239
11552A27462564j115850j026179q37996p23177p36442p93716p84590o55775m62250
11543A20326589l56762m30859n61928n55242m50234m97007p63226r79626r21318
11534A14810387p48470p51399q98072r06251p10333n69818o69949q61196r07101
11525A07787798q05842p19470p06389o87558o25394n85028o07782o31119n75380
11516A01843836m52876l51037l31582l71497l92016l32063k04511r0229o1125
11507I9256900r5320r0523J1703J42378J94916J72966J65550J84239J50318Q0957
$$ plain form
11568 151430748 149710588 147865040 145987020 144246766 142657597 141057029 139347628 137655947
11560 137655947 136157823 134816166 133436839 131972530 130607970 129488291 128505803 127462564
11552 127462564 126346714 125320535 124482539 123759362 123022920 122229204 121444614 120788839 120326589
11543 120326589 119969827 119538968 118977040 118421798 117971564 117474557 116711331 115731705 114810387
11534 114810387 114061917 113310518 112412446 111506195 110795862 110226044 109556095 108694899 107787798
11525 107787798 106981956 106262486 105556097 104868539 104243145 103658117 103050335 102419216 101843836
11516 101843836 101390960 101039923 100708341 100336844 99944828 99612765 99408254 99318025 99256900
11507 99256900 99161580 99071057 99082760 99225138 99420054 99593020 99758570 99942809 100093127 100174084
11497A00174084J35222L65877N64403N22277L46057L11346M72045O41447P15290
11488A04248048P44945O92191M21881J7949j93353p2462J50053K66129L75072
11479A06650453N74930O73184M99978K58075K16439K59904J26465p4671k2356
11470A09162401K34853L29806J97499J62147L38016M29638K88168K01640L79885
11461A11724053N65662M87986L53256M87100P47515P43218M92700M09423O53293
11452A16664206R13437R10816P67597P34921Q23143Q87462R03014R62013J083148
11443A24649757J180837J196414J156499J117189J127590J233508J432753J607961
11435A34702508J582057J312152R97364R01961J059428J253439J337452J441575
$$ plain form
11497 100174084 100309306 100675183 101239586 101761863 102107920 102419266 102891311 103532758 104248048
11488 104248048 104992993 105685184 106107065 106125014 105931661 105859199 106009252 106275381 106650453
11479 106650453 107225383 107898567 108398545 108656620 108873059 109132963 109259428 109184757 109162401
11470 109162401 109397254 109727060 109924559 110086706 110424722 110854360 111142528 111344168 111724053
11461 111724053 112289715 112777701 113130957 113618057 114365572 115108790 115601490 116010913 116664206
11452 116664206 117577643 118488459 119256056 119990977 120814120 121701582 122604596 123566609 124649757
11443 124649757 125830594 127027008 128183507 129300696 130428286 131661794 133094547 134702508
11435 134702508 136284565 137596717 138594081 139496042 140555470 141808909 143146361 144587936
11427A44587936J737472K109006K257440K099901J858856J750851J790631J927511
11419A60119604K146548K364394K453765K477783K675294L081411L404429L470123
11411A82193351L545487L934634M423171M468845L894440L081063K462616K109685
11403B10113292J876519J700679J598591J502573J274002Q86734N31802M77819
11395B19962011P73671J135426J274940J334765J752410K590885L290891L335235
11387B35450234K932611K718894K944022L328589L616786L828832L961417L893107
11379B62674492L719159L792012M227601M672037M762467M560105M322513M102520
11371B96832906L831277L603331L589049L757686L922091M001757M063703M164162
$$ plain form
11427 144587936 146325408 148434414 150691854 152791755 154650611 156401462 158192093 160119604
11419 160119604 162266152 164630546 167084311 169562094 172237388 175318799 178723228 182193351
11411 182193351 185738838 189673472 194096643 198565488 202459928 205540991 208003607 210113292
11403 210113292 211989811 213690490 215289081 216791654 218065656 218952390 219484192 219962011
11395 219962011 220735682 221871108 223146048 224480813 226233223 228824108 232114999 235450234
11387 235450234 238382845 241101739 244045761 247374350 250991136 254819968 258781385 262674492
11379 262674492 266393651 270185663 274413264 279085301 283847768 288407873 292730386 296832906
11371 296832906 300664183 304267514 307856563 311614249 315536340 319538097 323601800 327765962
11363C27765962M298764M436754M479882M301954L982771L873937M222713M811620
11355C62174357N185515N183656N027285M910770M758286M437086L988740L527855
11347C99193550L061406K550389K061435J695829J370121Q05602j80467j430065
11339D09127800k587671l477071m222434m969701n650531o153160o584612p129344
11331C68353276p699089p989605p921929p774299p779767p820460p661957p299564
11323C06406606o904588o574589o304790o092776n918488n715013n482534n324898
11315B58088930n269172n191921n041549m957772n015409n042210m896784m738556
11307B17935557m761031m821722m653526m331670m177713m240324m230219l999648
$$ plain form
11363 327765962 332064726 336501480 340981362 345283316 349266087 353140024 357362737 362174357
11355 362174357 367359872 372543528 377570813 382481583 387239869 391676955 395665695 399193550
11347 399193550 402254956 404805345 406866780 408562609 409932730 410738332 410557865 409127800
11339 409127800 406540129 403063058 398840624 393870923 388220392 382067232 375482620 368353276
11331 368353276 360654187 352664582 344742653 336968354 329188587 321368127 313706170 306406606
11323 306406606 299502018 292927429 286622639 280529863 274611375 268896362 263413828 258088930
11315 258088930 252819758 247627837 242586288 237628516 232613107 227570897 222674113 217935557
11307 217935557 213174526 208352804 203699278 199367608 195189895 190949571 186719352 182719704
11299A82719704l744831l641855l587550l441894l273471l193703l139709k996849
11291A55699842k802353k668061k592164k482986k313544k149034k050796k015855
11283A36625049j992908j935524j854792j797000j746953j631078j474411j430862
11275A22761521j538081j585130j413709j214325j261234j457160j467411j260577
11267A11563894j144103j232613j275685j133731j039784j176615j327840j228348
11259A02005175j004314r57253j090285j155441j060570r49329r38280j008862
11251I3840841j114643j198856j159001r77849q32100q90653j060871j113621
11243H5493247j005812q94045q69875q71153q43056q16535q19799q42291q79347
$$ plain form
11299 182719704 178974873 175333018 171745468 168303574 165030103 161836400 158696691 155699842
11291 155699842 152897489 150229428 147637264 145154278 142840734 140691700 138640904 136625049
11283 136625049 134632141 132696617 130841825 129044825 127297872 125666794 124192383 122761521
11275 122761521 121223440 119638310 118224601 117010276 115749042 114291882 112824471 111563894
11267 111563894 110419791 109187178 107911493 106777762 105737978 104561363 103233523 102005175
11259 102005175 101000861 100043608 98953323 97797882 96737312 95787983 94849703 93840841
11251 93840841 92726198 91527342 90368341 89390492 88558392 87667739 86606868 85493247
11243 85493247 84487435 83593390 82723515 81852362 81009306 80192771 79372972 78530681 77651334
11234G7651334r07661q57929p23904o35698o92398p90286p70014o69382o54594
11225G0949468p45829p97141p29922o08730m91853l78606l10289l58616m92160
11216F6036322n90845o01547n56674m61007l08593j90113k14968l31458l89643
11207F2391474l71687l79667m10195l59329k61940k78620l90154l68860j65251
11198E9405771n9738k47165n01262m99430l09886k58191l97428m38507k33605
11189E6460559k5706q0720k94115l65287k38989j45875k26790l32758k71583r1963
11179E4386773P315m4678j50660k29658k78748k63010j26051M5311M4585j68907
11169E3222272l59446l18551j50137r4609j73013k01725j10607l7825q7430j66292
$$ plain form
11234 77651334 76743673 75885744 75161840 74526142 73833744 73043458 72273444 71604062 70949468
11225 70949468 70203639 69406498 68676576 68067846 67575993 67197387 66887098 66528482 66036322
11216 66036322 65445477 64843930 64287256 63826249 63517656 63327543 63112575 62781117 62391474
11207 62391474 62019787 61640120 61229925 60870596 60608656 60330036 59939882 59571022 59405771
11198 59405771 59346033 59098868 58597606 58098176 57788290 57530099 57132671 56694164 56460559
11189 56460559 56434853 56354133 56060018 55694731 55455742 55309867 55083077 54750319 54478736 54386773
11179 54386773 54394088 54349410 54198750 53969092 53690344 53427334 53301283 53346594 53391179 53222272
11169 53222272 52862826 52544275 52394138 52299529 52126516 51924791 51814184 51776359 51688929 51522637
11159E1522637j31813M361R1660J9237j52317k35656j21076O5622R6834m5743
11149E1113746j34524l7426Q2808M9394l2266K4343J40265J03452m3377n4818
11139E1211597J03654K02369J31861M2320L5163O912q7675q7952R2843K58997
11129E1910089J95372j2778j07210n647J37213J63769Q4429K9966R5978K30672
11119E2721853K86555K15540J48833K03009L02874L29874L31844L95232M29535
11110E5365149L30837K47813L71124N47547M79246K53685K39012M51831N21486
11101E8807730L58502L21412N43539O46178M11568K18504M17781P32794P38593
11092F3196601N49104N28115O36079N93666M52784M75531O21610O57841O28989
$$ plain form
11159 51522637 51390824 51395185 51486845 51506082 51353765 51118109 50997033 51062655 51159489 51113746
11149 51113746 50979222 50941796 51024604 51073998 51041732 51066075 51206340 51309792 51266415 51211597
11139 51211597 51315251 51517620 51649481 51691801 51726964 51733876 51646201 51558249 51651092 51910089
11129 51910089 52105461 52092683 51985473 51979826 52117039 52280808 52365237 52395203 52491181 52721853
11119 52721853 53008408 53223948 53372781 53575790 53878664 54208538 54540382 54935614 55365149
11110 55365149 55695986 55943799 56314923 56862470 57341716 57595401 57834413 58286244 58807730
11101 58807730 59166232 59487644 60031183 60677361 61088929 61307433 61725214 62458008 63196601
11092 63196601 63745705 64273820 64909899 65503565 65956349 66431880 67053490 67711331 68340320
11083F8340320P36623Q91211Q70457P89777R17933J148613J171756J059718J146578
11074G7072986J428963J653176J883016K332762K730356K628414K369395K836169
11066I4935237L974061M441767L270371J218574j24848j27037N64053J103867
11058A09256045J265552J351382J739253K407845K691400J821422p166j521199
11050A19004534j740983j107969p80774j176710j801525k228396k509458k687270
11042A04971449k607674k344359k255783k440899k565837k394190k116802j988808
11034H6257097j967518j897158j792518j751992j767018j759186j682344j520386
11026G2118977j309104j177942j221189j328946j309219j160822j042627r97201
$$ plain form
11083 68340320 69076943 69968154 70838611 71628388 72546321 73694934 74866690 75926408 77072986
11074 77072986 78501949 80155125 82038141 84370903 87101259 89729673 92099068 94935237
11066 94935237 98909298 103351065 106621436 107840010 107715162 107588125 108152178 109256045
11058 109256045 110521597 111872979 113612232 116020077 118711477 120532899 120525733 119004534
11050 119004534 117263551 116155582 115374808 114198098 112396573 110168177 107658719 104971449
11042 104971449 102363775 100019416 97763633 95322734 92756897 90362707 88245905 86257097
11034 86257097 84289579 82392421 80599903 78847911 77080893 75321707 73639363 72118977
11026 72118977 70809873 69631931 68410742 67081796 65772577 64611755 63569128 62571927
11018F2571927r16604p77643o93064p08285p40326p34089p04365o31038m90903
11009E6175610l66842l39658l23128k15159j34201k40935l96091l19319o1722
11000E3778555L6214j14870k22336j04783M2543J5009r1127j07498n8099k4598
10990E3149010J0051L3145m2324j59627j17043P6170J33135n2394j94306p9562
10980E2756255P4911J5242j01889j1521J58840J04742j04335j24318Q8618K19299
10970E3075844J07222n5909q4460k5054L9953J22746J87850J39814K8307K5596
10960E3561909J32953J53652L1821l8524N5386J61304J44760J08537J57523J76124
10950E4645445N7169m6620M2999J97700J72824K7506L6797K18022K83841J26619
$$ plain form
11018 62571927 61655323 60877680 60184616 59476331 58736005 58001916 57297551 56666513 56175610
11009 56175610 55808768 55469110 55145982 54930823 54796622 54555687 54159596 53840277 53778555
11000 53778555 53814769 53699899 53477563 53372780 53415323 53430332 53339205 53231707 53173608 53149010
10990 53149010 53159061 53192206 53149882 52990255 52873212 52949382 53082517 53030123 52835817 52756255
10980 52756255 52831166 52846408 52744519 52732998 52891838 52996580 52892245 52767927 52856545 53075844
10970 53075844 53183066 53127157 53042697 53017643 53057596 53180342 53368192 53508006 53536313 53561909
10960 53561909 53694862 53848514 53880335 53841811 53897197 54058501 54203261 54311798 54469321 54645445
10950 54645445 54702614 54655994 54698993 54896693 55069517 55097023 55133820 55351842 55635683 55762302
10940E5762302K1294J86361M18303M04100K04446J34156K60625L34228K17623
10931E7943438Q4121J00862J75083J65704J30650J64822J63910m593k07339j97606
10921E8519052j4550N8199n3850j05146L8621J55904L8224j46202j17778N4929
10911E8427403O7208j22062k19350n7957J49000J31174p2347k18742j90772o3478
10901E7830077O2581J35104J09972r482j09805p9016K4745N0937K802L8870J84755
10890E8241540K33992N9988j40466j07975R1040J73850P8359J3609O1868L2256
10880E8738061j77828l53018k85873j17567j20466k96177m34921m60978m65700
10871E6025533m74264m35879m03547m75587n80542n61389m58941m60056n61857
$$ plain form
10940 55762302 55783596 55969957 56388260 56792360 56996806 57130962 57391587 57725815 57943438
10931 57943438 58027559 58128421 58303504 58469208 58599858 58764680 58928590 58923997 58716658 58519052
10921 58519052 58504502 58562701 58508851 58403705 58442326 58598230 58636454 58490252 58372474 58427403
10911 58427403 58494611 58372549 58153199 58095242 58244242 58375416 58303069 58084327 57893555 57830077
10901 57830077 57892658 58027762 58137734 58128252 58018447 57939431 57964176 58015113 58017915 58056785 58241540
10890 58241540 58475532 58535520 58395054 58287079 58378119 58551969 58630328 58643937 58705805 58738061
10880 58738061 58560233 58207215 57921342 57803775 57683309 57387132 56952211 56491233 56025533
10871 56025533 55551269 55115390 54711843 54236256 53655714 53094325 52635384 52175328 51613471
10862E1613471n55030l79051k27782k28667k69202k42266k27793l01231l64063
10853D8818386l08752j94953j35106j35770j52383j78279k00423j83281j46097
10844D7183342j37567j26194o4037l5105j42470k81770k74208j88573k27082l21500
10834D5384836k23468o681k8091l06643m33709k59499j42367k73479l10878m4947
10824D3355074J21975j51090m78310l40979N0464J34085p6696j36023j0742n1578
10814D2416180k35804j74337J31460K37508K6460j21375k9539K9264o9060o9698
10804D2141059J01407J33871p1951j58172O4286K58356J42870m3469k658J28161
10794D2693760J07009L2132Q4976J59244J08837O6488J64460K25162Q6794l7369
$$ plain form
10862 51613471 51058441 50679390 50451608 50222941 49953739 49711473 49483680 49182449 48818386
10853 48818386 48509634 48314681 48179575 48043805 47891422 47713143 47512720 47329439 47183342
10844 47183342 47045775 46919581 46855544 46820439 46677969 46396199 46121991 45933418 45706336 45384836
10834 45384836 45161368 45154687 45126596 44819953 44386244 44126745 43984378 43710899 43400021 43355074
10824 43355074 43477049 43325959 42847649 42506670 42557134 42691219 42614523 42478500 42467758 42416180
10814 42416180 42180376 42006039 42137499 42375007 42401467 42280092 42250553 42279817 42210757 42141059
10804 42141059 42242466 42376337 42304386 42146214 42210500 42468856 42611726 42568257 42565599 42693760
10794 42693760 42800769 42832901 42917877 43077121 43185958 43252446 43416906 43642068 43728862 43691493
10784D3691493R7438L10424K79989Q6476O2525K40347L46885K76803K08699K66195
10774D5867274L59586L80153L39045L05205L37395M36067M84300L56258J57400
10765D9022683J64708M19356O10055N16158L25606L17609M61377N54327N51739
10756E2943618N27541M87877M36905M58089N51892N83824N41844N98752P67283
10747E7897625Q03386O46087N98734Q17276R93808Q73163P09142Q14064J008706
10738F5161991R74414Q33792Q78180R93685R03433P53793Q77183J134708J096752
10729G3607931P85618O40837P76280Q54989P27356O32330O82913O71098N08397
10720G9887749L99342M34952M13711K02751o4814k49940l53053l55208k36432
$$ plain form
10784 43691493 43788931 44099355 44379344 44465820 44528345 44768692 45115577 45392380 45601079 45867274
10774 45867274 46226860 46607013 46946058 47251263 47588658 48024725 48509025 48865283 49022683
10765 49022683 49187391 49606747 50216802 50732960 51058566 51376175 51837552 52391879 52943618
10756 52943618 53471159 53959036 54395941 54854030 55405922 55989746 56531590 57130342 57897625
10747 57897625 58701011 59347098 59945832 60763108 61756916 62630079 63339221 64153285 65161991
10738 65161991 66136405 66970197 67848377 68842062 69745495 70499288 71376471 72511179 73607931
10729 73607931 74393549 75034386 75810666 76665655 77393011 78025341 78708254 79379352 79887749
10720 79887749 80287091 80722043 81135754 81338505 81273691 81023751 80670698 80315490 80079058
10711H0079058j69004l51217o42358p15083n59460m58570m87295m60556l78188
10702G5857327m56789o63567o77869m20191k00534k28429l61584m37902m79151
10693G1931311m76847l49587j94544k18333l57912l36027j26533K0231K5581L9040
10683F9956380N4016o8452j92661l6871K68140K95506M4055m0258J56552K46319
10673G0682726R2390Q0042L96868O60667N66481L55437L27998L89477L79562L88963
10663G4320611M69891M68784L78587M15647N66172N43047L51840L57591O24174
10654G8496344P72511O71855O47938Q14127Q58503P02454O74864Q20667P82619
10645H5241882N84036P00806J106507J161359P67013O42377J048971J295659J021099
$$ plain form
10711 80079058 79910054 79558837 78916479 78201396 77641936 77183366 76696071 76235515 75857327
10702 75857327 75400538 74736971 74059102 73638911 73438377 73209948 72848364 72410462 71931311
10693 71931311 71454464 71104877 70910333 70692000 70334088 69998061 69871528 69891759 69917340 69956380
10683 69956380 70010396 69941944 69749283 69712412 69980552 70276058 70320113 70279855 70436407 70682726
10673 70682726 70775116 70855158 71252026 71912693 72479174 72834611 73162609 73552086 73931648 74320611
10663 74320611 74790502 75259286 75637873 76053520 76619692 77162739 77514579 77872170 78496344
10654 78496344 79268855 79940710 80588648 81402775 82261278 82963732 83638596 84459263 85241882
10645 85241882 85825918 86526724 87633231 88794590 89561603 90203980 91252951 92548610 93569709
10636I3569709Q70406J257239J555549J285636J036735J358520J757200J694321
10628A04385315J588682J900045K214689K177001K278408K756516K867665K315173
10620A22483494K145380L018639L907916L857172L629964M104878M547388M219500
10612A51914331M113447N084983N946686N713385N909904P910743R971225J0276180
10604B06840884J0844095J4070802J7391997J7140354J6492009K2067815L1511652
10597C36359608L2519985J8556806o11958r698005n172945L559182O856092K753229
10589C85121994n576755j3785846j7822553j6586496j3836002j3932268j5893616
10582B87688458j5273917j1283387p599773o127715m773506k407620j409488l290288
$$ plain form
10636 93569709 94440115 95697354 97252903 98538539 99575274 100933794 102690994 104385315
10628 104385315 105973997 107874042 110088731 112265732 114544140 117300656 120168321 122483494
10620 122483494 124628874 127647513 131555429 135412601 139042565 143147443 147694831 151914331
10612 151914331 156027778 161112761 167059447 172772832 178682736 186593479 196564704 206840884
10604 206840884 217684979 231755781 249147778 266288132 282780141 304847956 336359608
10597 336359608 368879593 387436399 386824441 377126436 371953491 375512673 382368765 385121994
10589 385121994 379545239 365759393 347936840 331350344 317514342 303582074 287688458
10582 287688458 272414541 261131154 253531381 247403666 242630160 240222540 238813052 235522764
10574B35522764n608303n670800m361885l943040m520285n007816n515235o479532
10566A94415868p071428o560753n896886o100150o407111n745515m742300m502203
10558A47389522m590904m017574l171785l011048l217895k885776k272055k215455
10550A22007030k477087k250965j738205j682468j865252j552972r75346r02102
10542A08562633j152459r53756m46636m33070q80847j022662p53672o56429p94814
10533A01468288p09958m87120o41796j044186j093173q64322r67844j352505j376705
10524I2930679j026094r41119j219151j282479j005101r12091j137508j194484
10516H4212652r48234q65939j098133j195774r60429p63184q02129p94558o10766
$$ plain form
10574 235522764 229914461 224243661 219881776 215938736 211418451 206410635 200895400 194415868
10566 194415868 187344440 180783687 174886801 168786651 162379540 156634025 151891725 147389522
10558 147389522 142798618 138781044 135609259 132598211 129380316 126494540 124222485 122007030
10550 122007030 119529943 117278978 115540773 113858305 111993053 110440081 109464735 108562633
10542 108562633 107410174 106456418 106009782 105576712 104695865 103673203 102919531 102263102 101468288
10533 101468288 100758330 100271210 99629414 98585228 97492055 96627733 95659889 94307384 92930679
10524 92930679 91904585 90963466 89744315 88461836 87456735 86544644 85407136 84212652
10516 84212652 83264418 82398479 81300346 80104572 79144143 78380959 77578830 76784272 76173506
10507G6173506n15163n93002n83333m28053l75981m41815l60350j39902o9239
10498G2666668j53393j37792o6237j87015l57761k14270J22202J99833L2888K0143
10488G1925266J46891N1322j71037o6606K82042L20722J7246p6590J76254L14625
10478G2920135J93022J89015L62833L09779K7535K7544L66173M69450J77208N1754
10468G5094448L41492N41631L51088J91272L62466N17792M12088L78982O16280
10459G8807539P61207O23707N93239Q66033J013331P84595O05635P95641J004714
10450H5855641R11761P71938P97262P26502M95658N63662J037389J267916R20451
10441I3348180O50143J029154J573359J610775J407171J569529J929814J918031
$$ plain form
10507 76173506 75658343 75065341 74482008 74053955 73677974 73236159 72875809 72735907 72666668
10498 72666668 72513275 72375483 72309246 72122231 71764470 71550200 71672402 71872235 71905123 71925266
10488 71925266 72072157 72123479 71952442 71885836 72167878 72488600 72505846 72429256 72605510 72920135
10478 72920135 73113157 73302172 73665005 73974784 74002319 74029863 74396036 74865486 75042694 75094448
10468 75094448 75435940 75977571 76328659 76519931 76882397 77400189 77812277 78191259 78807539
10459 78807539 79568746 80192453 80785692 81651725 82665056 83449651 84055286 84850927 85855641
10450 85855641 86767402 87539340 88336602 89063104 89558762 90122424 91159813 92427729 93348180
10441 93348180 93998323 95027477 96600836 98211611 99618782 101188311 103118125 105036156
10433A05036156J582278J378432J308497J060547P09075N66317N93515N58710
10425A12793527M96512M95751L80303Q1763p9107O3117J73681O0277Q5052M51739
10415A15002615P30592O42817O22566R84838J273725J129401J027423J370755
10407A22784732J645087J376122J133905J560525K142370K080219J712883J866617
10399A36302460K372237K492944K326975K485639K800824K681354K407051K721880
10391A56591364L407951L601458L316761L342366L813685M200070M510133N156259
10383A87940047N816531N858279N721989O336099P213250O774400M739995K656487
10375B33057077J775577J819869K065607K206768J890532Q31112l22916o03414
$$ plain form
10433 105036156 106618434 107996866 109305363 110365910 111074985 111641302 112234817 112793527
10425 112793527 113290039 113785790 114166093 114247856 114168749 114231866 114405547 114465824 114550876 115002615
10415 115002615 115733207 116376024 116998590 117983428 119257153 120386554 121413977 122784732
10407 122784732 124429819 125805941 126939846 128500371 130642741 132722960 134435843 136302460
10399 136302460 138674697 141167641 143494616 145980255 148781079 151462433 153869484 156591364
10391 156591364 159999315 163600773 166917534 170259900 174073585 178273655 182783788 187940047
10383 187940047 193756578 199614857 205336846 211672945 218886195 225660595 230400590 233057077
10375 233057077 234832654 236652523 238718130 240924898 242815430 243646542 243323626 242720212
10367B42720212l82510r38495k210319k666365j739893o61160l74316l36249J9437
10358B33430342L10422L75251P90247J528481J700357J283077J446498K510416
10350B43375091L347325L488512L902202M919144N461558N236020N507988O686254
10342B81924094P463783P444526Q027973R469176J0107223J0065205J2059302
10335C46561282J6225170J8379183J7066691J7860917K4862150L1242819K5936366
10328D98134578R226021n703131q249836j359575M923966M991377l36211q106258
10320D93520931j4955150j7643804j6122162j4393385j5391465j6942215j5546842
10313C82525908j1901971r330618q535945p549254n797057m654029m394275l798376
$$ plain form
10367 242720212 242337702 241399207 239188888 236522523 234782630 234121470 233747154 233410905 233430342
10358 233430342 233740764 234116015 234906262 236434743 238135100 239418177 240864675 243375091
10350 243375091 246722416 250210928 254113130 259032274 264493832 269729852 275237840 281924094
10342 281924094 289387877 296832403 304860376 314329552 324436775 334501980 346561282
10335 346561282 362786452 381165635 398232326 416093243 440955393 472198212 498134578
10328 498134578 507360599 501657468 493407632 492048057 496972023 501963400 501627189 493520931
10320 493520931 478565781 460921977 444799815 430406430 415014965 398072750 382525908
10313 382525908 370623937 361293319 352757374 345208120 339411063 334757034 330362759 326564383
10305C26564383k738973k374635k706038k456500j514280j136917j517413j404127
10297C10715500m83706m719n35220j065421r43543r10077j518726k145535k313550
10288C00795003k571175l299820l923950m045674m211720m827813n355903n301412
10280B67257536n055382n067901n041612m616402m087758l800759l504715k901715
10272B33181292k236624j819451j515965j162290r43510r67871j009153j014628
10264B22511800j293983j875864k283338k297311k336900k718548l136107l253212
10256B03316537l226666l255351l177641k906357k712411k694849k516687k039129
10248A80787446j651476j586713j498213j133834q23909q26121p95168m57308
$$ plain form
10305 326564383 323825410 321450775 318744737 316288237 314773957 313637040 312119627 310715500
10297 310715500 310231794 310227075 309691855 308626434 307682891 306772814 305254088 303108553 300795003
10288 300795003 298223828 294924008 291000058 286954384 282742664 277914851 272558948 267257536
10280 267257536 262202154 257134253 252092641 247476239 243388481 239587722 236083007 233181292
10272 233181292 230944668 229125217 227609252 226446962 225503452 224535581 223526428 222511800
10264 222511800 221217817 219341953 217058615 214761304 212424404 209705856 206569749 203316537
10256 203316537 200089871 196834520 193656879 190750522 188038111 185343262 182826575 180787446
10248 180787446 179135970 177549257 176051044 174917210 174093301 173267180 172472012 172014704
10240A72014704k37128n73366j093746j149126p94531n78455o58839p68831q23996
10231A65336686r51195j082634j065696j028794j157970j283208j154552r41120
10223A56671517r72848j159117j155894r66385q84749r52098r45815q35346q00038
10214A47999227q44513q06526o99663o69665o69795n45049l67689l23527l41723
10205A42731077k14827j6835o645j54718j64285L1268J67761Q8309m9864o8683
10195A42342558P302P8572R8723M3834o3892j13391m3843L7624L0300O851K8279
10184A42452917k7884k20239l29856j94946n6512k06017m69465m69079k61627
10175A40217292k34952m36209n18590l80135l40914n63300p64952p03263n49277
$$ plain form
10240 172014704 171777576 171204210 170110464 168961338 168166807 167588352 166929513 166160682 165336686
10231 165336686 164385491 163302857 162237161 161208367 160050397 158767189 157612637 156671517
10223 156671517 155698669 154539552 153383658 152417273 151532524 150580426 149634611 148799265 147999227
10214 147999227 147154714 146348188 145648525 144978860 144309065 143764016 143396327 143072800 142731077
10205 142731077 142516250 142499415 142492770 142338052 142173767 142205035 142372796 142461105 142411241 142342558
10195 142342558 142349860 142428432 142527155 142570989 142507097 142393706 142349863 142387487 142417787 142424638 142452917
10184 142452917 142425033 142204794 141874938 141679992 141623480 141417463 140947998 140478919 140217292
10175 140217292 139982340 139546131 139027541 138647406 138306492 137743192 136978240 136274977 135725700
10166A35725700n49230o39602o43761n91791n99260o21844n56866m51263m18484
10157A30653599m47808m44863l85261l19780k88749k95327l05648k60829j63720
10148A27741614j23551j98635k49394j18402R1063J36106J7993p503J63252L28467
10138A27781010L27838K96753M20615O27372P14573O69489O80285Q69853J158732
10129A33546520J395932J534827J647009J796373J945089K016869K028152K075951
10121A47986722K185415K269869K273834K238964K183211K055259J871084J730122
10113A64794480J611152J343678Q97061M87275K50657M2656k60113n19603o36344
10104A68010899q14481j211935j577803j615687j492506j559223j743114j697156
$$ plain form
10166 135725700 135176470 134536868 133893107 133301316 132702056 132080212 131523346 131072083 130653599
10157 130653599 130205791 129760928 129375667 129055887 128767138 128471811 128166163 127905334 127741614
10148 127741614 127618063 127419428 127170034 127051632 127142695 127278801 127296794 127289291 127452543 127781010
10138 127781010 128108848 128405601 128826216 129453588 130168161 130837650 131517935 132387788 133546520
10129 133546520 134942452 136477279 138124288 139920661 141865750 143882619 145910771 147986722
10121 147986722 150172137 152442006 154715840 156954804 159138015 161193274 163064358 164794480
10113 164794480 166405632 167749310 168646371 169133646 169384303 169426959 169166846 168647243 168010899
10104 168010899 167196418 165984483 164406680 162790993 161298487 159739264 157996150 156298994
10096A56298994j436851j312147j383079j342068j092425r06012r12323q93945
10088A47020144p25653n97123o36056o75429n60304l75827k39456j49613j22777
10079A42937906j91081k23416o9623J08111K1447k23948k33173K0847J36789l0269
10069A42253590j41749J3514J94666K01239K02590L42429M76280N40292P28692
10060A44811543J070741J296074J355718J585093K099292K551800K771571L074556
10052A60616388L617298M042331M163677M395157N033705N726833O179322O780309
10044B00555020P929206R320360J0527018J1700851J3034502J4207506J5108165
10037B82382628J6241820J7324714J6345873J1707798N025554J02572j091405
$$ plain form
10096 156298994 154862143 153549996 152166917 150824849 149732424 148826412 147914089 147020144
10088 147020144 146294491 145697368 145061312 144385883 143825579 143449752 143210296 143060683 142937906
10079 142937906 142746825 142523409 142453786 142561897 142583344 142359396 142126223 142147070 142283859 142253590
10069 142253590 142111841 142125355 142320021 142521260 142723850 143066279 143542559 144082851 144811543
10060 144811543 145882284 147178358 148534076 150119169 152218461 154770261 157541832 160616388
10052 160616388 164233686 168276017 172439694 176834851 181868556 187595389 193774711 200555020
10044 200555020 208484226 217804586 228331604 240032455 253066957 267274463 282382628
10037 282382628 298624448 315949162 332295035 344002833 349028387 349130959 348039554
10030C48039554j04483M01473p71507l465299p123868j0687933j2776626j3110272
10022C00401039j3018898j3670133j4512140j4322964j3072358j1728758j0754054
10015B09321734r852798q910703q179624p637329p000336o326962n909598n644622
10007A49859762n171039m555208m183116m032664l709436l186416k855734k810864
9999A19355285k709011k428209k251234k268201k182529j889027j689691j713805
9991A02223578j656980j375044j228280j468903j726621j548248j116694r47605
9983I1155203j090921j142215r51716q10321q77772q88000o22143l25568l56822
9974H4089725o26513p20493n11451l10377l56055m71780m07446k64170k96522
$$ plain form
10030 348039554 347935071 348336544 347565037 344099738 336975870 326287937 313511311 300401039
10022 300401039 287382141 273712008 259199868 244876904 231804546 220075788 209321734
10015 209321734 199468936 190558233 182378609 174741280 167740944 161413982 155504384 149859762
10007 149859762 144688723 140133515 135950399 131917735 128208299 125021883 122166149 119355285
9999 119355285 116646274 114218065 111966831 109698630 107516101 105627074 103937383 102223578
9991 102223578 100566598 99191554 97963274 96494371 94767750 93219502 92102808 91155203
9983 91155203 90064282 88922067 87970351 87160030 86282258 85394258 84772115 84446547 84089725
9974 84089725 83463212 82742719 82231268 81920891 81564836 81093056 80685610 80421440 80124918
9965H0124918m54402m62235k94269k11948k99876l22826j52899j320n1613j62090
9955G7711440j44543o9131n5848j7648J17252J63557k6006k22942j27589J40948
9945G7469490K26037R6924M4013J57413K02023M8230j19795j13245K0043J51044
9935G8182177K37330K59850J92313J01468J11562K25413L24313L51354L49464
9926H0335244L40362L20764L33764L82112L50416K01707J33900K93835M64700
9917H3156804L59757J22237J39268M04636N12613L25249J81458L06695M58977
9908H5967694L87367K56807L28802N21412N93547N44664N40700O08412O64378
9899I0413783P20140Q34383R65036J042813J078755J071461R73842Q81795J031476
$$ plain form
9965 80124918 79670516 79208281 78914012 78702064 78402188 78079362 77926463 77925143 77873530 77711440
9955 77711440 77566897 77497766 77441918 77424270 77541522 77705079 77679073 77456131 77328542 77469490
9945 77469490 77695527 77792451 77836464 77993877 78195900 78244130 78124335 78011090 78031133 78182177
9935 78182177 78419507 78679357 78871670 78973138 79084700 79310113 79634426 79985780 80335244
9926 80335244 80675606 80996370 81330134 81712246 82062662 82264369 82398269 82692104 83156804
9917 83156804 83516561 83638798 83778066 84182702 84695315 85020564 85202022 85508717 85967694
9908 85967694 86355061 86611868 86940670 87462082 88055629 88600293 89140993 89749405 90413783
9899 90413783 91133923 91968306 92933342 93976155 95054910 96126371 97100213 97982008 99013484
9890I9013484J420158J662329J474074J097304R52353J044869J058880R19278
9882A08642729Q70430J001598J066779Q83484O28259N76165P26056Q47721Q11873
9873A16055094P32548P85335R67342J101801J093061J089915J272819J531702
9865A24629617J572802J377280J289295J518208J821851J907880J902833K100887
9857A38120653K429004K565097K515653K639605L046186L389891L435144L462411
9849A61603644L838492M442228M853384M977648N132783N523246N959091O216753
9841B02547269O428380O895097P637354Q377576Q968332R613751J0568806J1786114
9833B72822679J3017940J4167908J5354535J6644899J7861824J8613561J8369010
$$ plain form
9890 99013484 100433642 102095971 103570045 104667349 105619702 106664571 107723451 108642729
9882 108642729 109513159 110514757 111581536 112465020 113093279 113669444 114395500 115243221 116055094
9873 116055094 116787642 117572977 118540319 119642120 120735181 121825096 123097915 124629617
9865 124629617 126202419 127579699 128868994 130387202 132209053 134116933 136019766 138120653
9857 138120653 140549657 143114754 145630407 148270012 151316198 154706089 158141233 161603644
9849 161603644 165442136 169884364 174737748 179715396 184848179 190371425 196330516 202547269
9841 202547269 208975649 215870746 223508100 231885676 240854008 250467759 261036565 272822679
9833 272822679 285840619 300008527 315363062 332007961 349869785 368483346 386852356
9826C86852356J6621049J3334801R348305O009170M092992L120381J911129k21365
9818D41068818k921150n305793o817003p550358p914855q112331q010313p497103
9810C86939912o794094o241122n861244n410782m875010m605865m848599n415806
9802C42887390o009795o604584p277074p900774q302803q554715q809292q983265
9794B80445088q902554q646137q424818q201749p768636p155991o625907o252767
9786B18466529n842536n316983m867352m630548m469893m189073l771649l330113
9778A82048382k981161k806403k768378k660214k323747j900874j656828j587818
9770A63362959j463394j234966j092382j092184j059098r28195q61586r24235
$$ plain form
9826 386852356 403473405 416808206 426156511 432165681 436258673 439379054 441290183 441068818
9818 441068818 438147668 432841875 426024872 418474514 410559659 402447328 394437015 386939912
9810 386939912 380145818 373904696 368043452 362632670 357757660 353151795 348303196 342887390
9802 342887390 336877595 330273011 322995937 315095163 306792360 298237645 289428353 280445088
9794 280445088 271542534 262896397 254471579 246269830 238501194 231345203 224719296 218466529
9786 218466529 212623993 207307010 202439658 197809110 193339217 189150144 185378495 182048382
9778 182048382 179067221 176260818 173492440 170832226 168508479 166607605 164950777 163362959
9770 163362959 161899565 160664599 159572217 158480033 157420935 156492740 155631154 154706919
9762A54706919r63613r32653j000764j187669j233641j051545r67801j217742
9754A46151491j496721j381081r84905p90525r31689j054501q97433o39559n55952
9745A37419125o03789n44839l41598k26426l65109n92160o03972l84957k61700
9736A33494575m40365o83351o68400n12507n96661r34917j135778j043592r78053
9727A26500951j170268j386773j380966j335753j505052j725471j690579j487230
9719A14818859j439841j572315j635566j570728j542622j564708j477984j295570
9711A02719525j209919j238684j196069j049095r81844j048418j063504r21661
9703I4010331p59737p12234p40798p90288q91904j022864j065823r98011r47690
$$ plain form
9762 154706919 153743306 152810653 151809889 150622220 149388579 148337034 147369233 146151491
9754 146151491 144654770 143273689 142288784 141498259 140566570 139512069 138614636 137975077 137419125
9745 137419125 136815336 136270497 135928899 135702473 135337364 134745204 134141232 133756275 133494575
9736 133494575 133054210 132370859 131702459 131189952 130593291 129658374 128522596 127479004 126500951
9727 126500951 125330683 123943910 122562944 121227191 119722139 117996668 116306089 114818859
9719 114818859 113379018 111806703 110171137 108600409 107057787 105493079 104015095 102719525
9711 102719525 101509606 100270922 99074853 98025758 97043914 95995496 94931992 94010331
9703 94010331 93250594 92538360 91797562 91007274 90115370 89092506 88026683 87028672 86080982
9694H6080982r92640j067776j124190j203507j297391j308966j222282j151449
9686G6712781j156523j157913j093302j019045r93731r83188r38897q75915q36746
9677F7657521q45210q87032q78747p28033n08335m46574o01515p15507n87341
9668F1459227m14603m82576o74785o57985m48256l76887n29229o50364o27916
9659E6596626o26026o72276n65985l23068k61764m64055n84203m18165k45436
9650E2435648l29988m74580l97674k10048j64774k26714k41556k63257l58079
9641D9768978l43864j04229P8836q4888l81109m01120j89846j23012k61649l15710
9631D7642387k02142j58213k71250l37992k72732k61012l91084m76605l86383
$$ plain form
9694 86080982 85088342 84020566 82896376 81692869 80395478 79086512 77864230 76712781
9686 76712781 75556258 74398345 73305043 72285998 71292267 70309079 69370182 68494267 67657521
9677 67657521 66812311 65925279 65046532 64318499 63810164 63363590 62762075 62046568 61459227
9668 61459227 61044624 60562048 59887263 59229278 58781022 58404135 57874906 57224542 56596626
9659 56596626 55970600 55298324 54732339 54409271 54147507 53683452 53099249 52681084 52435648
9650 52435648 52105660 51631080 51233406 51023358 50858584 50631870 50390314 50127057 49768978
9641 49768978 49425114 49320885 49399721 49314833 48933724 48532604 48342758 48219746 47958097 47642387
9631 47642387 47440245 47282032 47010782 46672790 46400058 46139046 45747962 45271357 44884974
9622D4884974k65743k86506m04100m86391m97510m58976l87172l31965l38990
9613D1427621l55145l09593k59601k91196l34379k80842k13406k72467l64180
9604C8746812k91695j26444j21238k71318l16718k03530j68886k94955l56919
9595C6595109k42893j66744k89644m50319m63704l97888l57476k72527j21262
9586C3832652r8651l12806n31140m83254k45944r5702j25912k18477k62046k18358
9576C1240362j00978k5525j20408k79959k34010J3762J14704p3368k09288k6455
9566C0298837J83611M7158k29354j76162J51750K60137K0997j69360q6395K347
9556C0303566j27818k70040j80089r53j2673k02874l41606l16442j90011n7302
$$ plain form
9622 44884974 44619231 44332725 43928625 43442234 42944724 42485748 42098576 41766611 41427621
9613 41427621 41072476 40762883 40503282 40212086 39877707 39596865 39383459 39110992 38746812
9604 38746812 38455117 38328673 38207435 37936117 37619399 37415869 37246983 36952028 36595109
9595 36595109 36352216 36185472 35895828 35445509 34981805 34583917 34226441 33953914 33832652
9586 33832652 33734001 33421195 32890055 32406801 32160857 32065155 31939243 31720766 31458720 31240362
9576 31240362 31139384 31113859 30993451 30713492 30479482 30493244 30607948 30534580 30325292 30298837
9566 30298837 30482448 30529606 30300252 30124090 30275840 30535977 30556974 30387614 30301219 30303566
9556 30303566 30175748 29905708 29725619 29724666 29711993 29509119 29167513 28851071 28661060 28603758
9546B8603758J509m6996r9027j0393J34832O8851k26441l84735j56771J85541
9536B8070128K21158j9944j57562o6839j6216j75023l29908k43087l8977j2496
9526B7231234j90344l19292k58910j66217k21633l39626l05183j22303l2150j52556
9516B5123020k84497k05084j4675Q325j64996k70692j59476q587k1840j26856
9506B3874642j40354p5018o7464j01699m6171O7904N5260j01453j75974m6387
9496B3243286Q8644O664j80740j85166J8058J46404K6291j64889j69910j141J25441
9485B2952942J06062L6271J8906M0441N4955O5136P6547O6067M3466O5367J38932
9474B3665092J85790J60949J39913K11604L33358L79961L18004K49257K72509
$$ plain form
9546 28603758 28605267 28558271 28459244 28448851 28583683 28652534 28426093 28041358 27884587 28070128
9536 28070128 28291286 28271342 28113780 28046941 28030725 27855702 27525794 27282707 27243730 27231234
9526 27231234 27040890 26721598 26462688 26296471 26074838 25735212 25430029 25307726 25275576 25123020
9516 25123020 24838523 24633439 24618764 24627089 24462093 24191401 24031925 24023338 24001498 23874642
9506 23874642 23734288 23659270 23591806 23490107 23443936 23511840 23567100 23465647 23289673 23243286
9496 23243286 23331930 23338594 23157854 22972688 22990746 23137150 23163441 22998552 22828642 22827501 22952942
9485 22952942 23059004 23095275 23114181 23154622 23209577 23274713 23351260 23417327 23460793 23526160 23665092
9474 23665092 23850882 24011831 24151744 24363348 24696706 25076667 25394671 25643928 25916437
9465B5916437L67526M44833M69309M88797N45050O09013O50812P35873R46842
9456C1174492J205051J334541J391310J707010K343821K676320J973871M63202
9448D4269618o62078n76784J82035M35927j82572r84224j304719j256651j281121
9439C8639431j446682j511454j393716j237217j124955j000014q37132o97254
9431B9391007o13958n56475n01990m56025m17200l86287l80421l89701l67700
9422B5321250l12551k95285l49609l95998l44028k20851j31233j27170j75003
9413B2969522k21437k41679k37804k16876j64347n7089O3297P9666n1622j84767
9403B1736864j44583K2733J12900O7551K3678L6779j4578j55983j84126K1171
$$ plain form
9465 25916437 26283963 26728796 27198105 27686902 28231952 28840965 29491777 30227650 31174492
9456 31174492 32379543 33714084 35105394 36812404 39156225 41832545 43806416 44269618
9448 44269618 43607540 43030756 43212791 43648718 43466146 42481922 41177203 39920552 38639431
9439 38639431 37192749 35681295 34287579 33050362 31925407 30925393 30088261 29391007
9431 29391007 28777049 28220574 27718584 27262559 26845359 26459072 26078651 25688950 25321250
9422 25321250 25008699 24713414 24363805 23967807 23623779 23402928 23271695 23144525 22969522
9413 22969522 22748085 22506406 22268602 22051726 21887379 21830290 21893587 21973253 21921631 21736864
9403 21736864 21592281 21615014 21727914 21795465 21819143 21855922 21841344 21685361 21501235 21522406
9393B1522406K39924J87282p5929k36617j64081k6541O222l2845l3183K5462Q7281
9382B1499381J04828P2558L4523N6311J38076J89948J56178J11138J53348K62565
9372B2778854L52131M00362M27333M08395L33178K91496L63183M66653M58736
9363B6280321L50505K76115K71269K38793J30654J0747p8218j68337k62360l06712
9353B6742777l02391l27371m10551m80814m75468m19075l72178l68496m05888
9344B3180545m38195l96641k84465k04759k16223k33174j75042j23594j79862
9335B0928590k52714j85843l2282K1864k8081j2673R4021J25003K5797m6396J556
9324B0638842O2347M8684K1236J4010l4022q8468j5788J31756J13703q2484j39921
$$ plain form
9393 21522406 21762330 21949612 21873683 21637066 21472985 21446444 21452666 21419821 21386638 21412100 21499381
9382 21499381 21604209 21676767 21711290 21767601 21905677 22095625 22251803 22362941 22516289 22778854
9372 22778854 23130985 23531347 23958680 24367075 24700253 24991749 25354932 25821585 26280321
9363 26280321 26630826 26906941 27178210 27417003 27547657 27558404 27480186 27311849 27049489 26742777
9353 26742777 26440386 26113015 25702464 25221650 24746182 24327107 23954929 23586433 23180545
9344 23180545 22742350 22345709 22061244 21856485 21640262 21407088 21232046 21108452 20928590
9335 20928590 20675876 20490033 20457751 20479615 20451534 20438861 20532882 20657885 20683682 20637286 20638842
9324 20638842 20701189 20749873 20771109 20785119 20751097 20662629 20646841 20778597 20892300 20809816 20669895
9313B0669895P6714K38271N9327k16885k04385K871K0351j81080k77913j67216
9303B0019950p8475j09996r3625J1729N083j60567k46070j40593n3758j15402
9293A9038276j31835K8910J38588p832j89647r3117J59914K01150Q414q9547L6380
9282A9099654J48772Q1148j445R0962K70673L39546K81406K38730L09431M67647
9272B1326524O01082N91009M74064N19914R37609J458172J479850P92270o9745
9263B8110749m13956j58011K22493L40300J85005j20160m78476p24316p02924
9254B6260704n29856n00900o64541p52389o22948m76947m88038n18963m13209
9245B1292913k95647l25198l86146l16692k34122l07010l90773k63485p6058j43291
$$ plain form
9313 20669895 20746609 20984880 21044207 20827322 20622937 20625808 20646159 20465079 20187166 20019950
9303 20019950 19941475 19831479 19737854 19749583 19754666 19594099 19348029 19207436 19153678 19038276
9293 19038276 18906441 18935351 19073939 19066107 18876460 18783343 18943257 19144407 19152821 19063274 19099654
9282 19099654 19248426 19329574 19328129 19419091 19689764 20029310 20310716 20549446 20858877 21326524
9272 21326524 21927606 22518615 22992679 23512593 24450202 25908374 27388224 28180494 28110749
9263 28110749 27696793 27538782 27761275 28101575 28286580 28166420 27687944 26963628 26260704
9254 26260704 25730848 25229948 24565407 23813018 23190070 22713123 22225085 21706122 21292913
9245 21292913 20997266 20672068 20285922 19969230 19735108 19428098 19037325 18773840 18697782 18554491
9235A8554491l75062l80253j25870n360j73214k98057j49380K6225k9887j45818
9225A6897815n9925J15166J15305k9620j11756j17865j60133j88648r1255L5801
9215A6404885J5414j01568j23430l0332M3738N1880L0075l9769j40583j27713
9205A5982597M2229J50263L6987j05231n9076J7938j06054k54979j29835R5672
9195A5670511J2207k86680l09764j6286Q1565k12311m40359k66475p564n0786
9185A4174058k36443k19964n0233K1869n148o961l6549j52482k01738j00376n8359
9174A3127674j97059k47717p248K16356O0066k66047l05748r2493k0780j36804
9164A2130200j26071N8602J20503j5356q2166K0184P3971j3888o2256l068N579
$$ plain form
9235 18554491 18179429 17799176 17673306 17667946 17494732 17196675 17047295 17073520 17043633 16897815
9225 16897815 16837890 16953056 17068361 17038741 16926985 16809120 16648987 16460339 16369084 16404885
9215 16404885 16420299 16318731 16195301 16164969 16208707 16260587 16290662 16250893 16110310 15982597
9205 15982597 16024826 16175089 16212076 16106845 16047769 16065707 15959653 15704674 15574839 15670511
9195 15670511 15682718 15396038 15086274 15069988 15151553 14939242 14498883 14232408 14224844 14174058
9185 14174058 13937615 13717651 13667418 13689287 13684139 13677178 13640629 13488147 13286409 13186033 13127674
9174 13127674 12930615 12682898 12675650 12892006 12952072 12686025 12380277 12287784 12267004 12130200
9164 12130200 12004129 12062731 12183234 12167878 12085712 12105896 12179867 12165979 12103723 12100655 12106234
9153A2106234n0681J7014J84187J71663m6180j33877L6054J54181K7763q5489
9143A2380869K7307J35732O105j45328l9606J45183P9043j42296j79088l2386
9133A2235535Q572j01058j26560j6812J3085j07461j75753p2411N2869M2128o1049
9122A1691085j40062j51484r2066J0515N1172m3632j62807j42476l3131l1624
9112A0955490j53999k03233q9055M3695N9463J231m6478p5377p2149k034O4322
9101A0481876p016j76061k26390q4796N2794K3443o9655o6495j1878l1114q8656
9090I796052o6580J3755L6850p370m0721n6394r4318j07859l0991N6989K0405
9079I519818r2320r5187K9098P7757m7674j65957r4128O3051P9413m2470r3709
$$ plain form
9153 12106234 12055553 12072567 12256754 12428417 12382237 12248360 12284414 12438595 12466358 12380869
9143 12380869 12408176 12543908 12550013 12404685 12365079 12510262 12589305 12447009 12267921 12235535
9133 12235535 12244107 12143049 12016489 11999677 12012762 11905301 11729548 11657137 11710006 11752134 11691085
9122 11691085 11551023 11399539 11307473 11317988 11369160 11325528 11162721 11020245 10987114 10955490
9112 10955490 10801491 10598258 10509203 10552898 10612361 10613592 10567114 10491737 10419588 10417554 10481876
9101 10481876 10474860 10298799 10072409 9987613 10040407 10063850 9994195 9927700 9915822 9884708 9796052
9090 9796052 9729472 9743227 9780077 9772707 9731986 9675592 9581274 9473415 9442424 9499413 9519818
9079 9519818 9427498 9332311 9361409 9439166 9391492 9225535 9131407 9194458 9273871 9231401 9137692
9068I137692K692Q3754J5950j03553j07735M602J08540J40650J19662L8128j16147
9057I324235k40084j74492O3313K33276J52658o1156j39240r732J24552O9403
9047I342733j06760j72228l7273J32132J34614J234n0840O6033J65302N3897j51902
9036I376942j59690O3136K02813L7772k29125k51375k3085J41787O8058p9990
9026I147243r6666k0992p319n9148n5394K1731M8267l8096j24174p9546M6424
9015H782330Q4970j1359r8804n8365K1071j4554j25928j28200P955R0731N523
9004H555370j04166p4937K1262K9798j5790Q609M7055n0985k11305j82934N5469
8993H077446K09381R5249q8518q0514N3544O7183n8254j00745L3861J55726O7263
$$ plain form
9068 9137692 9140384 9224138 9240088 9136535 9028800 9033402 9141942 9282592 9402254 9440382 9324235
9057 9324235 9084151 8909659 8972972 9206248 9358906 9297750 9158510 9148778 9273330 9342733
9047 9342733 9235973 9063745 9026472 9158604 9293218 9294452 9243612 9309645 9474947 9528844 9376942
9036 9376942 9217252 9280388 9483201 9520973 9291848 9040473 9017388 9159175 9227233 9147243
9026 9147243 9050577 9029585 9022266 8963118 8907724 8929455 8977722 8939626 8815452 8735906 8782330
9015 8782330 8867300 8855941 8757137 8698772 8719843 8705289 8579361 8451161 8459116 8549847 8555370
9004 8555370 8451204 8376267 8397529 8427327 8411537 8420146 8467201 8416216 8204911 8021977 8077446
8993 8077446 8286827 8382076 8293558 8213044 8266588 8333771 8275517 8174772 8208633 8364359 8431622
8982H431622j53386k50827j16826Q1013J13221k5938j18631j6272J58340J78894
8972H281210J7505j42728j63730p9275K9200J26211J63117Q3190n7457j16232
8962H141011o7631l2049m8446m740J18041J47135J1091q2986K5413J43787K0553
8951H371179k06179j89419P1551K19412R1990p2459o7047r607m7527p8234J2796
8940H096456Q8477k52j09848l5333J02813L6800j67273j75881N6939J81463J2595
8929H086956j60036m5381J63784J01999j65971k39655j8181J55728N3267j04188
8919G828322m6147J07972Q1870q2116r9258Q5346K11605J09604p4794j36312q0443
8908G905649k8124j0884J3186M2488M2757J4112k5706o9917r0218m3839M8557
$$ plain form
8982 8431622 8278236 8027409 7910583 7991596 8104817 8078879 7960248 7943976 8102316 8281210
8972 8281210 8298715 8155987 7992257 7912982 7942182 8068393 8231510 8314700 8257243 8141011
8962 8141011 8073380 8041331 7992885 7988145 8106186 8253321 8264412 8181426 8206839 8350626 8371179
8951 8371179 8165000 7975581 8047132 8266544 8358534 8286075 8219028 8209421 8161894 8083660 8096456
8940 8096456 8184933 8184681 8074833 8039500 8142313 8179113 8011840 7835959 7892898 8074361 8086956
8929 8086956 7926920 7881539 8045323 8147322 7981351 7741696 7723515 7879243 7932510 7828322
8919 7828322 7782175 7890147 7972017 7889901 7790643 7875989 8087594 8197198 8122404 7986092 7905649
8908 7905649 7877525 7866641 7879827 7922315 7965072 7979184 7953478 7883561 7793343 7749504 7798061
8897G798061J03239Q1417K5119k5021n9859n3428M331M0090q00j7238R1216J68685
8885H155812j4642l09141k78100J31119L98675J64314k19269k26940N4515J46094
8875H002437k9708j07971M0273J26518m345j23460n2118O0139N2563O1j4642n4577
8863G895170j05042j7636J68799J86876n683q9248Q1514J84121k8561k57302j26216
8852G886792J76033J93929n9058j66042r291R9246l002r2677k303J07560P4373
8841H205560J989K2805N5848p781q0960k9577R6137J41160O2753n0846j05915
8830H311173o9595K0808P2254L2623k1171J1685Q4014P3806O155J5890Q7292N4111
8818H679045r3309j39545J2953J56849Q9398q0398j18696j3647O6593O1802N9287
$$ plain form
8897 7798061 7901300 7982717 8007836 7982815 7922956 7869528 7873859 7913949 7913149 7895911 7987127 8155812
8885 8155812 8141170 7832029 7553929 7685048 8083723 8248037 8028768 7801828 7856343 8002437
8875 8002437 7972729 7864758 7905031 8031549 8027204 7903744 7851626 7911765 7964328 7964389 7949747 7895170
8863 7895170 7790128 7772492 7941291 8128167 8122484 8033236 8114750 8298871 8270310 8013008 7886792
8852 7886792 8062825 8256754 8197696 8031654 8022363 8121609 8118607 8025930 8023627 8131187 8205560
8841 8205560 8207549 8230354 8286202 8278421 8197461 8167884 8264021 8405181 8467934 8417088 8311173
8830 8311173 8241578 8262386 8334640 8367263 8346092 8357777 8441791 8515597 8521752 8537642 8624934 8679045
8818 8679045 8585736 8446191 8459144 8615993 8705391 8624993 8506297 8492650 8559243 8621045 8680332
8807H680332R3424R2187K2525m9723n7190O30P6851J00890K4133r0723r0412P0896
8795H873820K23451J82864J168j10222o8099J2586K4629Q37J0916M3602M7815
8784I243367J9024n971l284J5396J4200k8796p3387m0892P0123J38782O8667n8759
8772I358470p9960J7613P8173J0218q7904r1051k5053R744Q567L6656P8871N0491
8760I364835l8831o5810J2798O6753j4250j26569q7726P9163J57229M9295p9099
8749I317788m6104Q7993J29292L2242o6446o1050P514N2492M9669J9919k0751
8738I502558o3415r5706r7805m0904P0800J44705P4763q4287j37535k8954M6933
8727I291153m5516j25855J9459K31460J74940j11724k26606j2348K07022J34783
$$ plain form
8807 8680332 8773756 8865943 8888468 8838745 8781555 8782185 8859036 8959926 8984059 8893336 8802924 8873820
8795 8873820 9097271 9280135 9281303 9171081 9102982 9115568 9140197 9141034 9151950 9195552 9243367
8784 9243367 9262391 9256420 9253136 9268532 9282732 9253936 9180549 9139657 9209780 9348562 9417229 9358470
8772 9358470 9278510 9296123 9374296 9384514 9296610 9205559 9180506 9190250 9198817 9235473 9314344 9364835
8760 9364835 9326004 9260194 9272992 9339745 9325495 9198926 9111200 9190363 9347592 9396887 9317788
8749 9317788 9271684 9359677 9488969 9521211 9454765 9393715 9401229 9453721 9503390 9523309 9502558
8738 9502558 9439143 9343437 9245632 9204728 9275528 9420233 9494996 9410709 9273174 9244220 9291153
8727 9291153 9245637 9119782 9139241 9370701 9545641 9433917 9207311 9194963 9401985 9536768
8717I536768p9507j35170k3334P0937R9235J24812J21381M2335k6710j058L2612
8706I762301k0728o5672M779Q0080K9044k2496R5989K37951J33033j36201k22672
8695I875408n9778O5752K1947J6450J59434K22842L9106j75895j51412K7373J04547
8684A0145774O5056P6867J41942J00128n1778j12668P586J33321P5904r6857j62436
8673A0322839m8364R2107J17674Q9931J31773J81322P1397j45188j83666N1445
8663A0681270K64852J88120j2968k9053P5588J0829j80675j61004R8904K19766
8653A1155629L6556j27623j8264J35192N3926r7712j9747J91335K15746M2219
8643A1567257o1658j0029L3427L368J8605J16244J74170J23778K9830m5303q3270
$$ plain form
8717 9536768 9457261 9322091 9298757 9369694 9468929 9593741 9715122 9757457 9730747 9729689 9762301
8706 9762301 9741573 9675901 9680680 9760760 9789804 9767308 9863297 10101248 10234281 10098080 9875408
8695 9875408 9815630 9881382 9903329 9919779 10079213 10302055 10341161 10165266 10013854 10041227 10145774
8684 10145774 10210830 10287697 10429639 10529767 10477989 10365321 10372907 10506228 10582132 10485275 10322839
8673 10322839 10274475 10366582 10484256 10574187 10705960 10887282 10958679 10813491 10629825 10681270
8663 10681270 10946122 11134242 11121274 11092221 11167809 11178638 10997963 10836959 10935863 11155629
8653 11155629 11192185 11064562 11046298 11181490 11235416 11137704 11117957 11309292 11525038 11567257
8643 11567257 11505599 11495570 11528997 11532365 11550970 11667214 11841384 11965162 11994992 11949689 11866419
8632A1866419m7948N1796R6771K0320n2774p794M4895k4228q5188M1311K14209
8621A2117789J47331j10986k25395q5172P9317J09563J00727J15954N9558o6540
8611A2242146q9076L4910J15484M2655n3113n5737k4495m263O1222J29351N3469
8600A2452553j12666j05998J15025K45297J07876o7720n1381K7163j4835n5111
8590A2540203O5377J83018Q0659r5325o5069J00987J16986j7259m9039N6930P8675
8579A2996143l5729p7386L6100J18451M7489m7434l6556J1523p363o2834p9142
8568A2863262m3908L3209J32739J67911O1344j04468j60536p6827L2992J04359
8558A3010077J44355J04217n2242j80292j03043P6666Q6065p6928j18780O4089
$$ plain form
8632 11866419 11818471 11870267 11967038 11987358 11934584 11926790 11971685 11947457 11862269 11903580 12117789
8621 12117789 12265120 12154134 11928739 11843567 11922884 12032447 12133174 12249128 12308686 12242146
8611 12242146 12153070 12187980 12303464 12346119 12293006 12237269 12212774 12208511 12269733 12399084 12452553
8600 12452553 12339887 12233889 12348914 12594211 12702087 12634367 12582986 12610149 12595314 12540203
8590 12540203 12605580 12788598 12869257 12773932 12708863 12809850 12926836 12909577 12860538 12917468 12996143
8579 12996143 12960414 12883028 12919128 13037579 13085068 13037634 13001078 13012601 13005238 12942404 12863262
8568 12863262 12819354 12852563 12985302 13153213 13214557 13110089 12949553 12872726 12905718 13010077
8558 13010077 13154432 13258649 13206407 13026115 12923072 12999738 13085803 13008875 12890095 12954184
8548A2954184J98903Q0271j00334p8776P4443J18670L3482j4851J8144K7356j7746
8537A3293746l3429R668M0737J1848m4650p2926l6843N6732J25440P0899p3388
8526A3347834j42383n4873O9133Q5414J9511r769K7611O5799N1771j4795q8567
8515A3356686q4209L5872J55421J16636l1557o8764N8129J35905K4335j19228
8505A3579226r9798L0013J12307J21011P8677o0589k37051k10529Q1506L00964
8495A3695737J57240j14994j02560J20473J30852j12893j92166N5797K45473O2819
8485A3945778k41970k60642j7041J51756R7731l8745j04570p0602K8979J16882
8475A3607556R9900k777m9872J1435N6433L48n7853k9631M233j9713Q178J42350
$$ plain form
8548 12954184 13153087 13233358 13133024 13054248 13128691 13247361 13280843 13265992 13284136 13311492 13293746
8537 13293746 13260317 13269985 13310722 13322570 13277920 13204994 13168151 13224883 13350323 13421222 13347834
8526 13347834 13205451 13150578 13219711 13305125 13324636 13314867 13342478 13408277 13460048 13445253 13356686
8515 13356686 13272477 13308349 13463770 13580406 13548849 13480085 13538214 13674119 13698454 13579226
8505 13579226 13479428 13509441 13621748 13742759 13821436 13760847 13523796 13313267 13394773 13695737
8495 13695737 13852977 13737983 13635423 13755896 13886748 13773855 13581689 13637486 13882959 13945778
8485 13945778 13703808 13443166 13426125 13577881 13675612 13636867 13532297 13461695 13490674 13607556
8475 13607556 13707456 13704679 13654807 13666242 13722675 13723023 13665170 13635539 13639772 13620059 13628237 13770587
8463A3770587J83436k8914k63883j58802K19338M00911J52396k03096k38895J9425
8453A3852503J86816N6165j69179j93263j2316J31779J10086M9299P6217R8250
8443A4186357n930j15992l7839J28126R7570j06576j27906J45984L46092J83319
8433A4693205r0066r4759Q1431R3179o3490j01399K0581O2405k2693j7685J15139
8422A4675848J36847k7313j31639k6714J12897J26395J05444J28105P2706r9563
8412A5073013j68405O617K21416K35243J15229M3733J0856m9943m0718J04705
8402A5551746J98052P0217j00210m5859J46012J79850K9465p1096l5212J9178
8392A5942143O6640J82328K78159J78458l5688r6548J6709N8563l5256m8715Q8697
$$ plain form
8463 13770587 13954023 13925109 13661226 13502424 13721762 14122673 14275069 14071973 13833078 13852503
8453 13852503 14039319 14095484 13926305 13733042 13720726 13852505 13962591 14011890 14088107 14186357
8443 14186357 14180427 14064435 14026596 14154722 14252292 14145716 14017810 14163794 14509886 14693205
8433 14693205 14603139 14508380 14589811 14682990 14619500 14518101 14538682 14601087 14578394 14560709 14675848
8422 14675848 14812695 14785382 14653743 14627029 14739926 14866321 14971765 15099870 15172576 15073013
8412 15073013 14904608 14911225 15132641 15367884 15483113 15526846 15537702 15487759 15447041 15551746
8402 15551746 15749798 15820015 15719805 15673946 15819958 15999808 16029273 15958177 15922965 15942143
8392 15942143 16008783 16191111 16469270 16647728 16612040 16515492 16532201 16590764 16555508 16506793 16595490
8381A6595490J53174L6787n0738L7337J36217R8472M9169Q8250N9970j08830j53568
8370A6941730J04849L54696K17752j21390j62087J44000L39087J69969r1531j27980
8360A7769095R107J13614J39226J22406M0646p1763o7276Q3465J78110P1855p7744
8349A8310741m3276J24040J87365Q5892j0608J3663P9314Q5394N9759O3424O3871
8338A9019579N615n8523k2926R1548J28032J4830r9153l7742J32479J81623O1349
8327A9416711k1567N5403J21535j26j69575j24927J02104K25665J26492k1490
8317A9710225n6581j8606J2568M3882O9018M2768J4378Q3827J76307R8930j07719
8306B0068997j51440N4306K06775P7360j22666r5533P3358J13028L5782M9614
$$ plain form
8381 16595490 16748664 16785451 16734713 16772050 16908267 17006739 17055908 17144158 17204128 17095298 16941730
8370 16941730 17046579 17401275 17619027 17497637 17335550 17479550 17818637 17988606 17897075 17769095
8360 17769095 17778202 17891816 18031042 18153448 18194094 18122331 18055055 18138520 18316630 18388485 18310741
8349 18310741 18267465 18391505 18578870 18664762 18654154 18667817 18747131 18832525 18892284 18955708 19019579
8338 19019579 19025194 18966671 18943745 19035293 19163325 19178155 19079002 19041260 19173739 19355362 19416711
8327 19416711 19395144 19450547 19572082 19571956 19402381 19277454 19379558 19605223 19731715 19710225
8317 19710225 19653644 19635038 19647606 19691488 19760506 19803274 19817652 19901479 20077786 20176716 20068997
8306 20068997 19917557 19971863 20178638 20255998 20133332 20037799 20111157 20224185 20259967 20309581
8296B0309581J31890P1423j16794j87423p9248Q374j1886O37Q5419O1011j34683
8285B0138301k68901j52380O7223J32195L3197l0764N3344J91563K00624m041
8275B0360361k73689l14580m7566J96845Q0900k10823j94268J59500L35711P5480
8265B0167871k09021j02675J63688J47024p1744r4513P8641R8699o9040r4477
8255B0014453Q9694J49971m1831j59444J7339K21982J49970o0394j01555J7081
8245B0297266P5021L7829L3573O1192J6623o7507p0598k1494m8087j24206r8914
8234B0090698K8248Q3146l557q9890n2864L8831O0692J6627j852L7319Q1992Q3138
8222B0372528N1714L4305N0375N7839J960r3087j28534n9688L3618N8456L8160
$$ plain form
8296 20309581 20441471 20512894 20396100 20208677 20129429 20137803 20125917 20126554 20211973 20272984 20138301
8285 20138301 19869400 19717020 19784243 19916438 19949635 19918871 19972215 20163778 20364402 20360361
8275 20360361 20086672 19772092 19724526 19921371 20002271 19791448 19597180 19756680 20092391 20167871
8265 20167871 19958850 19856175 20019863 20166887 20095143 20000630 20079271 20177970 20108930 20014453
8255 20014453 20104147 20254118 20212287 20052843 20070182 20292164 20442134 20381740 20280185 20297266
8245 20297266 20372287 20410116 20443689 20504881 20521504 20453997 20383399 20361905 20313818 20189612 20090698
8234 20090698 20118946 20202092 20198535 20108645 20055781 20094612 20155304 20171931 20170079 20207398 20289390 20372528
8222 20372528 20424242 20458547 20508922 20566761 20568721 20475634 20347100 20287412 20321030 20379486 20417646
8211B0417646N6654J12191J16041L1565o1005n8275M5233J44835J32784K8385
8201B0966054k1920P3423J99467J69492R09r3153j8573P1733M6222k48M9726J09886
8189B1553018O2638n98N1598J12395P614j49137r4270J32153K19671R5078K8480
8178B2018640J41163J86146L328j57774m0401J82435J99230O8575O9910J91028
8168B2862280J64463l1530j05688O0880K17360J57479L3130P0605J99607J88942
8158B3817528K1361q6454K121J78525K50539J64936L8481R907Q5854J47741J19635
8147B4750174P4240J06298J62686J26066L5767N6151K06232L01101K28242J09315
8137B6156272Q5271J04107O2462J6076P2813J78382J99024J51011J54854K03886
$$ plain form
8211 20417646 20474300 20586491 20702532 20734097 20673092 20614817 20660050 20804885 20937669 20966054
8201 20966054 20944134 21017557 21217024 21386516 21387425 21294272 21275699 21347432 21393654 21393406 21443132 21553018
8189 21553018 21615656 21615058 21666656 21779051 21786665 21637528 21543258 21675411 21895082 21990160 22018640
8178 22018640 22159803 22345949 22349277 22191503 22151102 22333537 22532767 22601342 22671252 22862280
8168 22862280 23026743 22995213 22889525 22950405 23167765 23325244 23358374 23428979 23628586 23817528
8158 23817528 23838889 23752435 23754556 23933081 24183620 24348556 24387037 24396944 24482798 24630539 24750174
8147 24750174 24824414 24930712 25093398 25219464 25255231 25311382 25517614 25818715 26046957 26156272
8137 26156272 26241543 26345650 26408112 26424188 26497001 26675383 26874407 27025418 27180272 27384158
8127B7384158J81371R5655Q7955J79382K15875J30312O8016J49195K70398K71572
8117B9033889J73907J14978J43758K11904K86613L40702L04852J69380P0447J28755
8107C0979185K57437K87369K30247K29127K81869K43069J18420J06455K61816
8098C2994994L60012K45943R7966J39850K73729K61757J43135J60049L20981L71993
8088C5370409K37800J61500K85290L95215K83033J10707J50931L44668M18365
8079C7757918L36506L15366M12236M25368K63396J23953J79038L19934L71351
8070D0505066L60826L91834M11938L22314K10095K47343M10851N08806M64256
8061D3833329L82190L43360L21563L18266L89280M98309N23233M61880M56080
$$ plain form
8127 27384158 27565529 27661184 27749139 27928521 28144396 28274708 28342724 28491919 28762317 29033889
8117 29033889 29207796 29322774 29466532 29678436 29965049 30305751 30610603 30779983 30850430 30979185
8107 30979185 31236622 31523991 31754238 31983365 32265234 32508303 32626723 32733178 32994994
8098 32994994 33355006 33600949 33698915 33838765 34112494 34374251 34517386 34677435 34998416 35370409
8088 35370409 35608209 35769709 36054999 36450214 36733247 36843954 36994885 37339553 37757918
8079 37757918 38094424 38409790 38822026 39247394 39510790 39634743 39813781 40133715 40505066
8070 40505066 40865892 41257726 41669664 41991978 42202073 42449416 42860267 43369073 43833329
8061 43833329 44215519 44558879 44880442 45198708 45587988 46086297 46609530 47071410 47527490
8052D7527490N45531N84589M98991M32046M96057N62888M91362M06167N12449
8043E2057570P35110Q04448O59569N10644N00014N50386N82945O39496P14011
8034E7754193O93769N74158N24702O19617O98919O35884N48185N75089O31371
8025F3255887N88650N35360O12371P21988O75790N45376N70375P50482Q28033
8016F9084312O98579N57526N74352O73942P30715P55763P88938Q00825P99116
8007G5464068Q52279R26326Q88097P49252O99801Q12889R39742R89290J051981
7998H3373725J128881J045952Q20545P81917J061859J293162J163571R55276J079515
7989I2704403J341363J243648Q74512Q33678J253281J552648J349571J013999
$$ plain form
8052 47527490 48073021 48657610 49156601 49588647 50084704 50647592 51138954 51545121 52057570
8043 52057570 52792680 53597128 54256697 54767341 55267355 55817741 56400686 57040182 57754193
8034 57754193 58447962 59022120 59546822 60166439 60865358 61501242 62049427 62624516 63255887
8025 63255887 63844537 64379897 64992268 65714256 66390046 66935422 67505797 68256279 69084312
8016 69084312 69782891 70340417 70914769 71588711 72319426 73075189 73864127 74664952 75464068
8007 75464068 76316347 77242673 78130770 78880022 79579823 80392712 81332454 82321744 83373725
7998 83373725 84502606 85548558 86369103 87151020 88212879 89506041 90669612 91624888 92704403
7989 92704403 94045766 95289414 96163926 96997604 98250885 99803533 101153104 102167103
7981A02167103J012974J222828J282491J211764J235349J304079J244981J163429
7973A11844998J258539J410241J377700J268614J369049J603339J628838J437696
7965A23199014J389301J594506J730624J603710J472103J598163J829893J889064
7957A36306378J806525J794402J879551J938012J969126K080345K258792K366005
7949A52399136K341845K270811K266041K382645K599753K811026K901128K901682
7941A72874067K979964L201452L426554L543015L659325L915696M228550M423620
7933B02252243M545066M803288N226083N587322N741820N842240O108934O515979
7925B46622975O858295P075107P337825P772352Q231170Q482548Q574935Q811913
$$ plain form
7981 102167103 103180077 104402905 105685396 106897160 108132509 109436588 110681569 111844998
7973 111844998 113103537 114513778 115891478 117160092 118529141 120132480 121761318 123199014
7965 123199014 124588315 126182821 127913445 129517155 130989258 132587421 134417314 136306378
7957 136306378 138112903 139907305 141786856 143724868 145693994 147774339 150033131 152399136
7949 152399136 154740981 157011792 159277833 161660478 164260231 167071257 169972385 172874067
7941 172874067 175854031 179055483 182482037 186025052 189684377 193600073 197828623 202252243
7933 202252243 206797309 211600597 216826680 222414002 228155822 233998062 240106996 246622975
7925 246622975 253481270 260556377 267894202 275666554 283897724 292380272 300955207 309767120
7917C09767120R293336R682107R623215R255200R017292Q990993Q771584Q064794
7909C82465641P067261O072327N012015L682066K193677Q49345l06755j463742
7901D05571835k629683l594137m309854m971291n644145o126744o293107o298910
7893C65703964o307247o262138o100743n952091n910151n807922n470701n050569
7885C18842402m833099m798829m671067m377337m155359m131180m081382l787724
7877B84006425l412234l272317l353182l322261l031603k735250k693427k785295
7869B59400856k723709k510624k408648k505687k600696k570547k564078k701208
7861B38815659k841417k847900k850758k994313l122319l029728k875805k970718
$$ plain form
7917 309767120 319060456 328742563 338365778 347620978 356638270 365629263 374400847 382465641
7909 382465641 389532902 395605229 400617244 404299310 406492987 407342332 407035577 405571835
7901 405571835 402942152 399348015 395038161 390066870 384422725 378295981 372002874 365703964
7893 365703964 359396717 353134579 347033836 341081745 335171594 329363672 323892971 318842402
7885 318842402 314009303 309210474 304539407 300162070 296006711 291875531 287794149 284006425
7877 284006425 280594191 277321874 273968692 270646431 267614828 264879578 262186151 259400856
7869 259400856 256677147 254166523 251757875 249252188 246651492 244080945 241516867 238815659
7861 238815659 235974242 233126342 230275584 227281271 224158952 221129224 218253419 215282701
7853B15282701l226786l236311k914335k654388k746953l024301l228848l364854
7845A90885925l477486l422611l125378k802240k663051k625902k566519k584616
7837A67618122k740475k798517k574523k295460k240053k260238k096386j942079
7829A48670391k151253k522097k493299k047140j782217j972774k179965k032814
7821A31488832j806113j861230k015962j925920j709505j696593j818658j743749
7813A16911102j457077j246492j204491j166755j091214j098132j144348j028290
7805A07474303p50401n50979n49533o14968o04311m72009j72893K35010M10780
7796A04404999J8836p47982j281521j281489j027610q38860o60081l88939k37624
$$ plain form
7853 215282701 212055915 208819604 205905269 203250881 200503928 197479627 194250779 190885925
7845 190885925 187408439 183985828 180860450 178058210 175395159 172769257 170202738 167618122
7837 167618122 164877647 162079130 159504607 157209147 154969094 152708856 150612470 148670391
7829 148670391 146519138 143997041 141503742 139456602 137674385 135701611 133521646 131488832
7821 131488832 129682719 127821489 125805527 123879607 122170102 120473509 118654851 116911102
7813 116911102 115454025 114207533 113003042 111836287 110745073 109646941 108502593 107474303
7805 107474303 106723902 106172923 105623390 105008422 104404111 103932102 103759209 103994219 104404999
7796 104404999 104423835 103675853 102394332 101112843 100085233 99246373 98586292 98197353 97959729
7787I7959729m45914q74752j191554j287870j253689j123671r38103q90795j093090
7778H8860291j305792j232294r90526r43960j111757j134606q64902o06925o38488
7769H0031041q26498r09141q84241q81335q60093p07690n11426m70723n88565
7760G3391329o74371o34856n62181n26910m70898l51773k41647k13977k41875
7751F9472841k70257k93538k95052j98750K1057K27718K23542k8846l53779n51240
7741F7953696n86726n58575n21334m23963k45545j14468j97509m75744p23563
7732F4106269p51551o04832m72345m64759n52653o66311p52802p55778o48625
7723E8436613n02415m31324m48917m60973m21787m00239m43996m76514m13596
$$ plain form
7787 97959729 97513815 96639063 95447509 94159639 92905950 91782279 90844176 89953381 88860291
7778 88860291 87554499 86322205 85331679 84387719 83275962 82141356 81276454 80669529 80031041
7769 80031041 79204543 78295402 77411161 76529826 75669733 74962043 74450617 73979894 73391329
7760 73391329 72716958 72082102 71519921 70993011 70522113 70170340 69928693 69714716 69472841
7751 69472841 69202584 68909046 68613994 68415244 68436301 68664019 68887561 68858715 68504936 67953696
7741 67953696 67366970 66808395 66287061 65863098 65617553 65503085 65305576 64829832 64106269
7732 64106269 63354718 62749886 62277541 61812782 61260129 60593818 59841016 59085238 58436613
7723 58436613 57934198 57502874 57053957 56592984 56171197 55770958 55326962 54850448 54436852
7714E4436852l13316l06175m03546m71257l99755k34044j18977j51816k92521
7705E1745445l99466l66782k39214j57675j80369k23775k13072j98907k45630
7696D9520555k90875k39638j43134j40034k37481k93202k24868j08672n2579q9683
$$ plain form
7714 54436852 54123536 53817361 53413815 52942558 52542803 52308759 52189782 52037966 51745445
7705 51745445 51345979 50979197 50739983 50582308 50401939 50178164 49965092 49766185 49520555
7696 49520555 49229680 48990042 48846908 48706874 48469393 48176191 47951323 47842651 47790072 47700389
$$ [...]
##END NTUPLES=NMR SPECTRUM
##END=
