##TITLE=1H ikalashn
CG-1214-2
17.10.2024
##JCAMPDX= 6.0         $$ Bruker NMR JCAMP-DX V2.0
##DATA TYPE= NMR SPECTRUM
##DATA CLASS= NTUPLES
##ORIGIN= UXNMR, Bruker Analytische Messtechnik GmbH
##OWNER= root
$$ TOPSPIN		Version 1.3
$$ 2024-10-17 10:10:31.812 +0400  Irina@DPX200
$$ Compression mode = diff/dup
##.OBSERVE FREQUENCY= 200.131392401
##.OBSERVE NUCLEUS= ^1H
##.ACQUISITION MODE= SIMULTANEOUS
##.ACQUISITION SCHEME= undefined
##.AVERAGES= 16
##.DIGITISER RES= 18
##SPECTROMETER/DATA SYSTEM= spect
##.PULSE SEQUENCE= zg
##.SOLVENT NAME= CDCl3
##.SHIFT REFERENCE= INTERNAL, CDCl3, 1, 17.95386
##AUDIT TRAIL= $$ (NUMBER, WHEN, WHO, WHERE, WHAT)
$$ ##TITLE= Audit trail, TOPSPIN		Version 1.3
$$ ##JCAMPDX= 5.01
$$ ##ORIGIN= Bruker BioSpin GmbH
$$ ##OWNER= Irina
$$ $$ F:/spectra/data/iren/nmr/1H/4/pdata/1/auditp.txt
$$ ##AUDIT TRAIL=  $$ (NUMBER, WHEN, WHO, WHERE, VERSION, WHAT)
(   1,<2024-10-17 10:10:09.234 +0400>,<Irina>,<DPX200>,<TOPSPIN 1.3>,
      <created by zg
	started at 2024-10-17 10:09:01.234 +0400,
	POWCHK disabled, PULCHK disabled
       configuration hash MD5:
       BE 6D 3F 07 2A EA 11 49 91 17 2B D3 AF B3 58 0D
       data hash MD5: 16K
       26 1E 05 8C 79 7C 8D 24 9F 6D 2B 94 E9 B1 DB E9>)
(   2,<2024-10-17 10:10:14.937 +0400>,<Irina>,<DPX200>,<TOPSPIN 1.3>,
      <Start of raw data processing
       fp BC_mod = 2 FT_mod = 6 PKNL = 1 PHC0 = 305.8409 PHC1 = 25.52124 SI = 32K 
       data hash MD5: 32K
       9F CE 88 92 AF 3D 67 2B 19 7B 12 18 62 37 40 C5>)
(   3,<2024-10-17 10:10:18.468 +0400>,<Irina>,<DPX200>,<TOPSPIN 1.3>,
      <apk 
       data hash MD5: 32K
       7F 6E 50 D2 F8 A7 FA 52 46 CA 19 B0 C2 33 1B 61>)
(   4,<2024-10-17 10:10:24.484 +0400>,<Irina>,<DPX200>,<TOPSPIN 1.3>,
      <abs n ABSG = 5 
       data hash MD5: 32K
       51 74 15 AF 08 FE 92 85 90 CE 4F 69 FC B1 19 14>)
$$ ##END=
$$ 
$$ $$ hash MD5
$$ $$ F3 95 E5 0F EA 00 C9 96 02 CD 34 2D CA 7C A6 54
##$RELAX= 
##$RELAX= 
##$RELAX= 
##$RELAX= 
##$RELAX= 
##$RELAX= 
##$RELAX= 
##$RELAX= 
##$RELAX= 
$$ Bruker specific parameters
$$ --------------------------
##$DU= <F:/spectra>
##$EXPNO= 4
##$NAME= <1H>
##$PROCNO= 1
##$TYPE= <nmr>
##$USER= <iren>
##$AMP= (0..31)
100 100 100 100 100 100 100 100 100 100 100 100 100 100 100 100 100 100 
100 100 100 100 100 100 100 100 100 100 100 100 100 100 
##$ANAVPT= -1
##$AQSEQ= 0
##$AQ_mod= 1
##$AUNM= <au_zg>
##$AUTOPOS= <>
##$BF1= 200.13
##$BF2= 200.13
##$BF3= 200.13
##$BF4= 200.13
##$BF5= 200.13
##$BF6= 200.13
##$BF7= 200.13
##$BF8= 200.13
##$BYTORDA= 1
##$CFDGTYP= 0
##$CFRGTYP= 5
##$CHEMSTR= <none>
##$CNST= (0..63)
1 1 145 1 1 1 1 1 1 1 1 1 1 1 1 1 1 1 1 1 1 1 1 1 1 1 1 1 1 1 1 1 1 1 
1 1 1 1 1 1 1 1 1 1 1 1 1 1 1 1 1 1 1 1 1 1 1 1 1 1 1 1 1 1 
##$CPDPRG= <>
##$CPDPRG1= <>
##$CPDPRG2= <>
##$CPDPRG3= <>
##$CPDPRG4= <mlev>
##$CPDPRG5= <mlev>
##$CPDPRG6= <mlev>
##$CPDPRG7= <mlev>
##$CPDPRG8= <mlev>
##$CPDPRGB= <>
##$CPDPRGT= <>
##$D= (0..63)
0 2 0 0 0 0 0 0 0 0.06 0 0.03 0 0 0 0 0.0002 0 0 0 0 0 0 0 0 0 0 0 0 0 
$$ [...]
##$SW_h= 4401.40845070422
##$TD= 16384
##$TD0= 1
##$TE= 300
##$TE2= 300
##$TE3= 300
##$TEG= 300
##$TL= (0..7)
0 120 120 120 120 120 120 120 
##$TP= (0..7)
150 150 150 150 150 150 150 150 
##$TP07= 0
##$TPNAME0= <>
##$TPNAME1= <>
##$TPNAME2= <>
##$TPNAME3= <>
##$TPNAME4= <>
##$TPNAME5= <>
##$TPNAME6= <>
##$TPNAME7= <>
##$TPOAL= (0..7)
0.5 0.5 0.5 0.5 0.5 0.5 0.5 0.5 
##$TPOFFS= (0..7)
0 0 0 0 0 0 0 0 
##$TUNHIN= 0
##$TUNHOUT= 0
##$TUNXOUT= 0
##$USERA1= <user>
##$USERA2= <user>
##$USERA3= <user>
##$USERA4= <user>
##$USERA5= <user>
##$V9= 5
##$VALIST= <valist>
##$VCLIST= <CCCCCCCCCCCCCCC>
##$VD= 0
##$VDLIST= <DDDDDDDDDDDDDDD>
##$VPLIST= <PPPPPPPPPPPPPPP>
##$VTLIST= <TTTTTTTTTTTTTTT>
##$WBST= 1024
##$WBSW= 25
##$XGAIN= (0..3)
0 0 0 0 
##$XL= 0
##$YL= 0
##$YMAX_a= 722372
##$YMIN_a= -1832862
##$ZGOPTNS= <>
##$ZL1= 120
##$ZL2= 120
##$ZL3= 120
##$ZL4= 120
##$ABSF1= 17.95386
##$ABSF2= -4.038887
##$ABSG= 5
##$ABSL= 3
##$ALPHA= 0
##$AQORDER= 0
##$ASSFAC= 0
##$ASSFACI= 0
##$ASSFACX= 0
##$ASSWID= 0
##$AUNMP= <proc_1d>
##$AXLEFT= 0
##$AXRIGHT= 0
##$AXTYPE= 0
##$AXUNIT= <>
##$AZFE= 0.1
##$AZFW= 0.1
##$BCFW= 0
##$BC_mod= 2
##$BYTORDP= 0
##$COROFFS= 0
##$CY= 7568.61572265625
##$DATMOD= 1
##$DC= 0
##$DFILT= <>
##$DTYPP= 0
##$F1P= 17.9538593292236
##$F2P= -4.03888763876832
##$FCOR= 0.5
##$FTSIZE= 32768
##$FT_mod= 6
##$GAMMA= 0
##$GB= 0
##$INTBC= 0
##$INTSCL= 1.483618e-010
##$ISEN= 128
##$LB= 0
##$LEV0= 0
##$LPBIN= 0
##$MAXI= 945.577
##$MC2= 0
##$MEAN= 0
##$ME_mod= 0
##$MI= -402.1523
##$NCOEF= 0
##$NC_proc= -5
##$NLEV= 6
##$NOISF1= 8.587773
##$NOISF2= 6.764455
##$NSP= 0
##$NTH_PI= 0
##$NZP= 0
##$OFFSET= 17.95386
##$PC= 1
##$PHC0= 307.5701
##$PHC1= 21.43917
##$PH_mod= 1
##$PKNL= yes
##$PPARMOD= 0
##$PPDIAG= 0
##$PPIPTYP= 0
##$PPMPNUM= 100
##$PPRESOL= 1
##$PSCAL= 0
##$PSIGN= 0
##$REVERSE= no
##$SF= 200.13
##$SI= 32768
##$SIGF1= 16.12182
##$SIGF2= -4.496377
##$SINO= 3.521527
##$SIOLD= 32768
##$SREGLST= <1H.CDCl3>
##$SSB= 0
##$STSI= 32768
##$STSR= 0
##$SW_p= 4401.40845070423
##$SYMM= 0
##$S_DEV= 0
##$TDeff= 16384
##$TDoff= 0
##$TI= <>
##$TILT= no
##$TM1= 0
##$TM2= 0
##$TOPLEV= 0
##$USERP1= <user>
##$USERP2= <user>
##$USERP3= <user>
##$USERP4= <user>
##$USERP5= <user>
##$WDW= 0
##$XDIM= 32768
##$YMAX_p= 301925727
##$YMIN_p= -162809
$$ End of Bruker specific parameters
$$ ---------------------------------
##NTUPLES= NMR SPECTRUM
##VAR_NAME=  FREQUENCY,     SPECTRUM/REAL,   SPECTRUM/IMAG
##SYMBOL=    X,             R,               I
##VAR_TYPE=  INDEPENDENT,   DEPENDENT,       DEPENDENT
##VAR_FORM=  AFFN,          ASDF,            ASDF
##VAR_DIM=   32768,         32768,           32768
##UNITS=     HZ,            ARBITRARY UNITS, ARBITRARY UNITS
##FACTOR=    0.134324425510551, 1,           1
##FIRST=     4401.40845070423, -87505,       -1672392
##LAST=      0,             27394,           -2271523
##MIN=       0,             -162809,         0
##MAX=       4401.40845070423, 301925727,    0
$$ Real data points
##PAGE= N=1
##DATA TABLE= (X++(R..R)), XYDATA
$$ [...]
15079 161193 209772 232434 220497 212811 209400 179320 139544 143333 188388 210763 180640 139216
15067 139216 127117 136089 147901 165028 181885 174812 142658 116028 109889 108255 107873 128649 163150
15054 163150 167125 127335 92388 103800 136687 143373 120971 100554 98579 111778 134042 150243
15042 150243 141913 124289 140888 190618 205171 144868 74369 80979 148690 185798 160953 131748
15030 131748 135696 135048 97420 61179 74682 118652 139032 127099 119709 137046 162465 177250
15018 177250 180572 176507 168339 164980 170611 169942 145683 109551 93069 104431 115914 102115 73394
15005 73394 60094 75131 104096 125890 132088 127789 122116 119987 119154 113672 102647 96195 108104
14992 108104 136787 156342 139520 96350 76024 111939 172425 192171 154047 108648 100239 108282
14980 108282 91841 61931 63189 97920 122219 119304 120945 139765 136494 88992 45607 61277
14968 61277 115604 148690 151430 157668 163775 129842 64580 35962 74852 130543 151212 149387
14956 149387 150645 136987 94278 65627 91460 132349 123608 83189 86406 141164 171365 137480
14944 137480 95064 101367 131074 131828 111815 114708 138344 137812 101390 74270 98729 161139 208018
14931 208018 198740 139154 75069 53666 83508 132017 162156 163361 147053 128757 122191 135750
14919 135750 162832 184088 186996 177191 169250 174778 195736 216409 209603 170161 132964 132030 153671
14906 153671 165018 174406 211178 251537 233385 159879 116669 152405 209043 217348 197542 202767
14894 202767 218623 197455 154943 148850 181004 200009 193042 200324 238964 279778 301129 304770
14882 304770 282784 233473 201993 230746 275144 254904 190575 188308 268931 321441 273070 201612
14870 201612 208639 271252 306419 308284 321220 331061 292928 237382 239445 289933 301103 250071
14858 250071 219235 264065 325227 321762 270462 252838 296187 345274 346678 316437 307734 334218
14846 334218 354093 335471 309133 324149 366607 374288 336085 314181 341988 366905 342996 317168
14834 317168 351677 410718 411838 359713 334961 362828 386869 373971 354330 346314 329561 310240
14822 310240 326711 367452 369971 329391 318013 360482 384643 347409 313241 338932 372299 352278
14810 352278 326840 366087 424804 411491 349324 340959 395314 418937 380431 356246 388192 412908
14798 412908 379582 338485 352569 399329 423462 424881 431726 436513 422520 414812 442700 478616
14786 478616 472860 430860 401338 398925 391570 364907 351391 381414 437153 473998 473546 459774
14774 459774 463429 480489 479624 453687 440198 468549 510333 521941 518567 548964 602005 609421
14762 609421 557143 519609 547462 591534 590811 571187 586998 617638 607519 574451 585162 636566
14750 636566 654916 619399 598475 639152 696391 709261 686901 677392 695816 722065 737849 735629
14738 735629 718622 712937 748137 808033 838106 821785 807518 834387 875119 887881 883256 895850
14726 895850 922403 936240 939614 954164 975884 984924 988507 1010872 1047915 1072079 1077991 1086383
14714 1086383 1105874 1125437 1142201 1163295 1181397 1180742 1168349 1170432 1196561 1232054 1263592 1287628
14702 1287628 1297687 1289905 1278861 1284283 1305119 1325492 1337283 1340378 1339198 1356887 1421034 1506923
14690 1506923 1537460 1486042 1435161 1468191 1545571 1573303 1558063 1584197 1653766 1680167 1654624
14679 1654624 1680714 1796209 1894394 1899075 1895713 1987287 2125369 2206011 2247396 2333846 2446500
14668 2446500 2501268 2520927 2614935 2794351 2954077 3051230 3159221 3316283 3458912 3553908
14658 3553908 3666189 3827779 3954623 3974595 3940215 3927871 3912342 3836516 3731019 3658832
14648 3658832 3595141 3470060 3297840 3162793 3094104 3042991 2972349 2889830 2803267 2718880 2672744
14637 2672744 2689070 2716751 2683673 2607228 2571777 2598889 2624815 2615624 2618320 2671841 2743268 2788232
14625 2788232 2815147 2856505 2925885 3027801 3159620 3282595 3345444 3359023 3390223 3458160 3502121
14614 3502121 3486895 3470157 3512802 3583476 3617258 3621193 3648337 3697804 3714496 3674657 3606570
14603 3606570 3531891 3445480 3354985 3287675 3248117 3207686 3143231 3057096 2960774 2868520 2800804
14592 2800804 2760661 2713240 2624931 2516711 2439193 2398973 2354917 2290784 2243350 2241969 2261321
14581 2261321 2258400 2226356 2186458 2149070 2109453 2071367 2052499 2065806 2102824 2134248 2130233 2090241
14569 2090241 2049594 2043106 2065540 2082890 2077541 2063616 2062491 2084338 2129728 2186042 2226243 2237220
14557 2237220 2245175 2282645 2334527 2355774 2344891 2353677 2409338 2474578 2513887 2555969 2645397 2761158
14545 2761158 2837455 2858758 2885293 2974698 3115225 3254061 3366586 3474723 3607120 3763164
14535 3763164 3921206 4069628 4215485 4362521 4498915 4620679 4750787 4907180 5060082
14526 5060082 5160250 5215334 5292449 5419328 5523533 5512523 5387514 5228320 5081028 4919169
14516 4919169 4718753 4511174 4335542 4184611 4034191 3892674 3778799 3672044 3533840
14507 3533840 3372626 3240446 3156816 3079766 2972679 2860343 2784146 2731415 2657817 2568251
14497 2568251 2519580 2531032 2542457 2493883 2411225 2370392 2394262 2428920 2418281 2363528 2303837
14486 2303837 2270894 2271820 2290678 2296619 2270909 2231550 2210942 2209601 2199979 2176158 2161662 2159445
14474 2159445 2138541 2092135 2064497 2083541 2102974 2059574 1966426 1899398 1899467 1933175 1947349 1921898
14462 1921898 1867426 1809881 1782828 1799076 1823068 1805010 1748827 1709722 1714017 1722104 1693247 1650550
14450 1650550 1646352 1684858 1717425 1708959 1676558 1656965 1659683 1666389 1665422 1668386 1686623 1703226 1687259
14437 1687259 1637759 1593159 1585448 1604191 1622524 1637153 1656793 1671477 1668832 1665905 1684467 1706993
14425 1706993 1704554 1698373 1733475 1791228 1800293 1753437 1736798 1801421 1877262 1877973 1833270 1837280
14413 1837280 1903103 1958000 1969397 1986201 2044032 2107263 2133582 2137526 2156819 2197351 2240750
14402 2240750 2274938 2294151 2295513 2292786 2308410 2341153 2369143 2390471 2424623 2465847 2478486 2454912
14390 2454912 2434667 2444774 2464137 2471279 2479760 2493472 2476868 2416590 2368556 2385804 2433687 2440965
14378 2440965 2409015 2398155 2420608 2427553 2405735 2405126 2446859 2478071 2458826 2432310 2456085 2509380
14366 2509380 2527976 2502435 2481819 2493394 2515700 2531353 2555470 2599343 2645475 2676338 2699623
14355 2699623 2728420 2759299 2786407 2817708 2859397 2899852 2928055 2955841 3001266 3058137 3104917
14344 3104917 3140816 3188101 3254579 3318844 3364571 3406076 3460632 3516659 3558113 3604855 3690090
14333 3690090 3801836 3890280 3941012 3995930 4083307 4174682 4243377 4318541 4431128 4546359 4617479
14322 4617479 4681394 4819694 5027882 5207910 5308177 5389531 5518667 5674635 5813494 5954730
14312 5954730 6130952 6304223 6415725 6487655 6592805 6739548 6869266 6963363 7069934 7212853
14302 7212853 7350557 7447811 7522113 7592812 7647159 7689059 7760925 7875398 7979663 8037604 8100208
14291 8100208 8233102 8407874 8536826 8606564 8708674 8920817 9206176 9461457 9640524 9798237
14281 9798237 10011542 10281134 10533753 10718079 10862920 11016990 11165837 11259978 11306388 11362893
14271 11362893 11438419 11473320 11441464 11397238 11381415 11351882 11263492 11151511 11066355 10981686 10847662
14260 10847662 10688670 10557661 10430098 10244928 10029498 9874016 9783843 9668115 9491682
14251 9491682 9330310 9240420 9173985 9072178 8955673 8863237 8776626 8671984 8583377 8547653
14241 8547653 8535166 8497012 8437017 8380606 8319842 8249940 8212230 8231431 8251958 8211905 8146353
14230 8146353 8137440 8187534 8226851 8233876 8261472 8340049 8434592 8514016 8596445 8705117 8834626
14219 8834626 8981403 9160637 9372401 9587328 9780487 9951379 10108286 10263102 10435451
14210 10435451 10625536 10791312 10891340 10936958 10960685 10958428 10921040 10894429 10926228 10967896 10925904
14199 10925904 10812186 10738925 10743503 10729844 10628804 10507547 10447349 10407589 10305284 10158630
14189 10158630 10046684 9971135 9861941 9697605 9525192 9370397 9213266 9051355 8907845
14180 8907845 8771483 8600526 8397340 8214882 8076339 7947722 7804288 7666038 7547074
14171 7547074 7422045 7268292 7098711 6929455 6752962 6565508 6386678 6227895 6070967
14162 6070967 5899604 5726802 5571459 5430755 5293499 5160216 5034010 4909314 4782183
14153 4782183 4655590 4527740 4395369 4274211 4191483 4148395 4113395 4062814 4005337 3955860
14143 3955860 3909370 3855449 3798551 3748575 3705956 3666900 3630117 3592349 3552200 3520479 3507520
14132 3507520 3499534 3472483 3432663 3414645 3430722 3451484 3448524 3428317 3409302 3393327 3378613 3376113
14120 3376113 3390637 3403893 3397001 3377039 3366475 3378329 3410381 3447555 3463990 3444589 3411576
14109 3411576 3404605 3427621 3446278 3446871 3457547 3490758 3506927 3469973 3405596 3364257 3351583 3337870
14097 3337870 3316544 3305586 3299345 3266154 3199674 3136466 3110290 3110872 3097327 3041104 2953528 2876271
14085 2876271 2838163 2819747 2778771 2713991 2671679 2674184 2680504 2647063 2591754 2558170 2547247 2531404
14073 2531404 2511260 2504949 2498183 2461178 2406953 2379053 2385921 2399083 2410323 2433925 2454997 2438272
14061 2438272 2394510 2376418 2397704 2417176 2415149 2419263 2436911 2434559 2411849 2419400 2462020 2463951
14049 2463951 2390485 2329095 2368126 2454351 2467668 2398315 2345062 2353852 2365775 2334291 2294189
14038 2294189 2282820 2276020 2245910 2217286 2218585 2226236 2205331 2168731 2151726 2155852 2156924 2146195
14026 2146195 2129263 2104516 2074175 2058239 2069193 2091277 2109674 2136427 2178868 2209851 2208103
14015 2208103 2206142 2252765 2340260 2414139 2449119 2471273 2507331 2558246 2626707 2722839 2829633
14004 2829633 2908249 2958830 3034441 3164914 3301130 3371549 3371314 3357968 3372263 3400070 3409951
13993 3409951 3397041 3382450 3386031 3404308 3409079 3373442 3304682 3238115 3191277 3145371 3084766 3026135
13981 3026135 2983308 2932159 2847496 2750594 2673883 2598399 2484793 2356963 2284336 2270977 2235064
13970 2235064 2129026 2013159 1962827 1959880 1937746 1890901 1866926 1874041 1871393 1844905 1822517
13959 1822517 1808918 1771923 1710382 1674271 1689558 1714944 1707082 1684936 1689888 1716363 1725784 1707437
13947 1707437 1684422 1673009 1672700 1685930 1712005 1728308 1712728 1682983 1680012 1709999 1735951 1734418
13935 1734418 1727884 1744542 1774147 1789806 1796127 1824486 1882652 1936926 1954760 1947746 1957612 2008050
13923 2008050 2085166 2163114 2234522 2311504 2406224 2515674 2620280 2696938 2741701 2778097 2828577
13912 2828577 2877544 2885085 2845772 2807165 2809493 2830734 2821247 2774384 2724879 2687796 2644080 2589280
13900 2589280 2550857 2539624 2520902 2459498 2368212 2285999 2224861 2163053 2082445 1991899 1913159
13889 1913159 1853348 1795298 1720192 1641269 1596090 1589012 1566936 1488371 1394954 1360001 1375834
13878 1375834 1360729 1286831 1225711 1234411 1266258 1246563 1180786 1127182 1105500 1096619 1098146 1113623
13866 1113623 1112878 1071678 1031318 1048252 1097723 1102143 1051185 1014936 1027894 1038932 1004845 964230
13854 964230 973385 1016590 1028563 981239 911137 873159 889451 933771 955749 931366 888360 865386
13842 865386 858568 840288 818204 827730 865594 881982 851658 808558 793387 805335 820895 824903
13830 824903 810009 778940 755644 760401 773318 763551 749279 772731 817267 819054 771424 741321
13818 741321 759313 772584 742112 707015 705794 711258 699940 709123 756010 774322 715519 648725
13806 648725 664253 730047 748012 712531 699865 724061 722186 680549 661336 688151 707931 691002
13794 691002 674959 679443 666474 622496 596644 613305 622864 590428 564965 600203 660860 670945
13782 670945 619430 562302 544449 564422 596141 609797 589594 555426 544360 555924 551516 523534
13770 523534 516104 550003 579352 562349 526437 516423 523528 521138 529380 576488 624007 605023
13758 605023 528966 479699 503057 553972 568264 537963 496771 469901 461516 467273 479189 489637
13746 489637 498862 509970 518320 517864 512356 506606 496414 483473 485470 506879 514336 476131 421342
13733 421342 420118 494677 581370 600651 546452 486630 482396 524256 551289 525398 474036 451984
13721 451984 471749 494818 493057 488264 511774 549206 557183 526561 497977 509537 550334 576450
13709 576450 563337 532660 526405 557683 594948 600614 575211 548934 539898 544628 562422 595430
13697 595430 623131 614557 577123 557218 575809 598163 588184 559115 544736 549962 557566 558381 549068
13684 549068 524240 494196 484967 499791 510067 503968 506426 527807 538599 527171 531793 571205
13672 571205 594985 560529 512494 516433 551602 547724 501522 474326 487971 504246 503085 503957
13660 503957 508967 498300 484709 500163 525717 510583 466935 464385 515235 548756 526595 503172
13648 503172 531629 580329 590844 563409 537417 529261 529847 531005 526128 513907 513412 538522 557705
13635 557705 531875 488325 487192 515963 506150 463756 475641 555176 598086 549093 497980 529094
13623 529094 582531 568123 523635 536452 581137 571162 523263 529059 588907 614192 588642 588867
13611 588867 630810 632187 567054 533130 599696 688092 685458 609286 572881 622872 690005 696576
13599 696576 653700 633894 675475 739377 763583 741543 719093 718662 713438 693021 698293 750844
13587 750844 800886 801464 786136 805086 830191 807832 769438 791343 864690 907214 897216 892594
13575 892594 914291 917124 892357 894943 940609 972084 960536 950150 969255 987819 996477 1031516
13563 1031516 1081952 1075175 1008469 990575 1081518 1186698 1193319 1129043 1096958 1125764 1174650
13552 1174650 1221868 1258282 1253414 1216933 1231232 1329241 1407795 1371818 1298499 1326610 1434861
13541 1434861 1483087 1448085 1452172 1545525 1623266 1608422 1574637 1611027 1679893 1700472 1690198
13530 1690198 1725367 1812852 1890785 1931736 1971559 2043644 2138688 2230683 2309474 2387190 2487858
13519 2487858 2622202 2767150 2890012 2996375 3125257 3290811 3462893 3615313 3756274
13510 3756274 3895973 4022000 4129301 4241480 4375577 4510261 4614742 4691825 4769944 4862597
13500 4862597 4950219 4997002 4983616 4931863 4889472 4875525 4855792 4795974 4718364 4666449 4630310
13489 4630310 4558230 4435613 4298534 4169690 4037222 3901325 3782032 3669436 3526901 3361030
13479 3361030 3226780 3138425 3036237 2874055 2684015 2518722 2383145 2263580 2171312 2110321
13469 2110321 2047393 1963344 1892731 1862896 1833446 1752028 1638129 1554704 1520807 1505323 1485494
13458 1485494 1459858 1422567 1375521 1348654 1359481 1370661 1337183 1276701 1239671 1227976 1203570
13447 1203570 1165948 1154255 1171238 1170206 1131761 1097137 1103376 1130950 1140467 1126130 1108063 1097200
13435 1097200 1090780 1087588 1090634 1099662 1105988 1094663 1062597 1038324 1058890 1112334 1135942 1100263
13423 1100263 1060390 1081460 1144180 1178990 1171020 1166783 1186932 1200367 1189210 1176639 1177708 1178324
13411 1178324 1177782 1200012 1245506 1279950 1287147 1288143 1294840 1293696 1289703 1312299 1356476 1372628 1343386
13398 1343386 1319669 1347632 1406076 1449593 1468672 1472442 1458370 1439479 1457027 1519808 1570274
13387 1570274 1559943 1522921 1522738 1558418 1580109 1572849 1565426 1571359 1577117 1579742 1585874 1581839 1552629
13374 1552629 1522532 1529638 1566769 1592580 1592152 1580578 1559340 1522872 1498223 1517550 1554650 1552987
13362 1552987 1519036 1518591 1568877 1607221 1591320 1559089 1552367 1549986 1528029 1526298 1588326 1676400
13350 1676400 1716204 1703012 1698901 1736565 1785329 1809758 1810587 1805325 1809445 1836134 1879020 1903412
13338 1903412 1893335 1892403 1947295 2023194 2040234 1994264 1968052 2003428 2036115 1997737 1919277 1877864
13326 1877864 1887634 1904241 1904563 1898754 1883997 1849719 1820131 1832035 1869896 1876293 1831489 1774062
13314 1774062 1737478 1715865 1701920 1707466 1728257 1734338 1717588 1708313 1722894 1735358 1725577 1715840
13302 1715840 1730288 1754136 1763954 1765051 1768963 1769346 1771525 1805293 1868668 1901983 1870644 1835580
13290 1835580 1875851 1967445 2012459 1978812 1937130 1952660 2007044 2045011 2044923 2022162 2003333 2011948
13278 2011948 2045581 2062578 2028195 1970985 1948823 1965220 1975273 1969850 1982803 2007344 1986523
13267 1986523 1914250 1866457 1887496 1916324 1881221 1806718 1761845 1751850 1732341 1696186 1674779
13256 1674779 1672132 1661043 1634493 1609157 1587907 1562502 1539563 1524556 1499991 1459043 1434067
13245 1434067 1446458 1457925 1424712 1371026 1347577 1343924 1312875 1263393 1250363 1276356 1281977 1242427
13233 1242427 1201947 1196530 1206676 1206036 1199191 1190728 1168415 1136265 1118428 1116955 1110808 1102857 1115964
13220 1115964 1137891 1129989 1098096 1088736 1104191 1096050 1061526 1062040 1112104 1136654 1090911 1040342
13208 1040342 1053092 1086749 1066453 1016782 1019175 1074657 1106785 1084508 1050543 1031914 1009580
13197 1009580 985716 1000259 1057747 1104030 1102824 1080423 1068309 1054455 1026277 1016314 1058529 1124551
13185 1124551 1149613 1115945 1073408 1070748 1094155 1093061 1052991 1013177 1004702 1003352 975750 949115
13173 949115 980759 1059698 1102959 1071950 1028862 1036110 1060644 1041038 999995 1007586 1059677 1082416
13161 1082416 1053153 1029704 1046238 1062702 1048141 1041486 1083774 1144833 1167511 1145762 1111951
13150 1111951 1079466 1048159 1043441 1094357 1176029 1220268 1193634 1134417 1101241 1108190 1125239 1127227
13138 1127227 1121741 1127945 1144572 1153735 1151868 1156838 1177308 1194525 1190298 1176692 1176692 1187996 1190646
13125 1190646 1182071 1178808 1188364 1203755 1221916 1244808 1267191 1284172 1301628 1318744 1318319 1301865
13113 1301865 1308486 1357516 1399986 1385566 1354887 1387530 1466555 1489077 1428075 1382748 1421921
13102 1421921 1473690 1447421 1387400 1403626 1495943 1556553 1534315 1494496 1504200 1546824 1577613
13091 1577613 1591679 1599886 1592737 1567992 1554026 1570725 1599159 1618664 1640774 1676044 1700390 1691290
13079 1691290 1670447 1670863 1683617 1679804 1667205 1676576 1702135 1709471 1702034 1721154 1767652 1785439
13067 1785439 1753102 1731815 1772803 1828684 1824610 1780106 1776228 1818717 1829412 1782689 1752262 1786075
13055 1786075 1825431 1807098 1767562 1770243 1793244 1778786 1746477 1758242 1800467 1805930 1781012 1803400
13043 1803400 1885641 1944893 1933004 1901469 1902035 1910846 1896279 1883386 1898782 1917993 1918017 1921300 1939462
13030 1939462 1935224 1891741 1859560 1880103 1920226 1937250 1947978 1974282 1985810 1966245 1970060 2030977
13018 2030977 2077060 2033690 1956482 1951830 2006769 2018836 1971247 1949961 1987188 2014002 1990724
13007 1990724 1970772 1997476 2034238 2041178 2040651 2062860 2093169 2111106 2123528 2131665 2123285 2116973
12995 2116973 2150197 2206631 2226155 2204135 2202000 2238361 2258165 2241235 2247057 2305715 2357283 2357720
12983 2357720 2356478 2401877 2454897 2473211 2497305 2564081 2613392 2585006 2541703 2579164 2665658
12972 2665658 2698092 2680883 2710251 2792552 2823636 2771281 2743244 2820990 2935763 2979146 2953668
12961 2953668 2939194 2969388 3016254 3060417 3107994 3153384 3178780 3187018 3200128 3228998 3267712
12950 3267712 3310896 3357965 3405918 3449937 3485706 3508441 3520553 3537848 3570474 3602200 3612901
12939 3612901 3616742 3645086 3691730 3715290 3705341 3703816 3740384 3786638 3805905 3814858 3852305 3906238
12927 3906238 3922497 3888708 3864669 3906678 3989308 4034309 4009231 3966086 3973976 4038468 4107282
12916 4107282 4139379 4141885 4145526 4171461 4221889 4276906 4301011 4282485 4265783 4307652 4398123 4469759
12904 4469759 4492985 4506856 4537498 4553712 4543702 4567790 4669971 4790091 4840338 4830523 4837442
12893 4837442 4881868 4925180 4965885 5038611 5119815 5137442 5091564 5069770 5113806 5160911 5156122
12882 5156122 5135706 5145810 5155623 5118403 5060100 5037794 5051860 5062848 5061615 5062699 5056414 5025985
12870 5025985 4991438 4983009 4988084 4974428 4950985 4955839 4992557 5024403 5029309 5022807 5027113 5047086
12858 5047086 5074722 5095703 5099171 5098027 5123286 5179768 5229477 5241838 5236159 5247660 5276043 5297992
12846 5297992 5307760 5314465 5321056 5335334 5375899 5434747 5462996 5433545 5391902 5400931 5456662 5503414
12834 5503414 5512753 5501218 5486547 5473480 5470128 5474935 5461869 5419983 5386313 5392518 5405437 5379466
12822 5379466 5342468 5356114 5406506 5418799 5380995 5364324 5402242 5436306 5418976 5392512 5414301
12811 5414301 5465911 5494132 5495789 5504320 5527613 5554308 5592894 5648696 5683795 5658455 5603450 5595534
12799 5595534 5657361 5729029 5750352 5731917 5726026 5757300 5807859 5855969 5901533 5950415 5993242
12788 5993242 6016454 6030265 6065418 6132029 6198237 6228842 6233853 6254401 6307610 6374064 6436683
12777 6436683 6497331 6549844 6574796 6578171 6601588 6668442 6745593 6787238 6796840 6813215 6848141 6874150
12765 6874150 6873543 6865601 6873122 6886044 6877349 6843997 6813071 6807564 6819901 6824089 6804388 6765305 6722736
12752 6722736 6695733 6697110 6714724 6709747 6658100 6590543 6560997 6573091 6576105 6543396 6508854 6502386
12740 6502386 6499543 6476511 6468309 6512519 6569141 6568755 6524266 6518660 6580801 6647820 6667255 6668738
12728 6668738 6703923 6769196 6824331 6850549 6858584 6865808 6887209 6926015 6961704 6973425 6979202 7017446
12716 7017446 7085955 7139792 7155143 7151491 7145422 7133910 7133354 7177288 7254497 7303800 7295543 7268257
12704 7268257 7262204 7271937 7290865 7341672 7424049 7487822 7502249 7505000 7541432 7602431 7662928 7731269
12692 7731269 7813626 7877559 7902230 7923338 7979952 8056630 8121943 8179842 8239387 8284627 8321991
12681 8321991 8400966 8532972 8648697 8698088 8732247 8817180 8929927 9020389 9111622 9243181
12671 9243181 9372506 9439809 9484025 9582464 9716993 9819302 9910918 10064380 10250484 10369864
12661 10369864 10431462 10550831 10756689 10945273 11057716 11162230 11315817 11478415 11620900
12652 11620900 11792762 12015191 12219606 12363034 12502803 12689914 12888869 13068940 13269012
12643 13269012 13499594 13691466 13826373 14004957 14281199 14539001 14659394 14715909 14860084
12634 14860084 15086510 15268551 15379730 15514923 15705746 15873248 15981793 16102405 16285452
12625 16285452 16481815 16635703 16768524 16926620 17112933 17306560 17496441 17670802 17821108
12616 17821108 17972422 18164351 18393818 18622460 18841926 19081203 19349177 19624161 19902207
12607 19902207 20201361 20515587 20819389 21121455 21458879 21833941 22211150 22581672 22975675
12598 22975675 23403966 23840845 24273095 24716225 25176091 25641633 26115166 26598646 27055064
12589 27055064 27445318 27804410 28215640 28702180 29208893 29699220 30199270 30729699 31265473
12580 31265473 31789913 32324455 32875367 33409831 33914838 34424711 34961683 35504544 36046723
12571 36046723 36630869 37291330 38011068 38768232 39579212 40465668 41425844 42469235 43636731
12562 43636731 44960919 46446546 48099831 49923125 51883839 53974794 56301853 58958397
12554 58958397 61730803 64070268 65524824 66164221 66465571 66838843 67410252 68210833 69317500
12545 69317500 70683260 71991270 72882388 73324657 73636369 74139175 74912821 75932467 77282552
12536 77282552 79023183 80841961 82063860 82199961 81446585 80505216 79937361 79845616 80155185
12527 80155185 80933222 82258302 83937811 85595381 87014364 88215515 89208368 89874460
12519 89874460 90170157 90277300 90418078 90607766 90718173 90729269 90765962 90876060 90922930 90800788
12509 90800788 90677569 90871178 91446833 92044129 92194721 91759181 90954661 90010545 88979792
12500 88979792 87926959 87090031 86667871 86540127 86401230 86157982 86020046 86207880 86791955
12491 86791955 87864255 89570717 91719740 93518141 94049945 93105196 91354675 89656458
12483 89656458 88383410 87500474 87007775 86973757 87190456 87143534 86490311 85420341 84419757
12474 84419757 83799764 83579400 83681472 83991980 84234673 84035088 83244043 82098447 80974568
12465 80974568 80060153 79332670 78748977 78322485 78051338 77891026 77807736 77787344 77792221 77770525
12455 77770525 77707862 77619725 77500922 77334090 77140886 76970628 76834534 76691514 76498895 76245774
12445 76245774 75947816 75645034 75392713 75219304 75104893 75027814 75007488 75072154 75222784 75470037
12435 75470037 75862700 76425854 77117576 77914194 78890948 80130853 81587687 83134718 84724457
12426 84724457 86395252 88131037 89828170 91414869 92905442 94321806 95655642 96919108
12418 96919108 98126731 99200889 99999344 100473584 100705929 100761063 100612953 100266097 99828393
12409 99828393 99379548 98857914 98163286 97296134 96313386 95222026 94011953 92737417 91471426
12400 91471426 90219770 88961237 87730484 86579966 85501166 84469086 83531601 82770383
12392 82770383 82199731 81783837 81528387 81472709 81608973 81885694 82274200 82758271 83279623
12383 83279623 83776554 84266796 84814832 85425585 86045274 86654631 87273932 87875872 88385441
12374 88385441 88788759 89168087 89605057 90113863 90690599 91357217 92116258 92917781 93723406
12365 93723406 94573510 95537610 96588744 97544240 98147806 98236187 97852433 97203763 96513894
12356 96513894 95926048 95512653 95287118 95163725 94977854 94625990 94169487 93763149 93523330
12347 93523330 93506424 93746100 94217913 94788225 95267818 95504895 95402308 94929448 94208943
12338 94208943 93527675 93145839 93120655 93394905 93973813 94865180 95898837 96795132 97426279
12329 97426279 97857406 98127815 98174870 98013309 97798698 97618950 97373918 96964392 96467235
12320 96467235 96010584 95598308 95192670 94869301 94723999 94662597 94424526 93818307 92848139
12311 92848139 91631638 90295996 88963584 87753053 86741356 85924390 85216254 84511561
12303 84511561 83802771 83235677 82988236 83099662 83489543 84097517 84832960 85371886 85236260
12294 85236260 84230893 82669387 81026219 79492073 78024413 76673513 75579207 74676051
12286 74676051 73664890 72342216 70788539 69190329 67645111 66198931 64899922 63693418
12278 63693418 62369900 60738307 58809828 56746700 54688051 52693565 50803544 49063542
12270 49063542 47489357 46056610 44734462 43514378 42406063 41407310 40480047 39578391
12262 39578391 38709307 37925814 37237080 36578413 35908902 35272082 34698981 34127730 33511645
12253 33511645 32933353 32486941 32104090 31646977 31138776 30731990 30454031 30167969 29815089
12244 29815089 29508923 29319503 29140475 28876062 28609641 28457611 28375880 28252519 28101490
12235 28101490 28017219 27997450 27954805 27870500 27803650 27761318 27679979 27541663 27406786 27313958 27226017
12224 27226017 27093907 26913660 26706662 26491585 26283325 26080732 25855162 25584203 25288934
12215 25288934 25005917 24735269 24448429 24132302 23795017 23444696 23091065 22750534 22426289
12206 22426289 22104605 21786956 21493775 21221378 20938927 20647402 20388978 20172959 19952950
12197 19952950 19710375 19493214 19328771 19169905 18983290 18817411 18713314 18617971 18468639
12188 18468639 18300816 18181532 18089803 17960508 17800685 17661096 17531644 17369132 17194457
12179 17194457 17053296 16909044 16689845 16421926 16197875 16025367 15830106 15602519 15408473
12170 15408473 15244465 15020916 14722861 14456423 14284642 14135071 13931177 13707463 13522260
12161 13522260 13350289 13142763 12921158 12733615 12574438 12413052 12252447 12102364 11945402
12152 11945402 11780677 11646941 11552758 11442207 11283254 11129881 11036644 10969662 10868370 10742314
12142 10742314 10636258 10546603 10445849 10348572 10277804 10202231 10085282 9966838 9913684 9907714
12132 9907714 9865599 9761739 9653465 9583265 9529946 9467072 9403277 9346704 9285354 9222297 9181716
12121 9181716 9159375 9111884 9021990 8938294 8917007 8944872 8952050 8896855 8813140 8765419 8770537 8782982
12109 8782982 8760805 8721025 8704690 8706458 8683502 8631835 8601041 8616994 8639677 8626505 8594769
12098 8594769 8585433 8600228 8613603 8619093 8625044 8625796 8612321 8594248 8583670 8576739 8573428 8588294 8618326
12085 8618326 8632729 8620937 8614558 8633007 8649216 8644438 8651293 8697359 8749136 8763003 8751575 8745992
12073 8745992 8734598 8700672 8680089 8710315 8756269 8762267 8746292 8760104 8784391 8760888 8714596
12062 8714596 8736366 8833237 8899401 8869008 8810231 8821403 8900679 8967740 8968591 8917995 8870401 8875956
12050 8875956 8938614 9005417 9024468 9009308 9007138 9018534 9009022 8989783 9009297 9060382 9079001 9052517
12038 9052517 9042385 9069864 9070023 9008712 8959747 8995633 9068568 9080544 9026104 8984424 8995681 9021471
12026 9021471 9021138 9004869 9003213 9022922 9041985 9034555 9006592 9005512 9063821 9132728 9124022 9033197
12014 9033197 8958587 8966806 9005821 9000923 8971838 8983686 9031065 9053195 9036341 9021589 9024742 9022222
12002 9022222 9012251 9023217 9057606 9083103 9083335 9071704 9058097 9046589 9057363 9101591 9143338 9138699
11990 9138699 9104222 9090690 9098736 9086094 9055059 9056678 9095629 9108272 9064819 9022623 9034844 9067106
11978 9067106 9059238 9021964 9009232 9025221 9025556 8999528 8987776 9011356 9036464 9029944 9009894 9012914
11966 9012914 9037435 9052211 9047870 9045758 9055988 9060435 9050085 9049294 9077916 9111471 9112917 9090779
11954 9090779 9085496 9102385 9104371 9079252 9066174 9094004 9136545 9158295 9166345 9181676 9193539 9184788
11942 9184788 9175742 9197095 9237230 9259899 9260175 9261473 9270262 9276422 9287822 9320678 9362123 9384749
11930 9384749 9393877 9419250 9463404 9499898 9521414 9547973 9585170 9613421 9624061 9633327 9657353 9700364
11918 9700364 9762027 9827218 9861538 9854262 9851281 9900895 9980496 10028641 10038528 10059321 10108687 10150565
11906 10150565 10167542 10189613 10233437 10273476 10296456 10329589 10388663 10446526 10478320 10495001 10512789
11895 10512789 10533898 10572322 10646947 10731627 10768481 10752886 10746895 10783297 10820279 10824669 10832958 10882498
11883 10882498 10942428 10967902 10972224 10989816 11014059 11028235 11053655 11107170 11151688 11152330 11145725 11186875
11871 11186875 11256844 11291500 11280293 11270481 11289368 11324879 11370800 11432160 11494624 11540243 11581045
11860 11581045 11629345 11656474 11636050 11605839 11624855 11687251 11742362 11782253 11839505 11910871 11957794
11849 11957794 11979870 12016780 12076277 12127233 12163821 12208753 12254127 12271318 12280199 12331268 12413499
11838 12413499 12461061 12463331 12484638 12556155 12633228 12685852 12745255 12825628 12884186 12903121 12933208
11827 12933208 13009422 13098341 13175208 13272375 13397988 13492469 13532247 13590996 13717866 13840055
11817 13840055 13885290 13922627 14060117 14261281 14398325 14452038 14518134 14630904 14727670 14797043
11807 14797043 14913404 15086563 15218205 15270172 15346580 15522576 15706001 15781405 15802223 15905446
11797 15905446 16088109 16214341 16236613 16270946 16416654 16613560 16742413 16789994 16839191 16939657
11787 16939657 17064517 17180777 17295348 17421539 17548986 17667968 17792042 17933737 18079003
11778 18079003 18209405 18334640 18476136 18626097 18754097 18857847 18976715 19139664 19324384
11769 19324384 19489949 19632320 19782596 19962223 20165667 20378311 20584304 20764367 20917651
11760 20917651 21082095 21296391 21538568 21742358 21886771 22028906 22225887 22462394 22687351
11751 22687351 22889303 23094199 23312114 23532747 23761028 24010354 24265547 24499251 24725997
11742 24725997 24992014 25303554 25614728 25902308 26200775 26534515 26866315 27160144 27456640
11733 27456640 27826560 28267387 28706371 29104589 29502586 29951377 30445054 30942859 31424465
11724 31424465 31901224 32394295 32917191 33464404 34012849 34554141 35121064 35748905 36412936
11715 36412936 37050800 37655802 38293080 38997904 39713898 40376936 41013931 41699370 42444202
11706 42444202 43192775 43916931 44650905 45432698 46264557 47136265 48039185 48950580 49850806
11697 49850806 50766852 51755834 52832526 53952986 55082579 56239791 57456672 58735167
11689 58735167 60063788 61445966 62895070 64431905 66096977 67924446 69891168 71945513
11681 71945513 74115856 76530226 79270050 82251991 85345567 88602242 92257545 96417369
11673 96417369 100761549 104647585 107579409 109588447 111148553 112754234 114639618 116864829
11665 116864829 119484288 122466375 125517012 128198504 130303667 132010766 133638542 135397012
11657 135397012 137443361 139952989 142857226 145556025 147188981 147351545 146452299 145296927
11649 145296927 144438625 144016697 144047713 144589525 145569630 146672821 147591822 148346758 149210083
11640 149210083 150306921 151422612 152257508 152744374 153004088 153097898 153021259 152931751 153171001
11631 153171001 153965190 155238379 156803438 158571433 160417120 161990509 162938218 163321465
11623 163321465 163595194 164106592 164781019 165370693 165820793 166221159 166504894 166409954 165771931
11614 165771931 164733434 163616918 162673247 162014449 161713905 161802897 162056336 161849446 160442711
11605 160442711 157574627 153741935 149787183 146231985 143098429 140273703 137771903 135548136
11597 135548136 133293057 130651085 127597002 124444780 121519382 118957615 116791935 115027846
11589 115027846 113549527 112061468 110251345 108027212 105570477 103163706 100973917 98983708
11581 98983708 97106203 95333169 93733033 92318190 90992934 89667752 88352492 87074505
11573 87074505 85770499 84351178 82834750 81317939 79831075 78317755 76752931 75181195
11565 75181195 73623630 72041272 70422335 68823541 67284585 65771634 64250067 62751171
11557 62751171 61316086 59924676 58535717 57162160 55854040 54629957 53470610 52363314
11549 52363314 51312882 50318043 49369065 48463969 47607225 46800533 46047102 45349521 44691992
11540 44691992 44045263 43403359 42794241 42239426 41725403 41230988 40759025 40320986 39911363
11531 39911363 39518679 39143995 38788325 38438541 38085647 37741674 37419823 37113417 36813236
11522 36813236 36528998 36271376 36026568 35772869 35512703 35263433 35022314 34767772 34498829
11513 34498829 34248815 34045089 33867811 33668236 33429721 33193295 33008355 32868519 32720411
11504 32720411 32534846 32338449 32165596 32015481 31879621 31773128 31698530 31611743 31479393 31348204
11494 31348204 31291393 31293742 31263833 31171304 31096677 31112944 31184853 31235443 31260910 31317125 31420018
11483 31420018 31521661 31582299 31621162 31688512 31811941 31973280 32125345 32234318 32309294 32376206
11473 32376206 32425533 32421917 32378896 32380668 32492702 32677572 32839825 32939104 33020322 33139702 33299917
11462 33299917 33464798 33610513 33746722 33893608 34046779 34176651 34275989 34396070 34601191
11453 34601191 34883834 35165541 35399029 35627790 35913807 36243968 36553564 36819249 37078682
11444 37078682 37366387 37678899 38009585 38376523 38795841 39250650 39705648 40141886 40564390
11435 40564390 40985057 41417458 41891380 42448695 43095623 43764913 44368889 44909930 45495847
11426 45495847 46205907 46978354 47686605 48296706 48875885 49463415 50026588 50556363 51115350
11417 51115350 51755380 52460298 53205261 54003505 54860879 55757793 56711486 57770565 58899860
11408 58899860 59967043 60918362 61880630 62999291 64254965 65543279 66860513 68283516
11400 68283516 69823031 71441853 73189505 75167088 77354655 79616035 81902230 84319305
11392 84319305 86940133 89642216 92176383 94320736 95952760 97088587 97922130 98748173
11384 98748173 99766283 100975224 102261159 103517836 104665985 105658223 106539125 107454860
11376 107454860 108554583 109905906 111495219 113214807 114816747 115988334 116571445 116682709
11368 116682709 116587828 116522158 116665714 117177738 118127232 119413525 120850893 122338037 123897177
11359 123897177 125568170 127321348 129057753 130634631 131894456 132730758 133162056 133339465
11351 133339465 133473812 133730774 134155997 134693549 135297218 135998217 136806789 137575397 138070253
11342 138070253 138211879 138158252 138111518 138130460 138181872 138275415 138455777 138725778 139072133 139538265
11332 139538265 140210806 141173720 142522734 144355953 146670904 149314253 152092354 154874171
11324 154874171 157537277 159926363 161993600 163916441 165943360 168158034 170507528 172997518
11316 172997518 175686230 178494296 181198693 183666230 185964552 188193135 190319443 192233763
11308 192233763 193849789 195070848 195747706 195776450 195214361 194238094 193001910 191562721 189905171
11299 189905171 187996231 185826126 183416115 180786497 177937010 174884208 171683119 168356758
11291 168356758 164834221 161034416 156997506 152857903 148703099 144547775 140433483 136439250
11283 136439250 132574223 128765681 124987284 121305217 117763926 114323414 110953406 107695226
11275 107695226 104577962 101563423 98633980 95848797 93243545 90750882 88293851 85890239
11267 85890239 83590720 81379117 79215454 77122406 75143625 73256759 71406058 69587952
11259 69587952 67835676 66155120 64541913 63021708 61602448 60225219 58836914 57476513
11251 57476513 56213386 55035015 53878039 52739338 51666084 50658094 49676204 48736402
11243 48736402 47893647 47124424 46324208 45449591 44579456 43799097 43095437 42408893 41725351
11234 41725351 41062342 40409064 39740416 39071205 38445527 37874517 37321011 36750800 36172807
11225 36172807 35617633 35093920 34583219 34071088 33561805 33059202 32558455 32071341 31629961
11216 31629961 31235498 30832594 30380926 29927448 29545166 29216821 28858592 28457151 28089468
11207 28089468 27786644 27478317 27117448 26763398 26472617 26192872 25854264 25498249 25216689
11198 25216689 25005725 24776958 24488190 24176395 23879890 23607758 23371426 23171649 22965954
11189 22965954 22716647 22456928 22244795 22069720 21872223 21638348 21406464 21195555 20992714
11180 20992714 20796490 20610086 20410471 20184397 19968413 19791605 19616334 19406274 19205688
11171 19205688 19063018 18925763 18721043 18498469 18363056 18291529 18159062 17945288 17763273
11162 17763273 17662686 17553835 17374436 17193523 17081103 16992867 16863951 16720274 16614412
11153 16614412 16528266 16418653 16299233 16206286 16129771 16036595 15925271 15816678 15725309 15660601
11143 15660601 15614889 15547157 15436825 15343622 15330721 15340523 15259669 15108012 15024738 15041856 15026581
11132 15026581 14906593 14793537 14788728 14813423 14756341 14665147 14646174 14668650 14621981 14505376 14415733
11121 14415733 14387860 14376057 14360717 14352241 14317462 14218339 14103326 14054109 14060631 14046770 13996070
11110 13996070 13953130 13924452 13880365 13837584 13839513 13866774 13861421 13828030 13820955 13845484 13860538 13863961
11098 13863961 13885944 13914119 13915951 13920285 13985709 14101330 14205543 14282852 14351187 14380296 14329465
11087 14329465 14250083 14240624 14305738 14363778 14385023 14412758 14452763 14458619 14434512 14442331 14494160 14539331
11075 14539331 14564927 14605941 14652316 14654533 14626456 14630984 14659780 14645575 14597946 14597074 14641853 14643712
11063 14643712 14592617 14582149 14635738 14661495 14629825 14638886 14732526 14806148 14784503 14751486 14797497
11052 14797497 14866570 14873792 14862880 14920173 15023013 15099043 15161508 15265611 15393181 15494085
11042 15494085 15589349 15730282 15903652 16068855 16237857 16434482 16632403 16815005 17031847
11033 17031847 17313851 17604174 17856109 18116861 18423495 18709282 18920001 19126294 19398410
11024 19398410 19667265 19848253 20004359 20226369 20445080 20546715 20594146 20728722 20917618
11015 20917618 21023994 21082425 21257991 21548726 21787456 21948974 22187829 22542553 22892609
11006 22892609 23264915 23856209 24642954 25337567 25934914 26909123 28497042 30078170 30741669
10997 30741669 30339937 29525794 28816020 28120351 27247911 26360636 25693954 25215639 24831100
10988 24831100 24625953 24653526 24790720 25095150 25952307 27408220 28613571 28538390 27216361
10979 27216361 25732226 24914679 24592749 24289944 24024856 24023588 24143131 24149447 24264448 24813048
10969 24813048 25444703 25325461 24172005 22589069 21261338 20276166 19422554 18696245 18182081
10960 18182081 17753722 17245519 16741347 16403841 16166769 15861962 15519706 15279338 15104761
10951 15104761 14847638 14519743 14256760 14064232 13832497 13565834 13373066 13254732 13110791
10942 13110791 12940324 12827335 12744806 12584074 12375541 12268520 12279287 12265088 12171231 12099647
10932 12099647 12095751 12069379 11983631 11933904 11970504 12012075 12003697 12002644 12041705 12062436 12051079 12089931
10920 12089931 12206959 12322757 12409874 12547959 12749578 12893229 12915137 12910735 12953368 12970959
10910 12970959 12909723 12864473 12918585 12990948 12974288 12904313 12861905 12824631 12749721 12693248 12705601
10899 12705601 12708586 12618412 12496957 12436238 12383734 12238972 12045615 11921994 11858419 11749484
10889 11749484 11590791 11483855 11461843 11453182 11412181 11361771 11312137 11247861 11189275 11169140 11162724
10878 11162724 11129997 11100013 11120589 11157163 11141661 11092453 11085275 11131881 11185882 11240617 11321578
10867 11321578 11409568 11473104 11552448 11709373 11912084 12065138 12134562 12155936 12147405 12107578 12071044
10856 12071044 12072274 12080935 12058513 12039111 12061420 12068145 11980729 11834623 11731949 11696352 11678556
10845 11678556 11658930 11631246 11537057 11345297 11152078 11066734 11041218 10953239 10813852 10734407
10835 10734407 10722258 10681440 10600300 10564188 10582720 10576378 10544217 10575136 10673816 10740943 10749516
10824 10749516 10776033 10829999 10822908 10746053 10710670 10760223 10803834 10790891 10791115 10838267 10854436 10805948
10812 10805948 10783562 10843056 10905576 10903093 10889614 10916493 10923400 10852229 10758827 10713841 10688291
10801 10688291 10627264 10550828 10501977 10473326 10449834 10444282 10441546 10398014 10335566 10330684 10373031 10357361
10789 10357361 10260429 10190654 10204215 10213015 10148335 10076655 10067233 10075647 10048998 10022372 10020687 9987468
10777 9987468 9903096 9853526 9888935 9931764 9914611 9888578 9904874 9914016 9877020 9852807 9881440
10766 9881440 9904679 9889851 9898245 9945287 9944413 9883382 9888606 10003923 10083149 10033100 9981531 10051710
10754 10051710 10152120 10165317 10170100 10277588 10406077 10431856 10423260 10508093 10637407 10700526 10751823
10743 10751823 10895971 11061499 11121925 11139022 11250208 11411060 11489462 11523456 11637990 11789422
10733 11789422 11847745 11860097 11974377 12163542 12284037 12350134 12487593 12667075 12752778 12773183
10723 12773183 12872576 13031452 13110891 13140242 13273048 13479690 13580240 13577323 13659765 13867837
10713 13867837 14048698 14159039 14317461 14534915 14689874 14798842 15011057 15301588 15479117
10704 15479117 15542697 15713488 16052075 16364400 16563005 16800352 17151817 17484558 17746768
10695 17746768 18075637 18504806 18871155 19127358 19438105 19848343 20175865 20362477 20602102
10686 20602102 20973538 21281704 21429545 21607658 21925951 22197297 22300792 22424664 22709580
10677 22709580 22975023 23061386 23134564 23370651 23629785 23738445 23824061 24063841 24351743 24522984
10667 24522984 24673837 24945413 25206097 25261110 25184280 25151114 25139355 25076690 25075806 25230733 25385327
10656 25385327 25394829 25408462 25602159 25852115 25977034 26078590 26323554 26612215 26790248 26965649
10646 26965649 27282242 27609251 27798888 28011415 28425104 28874639 29159763 29453215 29988999
10637 29988999 30606112 31049268 31470471 32150838 32956480 33573030 34067622 34705861 35420017
10628 35420017 35992228 36563196 37400477 38348219 39077432 39697382 40528281 41459283 42163337
10619 42163337 42767369 43637820 44661109 45438030 46051227 46912781 47979302 48877255 49689333
10610 49689333 50818857 52173423 53314249 54328953 55693924 57364587 58918026 60484795
10602 60484795 62516182 64713253 66324188 67494613 69119712 71324561 73391294 75279069
10594 75279069 77781402 80964487 83960871 86635093 89892496 93961904 98048451 102125601
10586 102125601 107236295 113523611 120044139 127084214 136120364 146729884 156871624 167767590
10578 167767590 184286159 206879467 226643531 233603110 228292142 220152872 215727357
10571 215727357 214189631 214114244 217384767 223669740 226931793 221995253 211293966 201350058
10563 201350058 195359905 192772987 193061155 194981335 193814037 184679746 168869080 152913873
10555 152913873 140977825 131653737 122600612 114372377 108137075 102883574 97150761 91465129
10547 91465129 87054990 83632399 80197693 76855745 74217923 71913514 69168992 66195815
10539 66195815 63729970 61743615 59729821 57762100 56219173 54875811 53246522 51499826
10531 51499826 50149092 49132113 48014835 46834513 45951551 45291074 44484727 43588976 42955877
10522 42955877 42531054 41947693 41211817 40663874 40332172 39917185 39378317 38985563 38798449
10513 38798449 38590088 38284106 38010545 37735329 37270963 36663181 36166663 35829557 35469144
10504 35469144 35044775 34684388 34353010 33870670 33272919 32798886 32497999 32180681 31775261
10495 31775261 31399490 31052602 30574931 29968505 29442279 29072487 28712512 28304811 27987276
10486 27987276 27805461 27602486 27301112 27036243 26890722 26738984 26483761 26236185 26121749
10477 26121749 26084716 26016345 25924130 25852782 25772879 25661709 25579625 25568282 25574444 25551311 25532493
10466 25532493 25539596 25523737 25464034 25421095 25432602 25455791 25465030 25500055 25564333 25584452 25529030
10455 25529030 25465095 25441561 25421705 25385289 25384361 25431753 25445498 25380473 25310788 25300078 25292478 25224404
10443 25224404 25146796 25129513 25129406 25073271 25005890 25027006 25121827 25180967 25170970 25166885 25216924 25285021
10431 25285021 25342846 25420298 25536101 25661443 25786683 25951555 26170129 26391925 26586084 26808346
10421 26808346 27125944 27514761 27890311 28214112 28511291 28802884 29084346 29365715 29673081
10412 29673081 30006313 30347560 30711539 31127009 31564530 31956490 32310849 32727974 33262111
10403 33262111 33836229 34350762 34813771 35291430 35778344 36201139 36528035 36800704 37068508
10394 37068508 37354841 37682750 38077484 38537796 39034580 39532799 40006551 40467093 40984782
10385 40984782 41625371 42348694 43046950 43705538 44424177 45239062 46051276 46807327 47619389
10376 47619389 48597410 49681225 50764345 51872474 53082550 54372706 55701514 57136751
10368 57136751 58754695 60506007 62314048 64177954 66037096 67711288 69177177 70727156
10360 70727156 72611553 74685465 76659247 78506280 80329899 82048314 83589896 85207161
10352 85207161 87171019 89328478 91420868 93628356 96209878 98757032 100512773 101426108
10344 101426108 102201149 103261340 104390922 105491519 106878256 108564982 110016698 110970622
10336 110970622 111850787 113049472 114465147 116062385 118141621 120645372 122934446 124723933
10328 124723933 126554241 128903456 131584031 134461450 137925669 142136778 146694525 151590276
10320 151590276 157504333 164639967 172455854 181081319 191394163 202999425 214417582
10313 214417582 226689226 243812743 266391923 287048883 296628023 294475525 288490063
10306 288490063 285240268 284772831 285730893 289648732 296753300 301925727 299662107 291060121
10298 291060121 282026561 276217685 273439814 273203103 274961867 275121837 268703956 255393817
10290 255393817 240549729 228895956 220142161 212041058 204554781 198795950 194249043 189635387
10282 189635387 185204278 182004535 179808773 177605969 175414579 173933311 172963517 171707914
10274 171707914 170214326 169153812 168505881 167708508 166813550 166313330 166054295 165437285 164530718
10265 164530718 163951445 163768832 163500353 163093786 162969532 163127694 163099090 162791159 162570831
10256 162570831 162486525 162171116 161552578 160938812 160347004 159432371 158145218 156813397 155506777
10247 155506777 153939398 152075252 150232283 148497532 146609920 144518081 142505892 140659609
10239 140659609 138734062 136660487 134694269 132952530 131279053 129664041 128327023 127283688
10231 127283688 126292201 125326734 124638401 124234076 123754683 123002715 122157621 121347257 120441895
10222 120441895 119398730 118366956 117301473 115902898 114107191 112230936 110478007 108709467
10214 108709467 106848844 105074384 103412737 101564302 99361425 97024484 94758121 92479995
10206 92479995 90162162 88033936 86183671 84336397 82307885 80331749 78655963 77158388
10198 77158388 75661022 74291644 73204530 72243752 71227255 70297370 69642308 69110756 68454717
10189 68454717 67743525 67185741 66723839 66154851 65501105 64923743 64393407 63766197 63080545
10180 63080545 62478538 61924414 61279452 60569918 59921146 59311701 58636858 57925943 57264128
10171 57264128 56596795 55840278 55082177 54442602 53844388 53150179 52415176 51771124 51175893
10162 51175893 50517846 49851197 49280747 48731419 48088748 47448791 46957459 46518201 45950089
10153 45950089 45331535 44876377 44549806 44128380 43587732 43110524 42740653 42344934 41906702
10144 41906702 41550689 41272257 40936354 40555522 40280779 40103081 39854440 39527958 39302098
10135 39302098 39208813 39072936 38839201 38668698 38631453 38582643 38441953 38333224 38335100 38336114
10125 38336114 38257365 38197910 38239494 38310017 38352510 38434295 38582175 38702981 38773860 38917774
10115 38917774 39178822 39415879 39542668 39689226 39990370 40381159 40739704 41081136 41472932
10106 41472932 41894665 42315779 42793303 43371974 43997486 44630697 45332010 46139863 46992693
10097 46992693 47866752 48855480 50001861 51178974 52253189 53252642 54264114 55275039
10089 55275039 56231167 57148597 58055634 58909241 59665134 60348117 60975598 61505497 61931758
10080 61931758 62327689 62721696 63035672 63215183 63312624 63383958 63427149 63479195 63633430 63895693
10070 63895693 64169104 64442957 64835551 65391114 66023171 66719357 67554187 68376838 68755953
10061 68755953 68449027 67726747 67024761 66473573 65997885 65651336 65513129 65375257 64883541
10052 64883541 63974931 62910973 61907779 60990636 60181779 59532810 58918494 58045320 56759168
10043 56759168 55190123 53554555 51969303 50483253 49120392 47837738 46569761 45347566
10035 45347566 44261846 43305532 42381897 41469554 40642524 39918339 39222086 38518566 37856949
10026 37856949 37267456 36723207 36210993 35738166 35276686 34799633 34349565 33968439 33603716
10017 33603716 33201174 32830049 32570921 32342469 32014430 31641020 31383607 31234261 31031637
10008 31031637 30741841 30496219 30331521 30122448 29822157 29551815 29379425 29208917 28968662
9999 28968662 28722737 28509793 28252291 27920675 27618076 27402377 27183785 26898849 26628620
9990 26628620 26437169 26245268 25980498 25710686 25508098 25314265 25063009 24812396 24628352
9981 24628352 24455011 24229749 24015825 23886302 23776823 23591902 23370718 23211440 23106139
9972 23106139 22981771 22837939 22717938 22603573 22459957 22329934 22267764 22227944 22128429 21978667
9962 21978667 21846441 21747597 21662912 21608401 21591248 21551158 21444779 21336537 21308504 21331242 21320173
9951 21320173 21269219 21231855 21217408 21200963 21192552 21209229 21223421 21217004 21231736 21291081 21340319 21344213
9939 21344213 21364621 21451039 21541787 21577585 21620182 21735888 21852920 21877863 21874180 21965820 22124789
9928 22124789 22220949 22239956 22284448 22385860 22479914 22555875 22670162 22811714 22903369 22943947 23011876
9917 23011876 23123721 23222636 23309073 23447228 23634585 23796641 23919205 24059217 24222479 24362607
9907 24362607 24501141 24706968 24951525 25134674 25268701 25479352 25795282 26096266 26316981
9898 26316981 26546902 26864327 27215215 27533786 27856683 28234649 28637816 29026739 29425285
9889 29425285 29856316 30290563 30712073 31144793 31570605 31923200 32211218 32539227 32951380
9880 32951380 33364087 33714834 34065904 34489373 34957596 35427254 35931022 36502442 37104162
9871 37104162 37715041 38397840 39193353 40031606 40831736 41602231 42354009 43007839 43499272
9862 43499272 43905027 44356422 44883094 45439876 46027716 46677897 47357770 47997347 48587778
9853 48587778 49173132 49773181 50385768 51028950 51707230 52368725 52962459 53506231 54043856
9844 54043856 54580010 55111476 55669170 56271186 56891059 57528426 58242951 59055918 59895709
9835 59895709 60714696 61578212 62551215 63581017 64595952 65642761 66809624 68080464 69390241
9826 69390241 70766870 72285601 73928130 75624513 77403138 79360749 81502024 83744611
9818 83744611 86074858 88564855 91233614 94025956 96949868 100113681 103595520 107380739
9810 107380739 111462839 115913738 120815480 126197983 132082365 138530084 145617223 153389501
9802 153389501 161849702 170974796 180759604 191203976 202094418 212698751 221839602 228535887
9794 228535887 232654455 234889776 236173898 237178191 238177798 239038533 239267992 238344095 236177365
9785 236177365 233199722 229981297 226847170 223785218 220459176 216255133 210598713 203447290
9777 203447290 195386753 187152991 179174113 171615520 164609281 158211547 152272677 146593636
9769 146593636 141179226 136176314 131614399 127371540 123357118 119560723 115934416 112387446
9761 112387446 108916469 105615809 102539339 99653965 96934049 94393338 92007574 89707205
9753 89707205 87475415 85371627 83433511 81628871 79925745 78338413 76876227 75509589
9745 75509589 74218879 73026597 71946859 70939547 69948117 68965206 68038023 67212562 66478997
9736 66478997 65775048 65053477 64341123 63703012 63150181 62630900 62124908 61685591 61355907
9727 61355907 61101906 60877659 60703693 60624586 60635000 60710730 60874021 61158899 61535822 61930856
9717 61930856 62297160 62613887 62842844 62946452 62929359 62812626 62591848 62265472 61866877 61416953
9707 61416953 60888431 60274387 59638705 59023802 58359849 57557175 56648354 55738000 54841090
9698 54841090 53879386 52824213 51733496 50645065 49534458 48389410 47236308 46083673
9690 46083673 44924598 43799171 42764652 41798861 40827671 39855637 38966752 38179268 37408353
9681 37408353 36604774 35825551 35123197 34463354 33804435 33167044 32565041 31952564 31305594
9672 31305594 30681578 30130590 29615393 29088624 28583867 28152207 27762428 27346766 26907518
9663 26907518 26499996 26136731 25780603 25414135 25051983 24699743 24356602 24043453 23774514
9654 23774514 23514472 23216684 22895852 22613528 22393223 22191986 21959540 21694301 21435563
9645 21435563 21217101 21028047 20816506 20547531 20255969 20008674 19811040 19599307 19341951
9636 19341951 19091918 18902206 18741084 18541261 18294786 18045212 17813543 17586963 17364621
9627 17364621 17162967 16979943 16792403 16587497 16372154 16160179 15967563 15803421 15650378
9618 15650378 15479240 15297559 15148163 15039730 14922191 14760884 14590688 14458251 14352902
9609 14352902 14239050 14117161 14003524 13886400 13755581 13641937 13570473 13503630 13392025 13257334
9599 13257334 13160632 13104858 13033309 12918314 12792353 12691722 12619446 12563673 12510198 12440135 12351044
9588 12351044 12269214 12208626 12142044 12051943 11975269 11942807 11909145 11814350 11689899 11620655 11611336
9577 11611336 11576817 11472739 11355581 11291535 11271894 11244001 11173743 11057493 10917672 10800523
9567 10800523 10737589 10704426 10657430 10602654 10575644 10566092 10530690 10474522 10442846 10431129 10387855
9556 10387855 10317740 10292504 10335474 10384949 10404915 10441350 10524353 10605829 10655165 10732184 10888190
9545 10888190 11062437 11158719 11172678 11165768 11161391 11147157 11136964 11144404 11125834 11035450 10913973
9534 10913973 10839156 10806084 10740504 10617980 10483116 10356393 10212547 10057169 9933070 9831035
9524 9831035 9682464 9473759 9286772 9180614 9104480 8981612 8818591 8669371 8541012 8406484
9514 8406484 8277736 8190294 8127613 8031314 7890909 7763904 7693583 7656372 7608145 7538613 7456980
9503 7456980 7362730 7260830 7175410 7114628 7045690 6941923 6836565 6785831 6785712 6772921 6714652
9492 6714652 6651235 6629962 6635887 6618412 6559775 6486842 6434260 6422795 6454275 6498834 6505809 6458629
9480 6458629 6401332 6378168 6368880 6326749 6261378 6228273 6242739 6262136 6257525 6245648 6239088 6223570
9468 6223570 6204788 6219136 6266588 6287070 6245105 6191822 6193520 6234651 6246844 6211577 6177981 6186221
9456 6186221 6222452 6253376 6267500 6273119 6280230 6292714 6305916 6311391 6310240 6313320 6323473 6333701
9444 6333701 6348938 6386497 6444666 6497493 6535044 6580288 6648614 6721445 6782131 6848197 6945068
9433 6945068 7079119 7257996 7493561 7746852 7912613 7915638 7804422 7703830 7690400 7750738
9423 7750738 7834385 7894332 7891616 7816920 7711352 7631454 7598260 7602363 7630092 7647611 7594934 7452440
9411 7452440 7289036 7184723 7125292 7036588 6904547 6788873 6725619 6690162 6657898 6629785 6591684
9400 6591684 6519357 6434625 6387566 6370514 6320378 6222478 6138698 6109009 6097476 6065679 6029040
9389 6029040 6005279 5975780 5937996 5929197 5954275 5957207 5914816 5891500 5939082 6004321 6007883 5962829
9377 5962829 5935876 5933160 5909934 5866561 5848423 5860985 5863392 5845200 5839636 5857341 5870459 5869639
9365 5869639 5880135 5912601 5947868 5976745 6007446 6030396 6026575 6017312 6053601 6142728 6233038 6286609
9353 6286609 6322267 6370480 6431159 6498134 6582801 6683580 6764128 6792692 6782240 6769153 6771716
9342 6771716 6787371 6808963 6824267 6818871 6797231 6782402 6779804 6763221 6714752 6655450 6612637 6577151
9330 6577151 6521645 6445907 6370840 6295438 6197983 6086404 6011104 6003459 6022944 5998249 5917912
9319 5917912 5847321 5842301 5874477 5873732 5829555 5805964 5849263 5925401 5974777 5992677 6015966 6056011
9307 6056011 6095084 6138520 6215901 6324235 6419233 6479257 6535281 6617279 6711632 6796400 6877022
9296 6877022 6953145 6991230 6977758 6965852 7009356 7072790 7076016 7019565 6986770 7010664 7023339 6974043
9284 6974043 6916716 6916777 6937517 6905049 6841885 6834285 6882789 6892612 6827563 6773001 6804486 6877170
9272 6877170 6902599 6872392 6843945 6849548 6880272 6927488 6986241 7040598 7086802 7146104 7225118 7300930
9260 7300930 7373151 7479475 7626801 7769098 7893104 8053534 8280065 8540005 8842561 9255909
9250 9255909 9747925 10180406 10595417 11296863 12388721 13395605 13702941 13321790 12843940
9241 12843940 12643122 12554847 12434717 12523086 12952297 13305744 13103377 12479373 11951532 11701792
9231 11701792 11535806 11420960 11530939 11735557 11563178 10841396 9975790 9389644 9023739
9222 9023739 8617013 8175942 7872468 7687989 7461982 7178844 6951827 6798579 6647320 6503525
9212 6503525 6419918 6354990 6234163 6100014 6039102 6012228 5920453 5791220 5730812 5729677 5686902
9201 5686902 5604363 5580198 5612005 5582316 5465027 5384534 5420425 5490063 5486739 5424009 5377560
9190 5377560 5368374 5365440 5345705 5305346 5253496 5217109 5210812 5198798 5138520 5057474 5021749 5029839
9178 5029839 5010666 4935398 4859145 4833439 4840169 4834153 4800470 4751362 4706144 4682910 4677295 4654876
9166 4654876 4598062 4541646 4522146 4520404 4501894 4477268 4465499 4440475 4384366 4346281 4362841 4369922
9154 4369922 4296332 4199435 4185484 4230675 4220591 4147099 4112434 4137626 4129927 4065070 4037485 4081425
9142 4081425 4102735 4057723 4045915 4132988 4221137 4205321 4138135 4120088 4130696 4098293 4052136
9131 4052136 4066776 4114686 4109532 4058651 4045667 4081535 4090090 4039784 3989545 3991772 4023915 4028500
9119 4028500 3972774 3871804 3787494 3782246 3839314 3865643 3810855 3734432 3710360 3724419 3723768 3706598
9107 3706598 3692281 3661389 3604106 3573508 3606792 3646415 3628334 3593234 3608804 3635783 3592767
9096 3592767 3515099 3512797 3583879 3607115 3531852 3447305 3434517 3464222 3482023 3492785 3508877 3498780
9084 3498780 3444918 3392348 3389559 3423025 3445415 3433840 3399364 3371346 3379671 3418855 3437727 3407307
9072 3407307 3378143 3409411 3463935 3454961 3385283 3346288 3374491 3405814 3392092 3369362 3377244 3394226
9060 3394226 3392603 3385503 3381598 3359400 3320957 3306593 3323888 3326118 3291622 3258477 3250803 3241691 3222405
9047 3222405 3232344 3277507 3293537 3241883 3176630 3161377 3179332 3180214 3161196 3146723 3136922 3126312
9035 3126312 3128458 3140170 3130691 3102472 3102680 3136449 3139586 3085174 3041040 3061472 3098025 3088263 3058068
9022 3058068 3054256 3047783 2998924 2954500 2973394 3007435 2971996 2897448 2888482 2952234 2989022 2953653
9010 2953653 2910947 2916112 2942397 2950621 2941804 2917923 2871409 2834149 2857205 2919657 2936246 2880719
8998 2880719 2823184 2815022 2816935 2783399 2743689 2743411 2765238 2767795 2758784 2770128 2791757 2786217 2751365
8985 2751365 2722098 2720253 2738463 2763611 2785201 2788453 2766678 2737376 2726434 2739046 2758708 2768832
8973 2768832 2764981 2753197 2746445 2756684 2780954 2797368 2781605 2731602 2677737 2662146 2695848 2740449
8961 2740449 2751530 2736367 2738408 2764898 2774727 2750841 2731912 2743871 2755263 2743071 2745973 2791758
8949 2791758 2824213 2781953 2711365 2708524 2769729 2799057 2762179 2731033 2756651 2793235 2787976 2766937
8937 2766937 2780127 2818608 2837704 2825379 2806739 2805554 2826060 2850063 2842999 2793593 2748349 2765282
8925 2765282 2833425 2886333 2893809 2883029 2869570 2837164 2795532 2784887 2804251 2806801 2786729 2794696
8913 2794696 2842328 2873404 2863141 2859911 2885352 2883629 2827869 2787489 2816346 2857900 2848223 2834398
8901 2834398 2884987 2947417 2918359 2819328 2775142 2827202 2887598 2889160 2870564 2882099 2901751 2892011
8889 2892011 2870265 2871684 2888076 2888264 2870164 2857380 2861347 2872223 2879648 2888569 2913270 2951927 2969726
8876 2969726 2931919 2862823 2835880 2880375 2936163 2937431 2902739 2892900 2914495 2926983 2921384 2923170
8864 2923170 2928372 2906836 2870637 2873349 2928652 2985523 3000210 2984583 2966724 2949137 2928555 2921059
8852 2921059 2941086 2975634 2997810 2996060 2983070 2982218 3002610 3024257 3021964 3006631 3015114 3051436
8840 3051436 3077045 3074607 3073016 3085711 3083083 3062201 3075924 3138144 3170923 3121056 3062891 3091725
8828 3091725 3172106 3201286 3178509 3188278 3242950 3272444 3261349 3265641 3288521 3269857 3216198 3212713
8816 3212713 3277503 3328627 3331036 3350588 3416714 3457435 3430897 3403189 3427362 3456752 3450609 3455257
8804 3455257 3500417 3524276 3492242 3483842 3558351 3634100 3618332 3567719 3589675 3657073 3661140 3598727
8792 3598727 3567706 3603683 3648993 3669108 3685680 3703892 3708837 3722694 3772445 3819272 3812204 3787329
8780 3787329 3816524 3884390 3919688 3922384 3947483 3985578 3980197 3948993 3961819 4005678 4001942 3957349
8768 3957349 3959854 4013333 4020613 3958090 3922789 3963495 4006262 4001903 4007295 4051820 4061121 3999550
8756 3999550 3958129 3999593 4037364 3986396 3925371 3972186 4083429 4123170 4071458 4021077 4009225
8745 4009225 3995499 3982981 4019510 4080928 4083681 4025980 4000082 4045997 4100686 4114839 4116067 4126495
8733 4126495 4118470 4092633 4106294 4173363 4219264 4192624 4147835 4153537 4185567 4183547 4159728 4169746
8721 4169746 4210570 4230842 4224980 4236351 4269241 4275367 4242926 4228954 4270652 4319934 4311277 4258325
8709 4258325 4233010 4265870 4315585 4336346 4332428 4333630 4350158 4373027 4396983 4419315 4429010 4420196
8697 4420196 4409581 4419146 4444651 4461305 4459932 4457957 4472349 4499830 4528348 4552201 4570508 4584142
8685 4584142 4598432 4616730 4629940 4626964 4617256 4626672 4667256 4725562 4781905 4823999 4841365 4829390
8673 4829390 4805763 4801847 4827619 4861502 4881907 4891363 4902643 4919803 4941506 4965924 4984690 4988848
8661 4988848 4986971 4999425 5029192 5057587 5074402 5091978 5123262 5165172 5207783 5240566 5250191 5236634
8649 5236634 5229397 5257841 5307142 5338285 5349628 5376560 5429205 5479265 5514315 5550822 5583570 5585170
8637 5585170 5574670 5616003 5714397 5785861 5778018 5752720 5786601 5852998 5879583 5871560 5889287 5938351
8625 5938351 5973149 5990171 6028885 6088364 6127548 6146407 6184374 6234827 6245552 6218105 6223566 6292261
8613 6292261 6363082 6379502 6371029 6394355 6445347 6479383 6485680 6495574 6532876 6587504 6631298 6646711
8601 6646711 6648374 6673690 6734361 6790169 6802091 6794839 6820620 6874828 6908254 6918406 6956438 7030996
8589 7030996 7080375 7072346 7065237 7123876 7225022 7294767 7303926 7282719 7269241 7282576 7325174 7379281
8577 7379281 7417780 7439089 7469556 7517798 7558572 7578217 7599660 7641672 7689248 7726043 7760471
8566 7760471 7799502 7834518 7871617 7932082 8003096 8039438 8039528 8061725 8130146 8187018 8187989 8183479 8239715
8553 8239715 8329976 8381080 8391296 8420187 8482940 8537212 8568382 8610131 8674117 8728142 8758652
8542 8758652 8795680 8855782 8909953 8932688 8946019 8990531 9075680 9175222 9256863 9309316 9350930
8531 9350930 9409123 9482075 9535988 9556438 9579502 9643455 9729515 9785892 9797288 9794991 9807423 9834884
8519 9834884 9867008 9894341 9907375 9908891 9918973 9947514 9976959 9991390 9998495 10000636 9978060 9932984
8507 9932984 9912347 9942357 9975003 9951442 9888095 9843403 9827371 9807163 9778981 9765219 9754705
8496 9754705 9714500 9652631 9604550 9567533 9514841 9462702 9448986 9453238 9417787 9347225 9304270 9301778
8484 9301778 9284170 9228407 9176726 9149473 9112652 9059588 9037840 9057583 9055835 8997067 8934462 8923133
8472 8923133 8941588 8947361 8943045 8937382 8908022 8857006 8838245 8872517 8898748 8870770 8838254 8861836
8460 8861836 8908573 8911553 8882801 8881758 8910207 8923886 8919699 8928219 8941334 8928943 8912140 8938481
8448 8938481 8990731 8999216 8951010 8917490 8957632 9045999 9111975 9115006 9074879 9051371 9085694 9144926
8436 9144926 9153871 9104384 9082223 9142299 9216945 9216773 9168852 9165831 9218190 9259190 9272219 9302270
8424 9302270 9346237 9345045 9299490 9286994 9334703 9374591 9361474 9341405 9355638 9366088 9337525 9315841
8412 9315841 9351411 9405303 9410134 9381130 9387374 9437966 9473638 9465301 9452920 9474605 9508473 9509615
8400 9509615 9476499 9453228 9469808 9499963 9494658 9454140 9437656 9483593 9549931 9570462 9545683 9528416
8388 9528416 9536554 9541854 9539651 9560134 9600369 9613512 9586418 9563565 9567599 9561436 9525304 9507846
8376 9507846 9550684 9613500 9629384 9597550 9569445 9572386 9594066 9618178 9633399 9628819 9614337 9619475
8364 9619475 9642630 9638609 9592791 9564833 9608875 9687451 9722818 9704955 9685828 9686973 9681746 9665345
8352 9665345 9677052 9739346 9822487 9884689 9913332 9917042 9908128 9904184 9924155 9971560 10030998 10080818
8340 10080818 10104044 10098877 10086585 10091933 10108899 10110314 10096943 10099079 10118202 10118523 10101541 10128597
8328 10128597 10223041 10307405 10303045 10246645 10232081 10270701 10293765 10273826 10254079 10258802 10260187 10247080
8316 10247080 10251398 10286329 10322375 10343514 10367627 10394968 10397809 10380840 10390298 10438876 10481330 10491820
8304 10491820 10504973 10547027 10586469 10594934 10600726 10631234 10652725 10627853 10593505 10613094 10674796 10707457
8292 10707457 10691504 10686465 10735402 10798568 10811221 10770607 10731479 10733748 10767516 10805528 10838482 10865278
8280 10865278 10872197 10849437 10818759 10810562 10812090 10779936 10718966 10699435 10757496 10823638 10809805 10737118
8268 10737118 10703738 10739175 10772703 10754294 10723484 10727305 10742925 10729707 10703306 10704734 10733013 10757270
8256 10757270 10768306 10775433 10775287 10762907 10754763 10766940 10788335 10803784 10821830 10851162 10874224 10876091
8244 10876091 10875628 10893582 10911931 10902780 10880233 10884515 10924857 10972929 11005398 11021565 11024470 11013925
8232 11013925 10998208 10992228 11003612 11028701 11052965 11052682 11018522 10983897 10998861 11062292 11113566 11109721
8220 11109721 11075600 11057111 11064749 11089495 11131136 11176874 11194557 11185523 11200226 11258558 11303337 11286941
8208 11286941 11254864 11275576 11331492 11359816 11365463 11400048 11450516 11452150 11411565 11413217 11484643 11551757
8196 11551757 11561256 11558119 11594515 11641235 11650928 11646774 11678766 11733997 11760026 11754256 11765910 11815652
8184 11815652 11866926 11883960 11879488 11890437 11927833 11966745 11981326 11978690 11988189 12019303 12050970 12072378
8172 12072378 12105786 12164084 12216496 12236544 12256072 12317996 12398010 12440030 12455659 12508546 12598102
8161 12598102 12646988 12627634 12616104 12678320 12776751 12842307 12876699 12925843 13001361 13084367 13165629
8150 13165629 13232502 13259600 13261705 13307921 13427138 13547426 13593349 13596816 13637004 13712647 13763165
8139 13763165 13789021 13852213 13961385 14050865 14088213 14120666 14191158 14279117 14354125 14427932 14519136
8128 14519136 14612966 14687935 14747405 14802047 14853293 14909957 14987879 15080957 15167038 15249776 15353673
8117 15353673 15470404 15559069 15614091 15681361 15785515 15892955 15975145 16056789 16164183 16274204
8107 16274204 16360315 16447329 16568499 16702787 16811967 16912837 17048502 17202908 17312258 17363628
8097 17363628 17418973 17525713 17658271 17772508 17871458 17984256 18114424 18244935 18371643 18497639
8087 18497639 18610534 18698942 18782001 18890603 19023945 19155420 19279416 19417531 19572441 19712834
8077 19712834 19824139 19942929 20109198 20303149 20465870 20577372 20679109 20814131 20975967
8068 20975967 21131567 21272601 21423362 21605516 21809811 22004283 22168480 22318815 22490925
8059 22490925 22691124 22883386 23042828 23199906 23396077 23613214 23799522 23961000 24161805
8050 24161805 24418066 24661543 24848207 25037128 25298047 25590591 25817754 25976232 26166740
8041 26166740 26450161 26770670 27046829 27278227 27523630 27811773 28113879 28389840 28634436
8032 28634436 28879324 29158215 29470116 29783302 30079725 30376375 30689540 31005992 31315273
8023 31315273 31638830 31989149 32332965 32646397 32974827 33370131 33792187 34156435 34471523
8014 34471523 34836429 35288779 35750927 36157103 36542105 36956715 37382058 37793297 38233749
8005 38233749 38745774 39283651 39779439 40255274 40783784 41362160 41912650 42401333 42878066
7996 42878066 43393707 43945715 44517416 45111178 45722100 46323631 46900984 47470667 48055634
7987 48055634 48663101 49288351 49918282 50535642 51142171 51767221 52429284 53105873 53771712
7978 53771712 54445971 55162029 55908485 56646130 57370267 58107402 58859765 59605767 60352055
7969 60352055 61131516 61946847 62767287 63586500 64432585 65312624 66199489 67086584 68004063
7960 68004063 68962008 69926587 70876632 71839574 72843735 73873490 74900470 75926560 76968663
7951 76968663 78029607 79109162 80217050 81352704 82498981 83656819 84856796 86113217
7943 86113217 87396237 88676255 89968981 91308146 92699008 94131044 95615370 97172974
7935 97172974 98797049 100461134 102162895 103934065 105804825 107775777 109828825 111957500
7927 111957500 114183703 116541334 119037892 121642192 124327457 127117309 130063172 133183263
7919 133183263 136457135 139876894 143463297 147227769 151160910 155265510 159555484 164013195
7911 164013195 168600237 173324234 178231088 183299984 188409072 193449330 198410705 203295431
7903 203295431 208000875 212365115 216290371 219737981 222627935 224842907 226341503 227187248
7895 227187248 227445838 227121449 226216529 224786835 222897842 220575140 217838017 214745644
7887 214745644 211371328 207758546 203940300 199983954 195982185 192007575 188100730 184293437
7879 184293437 180616663 177086348 173701920 170464528 167387194 164483498 161750859 159167594
7871 159167594 156706886 154353522 152104283 149953071 147885407 145892288 143978594 142148915
7863 142148915 140394212 138700510 137059312 135459889 133884706 132324680 130786666 129275556
7855 129275556 127784304 126309772 124854152 123396838 121895503 120339191 118770856 117227774
7847 117227774 115689910 114123300 112542196 110980479 109428770 107856659 106278711 104738089
7839 104738089 103236408 101740881 100251191 98793086 97353441 95898212 94455817 93096735
7831 93096735 91815657 90526826 89209820 87964338 86861564 85827209 84753873 83664501
7823 83664501 82669710 81802807 80995002 80200728 79459075 78823149 78293172 77824421 77346785
7814 77346785 76779522 76088557 75337033 74627108 73987311 73367769 72740735 72132007 71535843
7805 71535843 70876012 70099166 69256022 68439153 67674439 66920299 66143898 65344884 64522785
7796 64522785 63680443 62860341 62120789 61453976 60768481 59987145 59142132 58341044 57648638
7787 57648638 57034517 56437836 55847244 55296009 54800732 54334291 53853688 53332748 52772342
7778 52772342 52201743 51668150 51200904 50784564 50387506 50010657 49676654 49376036 49069797
7769 49069797 48754240 48474889 48256287 48067521 47886481 47744804 47662514 47585528 47448735 47266130
7759 47266130 47094725 46944037 46800640 46713559 46747069 46838480 46807724 46551479 46148080 45726279
7749 45726279 45312861 44876084 44444230 44080971 43777739 43471600 43166833 42943675 42816565
7740 42816565 42657205 42315241 41787407 41222889 40767764 40434949 40133761 39806396 39505560
7731 39505560 39316674 39215188 39046654 38678303 38144665 37603764 37163664 36799914 36442436
7722 36442436 36083233 35763199 35490753 35226537 34946135 34675686 34446929 34241733 34010829
7713 34010829 33744208 33493090 33305842 33164056 33013361 32847145 32714425 32634487 32555441 32435982
7703 32435982 32325631 32298480 32322846 32272181 32080897 31821803 31594511 31398702 31176690 30937552
7693 30937552 30759014 30674284 30631528 30579720 30527603 30483771 30395405 30205248 29945031 29715701
7683 29715701 29575933 29492690 29406245 29302892 29204196 29112872 28998578 28832569 28619865 28394539
7673 28394539 28187615 28000627 27813479 27619198 27439833 27297792 27183358 27069032 26947389
7664 26947389 26830809 26718342 26592527 26453330 26327034 26231382 26155124 26080257 25999494 25903638
7654 25903638 25782494 25653347 25557485 25507123 25463456 25389760 25297444 25214001 25137661 25058366 24993120
7643 24993120 24956486 24919307 24845549 24754090 24693070 24663333 24620693 24550223 24483469 24438398 24395882
7632 24395882 24345286 24301294 24260300 24190258 24086275 23992822 23945340 23924886 23892121 23833130 23752713
7621 23752713 23656149 23557368 23474775 23403588 23321860 23230069 23145783 23056544 22931103 22785426 22673028
7610 22673028 22592448 22478729 22317214 22182654 22114708 22039232 21886978 21714073 21611351 21556642
7600 21556642 21465137 21339465 21249186 21188769 21086038 20948197 20867074 20857300 20815623 20685550 20548604
7589 20548604 20490943 20478531 20437267 20371614 20321359 20270741 20189803 20112647 20083313 20063386 19986141
7578 19986141 19876118 19819620 19825875 19810884 19727196 19623375 19552131 19497579 19430499 19368745 19331238
7567 19331238 19280978 19174697 19042477 18955653 18920038 18858367 18715737 18538241 18413611 18359060
7557 18359060 18309323 18210353 18081732 17971221 17884069 17789766 17677217 17564325 17460864 17361089
7547 17361089 17274341 17223432 17201035 17162690 17081972 16985049 16910276 16857309 16799795 16730735 16669575
7536 16669575 16631027 16605476 16570060 16512765 16448321 16407240 16399319 16396218 16367552 16322626 16290007 16269088
7524 16269088 16239835 16210689 16208944 16226924 16231348 16226292 16244302 16269702 16246676 16182375 16156374 16190789
7512 16190789 16202315 16142435 16093183 16136164 16206531 16189676 16106471 16075331 16120222 16149532 16122970
7501 16122970 16108089 16146525 16183556 16176243 16170743 16214237 16270192 16282663 16264247 16264397 16298644 16355808
7489 16355808 16430251 16504990 16546237 16554251 16578925 16650311 16736394 16802226 16863420 16944175 17029360
7478 17029360 17099179 17169331 17258187 17354224 17448345 17551894 17652559 17710843 17737673 17808547 17951676
7467 17951676 18094111 18180863 18269891 18424791 18586943 18663339 18686068 18760630 18890803 18988001
7457 18988001 19040990 19136594 19298331 19440310 19518718 19603693 19745183 19881231 19952392 20010087
7447 20010087 20126623 20276196 20395490 20499377 20641063 20803097 20925681 21017043 21143184 21319094
7437 21319094 21494402 21645460 21803123 21981079 22148831 22294522 22453440 22649906 22861053
7428 22861053 23063529 23272460 23505896 23747623 23977843 24214107 24487170 24789864 25081199
7419 25081199 25339473 25588571 25866068 26178874 26501150 26812787 27125688 27461170 27812721
7410 27812721 28155745 28492391 28853192 29244026 29630775 30001782 30404433 30875455 31367585
7401 31367585 31805611 32199512 32636280 33159496 33722488 34272305 34813379 35362195 35903174
7392 35903174 36431893 36988873 37598320 38213685 38779000 39311845 39866313 40438970 40978033
7383 40978033 41473612 41969584 42483026 42977085 43427722 43858124 44286270 44693894 45075517
7374 45075517 45467395 45892812 46323164 46731764 47144064 47589296 48041368 48463348 48880685
7365 48880685 49347577 49860508 50373920 50893281 51476641 52133778 52799924 53440466 54114613
7356 54114613 54887967 55735725 56592121 57458608 58394268 59413676 60462604 61503263 62567218
7347 62567218 63701453 64903389 66137744 67387712 68653313 69911826 71117113 72245804
7339 72245804 73317129 74345337 75284014 76046969 76592812 76964636 77226421 77382008 77391186
7330 77391186 77252950 77024113 76748138 76414789 76014504 75588691 75186647 74802429 74397965
7321 74397965 73972131 73568730 73229282 72973214 72811612 72744880 72757838 72848153 73040721 73338931
7311 73338931 73690440 74052792 74465803 74990112 75592034 76174947 76726144 77337261 78051316
7302 78051316 78781245 79432043 80026185 80639734 81271398 81847250 82314817 82664468 82891316
7293 82891316 83003679 83041758 83022151 82891798 82607444 82230541 81852897 81440482 80853480 80039644
7283 80039644 79114183 78208246 77317689 76358798 75314782 74258383 73256879 72313555 71397444
7274 71397444 70492584 69616032 68801969 68060629 67354034 66642307 65957716 65385980 64953386
7265 64953386 64582928 64199297 63827769 63532095 63292873 63023974 62697980 62376267 62100082
7256 62100082 61821714 61478074 61076809 60659702 60216833 59694882 59076788 58396455 57670092
7247 57670092 56866411 55968807 55024476 54092457 53168250 52204255 51190578 50163540 49134103
7238 49134103 48068534 46965037 45894223 44915877 43993083 43045663 42066098 41120978 40247517
7229 40247517 39414574 38592572 37798973 37054824 36351046 35682342 35064303 34489540 33916516
7220 33916516 33334133 32787747 32303409 31838986 31359495 30906725 30525554 30165400 29741405
7211 29741405 29270246 28851328 28514448 28180247 27791400 27392817 27039437 26700968 26318353
7202 26318353 25901172 25504640 25143927 24791581 24437516 24094260 23755001 23399940 23040717
7193 23040717 22710558 22407838 22092643 21747648 21405486 21103449 20840399 20590578 20335253
7184 20335253 20068926 19795803 19531682 19291237 19063919 18819851 18548570 18274896 18027568
7175 18027568 17809110 17605620 17407828 17210626 17009300 16810717 16632944 16478770 16323755
7166 16323755 16146072 15954407 15770603 15601060 15445024 15312768 15206678 15097501 14953864
7157 14953864 14789499 14645635 14529278 14409641 14278937 14168799 14089440 14000645 13874082 13741518
7147 13741518 13639525 13543350 13409004 13253681 13130828 13038579 12923204 12776650 12657056 12588414
7137 12588414 12507814 12355689 12164930 12006646 11886718 11757327 11607990 11479759 11390928 11305831
7127 11305831 11190258 11055250 10928936 10816665 10707195 10596902 10491729 10396740 10311093 10224964
7117 10224964 10123807 10008499 9904380 9831560 9773427 9697691 9601995 9510729 9431097 9345662 9250419
7106 9250419 9165821 9101835 9044276 8986146 8939725 8903078 8848180 8763740 8679254 8618570 8555247
7095 8555247 8449444 8315034 8212283 8171875 8154393 8096642 7984507 7867292 7799141 7773645
7085 7773645 7730742 7634375 7521009 7445256 7396697 7317672 7201262 7113081 7093059 7088986 7029511
7074 7029511 6923787 6837337 6792986 6750149 6674724 6580655 6498467 6440448 6403306 6376143 6340977
7063 6340977 6288105 6231082 6186376 6144553 6085134 6011654 5944950 5889623 5835663 5784702 5743718
7052 5743718 5702505 5652211 5615348 5614933 5621345 5580101 5493705 5423261 5399210 5383510 5338039 5278448
7040 5278448 5233189 5195449 5148577 5100940 5063052 5024424 4983629 4965169 4972733 4962778 4904932 4835264
7028 4835264 4805009 4805934 4794203 4761110 4727537 4692124 4644842 4615199 4640137 4688127 4682619 4608370
7016 4608370 4530229 4492106 4463671 4415050 4379485 4393297 4421871 4405047 4349895 4318448 4330275
7005 4330275 4332805 4281035 4204334 4166515 4181021 4197571 4172570 4124587 4100780 4105427 4096922 4057073
6993 4057073 4020692 4014514 4009783 3977195 3950361 3971995 4002825 3964945 3870925 3819344 3844270 3864314
6981 3864314 3823427 3786356 3820688 3866700 3826579 3728397 3685738 3719477 3737943 3694838 3651051
6970 3651051 3654113 3662471 3635728 3609386 3620611 3634050 3606429 3563016 3541648 3515772 3450261 3389629
6958 3389629 3403306 3467775 3491183 3447675 3403231 3402952 3414453 3403887 3392946 3403300 3404889 3366206
6946 3366206 3313896 3295355 3309741 3319093 3309534 3301178 3305556 3307552 3290549 3256903 3221457 3198257
6934 3198257 3193105 3200516 3208972 3210128 3197693 3164835 3120227 3098771 3126027 3171705 3175198 3126613
6922 3126613 3082901 3085926 3106223 3096896 3064090 3044723 3046132 3052244 3063593 3083029 3083788 3045332 3003855
6909 3003855 3007708 3033961 3016904 2957772 2929330 2955998 2970683 2929106 2891137 2926323 2996700 3010542
6897 3010542 2957487 2909364 2902401 2899783 2874936 2855528 2862693 2871082 2861709 2860698 2886079 2901127 2868698
6884 2868698 2819297 2811726 2844821 2862939 2843096 2821994 2828283 2838717 2824562 2801571 2801456 2819759
6872 2819759 2826560 2814405 2802639 2800614 2796935 2784793 2770834 2755667 2730999 2703146 2695561 2715995
6860 2715995 2740470 2743157 2725643 2702927 2677550 2646685 2622178 2620741 2638259 2652322 2649001 2633027
6848 2633027 2614479 2599744 2592985 2592074 2584580 2561446 2533549 2522479 2536685 2567143 2600151 2620579
6836 2620579 2611854 2574782 2541960 2547827 2581882 2595846 2564098 2515399 2494903 2512728 2541138 2549341
6824 2549341 2531876 2511010 2512940 2532353 2528216 2475058 2410148 2396786 2439701 2474825 2454103 2402498
6812 2402498 2371061 2368952 2369978 2358379 2337981 2317649 2313677 2342311 2382974 2379315 2314256 2254798
6800 2254798 2271919 2335822 2350885 2290803 2235870 2259473 2331294 2365087 2326881 2260003 2220842
6789 2220842 2221383 2232360 2223270 2193551 2167348 2160532 2162694 2158087 2149200 2143388 2131755 2105454 2079730
6776 2079730 2072091 2067281 2038756 1997809 1981616 1993878 1999617 1983003 1966445 1962759 1954022 1934890
6764 1934890 1931900 1954926 1970533 1953967 1930923 1932517 1940860 1920122 1878205 1854928 1862628 1877455
6752 1877455 1881181 1875839 1861265 1831751 1796891 1779060 1785631 1801131 1807387 1798197 1778547 1762105
6740 1762105 1762706 1776969 1785593 1782129 1783593 1797801 1801193 1772744 1732368 1716116 1723357 1718858 1685281
6727 1685281 1647901 1643091 1677150 1718240 1723590 1682586 1636474 1637956 1685013 1720244 1707771 1678516
6715 1678516 1676894 1695845 1697952 1674020 1643820 1620499 1610487 1626602 1662872 1678650 1648837 1607162
6703 1607162 1595999 1600279 1583830 1562497 1573773 1594741 1569218 1509214 1486126 1516155 1539026 1525329
6691 1525329 1517401 1536206 1536466 1497367 1473258 1497382 1513705 1474391 1433991 1461200 1514229 1503146
6679 1503146 1439462 1417548 1460419 1489825 1460586 1426809 1441714 1473372 1468317 1437949 1426075 1430488
6667 1430488 1413292 1370187 1340119 1348351 1375894 1390893 1386214 1376594 1372278 1367242 1352480 1333200
6655 1333200 1324844 1331812 1340705 1340691 1339238 1347334 1360493 1369049 1376227 1386042 1381708 1343092 1286880 1261043
6641 1261043 1285682 1320779 1315468 1278543 1269665 1313597 1354413 1325587 1248168 1210259 1243152 1276381
6629 1276381 1250017 1212997 1241816 1303444 1295324 1212123 1166016 1217681 1289642 1295730 1261245 1244946
6617 1244946 1227923 1172431 1124038 1148425 1210751 1226735 1203032 1212803 1249335 1228064 1141525 1090911
6605 1090911 1132774 1200885 1220114 1200999 1177090 1143150 1109356 1126069 1189778 1208289 1133667
6594 1133667 1052665 1061051 1119078 1129386 1097069 1096594 1120023 1087978 1004082 970540 1026184 1082506
6582 1082506 1066830 1031888 1056683 1113053 1113454 1049685 1000941 1015239 1054243 1065224 1050515 1040208
6570 1040208 1036321 1021019 1001380 1006661 1039353 1061652 1045561 1012764 1002955 1019295 1031489 1021453
6558 1021453 996442 965040 933862 923080 945920 973047 961858 925811 922907 962227 981511 946011
6546 946011 908021 921430 952615 940184 901671 904424 950894 971400 932661 884583 881988 912889
6534 912889 928810 910955 882710 873893 886753 894794 880351 870471 905032 961793 963531 888697
6522 888697 817083 815410 838228 816420 786185 825961 903395 910535 842320 807674 846167 869436
6510 869436 829197 808314 866804 917743 864460 768929 759033 829940 868263 840113 823001 854156
6498 854156 872178 836328 799219 814261 848868 843261 802068 776172 787525 815156 834333 835383
6486 835383 817249 788380 766653 763260 773538 789030 804930 811591 797637 770605 757760 774532
6474 774532 803179 812882 793796 764083 748270 754036 769216 780101 788585 802735 812718 794881
6462 794881 748143 707669 706126 734129 755557 751662 733777 720813 719444 721449 711817 686920 666749
6449 666749 672713 692301 692305 671487 663767 676789 672196 632959 603598 622821 658202 659391 640400
6436 640400 647344 670964 661694 620214 601871 628632 661339 668812 665596 668101 667542 661565 663123
6423 663123 664386 640878 603366 593098 611906 614531 589484 585038 624147 655279 632106 589198
6411 589198 585576 614256 624968 608242 599724 615426 632827 631945 617405 602411 597913 611144 633610
6398 633610 641113 622737 594640 572237 552690 538761 547159 572926 582557 568389 569061 603379 629429
6385 629429 613800 595369 621133 658551 644686 595361 582898 615669 626224 587740 558099 579810
6373 579810 609906 594433 557089 559744 607443 643929 628962 581298 546658 547492 567169 574337
6361 574337 562070 557791 583703 618390 621999 592367 564108 554115 545909 533222 537267 564025 582520
6348 582520 570691 552661 561285 585451 585419 549875 511988 510539 548978 591063 592564 544905 488535
6335 488535 472328 502493 546117 575987 586287 573028 537535 510221 527841 576732 600813 580647
6323 580647 560046 573089 592253 581512 556549 549799 552641 540696 527094 538365 559043 554050
6311 554050 530933 525098 533338 519960 486708 476410 498723 510854 491277 478869 509580 558589
6299 558589 579836 567995 545599 518572 484867 465738 483943 519129 526224 500220 486644 517062
6287 517062 563325 574610 542235 505724 499266 512122 510103 485186 467047 481467 512357 521627
6275 521627 501525 485737 502766 538054 556935 550989 541470 543141 547374 544146 539966 542103 539977
6262 539977 520697 497148 499445 533804 568385 572111 552551 537046 528639 509139 482915 481301
6250 481301 510471 530329 512617 489491 503130 529111 507369 447380 436589 517220 611155 615928
6238 615928 537641 469835 461809 475826 474982 481499 518121 549552 532234 488748 478986 512429 540606
6225 540606 534668 521299 530420 549284 549742 530097 506947 489535 484648 504426 542911 562947 536371
6212 536371 485978 458803 466718 484008 496760 517275 545699 554807 529993 497136 489356 503250
6200 503250 508200 488939 461777 453149 473307 508060 530520 524741 499692 475397 460496 455454
6188 455454 469277 508046 547216 546233 502178 461542 461672 485391 495793 493233 506854 541667 566593
6175 566593 555535 516320 475725 454536 461522 494784 538180 564014 552351 514682 494279 527088
6163 527088 592844 622675 578033 507696 491842 537635 576379 567091 546913 557686 579675 578963
6151 578963 572492 592385 621085 621141 604356 609143 626600 616399 588822 598507 648206 670061 628186
6138 628186 577744 583802 630315 655930 646368 640193 657429 670937 655588 632688 645061 697939
6126 697939 744753 741633 705018 692168 723680 756472 748450 716814 705060 722620 752220 788140
6114 788140 824631 832890 798774 760975 761031 780728 785309 795664 843094 883689 853758 793146 802810
6101 802810 880023 916488 878331 858270 907416 948686 927025 918168 991004 1072776 1068477 1025818
6089 1025818 1053871 1143893 1201014 1205905 1216691 1244706 1253872 1259933 1308914 1374294 1393789 1392117
6077 1392117 1444090 1527286 1543907 1491436 1475719 1536374 1593355 1598861 1611086 1669422 1718355 1715571
6065 1715571 1709422 1747468 1802839 1847695 1906342 1981625 2025462 2038358 2096228 2216287 2304304
6054 2304304 2309937 2324660 2434410 2579370 2664343 2711822 2791310 2886761 2959213 3058441 3236102
6043 3236102 3421516 3530604 3633668 3856711 4173198 4469125 4766976 5180821 5674925 6113382
6033 6113382 6584367 7399365 8614241 9750704 10216629 9939340 9423431 9211467 9400160
6024 9400160 9652674 9574181 9079811 8469272 8133859 8148008 8187614 7894121 7252018 6536533
6014 6536533 5968450 5545022 5174142 4827496 4526697 4279236 4080634 3925384 3784137 3614720
6004 3614720 3416967 3235994 3097570 2981800 2869471 2765395 2662378 2535983 2398898 2307210
5994 2307210 2276660 2240963 2142306 2024949 1975890 1991807 1976478 1878106 1761428 1709159 1704245
5983 1704245 1665290 1570954 1483823 1450783 1442983 1418447 1390303 1389460 1397412 1371557 1318325 1283127
5971 1283127 1271963 1242198 1182031 1141700 1157446 1190018 1177502 1119809 1071621 1068569 1095030 1115317
5959 1115317 1106913 1067776 1015665 979272 972616 980332 979577 968287 958647 953065 944717 936237 939061
5946 939061 952529 957317 936550 899023 873545 874975 881940 864436 832215 825896 848482 846911 795044
5933 795044 751477 775781 821398 795146 710462 682601 754713 828727 813295 749562 724633 737190
5921 737190 731456 708058 710068 731199 723753 682823 650127 644759 652330 669180 697420 711039 686456
5908 686456 651231 645122 654035 643781 631847 652446 676614 652808 607653 610718 649363 644226
5896 644226 592196 579695 630582 656996 608466 562594 599120 671784 685131 633884 586634 576520
5884 576520 580463 576675 563771 544431 530091 535507 543713 518350 472768 468610 516466 547093 521768
5871 521768 495603 517846 547968 538564 523311 539607 538732 472953 406621 425617 486740 482416
5859 482416 420811 408311 467614 509398 491719 476223 500644 516977 494876 477245 487854 483176
5847 483176 444842 426503 455755 478240 457489 445158 485154 525745 502338 442193 409621 403830
5835 403830 390878 388511 433769 497948 514116 471457 417116 383581 373054 390110 428887 449553
5823 449553 427186 402128 422342 461666 462309 433890 432068 453529 438750 381946 352531 385374
5811 385374 423638 404948 347784 315554 334710 379070 406589 391865 347667 322983 350666 396392
5799 396392 398160 355545 329130 345143 360282 342148 324401 344322 375434 370241 335381 315037
5787 315037 321564 329384 326861 332010 355711 379460 377014 345727 314655 320587 364224 396297 374551
5774 374551 330220 333467 385709 404435 343991 271371 269464 315510 327625 298333 294987 335557
5762 335557 354810 314596 268020 273124 305728 311137 297173 314746 369014 407630 392794 340358
5750 340358 287419 258378 264190 299302 332813 333537 311617 307220 331338 350057 340253 326309 337248
5737 337248 357039 351710 326327 315834 327775 334542 324670 322266 341862 357596 340561 304702
5725 304702 290079 311288 343050 351934 328407 291900 273011 285010 309253 318827 315308 321010
5713 321010 334071 325059 291225 275143 301275 330551 318789 289502 296054 331653 338327 300480
5701 300480 267321 273346 293950 298566 297124 308927 327001 337508 339085 325228 286809 248101
5689 248101 253572 298106 322325 303589 291682 315747 323288 273456 229292 270728 355960 368654
5677 368654 290443 228251 257947 327696 347253 305663 262199 265837 314705 364406 361554 299931
5665 299931 244905 261871 325459 353774 327739 305092 310305 297587 251735 235809 284441 328501
5653 328501 297229 232672 222030 263583 286068 269697 259324 271715 274748 259815 259591 283513
5641 283513 299566 293366 289836 302490 310387 298715 278828 257900 230487 208584 218506 257961
5629 257961 293004 304091 301521 296273 291938 298520 313085 301250 250042 218801 265266 336103
5617 336103 324676 239967 207984 275889 331535 281176 199997 211062 296013 337981 301746 256932
5605 256932 246849 243588 231783 240998 279342 308667 303457 280446 263080 262667 288102 325699 326248
5592 326248 269878 221679 251945 321626 331200 269794 220810 224123 238953 251285 299540 364172
5580 364172 355185 264104 210888 265406 333246 312435 258970 276202 326413 299194 214539 199399
5568 199399 275779 325549 285056 235118 252638 293522 288237 257835 259302 285048 291463 278353
5556 278353 272059 266386 242706 220903 231978 259820 264346 249041 253438 283504 298476 273182
5544 273182 233362 214398 213130 200902 171540 156183 185488 245690 285878 274148 234060 213690
5532 213690 231291 267803 297579 302528 272067 221653 197175 222012 253527 239902 206125 219426
5520 219426 273489 286558 231367 183391 202203 244591 250297 240112 256656 271229 238522 198377
5508 198377 223401 288403 293640 217458 151218 165220 222066 251275 241283 223125 216096 222895
5496 222895 239758 248696 234124 217376 233255 267247 268700 235158 221547 247073 260071 226904
5484 226904 189755 192247 208679 201006 191287 213643 239529 223106 188566 195900 238688 252850
5472 252850 221250 194674 202523 213563 203474 197225 215403 232283 223202 211097 226069 250173
5460 250173 244824 214096 199400 217668 240718 239467 220577 208890 212356 218804 218871 217180 219353
5447 219353 219074 206573 185076 168222 162191 162029 166352 180908 202942 217974 220325 220621 222645 211805
5433 211805 183378 164364 183100 227052 254383 242922 208396 179235 171785 185310 203152 202999
5421 202999 182136 166278 177815 204303 215954 203850 181472 159994 144040 140033 145265 141666
5409 141666 125507 126452 165559 211716 219415 196256 188113 207112 224206 227805 234267 239009 217612
5396 217612 185393 192466 239300 260529 223172 179319 180351 197376 180097 144320 137102 152507
5384 152507 151543 141805 164855 212750 227420 191286 158057 173539 212779 222667 196149 175476
5372 175476 192631 226202 223654 167793 110645 116820 174577 204529 171385 135708 159302 211458
5360 211458 225686 205241 198949 203978 179636 143436 158096 216018 232506 181310 146735 194190
5348 194190 267060 274150 219730 177833 178620 189125 182682 164943 142413 117097 106685 128265
5336 128265 166805 193032 204070 216000 227780 223907 203402 178539 155228 138045 138839 156126
5324 156126 165525 156314 153423 173573 188490 170337 145706 156859 191827 205586 193564 188003
5312 188003 193704 187688 175924 185589 200045 171174 109509 91399 147878 209996 205248 155686
$$ [...]
##END NTUPLES=NMR SPECTRUM
##END=
