##TITLE=1H ikalashn
CG-1212-1
16.10.2024
##JCAMPDX= 6.0         $$ Bruker NMR JCAMP-DX V2.0
##DATA TYPE= NMR SPECTRUM
##DATA CLASS= NTUPLES
##ORIGIN= UXNMR, Bruker Analytische Messtechnik GmbH
##OWNER= root
$$ TOPSPIN		Version 1.3
$$ 2024-10-16 11:18:23.359 +0400  Irina@DPX200
$$ Compression mode = diff/dup
##.OBSERVE FREQUENCY= 200.131392401
##.OBSERVE NUCLEUS= ^1H
##.ACQUISITION MODE= SIMULTANEOUS
##.ACQUISITION SCHEME= undefined
##.AVERAGES= 8
##.DIGITISER RES= 18
##SPECTROMETER/DATA SYSTEM= spect
##.PULSE SEQUENCE= zg
##.SOLVENT NAME= D2O
##.SHIFT REFERENCE= INTERNAL, D2O, 1, 17.95386
##AUDIT TRAIL= $$ (NUMBER, WHEN, WHO, WHERE, WHAT)
$$ ##TITLE= Audit trail, TOPSPIN		Version 1.3
$$ ##JCAMPDX= 5.01
$$ ##ORIGIN= Bruker BioSpin GmbH
$$ ##OWNER= Irina
$$ $$ F:/spectra/data/iren/nmr/1H/4/pdata/1/auditp.txt
$$ ##AUDIT TRAIL=  $$ (NUMBER, WHEN, WHO, WHERE, VERSION, WHAT)
(   1,<2024-10-16 11:17:23.984 +0400>,<Irina>,<DPX200>,<TOPSPIN 1.3>,
      <acquisition in progress>)
(   2,<2024-10-16 11:18:00.734 +0400>,<Irina>,<DPX200>,<TOPSPIN 1.3>,
      <Start of raw data processing
       efp BC_mod = 2 LB = 0.02 FT_mod = 6 PKNL = 1 PHC0 = 293.3866 PHC1 = 37.94468 SI = 32K 
       data hash MD5: 32K
       62 25 2A 5E 1E E7 E6 D5 DA 73 0F AD D1 CA 91 BA>)
(   3,<2024-10-16 11:18:02.812 +0400>,<Irina>,<DPX200>,<TOPSPIN 1.3>,
      <apk 
       data hash MD5: 32K
       1F 30 ED 79 23 8F CA 17 D6 F0 96 2F 71 71 76 FE>)
(   4,<2024-10-16 11:18:09.421 +0400>,<Irina>,<DPX200>,<TOPSPIN 1.3>,
      <abs n ABSG = 5 
       data hash MD5: 32K
       4A 92 78 A2 02 A2 54 2E 84 F5 15 E8 B7 61 D8 00>)
$$ ##END=
$$ 
$$ $$ hash MD5
$$ $$ 3D C5 A8 95 58 AA 9D 4F 68 03 63 25 73 8B EF 72
##$RELAX= 
##$RELAX= 
##$RELAX= 
##$RELAX= 
##$RELAX= 
##$RELAX= 
##$RELAX= 
##$RELAX= 
##$RELAX= 
$$ Bruker specific parameters
$$ --------------------------
##$DU= <F:/spectra>
##$EXPNO= 4
##$NAME= <1H>
##$PROCNO= 1
##$TYPE= <nmr>
##$USER= <iren>
##$AMP= (0..31)
100 100 100 100 100 100 100 100 100 100 100 100 100 100 100 100 100 100 
100 100 100 100 100 100 100 100 100 100 100 100 100 100 
##$ANAVPT= -1
##$AQSEQ= 0
##$AQ_mod= 1
##$AUNM= <au_zg>
##$AUTOPOS= <>
##$BF1= 200.13
##$BF2= 200.13
##$BF3= 200.13
##$BF4= 200.13
##$BF5= 200.13
##$BF6= 200.13
##$BF7= 200.13
##$BF8= 200.13
##$BYTORDA= 1
##$CFDGTYP= 0
##$CFRGTYP= 5
##$CHEMSTR= <none>
##$CNST= (0..63)
1 1 145 1 1 1 1 1 1 1 1 1 1 1 1 1 1 1 1 1 1 1 1 1 1 1 1 1 1 1 1 1 1 1 
1 1 1 1 1 1 1 1 1 1 1 1 1 1 1 1 1 1 1 1 1 1 1 1 1 1 1 1 1 1 
##$CPDPRG= <>
##$CPDPRG1= <>
##$CPDPRG2= <>
##$CPDPRG3= <>
##$CPDPRG4= <mlev>
##$CPDPRG5= <mlev>
##$CPDPRG6= <mlev>
##$CPDPRG7= <mlev>
##$CPDPRG8= <mlev>
##$CPDPRGB= <>
##$CPDPRGT= <>
##$D= (0..63)
0 2 0 0 0 0 0 0 0 0.06 0 0.03 0 0 0 0 0.0002 0 0 0 0 0 0 0 0 0 0 0 0 0 
0 0 0 0 0 0 0 0 0 0 0 0 0 0 0 0 0 0 0 0 0 0 0 0 0 0 0 0 0 0 0 0 0 0 
##$DATE= 1729063077
##$DBL= (0..7)
120 120 120 120 120 120 120 120 
##$DBP= (0..7)
150 150 150 150 150 150 150 150 
##$DBP07= 0
##$DBPNAM0= <>
##$DBPNAM1= <>
##$DBPNAM2= <>
$$ [...]
##$SW_h= 4401.40845070422
##$TD= 16384
##$TD0= 1
##$TE= 300
##$TE2= 300
##$TE3= 300
##$TEG= 300
##$TL= (0..7)
0 120 120 120 120 120 120 120 
##$TP= (0..7)
150 150 150 150 150 150 150 150 
##$TP07= 0
##$TPNAME0= <>
##$TPNAME1= <>
##$TPNAME2= <>
##$TPNAME3= <>
##$TPNAME4= <>
##$TPNAME5= <>
##$TPNAME6= <>
##$TPNAME7= <>
##$TPOAL= (0..7)
0.5 0.5 0.5 0.5 0.5 0.5 0.5 0.5 
##$TPOFFS= (0..7)
0 0 0 0 0 0 0 0 
##$TUNHIN= 0
##$TUNHOUT= 0
##$TUNXOUT= 0
##$USERA1= <user>
##$USERA2= <user>
##$USERA3= <user>
##$USERA4= <user>
##$USERA5= <user>
##$V9= 5
##$VALIST= <valist>
##$VCLIST= <CCCCCCCCCCCCCCC>
##$VD= 0
##$VDLIST= <DDDDDDDDDDDDDDD>
##$VPLIST= <PPPPPPPPPPPPPPP>
##$VTLIST= <TTTTTTTTTTTTTTT>
##$WBST= 1024
##$WBSW= 25
##$XGAIN= (0..3)
0 0 0 0 
##$XL= 0
##$YL= 0
##$YMAX_a= 381777
##$YMIN_a= -442813
##$ZGOPTNS= <>
##$ZL1= 120
##$ZL2= 120
##$ZL3= 120
##$ZL4= 120
##$ABSF1= 17.95386
##$ABSF2= -4.038887
##$ABSG= 5
##$ABSL= 3
##$ALPHA= 0
##$AQORDER= 0
##$ASSFAC= 0
##$ASSFACI= 0
##$ASSFACX= 0
##$ASSWID= 0
##$AUNMP= <proc_1d>
##$AXLEFT= 0
##$AXRIGHT= 0
##$AXTYPE= 0
##$AXUNIT= <>
##$AZFE= 0.1
##$AZFW= 0.1
##$BCFW= 0
##$BC_mod= 2
##$BYTORDP= 0
##$COROFFS= 0
##$CY= 7568.61572265625
##$DATMOD= 1
##$DC= 0
##$DFILT= <>
##$DTYPP= 0
##$F1P= 17.9538593292236
##$F2P= -4.03888763876832
##$FCOR= 0.5
##$FTSIZE= 32768
##$FT_mod= 6
##$GAMMA= 0
##$GB= 0
##$INTBC= 0
##$INTSCL= 1.483618e-010
##$ISEN= 128
##$LB= 0.02
##$LEV0= 0
##$LPBIN= 0
##$MAXI= 945.577
##$MC2= 0
##$MEAN= 0
##$ME_mod= 0
##$MI= -402.1523
##$NCOEF= 0
##$NC_proc= -7
##$NLEV= 6
##$NOISF1= 8.587773
##$NOISF2= 6.764455
##$NSP= 0
##$NTH_PI= 0
##$NZP= 0
##$OFFSET= 17.95386
##$PC= 1
##$PHC0= 202.7994
##$PHC1= 6.872595
##$PH_mod= 1
##$PKNL= yes
##$PPARMOD= 0
##$PPDIAG= 0
##$PPIPTYP= 0
##$PPMPNUM= 100
##$PPRESOL= 1
##$PSCAL= 0
##$PSIGN= 0
##$REVERSE= no
##$SF= 200.13
##$SI= 32768
##$SIGF1= 16.12182
##$SIGF2= -4.496377
##$SINO= 3.521527
##$SIOLD= 32768
##$SREGLST= <1H.CDCl3>
##$SSB= 0
##$STSI= 32768
##$STSR= 0
##$SW_p= 4401.40845070423
##$SYMM= 0
##$S_DEV= 0
##$TDeff= 16384
##$TDoff= 0
##$TI= <>
##$TILT= no
##$TM1= 0
##$TM2= 0
##$TOPLEV= 0
##$USERP1= <user>
##$USERP2= <user>
##$USERP3= <user>
##$USERP4= <user>
##$USERP5= <user>
##$WDW= 1
##$XDIM= 32768
##$YMAX_p= 463658607
##$YMIN_p= -329089
$$ End of Bruker specific parameters
$$ ---------------------------------
##NTUPLES= NMR SPECTRUM
##VAR_NAME=  FREQUENCY,     SPECTRUM/REAL,   SPECTRUM/IMAG
##SYMBOL=    X,             R,               I
##VAR_TYPE=  INDEPENDENT,   DEPENDENT,       DEPENDENT
##VAR_FORM=  AFFN,          ASDF,            ASDF
##VAR_DIM=   32768,         32768,           32768
##UNITS=     HZ,            ARBITRARY UNITS, ARBITRARY UNITS
##FACTOR=    0.134324425510551, 1,           1
##FIRST=     4401.40845070423, 36296,        -1664962
##LAST=      0,             -27063,          -1930058
##MIN=       0,             -329089,         0
##MAX=       4401.40845070423, 463658607,    0
$$ Real data points
##PAGE= N=1
##DATA TABLE= (X++(R..R)), XYDATA
$$ [...]
$$ plain form
12872 5913333 5891461 5873210 5909627 5941158 5891823 5800977 5758757 5759251 5728214 5668156 5658618 5714109
12860 5714109 5754986 5741231 5732225 5772495 5807742 5774893 5710356 5700765 5764231 5841121 5881967 5893990
12848 5893990 5908104 5936814 5966695 5977890 5975388 5997768 6070591 6155925 6191064 6181766 6201250 6277479
12836 6277479 6345349 6351778 6347004 6406761 6508014 6560995 6544794 6531453 6573894 6641600 6684057
12825 6684057 6697752 6703908 6706462 6702218 6699472 6699780 6686742 6655127 6628288 6625807 6633928 6628343 6609524
12812 6609524 6596184 6596827 6604825 6611806 6613165 6609632 6611932 6631922 6661732 6676160 6663965 6641882 6629867
12799 6629867 6629119 6632753 6639525 6647365 6652980 6667144 6706225 6756643 6777964 6761302 6752029 6784367 6826186
12786 6826186 6832319 6825282 6863184 6937193 6967979 6917524 6844665 6821189 6842451 6859518 6860163 6869585
$$ packed form
12872E913333k1872j8251L6417L1531m9335r0846m2220M94l1037o0058r538N5491
12860E714109M0877j3755r006M0270L5247l2849o4537r591O3466P6890M0846J2023
12848E893990J4114K8710K9881J1195k502K2380P2823Q5334L5139r298J9484P6229
12836F277479O7870O429m774N9757J01253N2981j6201j3341M2441O7706M2457
12825F684057J3695O156K554m244k746L08j3038l1615k6839k481Q121n585j8819
12812F609524j3340O43P998O981J359l533K300J9990K9810J4428j2195k2083j2015
12799F629867p48L634O772P840N615J4164L9081N0418K1321j6662r273L2338M1819
12786F826186O133p037L7902P4009L0786n0455p2859k3476K1262J7067O45R422
$$ plain form
12774 6869585 6893829 6912086 6918874 6932786 6961562 6989537 7002479 7000976 6990194 6978528 6981324 7000877
12762 7000877 7009398 6981595 6938142 6920537 6924883 6904424 6845764 6795110 6787383 6793846 6774414 6745447
12750 6745447 6750140 6782835 6790859 6747505 6684400 6648236 6654018 6684421 6713346 6728367 6744839 6791123
12738 6791123 6864841 6920869 6928739 6924475 6968804 7065112 7161195 7228067 7289990 7370703 7457133 7532714
12726 7532714 7605148 7679019 7735287 7761607 7774841 7792677 7809190 7816232 7820239 7819507 7795701 7747915
12714 7747915 7702924 7671605 7633218 7587080 7573417 7604859 7623764 7581190 7520318 7517753 7569151
12703 7569151 7603636 7596400 7591935 7616660 7643523 7657107 7684903 7738892 7785121 7802123 7820228 7870643
12691 7870643 7937491 7992546 8041240 8102155 8170477 8230001 8276933 8312461 8338969 8376039 8443595
$$ packed form
12774F869585K4244J8257O788J3912K8776K7975J2942j503j0782j1666K796J9553
12762G000877Q521k7803m3453j7605M346k0459n8660n0654p727O463j9432k8967
12750F745447M693L2695Q024m3354o3105l6164N782L0403K8925J5021J6472M6284
12738F791123P3718N6028P870m264M4329R6308R6083O6872O1923Q0713Q6430P5581
12726G532714P2434P3871N6268K6320J3234J7836J6513P042M007p32k3806m7786
12714G747915m4991l1319l8387m6138j3663L1442J8905m2574o0872k565N1398
12703G569151L4485p236m465K4725K6863J3584K7796N3989M6229J7002J8105N0415
12691G870643O6848N5055M8694O0915O8322N9524M6932L5528K6508L7070O7556
$$ plain form
12680 8443595 8516595 8542557 8521711 8516141 8555314 8595355 8607840 8636262 8705935 8750392 8712942
12669 8712942 8663974 8711872 8832561 8903914 8896668 8907052 8986290 9064254 9087856 9119021 9220311
12658 9220311 9337129 9387720 9402945 9472157 9590292 9667645 9681305 9712565 9813908 9926244
12648 9926244 9972581 9974855 10023192 10156110 10318883 10437555 10501692 10561716 10657620 10770927 10860515
12637 10860515 10933367 11043811 11210472 11373384 11470160 11528047 11631644 11810332 12009247 12173441
12627 12173441 12309601 12451191 12610522 12789082 12994238 13214574 13411549 13570340 13732645
12618 13732645 13940957 14171146 14364988 14520008 14698420 14939129 15202767 15426093 15603816
12609 15603816 15789803 16029226 16312741 16596390 16850858 17087185 17341238 17635723 17954758
$$ packed form
12680H443595P3000K5962k0846n570L9173M0041J2485K8422O9673M4457l7450
12669H712942m8968M7898J20689P1353p246J0384P9238P7964K3602L1165J01290
12658I220311J16818N0591J5225O9212J18135P7353J3660L1260J01343J12336
12648I926244M6337K274M8337J32918J62773J18672O4137O0024R5904J13307Q9588
12637A0860515P2852J10444J66661J62912R6776N7887J03597J78688J98915J64194
12627A2173441J36160J41590J59331J78560K05156K20336J96975J58791J62305
12618A3732645K08312K30189J93842J55020J78412K40709K63638K23326J77723
12609A5603816J85987K39423K83515K83649K54468K36327K54053K94485L19035
$$ plain form
12600 17954758 18255868 18509638 18727153 18945445 19185780 19430852 19647965 19832055 20014804
12591 20014804 20224950 20450406 20655649 20832275 21009456 21206770 21399068 21548656 21660805
12582 21660805 21783173 21950503 22150175 22347850 22530259 22710818 22902487 23101472 23302838
12573 23302838 23523454 23793420 24114401 24436621 24701701 24915620 25156877 25494067 25909734
12564 25909734 26325976 26694041 27036118 27407633 27843531 28336282 28841154 29307063 29727427
12555 29727427 30153287 30626337 31110867 31535437 31893531 32243832 32607388 32938747 33225354
12546 33225354 33535118 33909497 34281314 34579006 34856465 35220232 35664451 36093436 36496339
12537 36496339 36971432 37554466 38150853 38697251 39277531 39989028 40780506 41531448 42237444
$$ packed form
12600A7954758L01110K53770K17515K18292K40335K45072K17113J84090J82749
12591B0014804K10146K25456K05243J76626J77181J97314J92298J49588J12149
12582B1660805J22368J67330J99672J97675J82409J80559J91669J98985K01366
12573B3302838K20616K69966L20981L22220K65080K13919K41257L37190M15667
12564B5909734M16242L68065L42077L71515M35898M92751N04872M65909M20364
12555B9727427M25860M73050M84530M24570L58094L50301L63556L31359K86607
12546C3225354L09764L74379L71817K97692K77459L63767M44219M28985M02903
12537C6496339M75093N83034N96387N46398N80280P11497P91478P50942P05996
$$ plain form
12528 42237444 43003925 43882843 44825111 45791714 46812705 47923351 49128406 50449938 51932667
12519 51932667 53577706 55346819 57263849 59434671 61917244 64640838 67520065 70586969
12511 70586969 73899728 77309441 80398792 82711812 84046685 84522642 84394214 83845738
12503 83845738 82975051 81912440 80849448 79914476 79106043 78433066 78058002 78175914 78778539
12494 78778539 79694714 80885570 82512910 84600125 86771482 88511505 89635860 90360256
12486 90360256 90952010 91496314 92015716 92627084 93474587 94604251 95985255 97572242 99254007
12477 99254007 100791219 101902928 102424894 102356651 101786227 100819808 99578271 98222325 96948188
12468 96948188 95917511 95166079 94634108 94350102 94508456 95208169 96130018 96682498 96561070
$$ packed form
12528D2237444P66481Q78918R42268R66603J020991J110646J205055J321532J482729
12519E1932667J645039J769113J917030K170822K482573K723594K879227L066904
12511G0586969L312759L409713L089351K313020J334873M75957j28428n48476
12503H3845738q70687j062611j062992r34972q08433o72977l75064J17912O02625
12494G8778539R16175J190856J627340K087215K171357J740023J124355P24396
12486I0360256N91754N44304N19402O11368Q47503J129664J381004J586987J681765
12477I9254007J537212J111709N21966o8243n70424r66419j241537j355946j274137
12468I6948188j030677p51432n31971k84006J58354O99713R21849N52480j21428
$$ plain form
12459 96561070 96002697 95381992 94745413 93940107 93044166 92370587 92076613 92059529 92286028
12450 92286028 92949983 94184815 95857076 97813000 100113618 102767404 105344861 107148469
12442 107148469 107790119 107418493 106381311 104877673 102999640 100907399 98803950 96813456
12434 96813456 94989934 93395838 92098049 91133222 90534155 90335512 90497578 90886829 91399013
12425 91399013 92042563 92829412 93653423 94380756 95010672 95624945 96203652 96625700 96855224
12416 96855224 96984057 97046727 96930074 96550519 96011784 95476384 94955864 94349739 93645932
12407 93645932 92952035 92339415 91783974 91282991 90916650 90744175 90727546 90818960 91056879 91510806
12397 91510806 92182000 93026122 94038629 95252323 96674926 98293063 100123444 102198139
$$ packed form
12459I6561070n58373o20705o36579q05306q95941o73579k93974j7084K26499
12450I2286028O63955J234832J672261J955924K300618K653786K577457J803608
12442A07148469O41650l71626j037182j503638j878033k092241k103449j990494
12434I6813456j823522j594096j297789r64827n99067j98643J62066L89251N12184
12425I1399013O43550P86849Q24011P27333O29916O14273N78707M22048K29524
12416I6855224J28833O2670j16653l79555n38735n35400n20520o06125p03807
12407I3645932o93897o12620n55441n00983l66341j72475j6629R1414K37919M53927
12397I1510806O71194Q44122J012507J213694J422603J618137J830381K074695
$$ plain form
12389 102198139 104503097 106985493 109618726 112403427 115297902 118199879 121008128 123654426
12381 123654426 126065002 128147994 129848422 131170891 132115097 132627690 132655135 132209811 131337859
12372 131337859 130046657 128321438 126214352 123868568 121433314 118977558 116501903 114018811
12364 114018811 111601793 109354167 107338624 105548405 103952023 102552446 101383427 100457413
12356 100457413 99749579 99237322 98922518 98804681 98868454 99116063 99574453 100242688 101068239
12347 101068239 102009036 103080662 104295297 105588247 106865101 108096794 109297990 110427011
12339 110427011 111393884 112179653 112864959 113506565 114054407 114432750 114642858 114737108 114748773
12330 114748773 114709300 114690646 114761829 114934496 115218941 115703084 116491310 117576430 118861135
$$ packed form
12389A02198139K304958K482396K633233K784701K894475K901977K808249K646298
12381A23654426K410576K082992J700428J322469R44206N12593K7445m45324q71952
12372A31337859j291202j725219k107086k345784k435254k455756k475655k483092
12364A14018811k417018k247626k015543j790219j596382j399577j169019r26014
12356A00457413p07834n12257l14804j17837O3773K47609M58390O68235Q25551
12347A01068239R40797J071626J214635J292950J276854J231693J201196J129021
12339A10427011R66873P85769O85306O41606N47842L78343K10108R4250J1665
12330A14748773l9473j8654P1183J72667K84445M84143P88226J085120J284705
$$ plain form
12321 118861135 120307932 121957740 123743732 125366977 126447462 126787051 126443178 125582594
12313 125582594 124336857 122798292 121080135 119326215 117669363 116202931 114993024 114104762
12305 114104762 113603021 113521876 113846648 114547192 115618645 117044215 118697107 120318904 121643515
12296 121643515 122546381 123067542 123330755 123485064 123688987 124060383 124606902 125247252 125919852
12287 125919852 126622525 127315751 127838823 127982743 127634569 126816225 125614142 124133481 122507209
12278 122507209 120869421 119293040 117810656 116522024 115606802 115153768 115001649 114819609
12270 114819609 114349053 113526126 112397674 111018981 109471580 107898037 106433636 105124456
12262 105124456 103973479 103049396 102478590 102322899 102531051 103036670 103844500 104961626 106257109
$$ packed form
12321A18861135J446797J649808J785992J623245J080485L39589l43873q60584
12313A25582594j245737j538565j718157j753920j656852j466432j209907q88262
12305A14104762n01741q1145L24772P00544J071453J425570J652892J621797J324611
12296A21643515R02866N21161K63213J54309K03923L71396N46519O40350O72600
12287A25919852P02673O93226N23072J43920l48174q18344j202083j480661j626272
12278A22507209j637788j576381j482384j288632r15222m53034j52119j82040
12270A14819609m70556q22927j128452j378693j547401j573543j464401j309180
12262A05124456j150977r24083n70806j55691K08152N05619Q07830J117126J295483
$$ plain form
12253 106257109 107428014 108108705 108017556 107046785 105266625 102846151 99941845 96656600
12245 96656600 93102757 89454662 85882066 82447895 79134729 75974242 73081659 70535711
12237 70535711 68287290 66235228 64346429 62642429 61101618 59651744 58258320 56953005
12229 56953005 55756638 54627841 53514777 52416349 51360700 50353767 49381829 48443678
12221 48443678 47548587 46695262 45879001 45109039 44395204 43726424 43084416 42471651 41906996
12212 41906996 41400542 40947487 40535897 40146907 39765179 39407148 39115503 38898962 38702943
12203 38702943 38477777 38253178 38095325 38005584 37922115 37818681 37734337 37692417 37658618 37607280
12193 37607280 37562765 37532857 37463440 37316727 37140007 36984262 36798467 36495597 36102484 35742529
$$ packed form
12253A06257109J170905O80691r1149r70771j780160k420474k904306l285245
12245I6656600l553843l648095l572596l434171l313166l160487k892583k545948
12237G0535711k248421k052062j888799j704000j540811j449874j393424j305315
12229E6953005j196367j128797j113064j098428j055649j006933r71938r38151
12221D8443678q95091q53325q16261p69962p13835o68780o42008o12765n64655
12212D1906996n06454m53055m11590l88990l81728l58031k91645k16541j96019
12203C8702943k25166k24599j57853q9741q3469j03434q4344m1920l3799n1338
12193C7607280m4515k9908o9417j46713j76720j55745j85795l02870l93113l59955
$$ plain form
12183 35742529 35459138 35151821 34723327 34207926 33697923 33207604 32683777 32115670 31557350
12174 31557350 31046035 30560481 30071849 29590084 29141168 28728750 28338345 27962038 27602791
12165 27602791 27264648 26951794 26671557 26425636 26197766 25962512 25717599 25501156 25354709
12156 25354709 25261702 25149325 24975087 24787170 24658494 24577060 24458418 24268342 24066414 23901957
12146 23901957 23731649 23491426 23200452 22927169 22681121 22409567 22090740 21760528 21441547
12137 21441547 21111185 20759723 20424282 20133777 19860453 19559492 19230011 18907371 18613257
12128 18613257 18339059 18069625 17806648 17570662 17379034 17212555 17018347 16774280 16536565
12119 16536565 16377075 16276847 16141233 15935220 15739069 15632278 15578606 15480491 15307250 15108916
$$ packed form
12183C5742529k83391l07317m28494n15401n10003m90319n23827n68107n58320
12174C1557350n11315m85554m88632m81765m48916m12418l90405l76307l59247
12165B7602791l38143l12854k80237k45921k27870k35254k44913k16443j46447
12156B5354709r3007j12377j74238j87917j28676q1434j18642j90076k01928j64457
12146B3901957j70308k40223k90974k73283k46048k71554l18827l30212l18981
12137B1441547l30362l51462l35441k90505k73324l00961l29481l22640k94114
12128A8613257k74198k69434k62977k35986j91628j66479j94208k44067k37715
12119A6536565j59490j00228j35614k06013j96151j06791n3672r8115j73241j98334
$$ plain form
12109 15108916 14930246 14775376 14644299 14539436 14433911 14290225 14120632 13980094 13886181
12100 13886181 13791332 13653421 13494669 13367261 13290089 13240612 13185060 13099523 12984935 12877516
12090 12877516 12821262 12814495 12806700 12762054 12698090 12643356 12589193 12513848 12428680 12363136 12318844
12079 12318844 12274604 12226354 12185021 12141037 12072326 11990914 11940547 11934284 11930967 11895333 11850025
12068 11850025 11837877 11855707 11862294 11840683 11813471 11795480 11769118 11720243 11668045 11637831 11625174
12057 11625174 11610565 11594507 11592262 11602354 11606057 11595334 11578764 11562862 11551184 11558663 11597535 11647268
12045 11647268 11670542 11666419 11672846 11702194 11711724 11664812 11590391 11547735 11554327 11581782 11602628 11604665
12033 11604665 11578064 11531432 11507792 11537259 11579269 11561712 11480545 11410942 11408073 11444160 11462413
$$ packed form
12109A5108916j78670j54870j31077j04863j05525j43686j69593j40538r3913
12100A3886181r4849j37911j58752j27408p7172m9477n5552q5537j14588j07419
12090A2877516n6254o767p795m4646o3964n4734n4163p5345q5168o5544m4292
12079A2318844m4240m8250m1333m3984o8711q1412n0367o263l317l5634m5308
12068A1850025j2148J7830O587k1611k7212j7991k6362m8875n2198l0214j2657
12057A1625174j4609j6058k245J0092L703j0723j6570j5902j1678P479L8872M9733
12045A1647268K3274m123O427K9348R530m6912p4421m2656O592K7455K0846K037
12033A1604665k6601m6632k3640K9467M2010j7557q1167o9603k869L6087J8253
$$ plain form
12022 11462413 11449061 11425257 11404627 11390498 11388731 11394136 11384940 11355975 11338260 11362085 11416912 11466997
12010 11466997 11489336 11480792 11451036 11426860 11438055 11477296 11499735 11485322 11471709 11495215 11529662
11999 11529662 11524778 11482789 11450028 11443328 11430533 11384300 11317941 11262915 11237007 11236287 11239921 11229502
11987 11229502 11218271 11240261 11288852 11299768 11237226 11165699 11174356 11246049 11273138 11207397 11122244
11976 11122244 11102697 11136937 11156455 11137378 11115749 11127770 11173845 11228923 11261666 11253592 11217708
11965 11217708 11189390 11190338 11214952 11253533 11304340 11356849 11390164 11398027 11392980 11382503 11368615 11370495
11953 11370495 11408937 11462828 11483819 11464999 11450308 11462157 11469356 11446269 11410060 11372161 11310371
11942 11310371 11227805 11182138 11203717 11233654 11202732 11129997 11079608 11058824 11032490 11009042 11029319
$$ packed form
12022A1462413j3352k3804k0630j4129j767N405r196k8965j7715K3825N4827N0085
12010A1466997K2339q544k9756k4176J1195L9241K2439j4413j3613K3506L4447
11999A1529662m884m1989l2761o700j2795m6233o6359n5026k5908p20L634j0419
11987A1229502j1231K1990M8591J0916o2542p1527Q657P1693K7089o5741q5153
11976A1122244j9547L4240J9518j9077k1629J2021M6075N5078L2743q074l5884
11965A1217708k8318R48K4614L8581N0807N2509L3315P863n047j0477j3888J880
11953A1370495L8442N3891K0991j8820j4691J1849P199k3087l6209l7899o1790
11942A1310371q2566m5667K1579K9937l0922p2735n0389k0784k6334k3448K0277
$$ plain form
11931 11029319 11082194 11111248 11104073 11100567 11109973 11096437 11060318 11058401 11114902 11175221 11182694 11153152
11919 11153152 11141589 11173251 11233014 11289649 11313335 11301180 11292376 11320845 11356868 11349618 11322041
11908 11322041 11346570 11417470 11441123 11387971 11355818 11418385 11501502 11499639 11442494 11435969 11486883
11897 11486883 11509581 11486854 11496734 11566252 11616302 11592767 11555010 11576673 11634526 11663249 11668531
11886 11668531 11715579 11830159 11967281 12067863 12109984 12116865 12141299 12223896 12341779 12420978
11876 12420978 12424843 12403208 12424655 12491201 12560218 12622137 12702005 12796426 12865259 12891033 12901853
11865 12901853 12926089 12961050 12995729 13032145 13074851 13125883 13192542 13272090 13334105 13357548 13379861
11854 13379861 13455212 13561237 13615654 13605199 13619081 13709053 13797526 13802809 13786899 13867856 14023198
$$ packed form
11931A1029319N2875K9054p175l506R406j3536l6119j917N6501O0319P473k9542
11919A1153152j1563L1662N9763N6635K3686j2155q804K8469L6023p250k7577
11908A1322041K4529P0900K3653n3152l2153O2567Q3117j863n7145o525N0914
11897A1486883K2698k2727R880O9518N0050k3535l7757K1663N7853K8723N282
11886A1668531M7048J14580J37122J00582M2121O881K4434Q2597J17883P9199
11876A2420978L865k1635K1447O6546O9017O1919P9868R4421O8833K5774J0820
11865A2901853K4236L4961L4679L6416M2706N1032O6659P9548O2015K3443K2313
11854A3379861P5351J06025N4417j0455J3882Q9972Q8473N283j5910Q0957J55342
$$ plain form
11843 14023198 14110930 14088176 14076300 14168314 14294312 14353907 14380908 14470347 14606708 14683339 14669303
11832 14669303 14648568 14688847 14762161 14815980 14850187 14892692 14949740 15009618 15063476 15106099 15141124
11821 15141124 15188296 15259496 15335666 15398425 15465599 15552293 15622056 15638368 15643381 15707822 15814042
11810 15814042 15878551 15889977 15921331 15989898 16022596 16004389 16040362 16191713 16355107 16408416 16395134
11799 16395134 16448076 16588466 16723412 16806543 16876970 16952927 17005772 17045177 17124682 17247743
11789 17247743 17359697 17445242 17543848 17655825 17729691 17767916 17849477 18007158 18168834 18270369
11779 18270369 18351912 18485856 18670189 18849775 18995904 19115132 19220625 19337312 19496621
11770 19496621 19690792 19872769 20028499 20198103 20397424 20582402 20730469 20887251 21077904
$$ packed form
11843A4023198Q7732k2754j1876R2014J25998N9595K7001Q9439J36361P6631j4036
11832A4669303k0735M0279P3314N3819L4207M2505N7048N9878N3858M2623L5025
11821A5141124M7172P1200P6170O2759O7174Q6694O9763J6312N013O4441J06220
11810A5814042O4509J1426L1354O8567L2698j8207L5973J51351J63394N3309j3282
11799A6395134N2942J40390J34946Q3131P0427P5957N2845L9405P9505J23061
11789A7247743J11954Q5545R8606J11977P3866L8225Q1561J57681J61676J01535
11779A8270369Q1543J33944J84333J79586J46129J19228J05493J16687J59309
11770A9496621J94171J81977J55730J69604J99321J84978J48067J56782J90653
$$ plain form
11761 21077904 21242621 21333647 21415246 21577662 21794393 21960432 22047051 22122369 22228775 22338155
11751 22338155 22438994 22575602 22767246 22958977 23096142 23200923 23334292 23512066 23695565
11742 23695565 23853046 24003389 24193547 24436722 24682272 24867378 24998956 25147701 25347250
11733 25347250 25548343 25705555 25853840 26041870 26239189 26388411 26515394 26695419 26925667
11724 26925667 27129803 27291081 27478824 27721396 27954106 28136108 28326155 28580198 28852340
11715 28852340 29075226 29280135 29549250 29882064 30197471 30460621 30729646 31064397 31448963
11706 31448963 31827878 32179016 32525547 32897474 33301104 33718658 34129893 34537281 34967632
11697 34967632 35442354 35950044 36455416 36932829 37389139 37858998 38375617 38936224 39500778
$$ packed form
11761B1077904J64717R1026Q1599J62416K16731J66039Q6619P5318J06406J09380
11751B2338155J00839J36608J91644J91731J37165J04781J33369J77774J83499
11742B3695565J57481J50343J90158K43175K45550J85106J31578J48745J99549
11733B5347250K01093J57212J48285J88030J97319J49222J26983J80025K30248
11724B6925667K04136J61278J87743K42572K32710J82002J90047K54043K72142
11715B8852340K22886K04909K69115L32814L15407K63150K69025L34751L84566
11706C1448963L78915L51138L46531L71927M03630M17554M11235M07388M30351
11697C4967632M74722N07690N05372M77413M56310M69859N16619N60607N64554
$$ plain form
11688 39500778 40039088 40570810 41135891 41734106 42329026 42912845 43527404 44207458 44936236
11679 44936236 45673236 46398407 47117084 47851129 48635364 49487922 50372547 51230614 52065190
11670 52065190 52944791 53899094 54864964 55778000 56669810 57618832 58639876 59684587 60729022
11661 60729022 61795112 62891779 63996348 65101891 66234065 67410378 68621996 69863417
11653 69863417 71142221 72451124 73768721 75102147 76495475 77978478 79536658 81153756
11645 81153756 82859663 84708013 86717972 88865885 91134539 93547372 96144402 98942097
11637 98942097 101936162 105135529 108569777 112266079 116251705 120583907 125330498 130496536
11629 130496536 136016225 141836200 147903888 153968079 159471242 163830521 166868437 168848207
$$ packed form
11688C9500778N38310N31722N65081N98215N94920N83819O14559O80054P28778
11679D4936236P37000P25171P18677P34045P84235Q52558Q84625Q58067Q34576
11670E2065190Q79601R54303R65870R13036Q91810R49022J021044J044711J044435
11661F0729022J066090J096667J104569J105543J132174J176313J211618J241421
11653F9863417J278804J308903J317597J333426J393328J483003J558180J617098
11645H1153756J705907J848350K009959K147913K268654K412833K597030K797695
11637I8942097K994065L199367L434248L696302L985626M332202M746591N166038
11629A30496536N519689N819975O067688O064191N503163M359279L037916J979770
$$ plain form
11621 168848207 170076145 170640177 170590246 170152407 169579519 168921450 168144078 167390083 166904591
11612 166904591 166746483 166806037 167109146 167844714 168992461 170133335 170792167 170864342 170593797
11603 170593797 170249968 169976319 169880312 170093871 170717313 171791411 173344339 175419538 178048085
11594 178048085 181195168 184690850 188206684 191387426 194069994 196333067 198309688 200030393
11586 200030393 201481155 202695611 203704307 204496772 205134696 205781315 206449562 206794607 206359520
11577 206359520 205027264 203057997 200673788 197810222 194356093 190455388 186420568 182448547
11569 182448547 178581422 174907030 171638492 168954891 166861433 165272278 164177667 163628917
11561 163628917 163516026 163418837 162793069 161363956 159289543 156886912 154264512 151320384
$$ packed form
11621A68848207J227938N64032m9931m37839n72888o58069p77372p53995m85492
11612A66904591j58108N9554L03109P35568J147747J140874O58832P2175k70545
11603A70593797l43829k73649r6007K13559O23442J074098J552928K075199K628547
11594A78048085L147083L495682L515834L180742K682568K263073J976621J720705
11586B00030393J450762J214456J008696P92465O37924O46619O68247L45045m35087
11577B06359520j332256j969267k384209k863566l454129l900705m034820l972021
11569A82448547l867125l674392l268538k683601k093458j589155j094611n48750
11561A63628917j12891r7189o25768j429113k074413k402631k622400k944128
$$ plain form
11553 151320384 148046868 144669578 141439885 138418267 135544142 132825536 130352427 128165103
11545 128165103 126204577 124384022 122644234 120947030 119269136 117601539 115918635 114160660
11537 114160660 112282073 110299000 108248109 106115178 103851469 101455256 98993436 96538242
11529 96538242 94115987 91724174 89371879 87090453 84912871 82846127 80867498 78961282
11521 78961282 77154634 75488703 73953974 72495747 71094344 69788594 68594807 67459304
11513 67459304 66335288 65252953 64252389 63293904 62314325 61341038 60455930 59651668 58818949
11504 58818949 57894728 56936777 56018752 55133473 54252784 53412538 52663288 51979432 51297356
11495 51297356 50626529 50046025 49586021 49180491 48760561 48340339 47972920 47659416 47350318
$$ packed form
11553A51320384l273516l377290l229693l021618k874125k718606k473109k187324
11545A28165103j960526j820555j739788j697204j677894j667597j682904j757975
11537A14160660j878587j983073k050891k132931k263709k396213k461820k455194
11529I6538242k422255k391813k352295k281426k177582k066744j978629j906216
11521G8961282j806648j665931j534729j458227j401403j305750j193787j135503
11513F7459304j124016j082335j000564r58485r79579r73287q85108q04262q32719
11504E8818949r24221r57951r18025q85279q80689q40246p49250o83856o82076
11495E1297356o70827n80504m60004m05530m19930m20222l67419l13504l09098
$$ plain form
11486 47350318 47022285 46704541 46421720 46149651 45849312 45517850 45176583 44823288 44430626
11477 44430626 43991481 43536167 43098655 42691180 42317604 41980640 41662082 41328782 40983226
11468 40983226 40679748 40457585 40280609 40083732 39863742 39676085 39543897 39422126 39269051
11459 39269051 39110588 39002122 38950677 38907795 38831783 38731708 38648508 38609114 38605393 38611515 38615134
11448 38615134 38629129 38675978 38767548 38898396 39045083 39169881 39246806 39296718 39374786 39503074
11438 39503074 39636552 39721350 39763938 39808150 39867773 39932122 40021688 40170759 40350643 40482779
11428 40482779 40555196 40658854 40863142 41113272 41312764 41463406 41646709 41890185 42138936
11419 42138936 42365747 42625150 42960682 43321570 43628439 43888837 44189429 44581368 45021751
$$ packed form
11486D7350318l28033l17744k82821k72069l00339l31462l41267l53295l92662
11477D4430626m39145m55314m37512m07475l73576l36964l18558l33300l45556
11468D0983226l03478k22163j76976j96877k19990j87657j32188j21771j53075
11459C9269051j58463j08466n1445m2882p6012j00075q3200l9394l721O122L619
11448C8615134J3995M6849R1570J30848J46687J24798P6925M9912P8068J28288
11438C9503074J33478Q4798M2588M4212N9623O4349Q9566J49071J79884J32136
11428D0482779P2417J03658K04288K50130J99492J50642J83303K43476K48751
11419D2138936K26811K59403L35532L60888L06869K60398L00592L91939M40383
$$ plain form
11410 45021751 45435751 45799340 46145433 46517903 46943573 47430668 47964553 48509954 49045650
11401 49045650 49597640 50205739 50848810 51445821 51964685 52492902 53140711 53889824 54612601
11392 54612601 55251664 55897079 56639780 57427115 58150711 58828890 59587543 60462461 61337051
11383 61337051 62116983 62865587 63690498 64571418 65404438 66183997 67029832 68022281 69103847
11374 69103847 70181069 71252693 72385757 73616021 74933060 76335979 77842125 79445023
11366 79445023 81112918 82835208 84634067 86524183 88495911 90552126 92734518 95094746
11358 95094746 97656981 100427164 103428094 106703682 110281843 114135448 118174315 122258997
11350 122258997 126203499 129764606 132670226 134723232 135908160 136376003 136312362 135848795
$$ packed form
11410D5021751M14000L63589L46093L72470M25670M87095N33885N45401N35696
11401D9045650N51990O08099O43071N97011N18864N28217O47809P49113P22777
11392E4612601O39063O45415P42701P87335P23596O78179P58653Q74918Q74590
11383F1337051P79932P48604Q24911Q80920Q33020P79559Q45835R92449J081566
11374F9103847J077222J071624J133064J230264J317039J402919J506146J602898
11366G9445023J667895J722290J798859J890116J971728K056215K182392K360228
11358I5094746K562235K770183L000930L275588L578161L853605M038867M084682
11350A22258997L944502L561107K905620K053006J184928M67843o3641m63567
$$ plain form
11342 135848795 135106028 134251810 133452920 132808994 132400034 132360279 132811276 133737239 135031128
11333 135031128 136662260 138663695 140906211 143023705 144681139 145848174 146712535 147403231
11325 147403231 147936677 148390725 148959672 149794008 150895689 152213745 153745291 155477113
11317 155477113 157287012 158961325 160284062 161097123 161341702 161094812 160532983 159818527 159035905
11308 159035905 158248552 157571700 157146455 157044660 157199190 157412299 157460696 157252533 156881722
11299 156881722 156484281 156073574 155605380 155179283 155028915 155268084 155781610 156453965 157391754
11290 157391754 158800615 160722559 163029517 165627131 168513775 171627684 174750924 177601237
11282 177601237 179963609 181746143 182998820 183897385 184642906 185356118 186100901 186976845 188108130
$$ packed form
11342A35848795p42767q54218p98890o43926m08960l9755M50997R25963J293889
11333A35031128J631132K001435K242516K117494J657434J167035Q64361O90696
11325A47403231N33446M54048N68947Q34336J101681J318056J531546J731822
11317A55477113J809899J674313J322737Q13061K44579k46890n61829p14456p82622
11308A59035905p87353o76852m25245j01795J54530K13109M8397k08163l70811
11299A56881722l97441m10707m68194m26097j50368K39169N13526O72355R37789
11290A57391754J408861J921944K306958K597614K886644L113909L123240K850313
11282A77601237K362372J782534J252677Q98565P45521P13212P44783Q75944J131285
$$ plain form
11273 188108130 189552762 191306956 193396100 195872075 198711932 201808172 205077688 208494673
11265 208494673 211993601 215432200 218692467 221737204 224515410 226880250 228655160 229726698
11257 229726698 230029064 229504070 228143595 226032000 223290597 220008310 216259508 212138239
11249 212138239 207724144 203057486 198196294 193250941 188304578 183342970 178328489 173306468
11241 173306468 168366248 163525932 158737254 153994251 149356790 144858537 140462613 136131916
11233 136131916 131890847 127790034 123845571 120037377 116345070 112768365 109325591 106039693
11225 106039693 102916885 99942488 97106906 94421107 91889005 89483196 87175214 84974949
11217 84974949 82908631 80968711 79120174 77350812 75677612 74097937 72567247 71042363
$$ packed form
11273A88108130J444632J754194K089144K475975K839857L096240L269516L416985
11265B08494673L498928L438599L260267L044737K778206K364840J774910J071538
11257B29726698L02366n24994j360475k111595k741403l282287l748802m121269
11249B12138239m414095m666658m861192m945353m946363m961608n014481n022021
11241A73306468m940220m840316m788678m743003m637461m498253m395924m330697
11233A36131916m241069m100813l944463l808194l692307l576705l442774l285898
11225A06039693l122808k974397k835582k685799k532102k405809k307982k200265
11217H4974949k066318j939920j848537j769362j673200j579675j530690j524884
$$ plain form
11209 71042363 69530789 68080666 66721197 65418974 64104781 62753378 61421166 60177317
11201 60177317 59010142 57847283 56666645 55526103 54465062 53442838 52414506 51407400
11193 51407400 50467433 49580785 48713072 47882333 47119496 46390607 45639744 44887068 44198856
11184 44198856 43571119 42932650 42267125 41641136 41088225 40547793 39958217 39345607 38775740
11175 38775740 38265340 37781564 37293739 36792182 36285102 35802993 35379201 35005698 34633574
11166 34633574 34231182 33814513 33411427 33028605 32662736 32309451 31952160 31577462 31208096
11157 31208096 30881646 30591106 30289739 29960556 29632858 29322775 29011681 28695745 28399017
11148 28399017 28119670 27822834 27508149 27220949 26969169 26697503 26382002 26080417 25837165
$$ packed form
11209G1042363j511574j450123j359469j302223j314193j351403j332212j243849
11201F0177317j167175j162859j180638j140542j061041j022224j028332j007106
11193E1407400r39967q86648q67713q30739p62837p28889p50863p52676o88212
11184D4198856o27737o38469o65525o25989n52911n40432n89576o12610n69867
11175C8775740n10400m83776m87825n01557n07080m82109m23792l73503l72124
11166C4633574m02392m16669m03086l82822l65869l53285l57291l74698l69366
11157C1208096l26450k90540l01367l29183l27698l10083l11094l15936k96728
11148B8399017k79347k96836l14685k87200k51780k71666l15501l01585k43252
$$ plain form
11139 25837165 25603645 25316553 24999397 24714774 24461618 24197026 23925935 23688348 23477596
11130 23477596 23249338 23002909 22781059 22590031 22387693 22158059 21937656 21755219 21594776
11121 21594776 21431363 21261539 21087168 20904761 20720667 20548671 20389438 20236306 20093707
11112 20093707 19961132 19813204 19634678 19463192 19350741 19286924 19207699 19082082 18944340 18834150
11102 18834150 18750131 18676616 18617724 18584497 18571069 18555281 18508865 18412947 18286361 18185804 18143295
11091 18143295 18114810 18034213 17910164 17815174 17773527 17719084 17589037 17410666 17257514 17150984
11081 17150984 17046680 16907015 16752874 16635664 16572105 16519614 16425464 16296688 16196826 16161471
11071 16161471 16148565 16102423 16036411 16002967 16000509 15973154 15905597 15855573 15868868 15912525 15927024
$$ packed form
11139B5837165k33520k87092l17156k84623k53156k64592k71091k37587k10752
11130B3477596k28258k46429k21850j91028k02338k29634k20403j82437j60443
11121B1594776j63413j69824j74371j82407j84094j71996j59233j53132j42599
11112B0093707j32575j47928j78526j71486j12451o3817p9225j25617j37742j10190
11102A8834150q4019p3515n8892l3227j3428j5788m6416r5918j26586j00557m2509
11091A8143295k8485q0597j24049r4990m1647n4443j30047j78371j53152j06530
11081A7150984j04304j39665j54141j17210o3559n2491r4150j28776r9862l5355
11071A6161471j2906m6142o6012l3444k458k7355o7557n0024J3295M3657J4499
$$ plain form
11060 15927024 15910148 15909388 15947724 15995342 16019669 16038662 16102239 16218249 16319147 16330971 16267347
11049 16267347 16211276 16197117 16167189 16072614 15954367 15871820 15807149 15711949 15603309 15528947 15470321
11038 15470321 15374571 15261031 15193779 15158898 15081293 14969704 14924849 14972640 15005355 14941738 14843265
11027 14843265 14805520 14822790 14835674 14839083 14861266 14889866 14896091 14894248 14914629 14953024 14998669 15070793
11015 15070793 15177584 15282231 15356740 15423123 15498810 15559342 15603963 15691879 15851436 16016956
11005 16016956 16124004 16204835 16317357 16447202 16564756 16710452 16920588 17126189 17239246
10996 17239246 17294482 17387018 17506145 17559188 17537691 17524429 17537954 17504252 17399027 17291834
10986 17291834 17217492 17117306 16948630 16753899 16578718 16408294 16224009 16043279 15869896
$$ packed form
11060A5927024j6876p60L8336M7618K4327J8993O3577J16010J00898J1824o3624
11049A6267347n6071j4159k9928r4575j18247q2547o4671r5200j08640p4362n8626
11038A5470321r5750j13540o7252l4881p7605j11589m4855M7791L2715o3617r8473
11027A4843265l7745J7270J2884L409K2183K8600O225j843K0381L8395M5645P2124
11015A5070793J06791J04647P4509O6383P5687O0532M4621Q7916J59557J65520
11005A6016956J07048Q0831J12522J29845J17554J45696K10136K05601J13057
10996A7239246N5236R2536J19127N3043k1497j3262J3525l3702j05225j07193
10986A7291834p4342j00186j68676j94731j75181j70424j84285j80730j73383
$$ plain form
10977 15869896 15682538 15499996 15374598 15291904 15164748 14961966 14755003 14597815 14451762
10968 14451762 14277901 14112645 13989356 13864082 13687090 13484335 13307947 13165197 13047356
10959 13047356 12962569 12888522 12765472 12594793 12468363 12432443 12399448 12276437 12110477 12011780
10949 12011780 11989085 11962547 11900684 11844233 11815938 11795968 11774440 11754496 11718308 11655590 11605861
10938 11605861 11611470 11654261 11695549 11741087 11804210 11852585 11867023 11902664 12003525 12106759 12134310
10927 12134310 12131444 12193584 12295209 12331819 12309100 12332477 12406701 12417223 12346897 12335436 12444338
10916 12444338 12523667 12430627 12251098 12161290 12163024 12114414 11970102 11828395 11748546 11671443 11552399
10905 11552399 11449316 11421219 11426973 11392138 11321362 11278985 11287497 11303755 11288615 11254926 11239019
$$ packed form
10977A5869896j87358j82542j25398q2694j27156k02782k06963j57188j46053
10968A4451762j73861j65256j23289j25274j76992k02755j76388j42750j17841
10959A3047356q4787p4047j23050j70679j26430l5920l2995j23011j65960r8697
10949A2011780k2695k6538o1863n6451k8295j9970k1528j9944l6188o2718m9729
10938A1605861N609M2791M1288M5538O3123M8375J4438L5641J00861J03234K7551
10927A2134310k866O2140J01625L6610k2719K3377P4224J0522p0326j1461J08902
10916A2444338P9329r3040j79529q9808J734m8610j44312j41707p9849p7103j19044
10905A1552399j03083k8097N754l4835p0776m2377Q512J6258j5140l3689j5907
$$ plain form
10894 11239019 11252878 11277343 11289270 11284535 11278855 11292793 11334533 11393310 11451573 11507315 11579004
10883 11579004 11678336 11783264 11858392 11906328 11975120 12100544 12262323 12416630 12550160 12674515
10873 12674515 12785093 12860324 12893316 12891589 12850991 12762493 12642924 12528895 12440213 12371871 12311838
10862 12311838 12239340 12124347 11970508 11842558 11797817 11798702 11754340 11648982 11558753 11526463 11496665
10851 11496665 11413264 11312556 11260563 11247944 11215231 11153427 11110527 11106583 11103241 11064801 11004178
10840 11004178 10957777 10949329 10986673 11060185 11129912 11144483 11097925 11052388 11079376 11182100 11297105
10829 11297105 11373779 11427919 11503548 11606352 11707166 11800608 11917759 12072366 12233009 12364774
10819 12364774 12462109 12522126 12528721 12492345 12460680 12450038 12409887 12302594 12171911 12073391 11985521
$$ packed form
10894A1239019J3859K4465J1927m735n680J3938M1740N8777N8263N5742P1689
10883A1579004R9332J04928P5128M7936O8792J25424J61779J54307J33530J24355
10873A2674515J10578P5231L2992j727m0598q8498j19569j14029q8682o8342o0033
10862A2311838p2498j14993j53839j27950m4741Q85m4362j05358r0229l2290k9798
10851A1496665q3401j00708n1993j2619l2713o1804m2900l944l342l8440o0623
10840A1004178m6401q448L7344P3512O9727J4571m6558m5537K6988J02724J15005
10829A1297105P6674N4140P5629J02804J00814R3442J17151J54607J60643J31765
10819A2364774R7335O0017O595l6376l1665j0642m0151j07293j30683r8520q7870
$$ plain form
10808 11985521 11866841 11756787 11721360 11726044 11673477 11561156 11489865 11507044 11553368 11584322 11631588
10797 11631588 11711337 11783699 11846476 11958158 12116390 12228962 12272517 12362104 12572572 12800199
10787 12800199 12913024 12944428 13008175 13095007 13099113 13007071 12917585 12881684 12847447 12771338 12679695
10776 12679695 12603872 12539554 12486498 12461763 12465299 12485148 12527726 12590778 12630103 12614728 12587393
10765 12587393 12603324 12641655 12652032 12651438 12686619 12734624 12738992 12715920 12718868 12724552 12674329 12612304
10753 12612304 12646946 12769306 12846359 12820884 12784569 12810123 12841329 12815289 12778857 12800981 12859124
10742 12859124 12896881 12923004 12971295 13019634 13030189 13029894 13076608 13169332 13252797 13296213 13320525
10731 13320525 13357059 13412860 13472833 13520562 13561928 13624093 13716446 13811116 13889319 13977585 14096173
$$ packed form
10808A1985521j18680j10054l5427M684n2567j12321p1291J7179M6324L0954M7266
10797A1631588P9749P2362O2777J11682J58232J12572M3555Q9587K10468K27627
10787A2800199J12825L1404O3747Q6832M106r2042q9486l5901l4237p6109r1643
10776A2679695p5823o4318n3056k4735L536J9849M2578O3052L9325j5375k7335
10765A2587393J5931L8331J0377n94L5181M8005M368k3072K948N684n0223o2025
10753A2612304L4642J22360P7053k5475l6315K5554L1206k6040l6432K2124N8143
10742A2859124L7757K6123M8291M8339J0555k95M6714R2724Q3465M3416K4312
10731A3320525L6534N5801N9973M7729M1366O2165R2353R4670P8203Q8266J18588
$$ plain form
10720 14096173 14209155 14284620 14362626 14486193 14607378 14658951 14681260 14762605 14884873 14962434
10710 14962434 15013232 15136352 15322271 15456593 15533333 15681611 15930758 16136162 16220876 16310755
10700 16310755 16518231 16757648 16912938 17045711 17278811 17582266 17835529 18024685 18229176
10691 18229176 18470892 18710396 18948735 19219635 19519945 19834907 20178638 20538298 20856335
10682 20856335 21138604 21476891 21883933 22233670 22469056 22724503 23103767 23483610 23714224
10673 23714224 23879594 24147825 24472017 24676543 24766907 24903856 25101689 25198683 25135490 25041404
10663 25041404 25015508 25015774 24996298 24978104 24953023 24879697 24801197 24814150 24903195 24955280 24947988 24971628
10651 24971628 25059534 25155437 25255689 25417845 25609948 25709080 25672148 25570424 25455634 25334493
$$ packed form
10720A4096173J12982P5465P8006J23567J21185N1573K2309Q1345J22268P7561
10710A4962434N0798J23120J85919J34322P6740J48278K49147K05404Q4714Q9879
10700A6310755K07476K39417J55290J32773K33100L03455K53263J89156K04491
10691A8229176K41716K39504K38339K70900L00310L14962L43731L59660L18037
10682B0856335K82269L38287M07042L49737K35386K55447L79264L79843K30614
10673B3714224J65370K68231L24192K04526R0364J36949J97833R6994o3193r4086
10663B5041404k5896K66j9476j8194k5081p3326p8500J2953Q9045N2085p292K3640
10651B4971628Q7906R5903J00252J62156J92103R9132l6932j01724j14790j21141
$$ plain form
10641 25334493 25256076 25263419 25282310 25227996 25184278 25285158 25466773 25561856 25596995 25738348 25972225
10630 25972225 26130138 26226135 26451620 26804315 27054342 27147219 27306003 27632124 27937118 28102379
10620 28102379 28281949 28591097 28905549 29144775 29452414 29904705 30329914 30614968 30906320
10611 30906320 31305732 31661257 31877951 32135625 32557813 32964921 33216843 33497485 33970176
10602 33970176 34450689 34743394 35015891 35492390 36043036 36445790 36807953 37344509 37966031
10593 37966031 38476924 38968157 39618606 40316536 40882020 41456753 42255747 43138846 43860933
10584 43860933 44538625 45415073 46371302 47151248 47866285 48771854 49749366 50546545 51329641
10575 51329641 52425352 53708580 54846833 55952482 57344795 58867301 60156885 61409389
$$ packed form
10641B5334493p8417P343J8891n4314m3718J00880J81615R5083L5139J41353K33877
10630B5972225J57913R5997K25485L52695K50027R2877J58784L26121L04994J65261
10620B8102379J79570L09148L14452K39226L07639M52291M25209K85054K91352
10611C0906320L99412L55525K16694K57674M22188M07108K51922K80642M72691
10602C3970176M80513K92705K72497M76499N50646M02754L62163N36556O21522
10593C7966031N10893M91233O50449O97930N65484N74733P98994Q83099P22087
10584D3860933O77692Q76448R56229P79946P15037R05569R77512P97179P83096
10575E1329641J095711J283228J138253J105649J392313J522506J289584J252504
$$ plain form
10567 61409389 63101278 65104624 66914415 68627779 70786052 73315477 75588010 77514685
10559 77514685 79584424 81834611 83871827 85938474 88772161 92320012 95854644 99464873
10551 99464873 104016192 109493353 115018286 120761754 127958662 136650910 145670107 155510823
10543 155510823 168453724 184570390 200853408 216624728 236237917 262143571 287597001
10536 287597001 301676228 301241523 292999481 283392668 271815280 255672659 236907713
10529 236907713 219546445 204016577 188162489 172165491 158544439 148066799 139101382
10522 139101382 130819001 124053246 118852621 113814185 108308456 103209903 98935665 94664858
10514 94664858 90025494 85822158 82484453 79314000 75871959 72720261 70170011 67592368
$$ packed form
10567F1409389J691889K003346J809791J713364K158273K529425K272533J926675
10559G7514685K069739K250187K037216K066647K833687L547851L534632L610229
10551I9464873M551319N477161N524933N743468P196908Q692248R019197R840716
10543A55510823J2942901J6116666J6283018J5771320J9613189K5905654K5453430
10536B87597001J4079227m34705q242042r606813j1577388j6142621j8764946
10529B36907713j7361268j5529868j5854088j5996998j3621052j0477640q965417
10522A39101382q282381o765755n200625n038436n505729n098553m274238m270807
10514I4664858m639364m203336l337705l170453l442041l151698k550250k577643
$$ plain form
10506 67592368 64632944 61926750 59918934 58052803 55834501 53721324 52227711 51030031
10498 51030031 49681180 48417207 47540585 46729488 45667856 44702682 44183852 43760349 43013701
10489 43013701 42221232 41806482 41555190 41064174 40497224 40213328 40065166 39733155 39373368
10480 39373368 39281402 39263968 38984569 38606700 38459813 38372855 37979654 37411025 37039989 36778857
10470 36778857 36272269 35588311 35083778 34746168 34286870 33750305 33423537 33249889 32924343
10461 32924343 32487596 32252830 32211511 32071103 31824409 31726078 31744788 31589495 31260063 31034537
10451 31034537 30919003 30644328 30214373 29924583 29811764 29612773 29309215 29183863 29269749
10442 29269749 29263901 29079507 28980032 29061403 29096802 29014411 29038618 29216987 29286373 29168551 29136332
$$ packed form
10506F7592368k959424k706194k007816j866131k218302k113177j493613j197680
10498E1030031j348851j263973q76622q11097j061632r65174n18830m23503p46648
10489D3013701p92469m14750k51292m91016n66950k83896j48162l32011l59787
10480C9373368r1966j7434k79399l77869j46887q6958l93201n68629l71036k61132
10470C6778857n06588o83958n04533l37610m59298n36565l26768j73648l25546
10461C2924343m36747k34766m1319j40408k46694r8331J8710j55293l29432k25526
10451C1034537j15534k74675m29955k89790j12819j98991l03558j25352Q5886
10442B9269749n848j84394r9475Q1371L5399q2391K4207J78369O9386j17822l2219
$$ plain form
10431 29136332 29315784 29472303 29470667 29505172 29680667 29801385 29784573 29856831 30114688 30305723
10421 30305723 30285834 30289051 30486789 30670409 30645727 30571807 30623132 30667351 30571316 30494732 30583055
10410 30583055 30680457 30637945 30604070 30725954 30864633 30890905 30954891 31170881 31352737 31373515
10400 31373515 31466394 31828437 32237659 32430255 32561167 32898021 33335063 33631195 33887498
10391 33887498 34351202 34946844 35436953 35878346 36491721 37225037 37865090 38452031 39166997
10382 39166997 39917331 40440257 40730287 40982238 41206753 41285842 41315565 41502592 41796073 41997079
10372 41997079 42150889 42453372 42856116 43157922 43411533 43839532 44413800 44923863 45401439
10363 45401439 46057715 46842602 47494104 48007659 48636303 49425886 50158431 50765677 51408736
$$ packed form
10431B9136332J79452J56519j636L4505J75495J20718j6812P2258K57857J91035
10421C0305723j9889L217J97738J83620k4682p3920N1325M4219r6035p6584Q8323
10410C0583055R7402m2512l3875J21884J38679K6272O3986K15990J81856K0778
10400C1373515R2879L62043M09222J92596J30912L36854M37042K96132K56303
10391C3887498M63704N95642M90109M41393O13375P33316O40053N86941P14966
10382C9166997P50334N22926K90030K51951K24515P9089K9723J87027K93481K01006
10372D1997079J53810L02483M02744L01806K53611M27999N74268N10063M77576
10363D5401439O56276P84887O51502N13555O28644P89583P32545O07246O43059
$$ plain form
10354 51408736 52145761 52900237 53738720 54787225 55903962 56845567 57715862 58812340 60077638
10345 60077638 61187152 62150641 63305536 64708189 66071426 67340940 68779099 70413352
10337 70413352 71969792 73449447 75195781 77267968 79327708 81294123 83519924 86139848
10329 86139848 88831904 91414849 94076536 96792825 99146497 100991749 102697945 104468792
10321 104468792 106039287 107325744 108723739 110444588 112215595 113962969 116090387 118730859
10313 118730859 121482128 124269456 127601245 131440769 134728833 136725670 137999463 139337241
10305 139337241 140531682 141136090 141596748 142579026 143841308 144855351 145943155 147702357
10297 147702357 149875937 151930054 154202626 157292152 160857975 164295879 168064513 172983108
$$ packed form
10354E1408736P37025P54476Q38483J048505J116737R41605Q70295J096478J265298
10345F0077638J109514R63489J154895J402653J363237J269514J438159J634253
10337G0413352J556440J479655J746334K072187K059740J966415K225801K619924
10329H6139848K692056K582945K661687K716289K353672J845252J706196J770847
10321A04468792J570495J286457J397995J720849J771007J747374K127418K640472
10313A18730859K751269K787328L331789L839524L288064J996837J273793J337778
10305A39337241J194441O04408M60658R82278J262282J014043J087804J759202
10297A47702357K173580K054117K272572L089526L565823L437904L768634M918595
$$ plain form
10289 172983108 178748467 184610897 190965005 198649310 207241903 215891504 225270999 236600959
10281 236600959 249335196 262379662 277077643 295720488 317238925 338476416 360446156
10274 360446156 388202988 421555365 450337615 463658607 461393668 451905144 440395678
10267 440395678 425117761 404550896 382069857 361408678 342090014 322303630 303213571
10260 303213571 287393278 275050035 264606289 255650177 248767142 243361317 237994267
10253 237994267 232461396 227632259 223561440 219451194 215249344 211707729 208935633 206276174
10245 206276174 203586170 201379720 199689931 197961180 196141898 194798779 194024489 193235769
10237 193235769 192222606 191469847 191225435 191095322 190805703 190596864 190591994 190471434 190065752
$$ packed form
10289A72983108N765359N862430O354108P684305Q592593Q649601R379495J1329960
10281B36600959J2734237J3044466J4697981J8642845K1518437K1237491K1969740
10274C60446156K7756832L3352377K8782250J3320992k264939r488524j1509466
10267D40395678j5277917k0566865k2481039k0661179j9318664j9786384j9090059
10260C03213571j5820293j2343243j0443746q956112o883035n405825n367050
10253B37994267n532871m829137m070819m110246m201850l541615k772096k659459
10245B06276174k690004k206450j689789j728751j819282j343119p74290p88720
10237A93235769j013163p52759k44412j30113k89619k08839m870j20560m05682
$$ plain form
10228 190065752 189665312 189458461 189201023 188706665 188175416 187789508 187432782 187038250 186792694
10219 186792694 186781607 186822368 186839964 187022536 187417777 187750809 187833631 187804229 187782658 187634989
10209 187634989 187249187 186698479 185951381 184758642 183020399 180950637 178698683 176129515
10201 176129515 173169184 170044467 166962912 163855513 160665085 157609599 154915795 152533257
10193 152533257 150343004 148424259 146889302 145661751 144638067 143885302 143485127 143362650
10185 143362650 143440664 143767500 144323133 144897732 145316076 145555675 145485130 144757784 143188342
10176 143188342 140996400 138452141 135529038 132159033 128571376 125056151 121592255 118042121
10168 118042121 114549321 111395286 108581181 105896499 103322757 101037238 99063905 97236833
$$ packed form
10228A90065752m00440k06851k57438m94358n31249l85908l56726l94532k45556
10219A86792694j1087M0761J7596J82572L95241L33032Q2822k9402k1571j47669
10209A87634989l85802n50708p47098j192739j738243k069762k251954k569168
10201A76129515k960331l124717l081555l107399l190428l055486k693804k382538
10193A52533257k190253j918745j534957j227551j023684p52765m00175j22477
10185A43362650P8014L26836N55633N74599M18344K39599p0545p27346j569442
10176A43188342k191942k544259k923103l370005l587657l515225l463896l550134
10168A18042121l492800l154035k814105k684682k573742k285519j973333j827072
$$ plain form
10160 97236833 95493758 93922307 92526058 91211535 90000488 88999201 88158868 87313073
10152 87313073 86454256 85730438 85163260 84615785 84059001 83622100 83331662 83029213 82610045
10143 82610045 82143057 81693636 81213146 80663684 80083866 79478776 78799875 78069464 77367587
10134 77367587 76670563 75869571 74972504 74110796 73321524 72512791 71678129 70937707 70307801
10125 70307801 69639081 68870881 68147906 67575675 67043677 66418821 65751763 65149733 64581568
10116 64581568 63957123 63292785 62656035 62029718 61361227 60678148 60038443 59423684 58786009
10107 58786009 58149680 57571584 57043700 56515657 55977158 55455485 54970737 54539412 54173387
10098 54173387 53840610 53487745 53128654 52834539 52613155 52392450 52151184 51951793 51803640
$$ packed form
10160I7236833j743075j571451j396249j314523j211047j001287q40333q45795
10152H7313073q58817p23818n67178n47475n56784m36901k90438l02449m19168
10143H2610045m66988m49421m80490n49462n79818o05090o78901p30411p01877
10134G7367587o97024q00992q97067q61708p89272q08733q34662p40422o29906
10125G0307801o68720p68200p22975n72231n31998o24856o67058o02030n68165
10116F4581568o24445o64338o36750o26317o68491o83079o39705o14759o37675
10107E8786009o36329n78096n27884n28043n38499n21673m84748m31325l66025
10098E4173387l32777l52865l59091k94115k21384k20705k41266j99391j48153
$$ plain form
10089 51803640 51623661 51394949 51229129 51186065 51164287 51076174 51005008 51059401 51183560 51259960
10079 51259960 51312256 51447688 51657787 51834747 51956348 52114005 52370445 52707158 53098410
10070 53098410 53531917 53974121 54412917 54912132 55531580 56227341 56929581 57677786 58565337
10061 58565337 59585947 60659650 61784439 63026429 64368461 65706347 67004810 68324685
10053 68324685 69674246 70964418 72150525 73295923 74438043 75496164 76378861 77096106
10045 77096106 77692497 78137905 78361839 78355353 78174022 77864455 77436704 76891304 76235670 75485340
10035 75485340 74674912 73860969 73102418 72442007 71897301 71450704 71065761 70748405 70578974
10026 70578974 70641873 70935002 71400365 72042195 72956019 74221538 75813677 77654560 79727775
$$ packed form
10089E1803640j79979k28712j65820m3064k1778q8113p1166N4393J24159P6400
10079E1259960N2296J35432K10099J76960J21601J57657K56440L36713L91252
10070E3098410M33507M42204M38796M99215O19448O95761P02240P48205Q87551
10061E8565337J020610J073703J124789J241990J342032J337886J298463J319875
10053F8324685J349561J290172J186107J145398J142120J058121Q82697P17245
10045G7096106N96391M45408K23934o486j81331l09567m27751n45400o55634p50330
10035G5485340q10428q13943p58551o60411n44706m46597l84943l17356j69431
10026G0578974O2899K93129M65363O41830R13824J265519J592139J840883K073215
$$ plain form
10017 79727775 82084468 84684544 87215325 89125982 89945829 89606909 88404455 86641722
10009 86641722 84414631 81765808 78882731 75999350 73190617 70419852 67740877 65296916
10001 65296916 63139643 61201353 59445722 57899045 56519258 55183479 53844881 52573675
9993 52573675 51403721 50266349 49125255 48051763 47101415 46225426 45370991 44568000 43848379
9984 43848379 43175167 42520611 41923715 41403118 40905443 40409814 39986934 39675220 39395078
9975 39395078 39076153 38774780 38561145 38378789 38137578 37874247 37689271 37575331 37441051
9966 37441051 37271951 37136056 37042541 36918240 36730200 36526896 36346466 36171951 35986373 35794861
9956 35794861 35586962 35344608 35083306 34822444 34534141 34193972 33855042 33582848 33341281
$$ packed form
10017G9727775K356693K600076K530781J910657Q19847l38920j202454j762733
10009H6641722k227091k648823k883077k883381k808733k770765k678975k443961
10001F5296916k157273j938290j755631j546677j379787j335779j338598j271206
9993E2573675j169954j137372j141094j073492r50348q75989q54435q02991p19621
9984D3848379o73212o54556n96896n20597m97675m95629m22880l11714k80142
9975C9395078l18925l01373k13635j82356k41211k63331j84976j13940j34280
9966C7441051j69100j35895r3515j24301j88040k03304j80430j74515j85578j91512
9956C5794861k07899k42354k61302k60862k88303l40169l38930k72194k41567
$$ plain form
9947 33341281 33047111 32720968 32462882 32274212 32036053 31699533 31371358 31145640 30956830
9938 30956830 30685423 30333434 30002477 29743352 29513282 29260762 28980548 28689127 28400558
9929 28400558 28132553 27902817 27712983 27549713 27395963 27234406 27056813 26880526 26737928
9920 26737928 26638742 26557778 26466226 26360031 26256191 26177637 26137432 26118060 26076854 25998877 25930178
9909 25930178 25922076 25955927 25969135 25946993 25935196 25962635 26010252 26064700 26142852 26243190 26327053
9898 26327053 26374693 26414734 26473615 26539847 26603162 26683044 26786812 26881480 26944471 27008248 27116508
9887 27116508 27263026 27410348 27546924 27689824 27846772 28009164 28173836 28344023 28513786
9878 28513786 28674355 28835951 29027461 29268258 29542438 29806892 30037606 30268350 30557435
$$ packed form
9947C3341281k94170l26143k58086j88670k38159l36520l28175k25718j88810
9938C0956830k71407l51989l30957k59125k30070k52520k80214k91421k88569
9929B8400558k68005k29736j89834j63270j53750j61557j77593j76287j42598
9920B6737928r9186q0964r1552j06195j03840p8554m0205j9372m1206p7977o8699
9909B5930178q102L3851J3208k2142j1797K7439M7617N4448P8152J00338Q3863
9898B6327053M7640M0041N8881O6232O3315P9882J03768R4668O2991O3777J08260
9887B7116508J46518J47322J36576J42900J56948J62392J64672J70187J69763
9878B8513786J60569J61596J91510K40797K74180K64454K30714K30744K89085
$$ plain form
9869 30557435 30904893 31239499 31513082 31760336 32019062 32245923 32391872 32520318 32741846
9860 32741846 33043109 33299584 33474084 33679126 33995586 34346429 34628635 34877114 35202174
9851 35202174 35627426 36084141 36525135 36958264 37395029 37841746 38320724 38835230 39335197
9842 39335197 39778158 40202399 40682122 41231856 41809732 42391340 42984474 43592507 44216148
9833 44216148 44870792 45556811 46241881 46916810 47628098 48405499 49209239 50010985 50864717
9824 50864717 51810039 52761503 53603123 54354130 55122663 55921919 56664908 57335577 58023016
9815 58023016 58761825 59474905 60124275 60797427 61577012 62427133 63283975 64171573 65143989
9806 65143989 66182145 67236214 68322651 69495215 70748201 72021602 73289787 74591440
$$ packed form
9869C0557435L47458L34606K73583K47254K58726K26861J45949J28446K21528
9860C2741846L01263K56475J74500K05042L16460L50843K82206K48479L25060
9851C5202174M25252M56715M40994M33129M36765M46717M78978N14506M99967
9842C9335197M42961M24241M79723N49734N77876N81608N93134O08033O23641
9833D4216148O54644O86019O85070O74929P11288P77401Q03740Q01746Q53732
9824E0864717R45322R51464Q41620P51007P68533P99256P42989O70669O87439
9815E8023016P38809P13080O49370O73152P79585Q50121Q56842Q87598R72416
9806F5143989J038156J054069J086437J172564J252986J273401J268185J301653
$$ plain form
9798 74591440 75979693 77476779 79064762 80701685 82370489 84119401 86011573 88029867
9790 88029867 90097328 92209430 94463368 96916217 99501107 102147867 104905948 107864467
9782 107864467 111019407 114319074 117790384 121515136 125517958 129787831 134387368 139424257
9774 139424257 144918480 150813844 157135067 164021107 171571246 179762866 188571487 198085392
9766 198085392 208447183 219755552 232071758 245432947 259773126 274871158 290401965
9759 290401965 305899400 320517622 332917608 341665197 345927800 345794258 341934293 335060167
9751 335060167 325751335 314611829 302343833 289594737 276823388 264351352 252450723
9744 252450723 241309438 230965495 221355111 212411946 204073026 196224952 188730471 181523864
$$ packed form
9798G4591440J388253J497086J587983J636923J668804J748912J892172K018294
9790H8029867K067461K112102K253938K452849K584890K646760K758081K958519
9782A07864467L154940L299667L471310L724752M002822M269873M599537N036889
9774A39424257N494223N895364O321223O886040P550139Q191620Q808621R513905
9766A98085392J0361791J1308369J2316206J3361189J4340179J5098032J5530807
9759B90401965J5497435J4618222J2399986Q747589M262603j33542l859965o874126
9751C35060167r308832j1139506j2267996j2749096j2771349j2472036j1900629
9744B52450723j1141285j0343943r610384q943165q338920p848074p494481p206607
$$ plain form
9736 181523864 174632974 168104004 161950841 156174922 150773041 145711113 140944926 136482044
9728 136482044 132365050 128574159 125012882 121622248 118436960 115477038 112657536 109887772
9720 109887772 107207159 104721508 102427129 100202694 97982161 95838546 93864545 92051236
9712 92051236 90335019 88704802 87200040 85833053 84573288 83404835 82354508 81448290
9704 81448290 80661601 79931084 79214075 78521529 77878107 77259669 76604034 75893926 75190190
9695 75190190 74552112 73959021 73357286 72760959 72247032 71856663 71560493 71332322 71204497
9686 71204497 71225882 71399590 71684920 72038259 72435642 72868172 73319320 73736469 74037048 74163624
9676 74163624 74117090 73912942 73535293 72972855 72263241 71440914 70473003 69324294 68061527
$$ packed form
9736A81523864o890890o528970o153163n775919n401881n061928m766187m462882
9728A36482044m116994l790891l561277l390634l185288k959922k819502k769764
9720A09887772k680613k485651k294379k224435k220533k143615j974001j813309
9712I2051236j716217j630217j504762j366987j259765j168453j050327r06218
9704H1448290p86689p30517p17009o92546o43422o18438o55635p10108p03736
9695G5190190o38078n93091o01735n96327n13927l90369k96170k28171j27825
9686G1204497K1385J73708K85330L53339L97383M32530M51148M17149L00579J26576
9676G4163624m6534k04148l77649n62438p09614q22327r67911j148709j262767
$$ plain form
9667 68061527 66798065 65546083 64234015 62875520 61591295 60425256 59271964 58058051
9659 58058051 56871064 55806164 54792752 53702988 52552961 51451559 50400581 49299432
9651 49299432 48130579 46990502 45926751 44882637 43831916 42839291 41940101 41073883 40196805
9642 40196805 39361742 38621082 37936979 37260219 36621834 36066572 35557550 35030290 34493632
9633 34493632 33995643 33528765 33051602 32574998 32143046 31747863 31343863 30933554 30558814
9624 30558814 30214828 29856529 29491155 29175917 28909775 28618307 28276957 27960776 27722100
9615 27722100 27500039 27220169 26916636 26669688 26470391 26245910 25995066 25792787 25653836
9606 25653836 25493367 25256973 25004138 24809428 24648225 24446430 24196272 23950415 23727931
$$ packed form
9667F8061527j263462j251982j312068j358495j284225j166039j153292j213913
9659E8058051j186987j064900j013412j089764j150027j101402j050978j101149
9651D9299432j168853j140077j063751j044114j050721r92625q99190q66218q77078
9642D0196805q35063p40660o84103o76760o38385n55262n09022n27260n36658
9633C4493632m97989m66878m77163m76604m31952l95183m04000m10309l74740
9624C0558814l43986l58299l65374l15238k66142k91468l41350l16181k38676
9615B7722100k22061k79870l03533k46948j99297k24481k50844k02279j38951
9606B5653836j60469k36394k52835j94710j61203k01795k50158k45857k22484
$$ plain form
9597 23727931 23498179 23249567 23008863 22788232 22569489 22350636 22158379 22001954 21859198
9588 21859198 21719790 21595755 21475677 21320429 21127874 20950596 20816830 20682611 20504410
9579 20504410 20314697 20172660 20074617 19971840 19852248 19741881 19640161 19518560 19380586 19260795
9569 19260795 19158834 19034106 18879140 18741246 18648994 18567346 18454124 18318582 18192410 18078513
9559 18078513 17964043 17858607 17784058 17739125 17699752 17646246 17575772 17499027 17431543 17372308 17291036
9548 17291036 17163480 17018419 16910024 16837978 16744621 16607783 16478655 16393160 16303178 16150253
9538 16150253 15961794 15806371 15683570 15532802 15338371 15149707 14992956 14833572 14645178
9529 14645178 14453772 14286531 14129748 13970445 13833285 13735446 13641297 13509817 13366115 13277729
$$ packed form
9597B3727931k29752k48612k40704k20631k18743k18853j92257j56425j42756
9588B1859198j39408j24035j20078j55248j92555j77278j33766j34219j78201
9579B0504410j89713j42037r8043j02777j19592j10367j01720j21601j37974j19791
9569A9260795j01961j24728j54966j37894r2252q1648j13222j35542j26172j13897
9559A8078513j14470j05436p4549m4933l9373n3506p0474p6745o7484n9235q1272
9548A7291036j27556j45061j08395p2046r3357j36838j29128q5495q9982j52925
9538A6150253j88459j55423j22801j50768j94431j88664j56751j59384j88394
9529A4645178j91406j67241j56783j59303j37160r7839r4149j31480j43702q8386
$$ plain form
9519 13277729 13265675 13281396 13277430 13265499 13288278 13357608 13444372 13520944 13588485 13653762 13697004
9508 13697004 13685301 13615082 13515789 13402346 13250193 13038420 12794178 12561026 12338819 12097614
9498 12097614 11846589 11638781 11493530 11360914 11191652 11004780 10848541 10723086 10589773
9489 10589773 10443639 10323685 10243953 10160756 10032552 9880305 9755945 9668589 9579626 9469314
9479 9469314 9368831 9305892 9247117 9133166 8966781 8826044 8772889 8776903 8756577 8676986 8572895
9468 8572895 8484170 8409416 8333954 8269239 8237989 8233734 8218902 8165226 8086756 8028597 8019704 8035683
9456 8035683 8019558 7949206 7869122 7835124 7842660 7841206 7808577 7768263 7734921 7694740 7652671 7643123
9444 7643123 7663021 7646936 7557002 7456459 7433276 7476024 7491832 7438442 7371293 7352050 7372955
$$ packed form
9519A3277729j2054J5721l966j1931K2779O9330Q6764P6572O7541O5277M3242
9508A3697004j1703p0219r9293j13443j52153k11773k44242k33152k22207k41205
9498A2097614k51025k07808j45251j32616j69262j86872j56239j25455j33313
9489A0589773j46134j19954p9732q3197j28204j52247j24360q7356q8963j10312
9479I469314j00483o2939n8775j13951j66385j40737n3155M014k0326p9591j04091
9468H572895q8725p4754p5462o4715l1250m255j4832n3676p8470n8159q893J5979
9456H035683j6125p0352q0084l3998P536j454l2629m0314l3342m0181m2069r548
9444G643123J9898j6085q9934j00543k3183M2748J5808n3390o7149j9243K0905
$$ plain form
9433 7372955 7394401 7405159 7411801 7406126 7381533 7361831 7381172 7442226 7512706 7556918 7562491 7548594
9421 7548594 7553705 7598999 7659786 7694517 7705867 7743937 7837888 7955649 8051092 8124434 8212038
9410 8212038 8336771 8491703 8658079 8821787 8985700 9174047 9403813 9652759 9897265 10185849
9400 10185849 10609547 11172150 11768768 12350294 13019125 13846720 14652306 15117419 15129771 14874807
9390 14874807 14552542 14150332 13578198 12894212 12250732 11684316 11109930 10509629 9992233
9381 9992233 9641436 9408661 9195359 8965077 8737481 8536570 8383420 8287157 8208011 8077375
9371 8077375 7886486 7705855 7582408 7471345 7317119 7150447 7038405 6970215 6867068 6699340
9361 6699340 6528036 6418132 6361425 6305484 6223935 6134732 6066296 6022568 5979319 5915893 5851651
$$ packed form
9433G372955K1446J0758O642n675k4593j9702J9341O1054P0480M4212N573j3897
9421G548594N111M5294O0787L4731J1350L8070R3951J17761R5443P3342Q7604
9410H212038J24733J54932J66376J63708J63913J88347K29766K48946K44506K88584
9400A0185849M23698N62603N96618N81526O68831Q27595Q05586M65113J2352k54964
9390A4874807l22265m02210n72134o83986o43480n66416n74386o00301n17396
9381I992233l50797k32775k13302k30282k27596k00911j53150r6263p9146j30636
9371H077375j90889j80631j23447j11063j54226j66672j12042o8190j03147j67728
9361F699340j71304j09904n6707n5941q1549q9203o8436m3728m3249o3426o4242
$$ plain form
9350 5851651 5831657 5861243 5879779 5831282 5744226 5701572 5737292 5800830 5824103 5787825 5719182
9339 5719182 5659473 5640072 5658018 5669882 5639972 5594059 5587444 5621509 5643211 5634640 5639937 5677134
9327 5677134 5690707 5644310 5603855 5652454 5755733 5799298 5755654 5725152 5784661 5871800 5873205
9316 5873205 5778983 5684070 5654739 5657568 5629541 5566415 5509582 5473548 5428108 5352249 5271332 5221586
9304 5221586 5196600 5156009 5084321 5015591 4991027 5009686 5032336 5022422 4975317 4919961 4898743 4929460
9292 4929460 4977645 4985752 4942534 4899892 4900332 4914065 4883622 4813956 4773904 4809316 4895267 4980904
9280 4980904 5043815 5086205 5110794 5122505 5133760 5152042 5178115 5222856 5299797 5389657 5442824
9269 5442824 5439445 5423740 5454467 5539242 5639520 5721075 5774211 5801356 5813932 5831604 5860180
$$ packed form
9350E851651j9994K9586J8536m8497q7056m2654L5720O3538K3273l6278o8643
9339E719182n9709j9401J7946J1864k9910m5913o615L4065K1702q571N297L7197
9327E677134J3573m6397m0455M8599J03279M3565m3644l0502N9509Q7139J405
9316E873205r4222r4913k9331K829k8027o3126n6833l6034m5440p5859q0917m9746
9304E221586k4986m0591p1688o8730k4564J8659K2650r914m7105n5356k1218L0717
9292D929460M8185Q107m3218m2642M40J3733l0443o9666m0052L5412Q5951Q5637
9280D980904O2911M2390K4589J1711J1255J8282K6073M4741P6941Q9860N3167
9269E442824l379j5705L0727Q4775J00278Q1555N3136K7145J2576J7672K8576
$$ plain form
9258 5860180 5880375 5878901 5873163 5878789 5873377 5828916 5763439 5716341 5682991 5624495 5540513 5476513
9246 5476513 5447891 5412495 5342345 5273140 5249579 5261876 5272140 5269257 5260808 5241812 5210949 5190401
9234 5190401 5190543 5183091 5150886 5132030 5162557 5207032 5212089 5203332 5246477 5321578 5331789 5255921
9222 5255921 5199056 5246687 5346318 5394631 5383587 5391771 5467411 5583180 5687606 5755853 5808989
9211 5808989 5911354 6111392 6359877 6552509 6700182 6967863 7445081 7946839 8179686 8080475
9201 8080475 7851189 7662238 7478711 7218801 6923477 6669572 6429533 6137627 5826671 5586002
9191 5586002 5424607 5276059 5113262 4969739 4865232 4789415 4745081 4736010 4726699 4680893 4621549
9180 4621549 4586998 4555377 4489877 4428543 4431231 4454813 4394463 4255054 4164204 4184095 4221635
$$ packed form
9258E860180K0195j474n738N626n412m4461o5477m7098l3350n8496q3982o4000
9246E476513k8622l5396p0150o9205k3561J2297J0264k883q449j8996l0863k0548
9234E190401J42p452l2205j8856L0527M4475N057q757M3145P5101J0211p5868
9222E255921n6865M7631R9631M8313j1044Q184P5640J15769J04426O8247N3136
9211E808989J02365K00038K48485J92632J47673K67681M77218N01758K32847r9211
9201H080475k29286j88951j83527k59910k95324k53905k40039k91906l10956k40669
9191E586002j61395j48548j62797j43523j04507p5817m4334r071r311m5806n9344
9180D621549l4551l1621o5500o1334K688K3582o0350j39409r0850J9891L7540
$$ plain form
9169 4221635 4177779 4086764 4037251 4036896 4036000 4024507 4022164 4014463 3976469 3930285 3908251 3885927 3822744
9156 3822744 3747954 3730969 3774073 3806260 3786527 3746635 3719683 3690363 3643866 3613073 3635668
9145 3635668 3690320 3714641 3682475 3636916 3638177 3691054 3740166 3739708 3707041 3686385 3679851 3657672
9133 3657672 3628718 3639233 3685588 3694341 3628977 3557062 3553828 3589022 3582440 3535270 3519271 3550255
9121 3550255 3563998 3527835 3492130 3502597 3531939 3537273 3528576 3535414 3549271 3546085 3534794 3536026
9109 3536026 3531914 3483862 3395868 3321575 3300764 3313031 3304704 3248848 3168353 3102672 3061446 3021137
9097 3021137 2966798 2918797 2903173 2908317 2893629 2839222 2769732 2728308 2736334 2772589 2784849 2737729
9085 2737729 2661252 2630179 2675098 2737577 2740572 2679834 2612699 2579533 2576272 2585681 2591849 2576456
$$ packed form
9169D221635m3856r1015m9513l55q96j1493k343p701l7994m6184k2034k2324o3183
9156C822744p4790j6985M3104L2187j9733l9892k6952k9320m6497l0793K2595
9145C635668N4652K4321l2166m5559J261N2877M9112m58l2667k0656o534k2179
9133C657672k8954J0515M6355Q753o5364p1915l234L5194o582m7170j5999L0984
9121C550255J3743l6163l5705J0467K9342N334q697O838J3857l186j1291J232
9109C536026m112m8052q7994p4293k0811J2267q327n5856q0495o5681m1226m0309
9097C021137n4339m8001j5624N144j4688n4407o9490m1424Q026L6255J2260m7120
9085B737729p6477l1073M4919O2479K995o0738o7135l3166l261R409O168j5393
$$ plain form
9073 2576456 2539921 2510674 2498802 2471481 2419196 2400749 2451496 2491711 2426653 2309630 2282867
9062 2282867 2357983 2390966 2306549 2211927 2222206 2292258 2310899 2267052 2224305 2203905 2191096
9051 2191096 2199426 2234723 2244971 2195769 2148088 2171515 2228223 2237623 2208492 2202070 2207020 2168877
9039 2168877 2113072 2111764 2142830 2112930 2022621 1976131 2008035 2031065 1992918 1959215 1985107 2018089
9027 2018089 1998185 1957658 1945337 1936031 1895728 1864835 1891928 1942705 1957888 1952140 1971183 1992466
9015 1992466 1959288 1889784 1863871 1907102 1961575 1974096 1950517 1917747 1887095 1865637 1861796 1870468
9003 1870468 1881326 1898825 1925305 1936271 1909923 1872341 1871567 1907671 1928062 1898345 1845508 1821357
8991 1821357 1845887 1894228 1924401 1915617 1888832 1884105 1909617 1927839 1906193 1863827 1846818 1869586
$$ packed form
9073B576456l6535k9247j1872k7321n2285j8447N0747M0215o5058j17023k6763
9062B282867P5116L2983q4417r4622J0279P0052J8641m3847m2747k0400j2809
9051B191096Q330L5297J0248m9202m7681K3427N6708R400k9131o422M950l8143
9039B168877n5805j308L1066k9900r0309m6490L1904K3030l8147l3703K5892L2982
9027B018089j9904m0527j2321r306m0303l0893K7093N0777J5183n748J9043K1283
9015A992466l3178o9504k5913M3231N4473J2521k3579l2770l0652k1458l841Q672
9003A870468J0858J7499K6480J0966k6348l7582p74L6104K0391k9717n2837k4151
8991A821357K4530M8341L0173q784k6785m727K5512J8222k1646m2366j7009K2768
$$ plain form
8979 1869586 1902393 1909523 1883583 1848056 1834527 1848975 1862453 1854145 1853306 1897411 1952326 1935895
8967 1935895 1839394 1759240 1769242 1823313 1837662 1811633 1798241 1801625 1784915 1751065 1734340 1728821
8955 1728821 1704969 1685533 1721501 1793343 1820623 1782521 1749812 1774702 1821233 1835591 1821800
8944 1821800 1810756 1805872 1797476 1792665 1799933 1814363 1835797 1867805 1889122 1869901 1826877 1811637
8932 1811637 1829703 1827983 1783754 1745525 1754248 1783382 1796481 1806683 1830847 1839198 1810466 1792146
8920 1792146 1836545 1906614 1918654 1867370 1838843 1891242 1978327 2012808 1971913 1916251 1913797 1960029
8908 1960029 1985963 1953522 1918354 1955729 2039529 2066516 2010962 1968215 2003670 2048870 2022252
8897 2022252 1972765 1997506 2072579 2092010 2049249 2044718 2107172 2143882 2106386 2077775 2126666 2184872
$$ packed form
8979A869586L2807P130k5940l5527j3529J4448J3478q308q39M4105N4915j6431
8967A935895r6501q0154J0002N4071J4349k6029j3392L384j6710l3850j6725n519
8955A728821k3852j9436L5968P1842K7280l8102l2709K4890M6531J4358j3791
8944A821800j1044m884q396m811P268J4430K1434L2008K1317j9221m3024j5240
8932A811637J8066j720m4229l8229Q723K9134J3099J0202K4164Q351k8732j8320
8920A792146M4399P0069J2040n1284k8527N2399Q7085L4481m0895n5662k454M6232
8908A960029K5934l2441l5168L7375Q3800K6987n5554m2747L5455M5200k6618
8897B022252m9487K4741P5073J9431m2761m531O2454L6710l7496k8611M8891N8206
$$ plain form
8885 2184872 2164833 2114049 2139311 2229084 2272535 2238834 2220155 2278577 2351360 2353787 2301992 2274391
8873 2274391 2297223 2330330 2344926 2356806 2381056 2400493 2396984 2385947 2396421 2428444 2451536 2446211
8861 2446211 2431464 2442193 2486378 2536089 2561509 2563449 2565569 2581577 2601883 2613136 2619983 2639884
8849 2639884 2680262 2728444 2766090 2790488 2818020 2862939 2911985 2929405 2901526 2873300 2914113
8838 2914113 3031584 3144201 3172375 3140868 3143912 3210379 3263967 3241284 3188337 3186965 3231648
8827 3231648 3252312 3236167 3244292 3304372 3366365 3388695 3400774 3444574 3509759 3566680 3617081 3671093
8815 3671093 3715494 3746923 3797955 3885651 3970199 4012262 4038929 4103501 4210536 4331922 4464608
8804 4464608 4611993 4736653 4802716 4849647 4951519 5108678 5251594 5354056 5468640 5634710
$$ packed form
8885B184872k0039n0784K5262Q9773M3451l3701j8679N8422P2783K427n1795k7601
8873B274391K2832L3107J4596J1880K4250J9437l509j1037J0474L2023K3092n325
8861B446211j4747J0729M4185M9711K5420J940K120J6008K0306J1253O847J9901
8849B639884M0378M8182L7646K4398K7532M4919M9046J7420k7879k8226M0813
8838B914113J17471J12617K8174l1507L044O6467N3588k2683n2947j372M4683
8827C231648K0664j6145Q125O0080O1993K2330J2079M3800O5185N6921N0401N4012
8815C671093M4401L1429N1032Q7696Q4548M2063K6667O4572J07035J21386J32686
8804D464608J47385J24660O6063M6931J01872J57159J42916J02462J14584J66070
$$ plain form
8794 5634710 5821556 5993986 6179030 6426151 6729648 7020512 7225639 7330503 7393728 7484463
8784 7484463 7588658 7615040 7530257 7432754 7420858 7441016 7375219 7246349 7201766 7293753 7421659
8773 7421659 7520225 7653246 7859632 8057832 8199555 8380686 8672540 8958814 9090475 9113703
8763 9113703 9180887 9302502 9366715 9365402 9405232 9493603 9509952 9431902 9406257 9516940 9643820
8752 9643820 9658905 9628140 9688992 9831922 9953424 10063929 10284364 10645610 11032648 11362136
8742 11362136 11709082 12191513 12778696 13273233 13482364 13387269 13138285 12884268 12623214 12251484
8732 12251484 11747656 11236985 10842848 10544732 10250057 9954834 9741239 9635001 9562666 9466139
8722 9466139 9377535 9345258 9349971 9341048 9312946 9295497 9292669 9276474 9232243 9173609 9113152 9043989
$$ packed form
8794E634710J86846J72430J85044K47121L03497K90864K05127J04864O3225R0735
8784G484463J04195K6382q4783r7503j1896K0158o5797j28870m4583R1987J27906
8773G421659R8566J33021K06386J98200J41723J81131K91854K86274J31661K3228
8763I113703O7184J21615O4213j313L9830Q8371J6349p8050k5645J10683J26880
8752I643820J5085l0765O0852J42930J21502J10505K20435L61246L87038L29488
8742A1362136L46946M82431N87183M94537K09131r5095k48984k54017k61054l71730
8732A2251484n03828n10671l94137k98116k94675k95223k13595j06238p2335r6527
8722I466139q8604l2277M713q923k8102j7449k828j6195m4231n8634o0457o9163
$$ plain form
8710 9043989 8952297 8829670 8670591 8471571 8238718 7992202 7761172 7570307 7422063 7292126
8700 7292126 7156282 7027556 6953067 6963781 7037599 7122352 7185694 7231151 7274806 7320919 7354788
8689 7354788 7346336 7266375 7113421 6919637 6717656 6511195 6295704 6091777 5923010 5767956
8679 5767956 5582541 5380352 5235853 5175455 5117719 4978370 4796418 4680263 4645041 4591292
8669 4591292 4457768 4308749 4229284 4206568 4173076 4110618 4043358 3969471 3876431 3800036 3788856
8658 3788856 3815740 3798425 3714410 3628928 3596794 3599867 3601149 3600009 3603876 3596392 3568834 3544096
8646 3544096 3538868 3537509 3529801 3534821 3555684 3550909 3492595 3421714 3399290 3422143 3430974 3391920 3331915
8633 3331915 3296390 3300146 3317623 3303257 3230396 3126157 3054385 3048885 3080205 3100539 3095137 3072492
$$ packed form
8710I043989r1692j22627j59079j99020k32853k46516k31030j90865j48244j29937
8700G292126j35844j28726p4489J0714P3818Q4753O3342M5457M3655M6113L3869
8689G354788q452p9961j52954j93784k01981k06461k15491k03927j68767j55054
8679E767956j85415k02189j44499o0398n7736j39349j81952j16155l5222n3749
8669D591292j33524j49019p9465k2716l3492o2458o7260p3887r3040p6395j1180
8658C788856K6884j7315q4015q5482l2134L073J282j140L867p484k7558k4738
8646C544096n228j359p708N020K0863m775n8314p0881k2424K2853Q831l9054o0005
8633C331915l5525L756J7477j4366p2861j04239p1772n500L1320K0334n402k2645
$$ plain form
8621 3072492 3038217 3007804 3012288 3052851 3077387 3045199 2990985 2975477 2991825 2979666 2926669 2893775
8609 2893775 2924839 2982881 3003633 2977679 2948441 2947080 2958631 2952167 2926654 2914035 2934296 2960927
8597 2960927 2952496 2914020 2893477 2909969 2925512 2908391 2881846 2876609 2875804 2851864 2823227 2821277
8585 2821277 2829330 2812838 2787308 2791989 2812042 2796804 2749910 2730298 2758646 2789545 2787262 2767207
8573 2767207 2750548 2738037 2739953 2769311 2793747 2762788 2699463 2689440 2752043 2800152 2768592 2706483
8561 2706483 2689360 2709814 2719867 2720721 2735909 2742893 2710689 2673178 2687758 2741533 2769480 2751388
8549 2751388 2725358 2717660 2722349 2738287 2761631 2752667 2681848 2606423 2624264 2737126 2830627 2816008
8537 2816008 2729555 2658576 2627527 2607349 2595299 2620290 2676143 2704864 2667980 2606596 2599370 2662406
$$ packed form
8621C072492l4275l0413M484M0563K4536l2188n4214j5508J6348j2159n2997l2894
8609B893775L1064N8042K0752k5954k9238j361J1551o464k5513j2619K0261K6631
8597B960927q431l8476k0543J6492J5543j7121k6545n237q05k3940k8637j950
8585B821277Q053j6492k5530M681K0053j5238m6894j9612K8348L0899k283k0055
8573B767207j6659j2511J916K9358K4436l0959o3325j0023O2603M8109l1560o2109
8561B706483j7123K0454J0053Q54J5188O984l2204l7511J4580N3775K7947j8092
8549B751388k6030p698M689J5938K3344q964p0819p5425J7841J12862R3501j4619
8537B816008q6453p0979l1049k0178j2050K4991N5853K8721l6884o1384p226O3036
$$ plain form
8525 2662406 2721255 2704474 2642417 2627915 2682459 2722660 2684959 2621851 2619843 2668973 2687584 2652183
8513 2652183 2621453 2631360 2643252 2616979 2574752 2562698 2591134 2637603 2676460 2688513 2671495 2651685
8501 2651685 2655290 2666634 2653283 2630654 2647111 2695763 2704825 2644561 2585283 2604087 2678274 2723221
8489 2723221 2707637 2679762 2692500 2746081 2801473 2819133 2785993 2725848 2680792 2670976 2681709 2694728
8477 2694728 2710195 2728573 2738915 2741115 2751523 2768843 2766582 2741788 2734741 2767015 2795277 2772238
8465 2772238 2726923 2729169 2785519 2827089 2805738 2751641 2718416 2713293 2709840 2701057 2703250 2715980
8453 2715980 2713021 2683877 2659786 2673692 2705205 2700602 2654442 2630079 2670144 2725620 2725258 2687228
8441 2687228 2690476 2743818 2767965 2725047 2680369 2693690 2727266 2723301 2706270 2730557 2775732 2781127
$$ packed form
8525B662406N8849j6781o2057j4502N4544M0201l7701o3108k008M9130J8611l5401
8513B652183l0730R907J1892k6273m2227j2054K8436M6469L8857J2053j7018j9810
8501B651685L605J1344j3351k2629J6457M8652R062o0264n9278J8804P4187M4947
8489B723221j5584k7875J2738N3581N5392J7660l3140o0145m5056r816J0733J3019
8477B694728J5467J8378J0342K200J0408J7320k261k4794p047L2274K8262k3039
8465B772238m5315K246N6350M1570k1351n4097l3225n123l453q783K193J2730
8453B715980k959k9144k4091J3906L1513m603m6160k4363M0065N5476l62l8030
8441B687228L248N3342K4147m2918m4678J3321L3576l965j7031K4287M5175N395
$$ plain form
8429 2781127 2754367 2756243 2791278 2800887 2766673 2738411 2746031 2757783 2747549 2738798 2754388 2776988
8417 2776988 2786817 2793146 2804741 2810746 2810438 2820871 2838793 2838072 2819123 2813265 2823520 2815421 2785418
8404 2785418 2776921 2799950 2801091 2755686 2723959 2756993 2806475 2802322 2772981 2800053 2879954 2925558
8392 2925558 2902342 2871414 2879990 2893371 2873360 2854503 2886749 2946108 2961651 2913419 2854510 2839346
8380 2839346 2867606 2904298 2927656 2944202 2968648 3000747 3024056 3026987 3020536 3026242 3046335 3057950
8368 3057950 3044041 3021565 3028155 3080880 3153851 3199368 3191312 3146722 3104019 3084939 3085465 3098144
8356 3098144 3123018 3151057 3160230 3145929 3136899 3157188 3187205 3192216 3177843 3178846 3196340 3193053
8344 3193053 3162624 3154842 3202526 3265337 3289796 3292489 3326213 3380939 3388014 3330697 3282162 3302275
$$ packed form
8429B781127k6760J876L5035R609l4214k8262P620J1752j0234q751J5590K2600
8417B776988R829O329J1595O005l08J0433J7922p21j8949n858J0255q099l0003
8404B785418q497K3029J141m5405l1727L3034M9482m153k9341K7072P9901M5604
8392B925558k3216l0928Q576J3381k0011j8857L2246N9359J5543m8232n8909j5164
8380B839346K8260L6692K3358J6546K4446L2099K3309K931o451N706K0093J1615
8368C057950j3909k2476O590N2725P2971M5517q056m4590m2703j9080N26J2679
8356C098144K4874K8039R173j4301r030K0289L0017N011j4373J003J7494l287
8344C193053l0429p782M7684O2811K4459K693L3724N4726P075n7317m8535K0113
$$ plain form
8332 3302275 3354148 3371177 3361527 3382659 3438612 3474727 3469949 3463228 3475163 3470991 3430979 3398136
8320 3398136 3413494 3451729 3469274 3475944 3504306 3541761 3555326 3559194 3589255 3625711 3615979 3571662
8308 3571662 3562932 3604875 3631781 3612848 3609791 3666757 3716371 3672721 3571225 3529252 3584100 3650887
8296 3650887 3648724 3601504 3587775 3635401 3698938 3723554 3706902 3694966 3720406 3755201 3745783 3694217
8284 3694217 3665591 3696242 3737957 3731087 3694920 3692470 3732175 3765934 3771772 3775781 3794302 3814591
8272 3814591 3836337 3872794 3903254 3886748 3837659 3823206 3861738 3889081 3861907 3829329 3848606
8261 3848606 3885985 3871686 3817278 3800708 3846914 3895881 3895817 3866965 3854372 3864748 3875906 3877363
8249 3877363 3875696 3875408 3871750 3855856 3822991 3783923 3763373 3772889 3792318 3796282 3789049 3789232 3792439
$$ packed form
8332C302275N1873J7029r650K1132N5953L6115m778o721J1935m172m0012l2843
8320C398136J5358L8235J7545O670K8362L7455J3565L868L0061L6456r732m4317
8308C571662q730M1943K6906j8933l057N6966M9614m3650j01496m1973N4848O6787
8296C650887k163m7220j3729M7626O3537K4616j6652j1936K5440L4795r418n1566
8284C694217k8626L0651M1715o870l6167k450L9705L3759N838M009J8521K0289
8272C814591K1746L6457L0460j6506m9089j4453L8532K7343k7174l2578J9277
8261C848606L7379j4299n4408j6570M6206M8967o4k8852j2593J0376J1158J457
8249C877363j667k88l658j5894l2865l9068k0550R516J9429L964p233J83L207
$$ plain form
8236 3792439 3784173 3781854 3817737 3875383 3894140 3856516 3821574 3837634 3867257 3849426 3802839 3802428
8224 3802428 3864576 3922519 3924902 3898115 3887511 3890275 3883358 3876235 3889997 3910544 3908960 3892976
8212 3892976 3894667 3916508 3931059 3927537 3916904 3896043 3854232 3816595 3829477 3889474 3935189 3929352
8200 3929352 3904648 3904474 3922091 3928226 3918673 3901859 3877688 3862447 3891817 3957421 3985666 3934672
8188 3934672 3871477 3885594 3957928 3993636 3966051 3942227 3966965 4006693 4023900 4030737 4043848 4051352
8176 4051352 4049732 4054570 4055441 4023799 3983759 3999618 4064815 4087309 4031230 3987856 4039556 4131541
8164 4131541 4163502 4142374 4142058 4159625 4129227 4060779 4046231 4115668 4191048 4212275 4218885 4263456
8152 4263456 4319373 4330928 4302811 4282462 4285449 4289918 4288205 4299572 4333581 4370523 4384915 4377876
$$ packed form
8236C792439q266k319L5883N7646J8757l7624l4942J6060K9623j7831m6587m11
8224C802428O2148N7943K383k6787j0604K764o917p123J3762K0547j584j5984
8212C892976J691K1841J4551l522j0633k0861m1811l7637J2882N9997M5715n837
8200C929352k4704j74J7617O135r553j6814k4171j5241K9370O5604K8245n0994
8188C934672o3195J4117P2334L5708k7585k3824K4738L9728J7207O837J3111P504
8176D051352j620M838Q71l1642m0040J5859O5197K2494n6079m3374N1700R1985
8164D131541L1961k1128l16J7567l0398o8448j4548O9437P5380K1227O610M4571
8152D263456N5917J1555k8117k0349K987M469j713J1367L4009L6942J4392p039
$$ plain form
8140 4377876 4381728 4426526 4495695 4530116 4498059 4447081 4452310 4519464 4580193 4587521 4572418 4588312
8128 4588312 4636514 4674982 4680082 4672114 4684358 4722075 4755511 4756531 4742655 4765674 4841478 4916567
8116 4916567 4936488 4925929 4954469 5033136 5098325 5102630 5071862 5059006 5083990 5133301 5181573 5200389
8104 5200389 5180254 5153367 5161539 5200797 5238589 5279692 5354523 5438485 5458406 5404810 5364436 5400226
8092 5400226 5466234 5492484 5490739 5512202 5554509 5585250 5617045 5679440 5743590 5756936 5739046 5762296
8080 5762296 5838737 5903917 5923458 5942073 6001956 6074941 6111423 6112257 6115869 6143618 6189285 6243181
8068 6243181 6300483 6354849 6399145 6428262 6440053 6443364 6459383 6497776 6538590 6560687 6580980 6635104
8056 6635104 6719415 6785497 6803311 6803989 6842627 6931508 7025431 7073189 7077862 7096630 7169898 7261981
$$ packed form
8140D377876L852M4798O9169L4421l2057n0978N229O7154O0729P328j5103J5894
8128D588312M8202L8468N100p968J2244L7717L3436J020j3876K3019P5804P5089
8116D916567J9921j0559K8540P8667O5189M305l0768j2856K4984M9311M8272J8816
8104E200389k0135k6887Q172L9258L7792M1103P4831Q3962J9921n3596m0374L5790
8092E400226O6008K6250j745K1463M2307L0741L1795O2395O4150J3346j7890K3250
8080E762296P6441O5180J9541J8615N9883P2985L6482Q34L612K7749M5667N3896
8068F243181N7302N4366M4296K9117J1791L311J6019L8393M0814K2097K0293N4124
8056F635104Q4311O6082J7814O78L8638Q8881R3923M7758M673J8768P3268R2083
$$ plain form
8044 7261981 7303265 7289910 7295322 7366878 7464728 7537265 7601137 7690193 7774400 7807026 7821565 7894506
8032 7894506 8022372 8122463 8158948 8183980 8241005 8311461 8381413 8478240 8603594 8705180 8761164
8021 8761164 8824936 8934515 9041118 9089166 9113234 9186141 9310050 9427946 9514614 9590418 9666616
8010 9666616 9740542 9828740 9943763 10051388 10111718 10152664 10240141 10381005 10520866 10638259
8000 10638259 10769904 10929090 11071076 11170652 11270936 11412265 11565905 11691097 11813904 11982635
7990 11982635 12171065 12303161 12374439 12473050 12654596 12861597 13013119 13121267 13253315 13412625
7980 13412625 13540564 13631803 13759292 13957866 14161222 14302180 14410734 14553153 14729968 14905686
7970 14905686 15090790 15307974 15514146 15656304 15784076 15996484 16280193 16518611 16677233
$$ packed form
8044G261981M1284j3355N412P1556R7850P2537O3872Q9056Q4207L2626J4539P2941
8032G894506J27866J00091L6485K5032N7025P0456O9952R6827J25354J01586N5984
8021H761164O3772J09579J06603M8048K4068P2907J23909J17896Q6668P5804P6198
8010I666616P3926Q8198J15023J07625O0330M0946Q7477J40864J39861J17393
8000A0638259J31645J59186J41986R9576J00284J41329J53640J25192J22807J68731
7990A1982635J88430J32096P1278R8611J81546K07001J51522J08148J32048J59310
7980A3412625J27939R1239J27489J98574K03356J40958J08554J42419J76815J75718
7970A4905686J85104K17184K06172J42158J27772K12408K83709K38418J58622
$$ plain form
7961 16677233 16854292 17106134 17349278 17509204 17654658 17886562 18179154 18435901 18638650
7952 18638650 18838974 19054889 19277206 19531293 19829349 20102493 20286497 20439655 20666724
7943 20666724 20959283 21229655 21473935 21765781 22098890 22381356 22602195 22862052 23202975
7934 23202975 23540957 23817214 24090797 24417611 24753485 25052195 25355655 25704651 26053537
7925 26053537 26361148 26681926 27073270 27487059 27851733 28198327 28603401 29059770 29506416
7916 29506416 29942519 30407596 30883708 31324756 31762098 32277968 32882597 33508892 34119841
7907 34119841 34734040 35357386 35982945 36651241 37413018 38231361 39020048 39787347 40638111
7898 40638111 41611043 42617985 43585877 44565254 45641663 46815379 48031139 49270608 50556200
$$ packed form
7961A6677233J77059K51842K43144J59926J45454K31904K92592K56747K02749
7952A8638650K00324K15915K22317K54087K98056K73144J84004J53158K27069
7943B0666724K92559K70372K44280K91846L33109K82466K20839K59857L40923
7934B3202975L37982K76257K73583L26814L35874K98710L03460L48996L48886
7925B6053537L07611L20778L91344M13789L64674L46594M05074M56369M46646
7916B9506416M36103M65077M76112M41048M37342N15870O04629O26295O10949
7907C4119841O14199O23346O25559O68296P61777Q18343P88687P67299Q50764
7898D0638111R72932J006942R67892R79377J076409J173716J215760J239469J285592
$$ plain form
7889 50556200 51902694 53310799 54774248 56260963 57727296 59177937 60663578 62190253
7881 62190253 63684067 65077362 66369649 67563176 68603728 69440871 70085024 70536304 70713372
7872 70713372 70539951 70067232 69421805 68651664 67711536 66592811 65376293 64140891 62897557
7863 62897557 61639230 60391970 59185755 58024261 56910489 55858992 54860130 53876330
7855 53876330 52898787 51965914 51099989 50270016 49450528 48673196 47974046 47323434 46663661
7846 46663661 45997802 45383283 44838594 44311834 43759852 43215827 42745760 42358384 41991154
7837 41991154 41584568 41146879 40735525 40388099 40087709 39791951 39472718 39116872 38712176
7828 38712176 38261758 37798843 37347692 36872227 36310881 35673666 35049649 34486022 33915117
$$ packed form
7889E0556200J346494J408105J463449J486715J466333J450641J485641J526675
7881F2190253J493814J393295J292287J193527J040552Q37143O44153M51280J77068
7872G0713372j73421m72719o45427p70141r40128j118725j216518j235402j243334
7863F2897557j258327j247260j206215j161494j113772j051497r98862r83800
7855E3876330r77543r32873q65925q29973q19488p77332o99150o50612o59773
7846D6663661o65859o14519n44689n26760n51982n44025m70067l87376l67230
7837D1991154m06586m37689m11354l47426l00390k95758l19233l55846m04696
7828C8712176m50418m62915m51151m75465n61346o37215o24017n63627n70905
$$ plain form
7819 33915117 33258956 32562490 31941613 31417525 30896001 30320911 29752424 29253025 28784836
7810 28784836 28289782 27802259 27390060 27024862 26614647 26154385 25742534 25431028 25151455
7801 25151455 24828704 24488465 24194896 23941715 23674675 23387679 23128704 22924168 22754872
7792 22754872 22602373 22468990 22349220 22225011 22098711 21996623 21929717 21878930 21830508 21802038
7782 21802038 21818587 21877581 21950621 22012861 22058260 22081675 22051662 21920039 21676125 21376886 21087868
7771 21087868 20797380 20436357 19994255 19558502 19205889 18909060 18602566 18295017 18044889
7762 18044889 17852858 17656928 17428785 17203268 17008869 16836720 16688044 16584720 16512048 16412014
7752 16412014 16262720 16116804 16035037 16022578 16048730 16084249 16101381 16087307 16080442 16143168 16271775
$$ packed form
7819C3915117o56161o96466o20877n24088n21524n75090n68487m99399m68189
7810B8784836m95054m87523m12199l65198m10215m60262m11851l11506k79573
7801B5151455l22751l40239k93569k53181k67040k86996k58975k04536j69296
7792B2754872j52499j33383j19770j24209j26300j02088o6906n0787m8422k8470
7782B1802038J6549N8994P3040O2240M5399K3415l0013j31623k43914k99239k89018
7771B1087868k90488l61023m42102m35753l52613k96829l06494l07549k50128
7762A8044889j92031j95930k28143k25517j94399j72149j48676j03324p2672j00034
7752A6412014j49294j45916q1767j2459K6152L5519J7132j4074o865O2726J28607
$$ plain form
7741 16271775 16381025 16403770 16356203 16279828 16179052 16053106 15928664 15811257 15658753 15458401
7731 15458401 15280065 15190640 15158811 15110942 15043402 15006791 15006881 14996784 14952338 14886008 14795930 14666227
7719 14666227 14512059 14365356 14221412 14052896 13865349 13684257 13504144 13312908 13149391
7710 13149391 13063538 13026637 12956691 12834528 12722473 12663804 12636737 12615674 12603367 12589602 12552987
7699 12552987 12521922 12560131 12669041 12775747 12841638 12911639 13031965 13196417 13402422 13671561
7689 13671561 13964382 14155198 14157270 14015293 13820594 13597732 13333155 13049763 12778645 12505667
7679 12505667 12215357 11942591 11714822 11492437 11239955 11009449 10871772 10804496 10732166 10641270
7669 10641270 10565127 10488325 10369889 10243261 10184221 10180047 10136744 10027723 9929981 9887430 9842963
$$ packed form
7741A6271775J09250K2745m7567p6375j00776j25946j24442j17407j52504k00352
7731A5458401j78336q9425l1829m7869o7540l6611R0j0097m4446o6330r0078j29703
7719A4666227j54168j46703j43944j68516j87547j81092j80113j91236j63517
7710A3149391q5853l6901o9946j22163j12055n8669k7067k1063j2307j3765l6615
7699A2552987l1065L8209J08910J06706O5891P0001J20326J64452K06005K69139
7689A3671561K92821J90816K072j41977j94699k22862k64577k83392k71118k72978
7679A2505667k90310k72766k27769k22385k52482k30506j37677o7276p2330r0896
7669A0641270p6143p6802j18436j26628n9040m174m3303j09021r7742m2551m4467
$$ plain form
7658 9842963 9752247 9671276 9664488 9694659 9676395 9596617 9518102 9489042 9500520 9517176 9511650 9482349
7646 9482349 9463592 9500780 9594657 9690950 9743341 9764166 9798522 9875572 9998303 10145890 10265119
7635 10265119 10294125 10222690 10103807 9985035 9859362 9707820 9554758 9441628 9366017 9283854
7625 9283854 9164972 9022109 8892081 8804613 8759534 8723219 8660649 8577192 8509231 8470743 8439485
7614 8439485 8403327 8380986 8377773 8360004 8304143 8241147 8217508 8232087 8241900 8216224 8161086 8103835
7602 8103835 8072037 8073052 8081844 8067193 8035690 8021279 8026880 8018484 7988953 7975659 7989840 7983117
7590 7983117 7922643 7848457 7808056 7779803 7716979 7629091 7559139 7511435 7462494 7415648 7383118
7579 7383118 7340782 7267144 7203010 7200411 7230544 7218226 7155248 7100991 7078836 7056005 7025521 7018569
$$ packed form
7658I842963r0716q0971o788L0171j8264p9778p8515k9060J1478J6656n526k9301
7646I482349j8757L7188R3877R6293N2391K0825L4356P7050J22731J47587J19229
7635A0265119K9006p1435j18883j18772j25673j51542j53062j13130p5611q2163
7625I283854j18882j42863j30028q7468m5079l6315o2570q3457o7961l8488l1258
7614H439485l6158k2341l213j7769n5861o2996k3639J4579R813k5676n5138n7251
7602H103835l1798J015Q792j4651l1503j4411N601q396k9531j3294J4181o723
7590G983117o0474p4186m0401k8253o2824q7888o9952m7704m8941m6846l2530
7579G383118m2336p3638o4134k599L0133j2318o2978n4257k2155k2831l0484o952
$$ plain form
7567 7018569 7023906 6984730 6899077 6838495 6837595 6847925 6835011 6833368 6857983 6849373 6773989 6704061
7555 6704061 6717652 6777390 6792721 6758615 6744244 6770545 6785834 6756504 6710061 6686128 6698470
7544 6698470 6740934 6783768 6777326 6709605 6643895 6644360 6681344 6672867 6606008 6544298 6516916 6479406
7532 6479406 6401917 6324444 6290468 6279733 6243716 6170134 6082580 6007316 5963289 5954821 5954383 5922227
7520 5922227 5860202 5815441 5814922 5830144 5825071 5803966 5788127 5777204 5760166 5737496 5707111 5654664
7508 5654664 5584694 5536341 5537747 5564575 5574408 5566507 5574940 5609909 5636103 5613727 5545582 5479298
7496 5479298 5464491 5502322 5541152 5536017 5504928 5501300 5537671 5573816 5580751 5572552 5567271 5564236 5572422
7483 5572422 5606581 5636210 5602973 5521676 5492172 5558062 5625933 5600827 5535212 5540827 5601556 5601497
$$ packed form
7567G018569N337l9176q5653o0582r00J0330j2914j643K4615q610p5384o9928
7555F704061J3591N9738J5331l4106j4371K6301J5289k9330m6443k3933J2342
7544F698470M2464M2834o442o7721o5710M65L6984q477o6859o1710k7382l7510
7532F479406p7489p7473l3976j0735l6017p3582q7554p5264m4027q468m38l2156
7520E922227o2025m4761n19J5222n073k1105j5839j0923j7038k2670l0385n2447
7508E654664o9970m8353J406K6828R833p901Q433L4969K6194k2376o8145o6284
7496E479298j4807L7831L8830n135l1089l628L6371L6145O935q199n281l035Q186
7483E572422L4159K9629l3237q1297k9504O5890O7871k5106o5615N615O0729n9
$$ plain form
7471 5601497 5523655 5483449 5540727 5606423 5591653 5541950 5546834 5598854 5629319 5626535 5632113 5657235
7459 5657235 5681557 5708371 5748717 5774533 5760294 5751259 5811916 5916094 5970902 5955277 5952503 6022539
7447 6022539 6118368 6168559 6178819 6198029 6229671 6239384 6228135 6238555 6290120 6353851 6398164 6424028
7435 6424028 6443754 6456144 6462228 6483360 6536645 6601104 6636281 6637230 6644499 6687735 6746371 6790388
7423 6790388 6834498 6909715 6994710 7032293 7022233 7038277 7124239 7226496 7272812 7272447 7283004 7315605
7411 7315605 7341082 7367397 7434515 7535042 7611870 7645001 7677422 7740818 7816491 7888238 7974017
7400 7974017 8080733 8184352 8282088 8407045 8558639 8677895 8736487 8797519 8934437 9130356
$$ packed form
7471E601497p7842m0206N7278O5696j4770m9703M884N2020L0465k784N578K5122
7459E657235K4322K6814M0346K5816j4239r035O0657J04178N4808j5625k774P0036
7447F022539R5829N0191J0260J9210L1642R713j1249J0420N1565O3731M4313K5864
7435F424028J9726J2390O084K1132N3285O4459L5177R49P269M3236N8636M4017
7423F790388M4110P5217Q4995L7583j0060J6044Q5962J02257M6316l65J0557L2601
7411G315605K5477K6315O7118J00527P6828L3131L2421O3396P5673P1747Q5779
7400G974017J06716J03619R7736J24957J51594J19256N8592O1032J36918J95919
$$ [...]
##END NTUPLES=NMR SPECTRUM
##END=
