##TITLE=1H ikalashn
CG-1213-A4
14.10.2024
##JCAMPDX= 6.0         $$ Bruker NMR JCAMP-DX V2.0
##DATA TYPE= NMR SPECTRUM
##DATA CLASS= NTUPLES
##ORIGIN= UXNMR, Bruker Analytische Messtechnik GmbH
##OWNER= root
$$ TOPSPIN		Version 1.3
$$ 2024-10-14 13:41:38.890 +0400  Irina@DPX200
$$ Compression mode = diff/dup
##.OBSERVE FREQUENCY= 200.131392401
##.OBSERVE NUCLEUS= ^1H
##.ACQUISITION MODE= SIMULTANEOUS
##.ACQUISITION SCHEME= undefined
##.AVERAGES= 32
##.DIGITISER RES= 18
##SPECTROMETER/DATA SYSTEM= spect
##.PULSE SEQUENCE= zg
##.SOLVENT NAME= DMSO
##.SHIFT REFERENCE= INTERNAL, DMSO, 1, 17.95386
##AUDIT TRAIL= $$ (NUMBER, WHEN, WHO, WHERE, WHAT)
$$ ##TITLE= Audit trail, TOPSPIN		Version 1.3
$$ ##JCAMPDX= 5.01
$$ ##ORIGIN= Bruker BioSpin GmbH
$$ ##OWNER= Irina
$$ $$ F:/spectra/data/iren/nmr/1H/4/pdata/1/auditp.txt
$$ ##AUDIT TRAIL=  $$ (NUMBER, WHEN, WHO, WHERE, VERSION, WHAT)
(   1,<2024-10-14 13:39:01.687 +0400>,<Irina>,<DPX200>,<TOPSPIN 1.3>,
      <acquisition in progress>)
(   2,<2024-10-14 13:41:11.609 +0400>,<Irina>,<DPX200>,<TOPSPIN 1.3>,
      <Start of raw data processing
       efp BC_mod = 2 LB = 0.05 FT_mod = 6 PKNL = 1 PHC0 = 311.0303 PHC1 = 31.60675 SI = 32K 
       data hash MD5: 32K
       96 31 29 4D D8 BD C4 FE 3D D8 0E 7B 09 7E FF B8>)
(   3,<2024-10-14 13:41:13.906 +0400>,<Irina>,<DPX200>,<TOPSPIN 1.3>,
      <apk 
       data hash MD5: 32K
       0E 41 E9 C1 DD 31 CF 20 1A F5 C7 2A 69 20 47 CE>)
(   4,<2024-10-14 13:41:29.250 +0400>,<Irina>,<DPX200>,<TOPSPIN 1.3>,
      <pk fgphup PHC0 = 5.370532 PHC1 = -7.6 
       data hash MD5: 32K
       55 2D 6B CC 98 C8 07 00 CF 2A 03 B8 CA 62 C0 5D>)
(   5,<2024-10-14 13:41:30.812 +0400>,<Irina>,<DPX200>,<TOPSPIN 1.3>,
      <abs n ABSG = 5 
       data hash MD5: 32K
       52 8C 76 F6 80 E5 CD 87 9E C7 DE D0 49 01 F6 15>)
$$ ##END=
$$ 
$$ $$ hash MD5
$$ $$ B4 68 DF 24 47 42 58 E6 49 6B E8 BF 51 C0 BD 35
##$RELAX= 
##$RELAX= 
##$RELAX= 
##$RELAX= 
##$RELAX= 
##$RELAX= 
##$RELAX= 
##$RELAX= 
##$RELAX= 
$$ Bruker specific parameters
$$ --------------------------
##$DU= <F:/spectra>
##$EXPNO= 4
##$NAME= <1H>
##$PROCNO= 1
##$TYPE= <nmr>
##$USER= <iren>
##$AMP= (0..31)
100 100 100 100 100 100 100 100 100 100 100 100 100 100 100 100 100 100 
100 100 100 100 100 100 100 100 100 100 100 100 100 100 
##$ANAVPT= -1
##$AQSEQ= 0
##$AQ_mod= 1
##$AUNM= <au_zg>
##$AUTOPOS= <>
##$BF1= 200.13
##$BF2= 200.13
##$BF3= 200.13
##$BF4= 200.13
##$BF5= 200.13
##$BF6= 200.13
##$BF7= 200.13
##$BF8= 200.13
##$BYTORDA= 1
##$CFDGTYP= 0
##$CFRGTYP= 5
##$CHEMSTR= <none>
##$CNST= (0..63)
1 1 145 1 1 1 1 1 1 1 1 1 1 1 1 1 1 1 1 1 1 1 1 1 1 1 1 1 1 1 1 1 1 1 
1 1 1 1 1 1 1 1 1 1 1 1 1 1 1 1 1 1 1 1 1 1 1 1 1 1 1 1 1 1 
##$CPDPRG= <>
##$CPDPRG1= <>
##$CPDPRG2= <>
##$CPDPRG3= <>
##$CPDPRG4= <mlev>
##$CPDPRG5= <mlev>
##$CPDPRG6= <mlev>
##$CPDPRG7= <mlev>
##$CPDPRG8= <mlev>
##$CPDPRGB= <>
##$CPDPRGT= <>
##$D= (0..63)
0 2 0 0 0 0 0 0 0 0.06 0 0.03 0 0 0 0 0.0002 0 0 0 0 0 0 0 0 0 0 0 0 0 
$$ [...]
##$SW_h= 4401.40845070422
##$TD= 16384
##$TD0= 1
##$TE= 300
##$TE2= 300
##$TE3= 300
##$TEG= 300
##$TL= (0..7)
0 120 120 120 120 120 120 120 
##$TP= (0..7)
150 150 150 150 150 150 150 150 
##$TP07= 0
##$TPNAME0= <>
##$TPNAME1= <>
##$TPNAME2= <>
##$TPNAME3= <>
##$TPNAME4= <>
##$TPNAME5= <>
##$TPNAME6= <>
##$TPNAME7= <>
##$TPOAL= (0..7)
0.5 0.5 0.5 0.5 0.5 0.5 0.5 0.5 
##$TPOFFS= (0..7)
0 0 0 0 0 0 0 0 
##$TUNHIN= 0
##$TUNHOUT= 0
##$TUNXOUT= 0
##$USERA1= <user>
##$USERA2= <user>
##$USERA3= <user>
##$USERA4= <user>
##$USERA5= <user>
##$V9= 5
##$VALIST= <valist>
##$VCLIST= <CCCCCCCCCCCCCCC>
##$VD= 0
##$VDLIST= <DDDDDDDDDDDDDDD>
##$VPLIST= <PPPPPPPPPPPPPPP>
##$VTLIST= <TTTTTTTTTTTTTTT>
##$WBST= 1024
##$WBSW= 25
##$XGAIN= (0..3)
0 0 0 0 
##$XL= 0
##$YL= 0
##$YMAX_a= 1283105
##$YMIN_a= -1911225
##$ZGOPTNS= <>
##$ZL1= 120
##$ZL2= 120
##$ZL3= 120
##$ZL4= 120
##$ABSF1= 17.95386
##$ABSF2= -4.038887
##$ABSG= 5
##$ABSL= 3
##$ALPHA= 0
##$AQORDER= 0
##$ASSFAC= 0
##$ASSFACI= 0
##$ASSFACX= 0
##$ASSWID= 0
##$AUNMP= <proc_1d>
##$AXLEFT= 0
##$AXRIGHT= 0
##$AXTYPE= 0
##$AXUNIT= <>
##$AZFE= 0.1
##$AZFW= 0.1
##$BCFW= 0
##$BC_mod= 2
##$BYTORDP= 0
##$COROFFS= 0
##$CY= 7568.61572265625
##$DATMOD= 1
##$DC= 0
##$DFILT= <>
##$DTYPP= 0
##$F1P= 17.9538593292236
##$F2P= -4.03888763876832
##$FCOR= 0.5
##$FTSIZE= 32768
##$FT_mod= 6
##$GAMMA= 0
##$GB= 0
##$INTBC= 0
##$INTSCL= 1.483618e-010
##$ISEN= 128
##$LB= 0.05
##$LEV0= 0
##$LPBIN= 0
##$MAXI= 945.577
##$MC2= 0
##$MEAN= 0
##$ME_mod= 0
##$MI= -402.1523
##$NCOEF= 0
##$NC_proc= -6
##$NLEV= 6
##$NOISF1= 8.587773
##$NOISF2= 6.764455
##$NSP= 0
##$NTH_PI= 0
##$NZP= 0
##$OFFSET= 17.95386
##$PC= 1
##$PHC0= 322.5794
##$PHC1= 6.90713
##$PH_mod= 1
##$PKNL= yes
##$PPARMOD= 0
##$PPDIAG= 0
##$PPIPTYP= 0
##$PPMPNUM= 100
##$PPRESOL= 1
##$PSCAL= 0
##$PSIGN= 0
##$REVERSE= no
##$SF= 200.13
##$SI= 32768
##$SIGF1= 16.12182
##$SIGF2= -4.496377
##$SINO= 3.521527
##$SIOLD= 32768
##$SREGLST= <1H.CDCl3>
##$SSB= 0
##$STSI= 32768
##$STSR= 0
##$SW_p= 4401.40845070423
##$SYMM= 0
##$S_DEV= 0
##$TDeff= 16384
##$TDoff= 0
##$TI= <>
##$TILT= no
##$TM1= 0
##$TM2= 0
##$TOPLEV= 0
##$USERP1= <user>
##$USERP2= <user>
##$USERP3= <user>
##$USERP4= <user>
##$USERP5= <user>
##$WDW= 1
##$XDIM= 32768
##$YMAX_p= 404331936
##$YMIN_p= -715578
$$ End of Bruker specific parameters
$$ ---------------------------------
##NTUPLES= NMR SPECTRUM
##VAR_NAME=  FREQUENCY,     SPECTRUM/REAL,   SPECTRUM/IMAG
##SYMBOL=    X,             R,               I
##VAR_TYPE=  INDEPENDENT,   DEPENDENT,       DEPENDENT
##VAR_FORM=  AFFN,          ASDF,            ASDF
##VAR_DIM=   32768,         32768,           32768
##UNITS=     HZ,            ARBITRARY UNITS, ARBITRARY UNITS
##FACTOR=    0.134324425510551, 1,           1
##FIRST=     4401.40845070423, 104503,       -2975481
##LAST=      0,             238334,          -3517923
##MIN=       0,             -715578,         0
##MAX=       4401.40845070423, 404331936,    0
$$ Real data points
##PAGE= N=1
##DATA TABLE= (X++(R..R)), XYDATA
$$ [...]
13548G87654k18116j37615J06159K23816J04274m1091j9879P2482N0069o7612
13538H60141j20284n9506K9982R8746J63487J98225J42147J9289o8280p5151m3237
13527A145559l006N2128R3711O8174r901o8277q1969p3781k9709O2254J06357
13516A261540p020j89553k15854m3024J12550R1680k180k1295o370m5078o8637
13505H66759J1206R2187L0813q6945n8551R6121J45451J855j48690j21522L3352
13494H62036J35526Q9802m8107j32528m7740J46825K25083O3142j53992j53972
13484I86075L9974J48474M5426r7762j10726m1812o89J5388L8497M2930L5221
13473A100996P4936J27966P1679p3013j13364M689P3518l8889j45776m0013J53852
$$ y = [787654, 569538, 431923, 538082, 761898, 866172, 825081, 805202, 877684, 927753, 860141, 739857, 680351, 710333, 809079, 972566, 1170791, 1312938, 1332227, 1263947, 1188796, 1145559, 1142553, 1194681, 1288392, 1356566, 1346665, 1278388, 1196419, 1122638, 1092929, 1155183, 1261540, 1254520, 1064967, 849113, 806089, 918639, 1010319, 1008139, 986844, 980474, 935396, 866759, 877965, 970152, 1000965, 914020, 855469, 951590, 1097041, 1098896, 950206, 828684, 862036, 997562, 1087364, 1039257, 906729, 858989, 1005814, 1230897, 1294039, 1140047, 986075, 1026049, 1174523, 1219949, 1122187, 1011461, 969649, 968960, 984348, 1022845, 1065775, 1100996, 1175932, 1303898, 1375577, 1302564, 1189200, 1193889, 1267407, 1228518, 1082742, 1042729, 1196581]
13462A196581J74444K9679n8709k3169P997j4394q623K7767L592n9265l5431O3717
13450A304186Q4121K329k1695O8407J09228m278j24813q1252N6656J04728M3560
13439A541177M640M2965Q0599N6212K868k8544k9186l477M7253R4387Q9639K7978
13427A926511k9906k3689L4052P6059O5990L3402J2492q268l3174p553R5548J75739
13415B317203J19064k637r616R0933R3050n4421j20351L5160K01434J56744M0649
13404B867212Q2824J56876K448k30545j36294K51290M17567J44070j49861o9794
13394C335793J77358J88543n220r6914l6571q56K830R9645K09177J28502p8882
13383C923405j28462M1069J83660J39998K9422n297J3492L3357O8763R4615M4185
$$ y = [1196581, 1371025, 1400704, 1341995, 1318826, 1326823, 1312429, 1303806, 1331573, 1335165, 1275900, 1240469, 1304186, 1388307, 1390636, 1368941, 1437348, 1546576, 1542298, 1417485, 1336233, 1392889, 1497617, 1541177, 1545817, 1588782, 1669381, 1725593, 1728461, 1699917, 1670731, 1667254, 1714507, 1808894, 1898533, 1926511, 1896605, 1872916, 1906968, 1983027, 2049017, 2082419, 2094911, 2086643, 2053469, 2045916, 2141464, 2317203, 2436267, 2433630, 2424014, 2514947, 2607997, 2553576, 2433225, 2468385, 2669819, 2826563, 2867212, 2950036, 3106912, 3109360, 2878815, 2742521, 2993811, 3411378, 3555448, 3405587, 3335793, 3513151, 3701694, 3696474, 3599560, 3562989, 3562133, 3564963, 3664608, 3873785, 4002287, 3923405, 3794943, 3836012, 4019672, 4159670, 4189092, 4183795, 4197287, 4230644, 4299407, 4394022, 4438207]
13372D438207l0529Q343J42853J90932R2790R00K0167O5701N9135O0711J07183
13361E156393J14706N5910M6486J32020J71555P5110j7390M0809J57874J67921
13351F101394J12459J50845K73712L13796K11038Q9158O9644J45325K40937K93580
13341H001888K74714K11422J74255J93127K25924K49255K98895L64517L51865
13332A0345862K37624J53190K04156L08342L33805K94761K75243K62750K13714
13323A2629447J85749K31633K55593J66809Q4011J63069K98072K55795O5078j7783
13313A4317473O5383R2240l7177j25059k9142Q9434M6906p0228r3031n4232p1609
13302A4130958j11860r3035q4812j74199k45863j45870J7003j821j91248k86128
$$ y = [4438207, 4407678, 4416021, 4558874, 4749806, 4842596, 4843496, 4863663, 4929364, 4988499, 5049210, 5156393, 5271099, 5327009, 5373495, 5505515, 5677070, 5752180, 5734790, 5775599, 5933473, 6101394, 6213853, 6364698, 6638410, 6952206, 7163244, 7252402, 7322046, 7467371, 7708308, 8001888, 8276602, 8488024, 8662279, 8855406, 9081330, 9330585, 9629480, 9993997, 10345862, 10583486, 10736676, 10940832, 11249174, 11582979, 11877740, 12152983, 12415733, 12629447, 12815196, 13046829, 13302422, 13469231, 13553242, 13716311, 14014383, 14270178, 14335256, 14317473, 14382856, 14475096, 14437919, 14312860, 14283718, 14373152, 14420058, 14349830, 14256799, 14202567, 14130958, 14019098, 13926063, 13841251, 13667052, 13421189, 13275319, 13292322, 13290501, 13099253, 12813125]
13292A2813125j72993m1727p1593j85520k13291j29068k4937K3586j6780j31641
13282A1849161k13567j41638K9337Q8598m3291j82807j45123p668L1152m3501
13272A1220653p3912R97O5616K9844l8286l6631J8772L7697n457m6549k9736K2252
13260A1165260N2223N6115Q5550J51588J77165J03098M989J1102J12779J71925
13250A2091794J36347J12322J65768J98805J32368P4329J50159K75883K89089
13241A3626864K25891K44725L16639K50930N4351l841K10581M68627N02573L68929
13231A6266269L01829L53691L95500L79075L76114L94296L58599K76960K51271
13222A9353604L06865L60010L72795L98282M46413M42762L61417K76558K36893
$$ y = [12813125, 12640132, 12598405, 12526812, 12341292, 12128001, 11998933, 11973996, 11997582, 11980802, 11849161, 11635594, 11493956, 11523293, 11611891, 11568600, 11385793, 11240670, 11233002, 11264154, 11220653, 11146741, 11147738, 11213354, 11243198, 11204912, 11168281, 11187053, 11224750, 11219293, 11172744, 11143008, 11165260, 11217483, 11273598, 11359148, 11510736, 11687901, 11790999, 11795988, 11807090, 11919869, 12091794, 12228141, 12340463, 12506231, 12705036, 12837404, 12911733, 13061892, 13337775, 13626864, 13852755, 14097480, 14414119, 14665049, 14719400, 14715559, 14926140, 15394767, 15897340, 16266269, 16568098, 16921789, 17317289, 17696364, 18072478, 18466774, 18825373, 19102333, 19353604, 19660469, 20020479, 20393274, 20791556, 21237969, 21680731, 22042148, 22318706, 22555599]
13213B2555599K01092J45170J24389J68683K10812J83072J11179N8478M3120N1189
13203B3852783O3266L5894o5673j86305k19748j61650j28767j88182k72655l11686
13193B2417277l28717l43895l05466k08832j67887k57771l84650m23014l88379
13184A9608666l58922l26398k59779k22219k71845l28864l02351k65384l20893
13175A6952011l77410k85758j42084j83057l77656m16184j82935L9031j8680k28607
13165A4778671k96780j94517j30719j96185k67094k37329j56429j14350j21450
13156A3063818j35930j29343j04076q9743j15711j62699j79994j70586j86805
13147A1788931k10528j44717R024Q5688j7070j55249j31115R394M8644p1010j74097
$$ y = [22555599, 22756691, 22901861, 23026250, 23194933, 23405745, 23588817, 23699996, 23758474, 23801594, 23852783, 23916049, 23951943, 23886270, 23699965, 23480217, 23318567, 23189800, 23001618, 22728963, 22417277, 22088560, 21744665, 21439199, 21230367, 21062480, 20804709, 20420059, 19997045, 19608666, 19249744, 18923346, 18663567, 18441348, 18169503, 17840639, 17538288, 17272904, 16952011, 16574601, 16288843, 16146759, 15963702, 15586046, 15169862, 14986927, 15025958, 15007278, 14778671, 14481891, 14287374, 14156655, 13960470, 13693376, 13456047, 13299618, 13185268, 13063818, 12927888, 12798545, 12694469, 12604726, 12489015, 12326316, 12146322, 11975736, 11788931, 11578403, 11433686, 11442710, 11528398, 11511328, 11356079, 11224964, 11234358, 11283002, 11211992, 11037895]
13136A1037895j22248J0824Q0005M7187l7910j21822j51071q7267J8135M3043
13126A0716771m9463j42781j17695j3601L3058k4392r2370p2985M654K0492p8008
13115A0183680j87919j63101j0511R4684K8417j18346j68807r5101k1279k4718
13105I516999n3417m4133j4157p751l0731o0344o1514j14R3095J04721j5037j26087
13093I301530n9008J16402J57525K080j37730r6926K1693N8117M4369Q7655J49565
13082I645272J24896M3809J6361M1896L8869P910N201P723l0328l9950O3110J84474
13070A0109243J57751K3120j8055O7905R8294q7n9280L4737J40756J05700J9812
13059A0679896M4423J29593J08005k2006j08873r2455n0953k8811R137N4666M5531
$$ y = [11037895, 10915647, 10926471, 11006476, 11053663, 11015753, 10893931, 10742860, 10655593, 10673728, 10716771, 10667308, 10524527, 10406832, 10393231, 10426289, 10401897, 10309527, 10236542, 10241196, 10261688, 10183680, 9995761, 9832660, 9822149, 9916833, 9945250, 9826904, 9658097, 9562996, 9541717, 9516999, 9463582, 9419449, 9405292, 9397541, 9366810, 9306466, 9244952, 9244838, 9337933, 9442654, 9427617, 9301530, 9242522, 9358924, 9516449, 9518529, 9380799, 9283873, 9305566, 9363683, 9408052, 9495707, 9645272, 9770168, 9813977, 9830338, 9872234, 9911103, 9919013, 9924214, 9931937, 9901609, 9861659, 9924769, 10109243, 10266994, 10290114, 10272059, 10339964, 10438258, 10438171, 10378891, 10413628, 10554384, 10660084, 10679896, 10724319, 10853912, 10961917, 10939911, 10831038, 10738583, 10687630, 10658819, 10667956, 10722622, 10768153]
13048A0768153p225j9357K0052L0233j1055k5734K2102O1743L9279k389j4770
13037A0861032j2495k425M7594J08101P0395q1875j86314j01637Q2924J64830
13027A0950130J01206K7565L0490N0095K7151J2400O8933J57466J86592J24541
13017A1736569J4631p3651p5538K9228J63426J96314R8703N234M9416J73237J95070
13006A2512639O4594n1799J1626J91188K68389J53335J618R527J57707K43491
12996A3562315J58811L6830O4116K17981K97957K05450P2976O8291J68663K22901
12986A5076291J81173J46546J99638K80827K93023K47693K39290L04982L75609
12977A7345072L71354L03388K58287K96138L84313M39146M24361L88060L93456
$$ y = [10768153, 10760928, 10741571, 10761623, 10791856, 10780801, 10755067, 10777169, 10838912, 10878191, 10875802, 10861032, 10848537, 10846112, 10893706, 11001807, 11072202, 10990327, 10804013, 10702376, 10785300, 10950130, 11051336, 11078901, 11109391, 11159486, 11186637, 11199037, 11267970, 11425436, 11612028, 11736569, 11751200, 11677549, 11602011, 11631239, 11794665, 11990979, 12089682, 12094916, 12144332, 12317569, 12512639, 12577233, 12525434, 12537060, 12728248, 12996637, 13149972, 13151590, 13161117, 13318824, 13562315, 13721126, 13757956, 13822072, 14040053, 14338010, 14543460, 14616436, 14684727, 14853390, 15076291, 15257464, 15404010, 15603648, 15884475, 16177498, 16425191, 16664481, 16969463, 17345072, 17716426, 18019814, 18278101, 18574239, 18958552, 19397698, 19822059, 20210119, 20603575]
12968B0603575M38187M73379M85809N09538N49100N50491M87467M30391M65591
12959B4993528N65727O13511N62391M99753N14755N71181N77720N34493N16164
12950B9949223N28173M91402L92671L38583L94724M65545M28150L13295K39552
12941C3541318K21262J78014J06200Q3988R8848L7729j04292j71934r3312k4603
12931C3873218j29786l38178m58962m39787l70266l15173k94821l53470m84011
12922C0688764n50819m58517l33719l51675m49127m35271l35686l49152m66677
12913B6958121m45577k29803q2656j67599k90730k46307j47618j75637k33402
12904B4938792j39853O709k6772k06370k79090j66131k8556K5198L3045O075p5293
$$ y = [20603575, 21041762, 21515141, 22000950, 22510488, 23059588, 23610079, 24097546, 24527937, 24993528, 25559255, 26172766, 26735157, 27234910, 27749665, 28320846, 28898566, 29433059, 29949223, 30477396, 30968798, 31361469, 31700052, 32094776, 32560321, 32988471, 33301766, 33541318, 33762580, 33940594, 34046794, 34130782, 34229630, 34267359, 34163067, 33991133, 33897821, 33873218, 33743432, 33405254, 32946292, 32506505, 32136239, 31821066, 31526245, 31172775, 30688764, 30137945, 29679428, 29345709, 28994034, 28544907, 28109636, 27773950, 27424798, 26958121, 26512544, 26282741, 26200085, 26032486, 25741756, 25495449, 25347831, 25172194, 24938792, 24798939, 24805648, 24778876, 24572506, 24293416, 24127285, 24098729, 24123927, 24156972, 24163047, 24087754]
12893B4087754j07388K3925J76635Q6193k02299l32877j46968R6002J25395J5249
12883B3821621k8540J309l089k8721N239P3893R5656O6786K3519l2198p2505l1841
12871B3891129N5728N7513k6489j7898J34537K17229R0056n4189Q835J75408K22068
12860B4753927J91102K50834L19370J99980O938M8669K92089L61728J47959M441
12850B6577037J76286M08853L74105J76938J28638K39483K76886J99829J93576
12841B8751631L05993L57102K52268J36738J53936K38260K52381J95488J62111
12832C0805908J77450J82854J51108J26418J43612J64456J26240L8033r068M7162
12822C1954173J41049J41856J8961j16517j61406j47800j66176k14839k12175
$$ y = [24087754, 23980366, 24004291, 24180926, 24267119, 24064820, 23731943, 23584975, 23680977, 23806372, 23821621, 23793081, 23794390, 23791301, 23762580, 23767819, 23841712, 23937368, 24004154, 24027673, 23995475, 23922970, 23891129, 23946857, 24004370, 23977881, 23959983, 24094520, 24311749, 24401805, 24347616, 24356451, 24531859, 24753927, 24945029, 25195863, 25515233, 25715213, 25722151, 25770820, 26062909, 26424637, 26572596, 26577037, 26753323, 27162176, 27536281, 27713219, 27841857, 28081340, 28358226, 28558055, 28751631, 29057624, 29414726, 29666994, 29803732, 29957668, 30195928, 30448309, 30643797, 30805908, 30983358, 31166212, 31317320, 31443738, 31587350, 31751806, 31878046, 31916079, 31907011, 31954173, 32095222, 32237078, 32256039, 32139522, 31978116, 31830316, 31664140, 31449301, 31237126]
12813C1237126j44942j12281j87369k97375l03294j82338o8869r0807k10423k80366
12803B9359062k38103j69064j57831j57438p1461Q6772K01472K04253J45955J23445
12793B9327062J88538L18725M32148M55844M21702M42768N35953N54582M08703
12784C3086025K60709L19603M90609M62693J66779r9710j02179P301l7436k03162
12774C4351232k39491p4289J03614J35824P3154L7864N8220R0032J00063P5868
12764C4712091J2832p1781j41516j68033j41538p4660j5619j9800p8554j16520
12754C3896902q5380j0177P5931J68745K39903K44361K23466K85781M21175M65877
12744C5926584L49863K40021K99177M33386M55970L89364L85466M25401L54923
$$ y = [31237126, 31092184, 30979903, 30792534, 30495159, 30191865, 30009527, 29940658, 29849851, 29639428, 29359062, 29120959, 28951895, 28794064, 28636626, 28565165, 28651937, 28853409, 29057662, 29203617, 29327062, 29515600, 29834325, 30266473, 30722317, 31144019, 31586787, 32122740, 32677322, 33086025, 33346734, 33666337, 34156946, 34619639, 34786418, 34686708, 34584529, 34591830, 34554394, 34351232, 34111741, 34037452, 34141066, 34276890, 34350044, 34387908, 34446128, 34536160, 34636223, 34712091, 34724923, 34653142, 34511626, 34343593, 34202055, 34127395, 34111776, 34091976, 34013422, 33896902, 33811522, 33801345, 33877276, 34046021, 34285924, 34530285, 34753751, 35039532, 35460707, 35926584, 36276447, 36516468, 36815645, 37249031, 37705001, 38094365, 38479831, 38905232, 39260155]
12735C9260155J94831J41738K14915J68257j31168m62808n56140m65490m46811
12726C7917479n67519o51793n85471m76600m62346m99178m42978k68221j01191
12717C3862182m2697n1318l9174l295J6626N0081J45456K35567K03684R4993R0298
12706C4562403K14793K59026R2813j27254k08706k01299k39179k79412k32131
12697C3841054j97636k94804l79530k55172o8501j23758l42823l29805j9593J71310
12687C2000742j4146k85007k80184q8542r087o5318p2218N71L3451M887j8303
12676C1206846m3631r6710j03089j5112N2842m296r3617q1758j2564P590J807
12665C0818308K1319P337n9439m7955P9597J16021n5388j93903o8653J27418R2878
$$ y = [39260155, 39454986, 39596724, 39811639, 39979896, 39848728, 39385920, 38829780, 38364290, 37917479, 37349960, 36698167, 36112696, 35636096, 35173750, 34674572, 34231594, 33963373, 33862182, 33819485, 33768167, 33728993, 33725698, 33742324, 33792405, 33937861, 34173428, 34377112, 34472105, 34562403, 34777196, 35036222, 35129035, 35001781, 34793075, 34591776, 34352597, 34073185, 33841054, 33643418, 33348614, 32969084, 32713912, 32645411, 32521653, 32178830, 31849025, 31829432, 32000742, 31986596, 31701589, 31421405, 31332863, 31323776, 31258458, 31186240, 31186811, 31220262, 31225149, 31206846, 31163215, 31066505, 30963416, 30948304, 31001146, 30996850, 30903233, 30821475, 30808911, 30816501, 30818308, 30839627, 30846964, 30787525, 30739570, 30819167, 30935188, 30879800, 30685897, 30617244, 30744662, 30837540]
12654C0837540n5900p177J55722R1080j47961j42224J76504L72392J98987m5208
12644C1433755m7861P0402P8468K1945K6027L2245j4697j520J00371R7519q2738
12633C1713916k00982r6475K8096k4612r9990j9254N0646q1815k18822r8644R6615
12622C1048679K4201j99732j70094J07110K10943R699j42675j6862J50338J06289
12612C1127896j7782R497J36494J72404J00029L0041L39o935K1106O7115O2631
12601C1702835K2915N7952J69870K11559J34493Q3931J37783J58705N2081l5560
12591C2696564L6854J45284J07261p794j8945M3978L1840k003J17858L15543L05728
12580C3772168O7592m9434J55598L97986L26105N8892o247J94609L27783K15876
$$ y = [30837540, 30781640, 30774463, 30930185, 31021265, 30873304, 30731080, 30907584, 31279976, 31478963, 31433755, 31385894, 31456296, 31534764, 31556709, 31582736, 31614981, 31600284, 31598764, 31699135, 31796654, 31713916, 31512934, 31416459, 31444555, 31419943, 31319953, 31300699, 31351345, 31269530, 31050708, 30952064, 31048679, 31072880, 30873148, 30703054, 30810164, 31021107, 31030806, 30888131, 30871269, 31021607, 31127896, 31110114, 31119611, 31256105, 31428509, 31528538, 31558579, 31558918, 31551983, 31573089, 31640204, 31702835, 31725750, 31783702, 31953572, 32165131, 32299624, 32383555, 32521338, 32680043, 32732124, 32696564, 32733418, 32878702, 32985963, 32978169, 32959224, 33003202, 33035042, 33033039, 33150897, 33466440, 33772168, 33839760, 33790326, 33945924, 34343910, 34670015, 34728907, 34722660, 34917269, 35245052, 35460928]
12570C5460928R6332J88717L18430K29810N1443J09444L80096M98515L25864J47765
12560C7807344J99825L29820L23106K69543L39350M26717L39178J86156K31725
12551D0452764M42918N33150M30046L54848M12247M45827L83606L95681N61300
12542D4412387O70700N57200L98839M67568P32929R23008Q85303P23472O38913
12533E0410319P43586R65969J095055J018812R19737J052650J328412J395980
12525E8930520J200899J113922J331868J515377J319325R61222Q59583R44730
12517F8177446Q07318M14685J78001K94938M84734M76013L62763L30512L68513
12508G1894923M26287N66096P72961Q59150P46858O33921O94896Q15805Q18929
$$ y = [35460928, 35557260, 35745977, 36064407, 36294217, 36345660, 36455104, 36835200, 37333715, 37659579, 37807344, 38007169, 38336989, 38660095, 38929638, 39268988, 39695705, 40034883, 40221039, 40452764, 40895682, 41428832, 41858878, 42213726, 42625973, 43071800, 43455406, 43851087, 44412387, 45083087, 45640287, 46039126, 46506694, 47239623, 48162631, 49047934, 49771406, 50410319, 51153905, 52119874, 53214929, 54233741, 55153478, 56206128, 57534540, 58930520, 60131419, 61245341, 62577209, 64092586, 65411911, 66373133, 67232716, 68177446, 68984764, 69399449, 69577450, 69872388, 70357122, 70833135, 71195898, 71526410, 71894923, 72321210, 72887306, 73660267, 74519417, 75266275, 75900196, 76595092, 77410897, 78229826]
12499G8229826P66249Q19433R42973R75858R01647Q33454P95468P13650N82579
12490H5561137M74461M13632L77853L74200L82618K96497P4737j19176j14430
12481H7721529j4029o5124k68804l59478k16245n6773j05964k68531l00981j75426
12471H5890174p2682p3618o0560N5893J84343K06271J64573J86574K78843L21889
12461H7081700K63713J99321K10593K23487J13039j08224l17947m81166o96983
12452H6487533j016377j320352j451722j402633j298397j241001j241138j267743
12444G6248170j277858j208315j026243q07741o92933p21482p67928o99219n60032
12435F8486419n16391o10654o74718n60021l75343l57850n22002o08372m51056
$$ y = [78229826, 78996075, 79815508, 80758481, 81734339, 82635986, 83469440, 84264908, 84978558, 85561137, 86035598, 86449230, 86827083, 87201283, 87583901, 87880398, 87955135, 87835959, 87721529, 87707500, 87642376, 87373572, 87014094, 86797849, 86741076, 86635112, 86366581, 86065600, 85890174, 85817492, 85743874, 85683314, 85739207, 85923550, 86129821, 86294394, 86480968, 86759811, 87081700, 87345413, 87544734, 87755327, 87978814, 88091853, 87983629, 87665682, 87184516, 86487533, 85471156, 84150804, 82699082, 81296449, 79998052, 78757051, 77515913, 76248170, 74970312, 73761997, 72735754, 71928013, 71235080, 70513598, 69745670, 69046451, 68486419, 67970028, 67359374, 66684656, 66124635, 65749292, 65391442, 64869440, 64261068, 63810012]
12426F3810012k31242k14254l55439l82606k24161j09856k00666l46467l34719
12417F1410602k06836j62336k55356l58935l82183l66043l65616l61802l17704
12408E8633791k47434k01733k15864k68436k77989j79337k6028M4081j3177p4232
12398E7173642j3898J21248J87859J43545P8190P4140J18697J50661J37452J08382
12388E8279918J32270K32547L23408L04005K24315K41063L71122M37179L43155
12379F0888982K43136K98387M16385M17159L33958L24045L71323L34489K45608
12370F3873472K83637M40111M86353L35759J83529J88588K53258K47860K35115
12361F6527682L03118L58932K86944J81689K18744L75423M71386M43141M05866
$$ y = [63810012, 63578770, 63364516, 63009077, 62626471, 62402310, 62292454, 62091788, 61745321, 61410602, 61203766, 61041430, 60786074, 60427139, 60044956, 59678913, 59313297, 58951495, 58633791, 58386357, 58184624, 57968760, 57700324, 57422335, 57242998, 57216970, 57261051, 57247874, 57173642, 57159744, 57280992, 57468851, 57612396, 57690586, 57764726, 57883423, 58034084, 58171536, 58279918, 58412188, 58644735, 58968143, 59272148, 59496463, 59737526, 60108648, 60545827, 60888982, 61132118, 61430505, 61846890, 62264049, 62598007, 62922052, 63293375, 63627864, 63873472, 64157109, 64597220, 65083573, 65419332, 65602861, 65791449, 66044707, 66292567, 66527682, 66830800, 67189732, 67476676, 67658365, 67877109, 68252532, 68723918, 69167059, 69572925]
12352F9572925M55429N53852O20109O26814N94472N64453N80246O46704P21482
12343G4936486P72292P96629P67740O51260N16976N15563O59756P45207O08141
12334H0970050L60040K21966K10366J60796J5121j04811j13858q2235r6598j40501
12324H1400336j70909k07241k77118l41765l34662k42627j19676l8188k5023k9184
12314G9613943K1067J11629J53913J39932J91168L65201N10218M55772K88590
12305H1851433K64639M53404O40621O25303M70357L86543M65818O06952O58797
12296H6423867N87075N06859N42788O56072O87431O10779O08713P75542Q95994
12287I2295120P37724M52681L90314N47420N48204K30834r9749j58208q7060j38298
$$ y = [69572925, 70028354, 70582206, 71202315, 71829129, 72423601, 72988054, 73568300, 74215004, 74936486, 75708778, 76505407, 77273147, 77924407, 78441383, 78956946, 79616702, 80361909, 80970050, 81330090, 81552056, 81762422, 81923218, 81938339, 81833528, 81719670, 81637435, 81540837, 81400336, 81229427, 81022186, 80745068, 80403303, 80068641, 79826014, 79706338, 79668150, 79643127, 79613943, 79635010, 79746639, 79900552, 80040484, 80231652, 80596853, 81107071, 81562843, 81851433, 82116072, 82569476, 83210097, 83835400, 84305757, 84692300, 85158118, 85765070, 86423867, 87010942, 87517801, 88060589, 88716661, 89404092, 90014871, 90623584, 91399126, 92295120, 93032844, 93485525, 93875839, 94423259, 94971463, 95202297, 95102548, 94944340, 94857280, 94718982]
12277I4718982k29625j37858O4442J29220Q4511J95563M93926O99411O66683N86007
12267I7271262O22562O42678M78523K39853J38952J51779Q8904o6646j20039L0915
12257I9478743K36435K97553K04017R8016P9992J27165J65388J49384P5377l1513
12247A00880557j25106j66664j65887j67348j72997j12571N8407K50550L01553
12238A00580494J58471o0872k07603k42908k20173k02683k40564l52287m67617
12229I8744258m58472k99107j31880r3628j43552j62991j62507k56912m61348
12220I6573861o50731p38543p91095r36548j222744j562073j770732j715475j493793
12211H5692127j381634j486447j563616j363800j052560r99981j194753j222951
$$ y = [94718982, 94489357, 94351499, 94415941, 94545161, 94629672, 94825235, 95319161, 96018572, 96685255, 97271262, 97893824, 98536502, 99015025, 99254878, 99393830, 99545609, 99634513, 99567867, 99447828, 99478743, 99715178, 100012731, 100216748, 100314764, 100394756, 100521921, 100687309, 100836693, 100912070, 100880557, 100755451, 100588787, 100422900, 100255552, 100082555, 99969984, 100028391, 100278941, 100580494, 100738965, 100678093, 100470490, 100227582, 100007409, 99804726, 99564162, 99211875, 98744258, 98285786, 97986679, 97854799, 97761171, 97617619, 97454628, 97292121, 97035209, 96573861, 95923130, 95184587, 94393492, 93456944, 92234200, 90672127, 88901395, 87185920, 85692127, 84310493, 82824046, 81260430, 79896630, 78844070, 77844089, 76649336, 75426385]
12203G5426385r03923n83671o05456q08888q36616o91766o49143p65523q36008
12194F8745391p73125o98494o72695o36636o23459p27087q36791p20584m38627
12185F2617893l45850n59629p49006o45038m58905n25407p76662q97425q38877
12176E6821094q20595q97207q82943p23499o17750o82234p62287p00746n80031
12167E0153802n53139n98572n93886n16777m36961l93358l91911m45512n12907
12158D5710779m81836l24704j92625k29256l54708l72234k48207j40688j61603
12149D3204918k50935l03211k95173k54395k03925j77007k02518k46002k47149
12140D1024603k35018l01762m25644m42805k75378q0701o0765j99498l14870l16175
$$ y = [75426385, 74522462, 73938791, 73333335, 72524447, 71687831, 70996065, 70346922, 69581399, 68745391, 67972266, 67273772, 66601077, 65964441, 65340982, 64613895, 63777104, 63056520, 62617893, 62272043, 61712414, 60963408, 60318370, 59859465, 59334058, 58557396, 57659971, 56821094, 56000499, 55103292, 54220349, 53496850, 52879100, 52196866, 51434579, 50733833, 50153802, 49600663, 49002091, 48408205, 47891428, 47454467, 47061109, 46669198, 46223686, 45710779, 45228943, 44904239, 44711614, 44482358, 44127650, 43755416, 43507209, 43366521, 43204918, 42953983, 42650772, 42355599, 42101204, 41897279, 41720272, 41517754, 41271752, 41024603, 40789585, 40487823, 40062179, 39619374, 39343996, 39263295, 39202530, 39003032, 38688162, 38371987]
12130C8371987k65376k11202j28470m3709n6042j61676k01436r0907J8389m8178
12120C7183380k05737k24187q5735j6005j24995k29409j45673J6893L1548r2864
12110C6107216j44555m7500M8868L2809k2122l6023o2241j40936j71580p2335
12100C5491601N4689P1655K0787K4751N5568L038p7087j6401J56959K04562M6863
12089C6036985q0355K5409K17041K19351M1272n1124P1315K38578K40641R5895
12079C7055008n675N7207K18198L20326K98395K43484K59098K90088K02948M0924
12069C8980001L1366K49977M49439L89244J95473J66383L14033L74181K49339
12060D1399436J47441K20442L38543L44982L03274L35292M03793M26108M44361
$$ y = [38371987, 38106611, 37895409, 37766939, 37723230, 37667188, 37505512, 37304076, 37213169, 37231558, 37183380, 36977643, 36753456, 36667721, 36651716, 36526721, 36297312, 36151639, 36168532, 36200080, 36107216, 35962661, 35915161, 35964029, 35996838, 35974716, 35938693, 35876452, 35735516, 35563936, 35491601, 35546290, 35617945, 35638732, 35663483, 35719051, 35722089, 35645002, 35628601, 35785560, 35990122, 36036985, 35956630, 35982039, 36199080, 36418431, 36459703, 36408579, 36479894, 36718472, 36959113, 37055008, 37049333, 37106540, 37324738, 37645064, 37943459, 38186943, 38446041, 38736129, 38939077, 38980001, 39011367, 39261344, 39710783, 40100027, 40295500, 40461883, 40775916, 41150097, 41399436, 41546877, 41767319, 42105862, 42450844, 42754118, 43089410, 43493203, 43919311, 44363672]
12051D4363672N06166N18514M11681L25363M21918O08122O61077N63969M93690
12042D8874172N20855N57583N86417O91769Q33223Q30417O53801N19292N84571
12033E4652100P27609P50463O56303N88481O06862O59988P00656P07036O45041
12024F0694539N14372L93000L56415L88452M25305M37041M22928L92504L89748
12015F4414304M53385N17478M61435L11946K63987M12972N93533N99131M49156
12006F8477327L11994K67455K81633L20577L47531L02134K21755K63633M40938
11997G1234977M87393K22577q5690m2278K69715L79689J35547q4543J6351K18490
11987G2752228J86514j4775j02272m3275j9492o3763m8468L0833M2986k8891o5198
$$ y = [44363672, 44869838, 45388352, 45800033, 46125396, 46547314, 47155436, 47816513, 48380482, 48874172, 49395027, 49952610, 50539027, 51230796, 52064019, 52894436, 53548237, 54067529, 54652100, 55379709, 56130172, 56786475, 57374956, 57981818, 58641806, 59342462, 60049498, 60694539, 61208911, 61601911, 61958326, 62346778, 62772083, 63209124, 63632052, 64024556, 64414304, 64867689, 65385167, 65846602, 66158548, 66422535, 66835507, 67429040, 68028171, 68477327, 68789321, 69056776, 69338409, 69658986, 70006517, 70308651, 70530406, 70794039, 71234977, 71722370, 71944947, 71859257, 71816979, 72086694, 72466383, 72601930, 72517387, 72533738, 72752228, 72938742, 72923967, 72821695, 72778420, 72758928, 72695165, 72646697, 72677530, 72720516, 72691625, 72626427]
11976G2626427l4493l4147j05024j84033k33633k56715k14553j03055o1724k01258
11966G1197792l67337l19600j26495j02429l21057m89064m01572k38860k51398
11957F8579980l93681m69968m52639m41350m45736m14778l79970l88267l85460
11948F4808131l28226l05264l76133m08147k77836j29096j89465l93497m46966
11939F1953501k54587l8326j703r5001j64559j45065m6589Q3703J37330L6397
11929F1465101j14853j28862p431O7731M2251O1534J69824J87426K5624j07583
11919F1660762j3637J69946J82277M7883J7902J65993K91887K34115P4353j3399
11909F2818082L1099J44761K32346K33946J71858J33411J54007J58154Q9394L1586
$$ y = [72626427, 72591934, 72557787, 72452763, 72268730, 72035097, 71778382, 71563829, 71460774, 71399050, 71197792, 70830455, 70510855, 70384360, 70281931, 69960874, 69471810, 69070238, 68831378, 68579980, 68186299, 67716331, 67263692, 66822342, 66376606, 65961828, 65581858, 65193591, 64808131, 64479905, 64174641, 63798508, 63390361, 63112525, 62983429, 62793964, 62400467, 61953501, 61698914, 61660588, 61658885, 61563884, 61399325, 61254260, 61207671, 61291374, 61428704, 61465101, 61350248, 61221386, 61213955, 61281686, 61323937, 61385471, 61555295, 61742721, 61768345, 61660762, 61647125, 61817071, 61999348, 62047231, 62065133, 62231126, 62523013, 62757128, 62831481, 62818082, 62849181, 62993942, 63226288, 63460234, 63632092, 63765503, 63919510, 64077664, 64167058, 64198644]
11899F4198644Q8714K03406K32042J59495R2060O7167L1674k341M6494J60625
11889F5277980K17039J80419J44440J47062J18036O3873J15606K93593M03330
11880F6961378L06745J50108J54664K93228L61905L02061K53305L06031L86545
11871F9475970M12753M08470M12212L96922L46620L18896L58624M14773M13204
11862G2958444L67413L48781L74754L96710L92142L97493M26756M20923L33671
11853G6417087K26621J98792K31978K05431Q9638J2992O4406J41569J16691N5363
11843G7760568R6554J80862J25264l8126o0656J12709K01210J8706j94682j18151
11833G8084258J48180K33915O5063n2453O6356K16661J52770m2916j18807k5969
$$ y = [64198644, 64287358, 64490764, 64722806, 64882301, 64974361, 65041528, 65073202, 65070861, 65117355, 65277980, 65495019, 65675438, 65819878, 65966940, 66084976, 66148849, 66264455, 66558048, 66961378, 67268123, 67418231, 67572895, 67866123, 68228028, 68530089, 68783394, 69089425, 69475970, 69888723, 70297193, 70709405, 71106327, 71452947, 71771843, 72130467, 72545240, 72958444, 73325857, 73674638, 74049392, 74446102, 74838244, 75235737, 75662493, 76083416, 76417087, 76643708, 76842500, 77074478, 77279909, 77369547, 77382539, 77446945, 77588514, 77705205, 77760568, 77857122, 78037984, 78163248, 78125122, 78064466, 78177175, 78378385, 78397091, 78202409, 78084258, 78232438, 78466353, 78531416, 78478963, 78545319, 78761980, 78914750, 78871834, 78753027, 78727058]
11823G8727058N6276l642j39158j94363r2875R0367J84701R0292q7697j43936
11813G8487023m0184L9376l8439j53646j28353k3286n7905k61714l97089k85532
11803G7140251n9315K1060r0316j96750j49164l4730l1874j66218k95286l01894
11793G5835764k13709j24762q0812p8101j05114j28793r4967r460K9922l9459
11783G4990509j32492j29687o5145p5020j70648k10274j24602k3240j2453m1726
11773G4005222k2930J6048R581j1950O171J6573m6879j21108r9052j8973n594
11762G3727109m5852o711J10862J34244K566r9755j4109J42121J58338N3748K6604
11751G4189165J33496K19625J77782R4910Q7794J46612K17749L04343L82942L45587
$$ y = [78727058, 78783334, 78779692, 78640534, 78446171, 78353296, 78443663, 78628364, 78718656, 78630959, 78487023, 78446839, 78486215, 78447776, 78294130, 78165777, 78142491, 78084586, 77822872, 77425783, 77140251, 77080936, 77101996, 77011680, 76814930, 76665766, 76631036, 76599162, 76432944, 76137658, 75835764, 75622055, 75497293, 75416481, 75338380, 75233266, 75104473, 75009506, 75000046, 75029968, 74990509, 74858017, 74728330, 74663185, 74588165, 74417517, 74207243, 74082641, 74059401, 74046948, 74005222, 73982292, 73998340, 74007921, 73995971, 74002142, 74018715, 73971836, 73850728, 73751676, 73732703, 73727109, 73681257, 73674546, 73785408, 73919652, 73922218, 73822463, 73808354, 73950475, 74108813, 74162561, 74189165, 74322661, 74542286, 74720068, 74814978, 74902772, 75049384, 75267133, 75571476, 75954418, 76300005]
11741G6300005J64846K3445J09173L28827M09828K80699J58441K15763L52458
11732G8343485L93411L45610L17784L15772K86894K79150L75440N15979N58894
11723H1732419M94298M36679M26031M09858M10194N08179O40849O27337M64716
11714H6150560L90073N39155P31619P37942N98801N14332N46917O11852O62437
11705I1483688P04151P01648O45912O46839P83421R25769Q97780P66586P58136
11696I8313930R06721J013236R68213Q92741R02875R42114R37183R40606J009916
11687A06827535J090152J122103J141733J175603J164108J092562J073908J180189
11679A15867893J302351J309505J253031J271865J371341J442026J443545J428770
$$ y = [76300005, 76464851, 76488296, 76597469, 76926296, 77336124, 77616823, 77775264, 77991027, 78343485, 78736896, 79082506, 79400290, 79716062, 80002956, 80282106, 80657546, 81173525, 81732419, 82226717, 82663396, 83089427, 83499285, 83909479, 84417658, 85058507, 85685844, 86150560, 86540633, 87079788, 87811407, 88549349, 89148150, 89662482, 90209399, 90821251, 91483688, 92187839, 92889487, 93535399, 94182238, 94965659, 95891428, 96789208, 97555794, 98313930, 99220651, 100233887, 101202100, 102094841, 102997716, 103939830, 104877013, 105817619, 106827535, 107917687, 109039790, 110181523, 111357126, 112521234, 113613796, 114687704, 115867893, 117170244, 118479749, 119732780, 121004645, 122375986, 123818012, 125261557, 126690327]
11671A26690327J426779J436749J499690J636780J748956J728551J651336J694271
11663A39513439J861784J970328J935932J891793J947103K009852J968870J890256
11655A54989357J866578J799178J543760J203723J039165J080381J068503Q48882
11647A65439527O03490N61945O67400P12943O75424O96938Q10670R11413R70420
11638A72050170J054559J125596J049052Q45096P03258O76178N94249L95637K95614
11629A78789409M51840O80276P26547O37131O11297O42241N91054M96332M96958
11620A84123085N25608M09099K32576K54655M55282N29137L85540K92366M12239
11611A87619587N47686N11475M24397M36075M37041K86914Q9977N482q312l7718
$$ y = [126690327, 128117106, 129553855, 131053545, 132690325, 134439281, 136167832, 137819168, 139513439, 141375223, 143345551, 145281483, 147173276, 149120379, 151130231, 153099101, 154989357, 156855935, 158655113, 160198873, 161402596, 162441761, 163522142, 164590645, 165439527, 166043017, 166604962, 167272362, 167985305, 168660729, 169357667, 170168337, 171079750, 172050170, 173104729, 174230325, 175279377, 176124473, 176827731, 177503909, 178098158, 178493795, 178789409, 179241249, 179921525, 180648072, 181285203, 181896500, 182538741, 183129795, 183626127, 184123085, 184648693, 185057792, 185290368, 185545023, 186000305, 186529442, 186914982, 187207348, 187619587, 188167273, 188678748, 189103145, 189539220, 189976261, 190263175, 190353152, 190358634, 190350322, 190312604]
11601A90312604j2131J10817J71783P2319K561J31326K67386J38068j63001l27874
11591A90703858k91916k21211j82528j58574k53342n19342p07526n83185l73705
11582A87412529m59405p11582o50958k46578K351j29559k61817o9735K30773L28835
11572A85444854L09254L82378M83831M67181M04811M00467L61374K19508J15178
11563A88588836J13619K9926k07094l44373k58287k66006o05163r43428q69755
11554A85238275n82793n58976p59237p54653n08373m08925n45947n66196l31789
11545A80221386j53063k13608k78551j72689p9661j33437j42759J3659J08686
11536A79169963k8376j84528j49821r9980k47366m10167l28771j75060l04691
$$ y = [190312604, 190300473, 190411290, 190583073, 190655392, 190657953, 190789279, 191056665, 191194733, 191031732, 190703858, 190411942, 190190731, 190008203, 189849629, 189596287, 189076945, 188369419, 187786234, 187412529, 186953124, 186241542, 185590584, 185344006, 185346357, 185216798, 184954981, 184885246, 185116019, 185444854, 185754108, 186136486, 186620317, 187087498, 187492309, 187892776, 188254150, 188473658, 188588836, 188702455, 188732381, 188525287, 188180914, 187922627, 187656621, 187051458, 186108030, 185238275, 184655482, 184096506, 183337269, 182582616, 182074243, 181665318, 181119371, 180553175, 180221386, 180068323, 179854715, 179576164, 179403475, 179323814, 179190377, 179047618, 179061277, 179169963, 179141587, 178957059, 178807238, 178707258, 178459892, 178049725, 177720954, 177545894, 177241203]
11527A77241203o44822p76078n80221l93052m77969p02113q21626q00621p35076
11518A71309625o78485o51771o69271o82318o27807n61165n92022o73526o36601
11509A65536659m69722l66126m18270m64644l63896k43244k97090m60121m87558
11500A61965988l14883j41700j40337k45152k93962k55249k17825k22732k13368
11491A59920780j47571p7853q4485j61659k08394j41338k984P2324K3486l6545
11481A59155761M7834K46089L48729K54584J34287J88857L46077L81391K82028
11472A61385637K48154L21266K91967Q0478p0382K5053J66403Q0775j25870j45318
11462A62258163L0507J26068M3400l7845j8481l015k7041J7143J16365J08233
$$ y = [177241203, 176596381, 175820303, 175240082, 174847030, 174369061, 173666948, 172845322, 172044701, 171309625, 170631140, 169979369, 169310098, 168627780, 167999973, 167438808, 166846786, 166173260, 165536659, 165066937, 164700811, 164282541, 163817897, 163454001, 163210757, 162913667, 162453546, 161965988, 161651105, 161509405, 161369068, 161123916, 160829954, 160574705, 160356880, 160134148, 159920780, 159773209, 159695356, 159610871, 159449212, 159240818, 159099480, 159096496, 159168820, 159192306, 159155761, 159203595, 159449684, 159798413, 160052997, 160187284, 160376141, 160722218, 161103609, 161385637, 161633791, 161955057, 162247024, 162327502, 162257120, 162282173, 162448576, 162529351, 162403481, 162258163, 162288670, 162414738, 162458138, 162420293, 162401812, 162398797, 162371756, 162388899, 162505264, 162613497]
11452A62613497J188J3815J89743K87513J87703R3948J63390K49955K12460J72335
11442A64185547K38924K76213J93733J73601L28400M33059L18372K29737M14453
11433A66792039O39558N69304L73941M48307P09951P42889N36279M87629O85764
11424A71985661P82818O47082N72050P01068P81365O73081O00479O85520P13356
11415A78142480N97203N98317Q09191Q92122O58556M50339N64604P37637O42216
11406A84092665M90225O25495Q64570Q18745O07161O38501Q65296Q88920P10040
11397A90601618P28205R94306J098880R01744P75177R42034J116694J049524R45420
11388A99153602J042723J185718J147113J045766J108849J279822J378767J431793
$$ y = [162613497, 162614685, 162628500, 162818243, 163105756, 163293459, 163387407, 163550797, 163800752, 164013212, 164185547, 164424471, 164700684, 164894417, 165068018, 165396418, 165829477, 166147849, 166377586, 166792039, 167431597, 168000901, 168374842, 168823149, 169533100, 170275989, 170812268, 171299897, 171985661, 172768479, 173415561, 173987611, 174688679, 175470044, 176143125, 176743604, 177429124, 178142480, 178739683, 179338000, 180147191, 181039313, 181697869, 182148208, 182712812, 183450449, 184092665, 184582890, 185208385, 186072955, 186891700, 187498861, 188137362, 189002658, 189891578, 190601618, 191329823, 192324129, 193423009, 194324753, 195099930, 196041964, 197158658, 198208182, 199153602, 200196325, 201382043, 202529156, 203574922, 204683771, 205963593, 207342360, 208774153]
11380B08774153J540503J619543J561331J494807J589216J744132J759902J688269
11372B21771856J722573J845725J888444J864919J945708K125937K210646K139195
11364B37515003K064921K085942K128642K127369K102043K029104J852848J661187
11356B53567059J629939J740209J771745J647047J556306J639427J766901J780230
11348B67098863J749991J814043J920862J938938J906320J959187K083215K139898
11340B82611317K100092K056864K026892J938553J829623J855318K035805K165982
11332B98620446K072454J832776J639936J555599J508328J451846J396732J328168
11324C11406285J214551J091180J039898J081979J165433J254355J353019J441543
$$ y = [208774153, 210314656, 211934199, 213495530, 214990337, 216579553, 218323685, 220083587, 221771856, 223494429, 225340154, 227228598, 229093517, 231039225, 233165162, 235375808, 237515003, 239579924, 241665866, 243794508, 245921877, 248023920, 250053024, 251905872, 253567059, 255196998, 256937207, 258708952, 260355999, 261912305, 263551732, 265318633, 267098863, 268848854, 270662897, 272583759, 274522697, 276429017, 278388204, 280471419, 282611317, 284711409, 286768273, 288795165, 290733718, 292563341, 294418659, 296454464, 298620446, 300692900, 302525676, 304165612, 305721211, 307229539, 308681385, 310078117, 311406285, 312620836, 313712016, 314751914, 315833893, 316999326, 318253681, 319606700, 321048243]
11316C21048243J475955J474010J517651J629149J717223J701867J628956J585000
11308C33778054J548074J432165J272670J241368J414057J619560J631833J465765
11300C45403546J343331J359537J343009J133631Q52955P33653P68509P42564
11292C53680735N96044N15984O05463O95754O21441M78048M22229L92742K61292
11283C58269732J17164J24156J93145J12178m8043j2128K05282K69589Q8519R264
11273C59328858K58245N52616N53474L86728L57035M01922K53207k8955j45098
11264C61918032j07883k39026n92498q26131p53792o20022o56385p26951o41283
11255C56754061n14396n42245o48584o42526n66512o01631p25867p43373o21678
$$ y = [321048243, 322524198, 323998208, 325515859, 327145008, 328862231, 330564098, 332193054, 333778054, 335326128, 336758293, 338030963, 339272331, 340686388, 342305948, 343937781, 345403546, 346746877, 348106414, 349449423, 350583054, 351436009, 352169662, 352938171, 353680735, 354276779, 354792763, 355398226, 356093980, 356715421, 357193469, 357615698, 358008440, 358269732, 358386896, 358511052, 358704197, 358816375, 358768332, 358756204, 358961486, 359231075, 359319594, 359328858, 359587103, 360139719, 360693193, 361079921, 361436956, 361838878, 362092085, 362063130, 361918032, 361810149, 361571123, 360978625, 360152494, 359398702, 358778680, 358122295, 357395344, 356754061, 356239665, 355697420, 355048836, 354406310, 353839798, 353238167, 352512300, 351768927, 351147249]
11246C51147249n55087o61846p99505p49790m94144k48793k38417m35727n59064
11237C46404876m02660j26374o3082k52987l95512l16066k11171k82578l90392
11228C43964054l09278j23257p2736j44707j26508M214N2499m4432j22680p0967
11218C43006202L8006J22098J71488J37712k5723j85470j38561N0679Q1316j38484
11208C43119263l43480l30528k57031l35887m72768m57433l45076l65107n39880
11199C39672073o70116o77804p08332q52290r83177r64852q67169q61560r89292
11190C32097481j136273j196582j176763j144741j136963j139199j135229j142993
11182C22888738j187826j253490j288892j268555j221215j190260j191324j218142
$$ y = [351147249, 350592162, 349930316, 349130811, 348381021, 347886877, 347638084, 347399667, 346963940, 346404876, 346002216, 345875842, 345812760, 345559773, 345164261, 344848195, 344637024, 344354446, 343964054, 343654776, 343531519, 343458783, 343314076, 343187568, 343191782, 343244281, 343199849, 343077169, 343006202, 343044208, 343166306, 343337794, 343475506, 343449783, 343264313, 343125752, 343176431, 343257747, 343119263, 342775783, 342445255, 342188224, 341852337, 341379569, 340922136, 340577060, 340211953, 339672073, 339001957, 338324153, 337615821, 336763531, 335780354, 334815502, 333948333, 333086773, 332097481, 330961208, 329764626, 328587863, 327443122, 326306159, 325166960, 324031731, 322888738, 321700912, 320447422, 319158530, 317889975, 316668760, 315478500, 314287176, 313069034]
11174C13069034j259075j288050j266267j183390j087142j043556j060330j067325
11166C03813899r96641q81896q37705r07056r73773r04038p47843o83454p54238
11157B96127255q03961p24396o10261n71599n54527m96183n00733o54129p91145
11148B90420321p03261m96888m57484n95315o44292n28019m80595o10008o87045
11139B85217414n46599l88883m37076n53165m87428l15188k99419m40001m94082
11130B81255573l97282l44652m35805n27016n02644m49974m66466m92557m53529
11121B77185648m13015m58138n40180n53137n03596m90888n49769o06836n96535
11112B72473554n56568n79026o88401q01478q24911p70653p32680p57115p96678
$$ y = [313069034, 311809959, 310521909, 309255642, 308072252, 306985110, 305941554, 304881224, 303813899, 302817258, 301935362, 301097657, 300190601, 299216828, 298312790, 297564947, 296881493, 296127255, 295323294, 294598898, 293988637, 293417038, 292862511, 292366328, 291865595, 291211466, 290420321, 289717060, 289220172, 288762688, 288167373, 287523081, 286995062, 286514467, 285904459, 285217414, 284670815, 284281932, 283844856, 283291691, 282804263, 282489075, 282189656, 281749655, 281255573, 280858291, 280513639, 280077834, 279550818, 279048174, 278598200, 278131734, 277639177, 277185648, 276772633, 276314495, 275774315, 275221178, 274717582, 274226694, 273676925, 273070089, 272473554, 271916986, 271337960, 270649559, 269848081, 269023170, 268252517, 267519837, 266762722, 265966044]
11103B65966044q06306q13803q58492r16258r28627q71816p79142p30478q01335
11094B58459787r53584j015038q85871p27012p68568r48574r77983p98998o94755
11085B50689404q27230r64648q77600p33840q06980j001381j009556q15486o93707
11076B42958976p67589q93222r59193r98983j008417r37337q71116r46952j079822
11067B34496345j046765q59484p68861q65613r64137r35944q73385q52771q15980
11058B26513405p68832q16194r05673q21481n49545l67752m35453n64575n52545
11049B20731355m76915m79428n01249m31694l17465k43720j91168j57696k17737
11040B17714283l23652k79754o2556Q2343K3854m3237M8798J67449J75291J95942
$$ y = [265966044, 265159738, 264345935, 263487443, 262571185, 261642558, 260770742, 259991600, 259261122, 258459787, 257506203, 256491165, 255605294, 254878282, 254109714, 253161140, 252183157, 251384159, 250689404, 249862174, 248897526, 248019926, 247286086, 246479106, 245477725, 244468169, 243652683, 242958976, 242191387, 241298165, 240338972, 239339989, 238331572, 237394235, 236523119, 235576167, 234496345, 233449580, 232590096, 231821235, 230955622, 229991485, 229055541, 228182156, 227329385, 226513405, 225744573, 224928379, 224022706, 223201225, 222651680, 222283928, 221848475, 221283900, 220731355, 220254440, 219775012, 219273763, 218842069, 218524604, 218280884, 218089716, 217932020, 217714283, 217390631, 217110877, 217048321, 217130664, 217154518, 217111281, 217160079, 217327528, 217502819, 217698761]
11030B17698761L28005L95871K82080K10201L62942N16292M35957L43601N36991
11021B21110701Q10497P77299N65619O14783Q99064R67001P29425N96062P58783
11012B27829234R20264Q76113Q27227R19544R67786Q70294Q49657J021006J129808
11003B36210933J000283Q71054R81582J161401J156676J073220J150626J331470
10995B44937245J398968J363695J389060J468404J472927J418265J423212J485967
10987B56357743J519930J529031J564080J602406J631306J730924J921364K066716
10979B69923500K081801K077020K147985K206174K183047K191865K292482K319940
10971B87423814K176675K065766K164998K298257K250160K193828K422934K815929
$$ y = [217698761, 218026766, 218422637, 218704717, 218914918, 219277860, 219794152, 220230109, 220573710, 221110701, 221921198, 222698497, 223264116, 223878899, 224777963, 225744964, 226474389, 227070451, 227829234, 228749498, 229625611, 230452838, 231372382, 232340168, 233210462, 234060119, 235081125, 236210933, 237211216, 238082270, 239063852, 240225253, 241381929, 242455149, 243605775, 244937245, 246336213, 247699908, 249088968, 250557372, 252030299, 253448564, 254871776, 256357743, 257877673, 259406704, 260970784, 262573190, 264204496, 265935420, 267856784, 269923500, 272005301, 274082321, 276230306, 278436480, 280619527, 282811392, 285103874, 287423814, 289600489, 291666255, 293831253, 296129510, 298379670, 300573498, 302996432, 305812361]
10963C05812361K992242K930083L010178L440056M011822M489119M928011N553317
10955C37167189O548843P947351R449078J0377478J0147158Q818173O917735M743433
10947D02116438K215498n35167k861039m123832m318050m019442l860734m089417
10939C80524255m416255m255968l350272k165018j394339j096727p14435M7724
10931C63178965R22693J824142L177063M921511N699007L970663K1433l862067
10923C79853410n537039m913025l458544k286606j321811j95075Q25139J225998
10915C64192447J153238J285121J848729K371118K572120K841216L324139L094631
10907C82682759J126139k030822m451432m941751m204319l584940l419729l225758
$$ y = [305812361, 308804603, 311734686, 314744864, 318184920, 322196742, 326685861, 331613872, 337167189, 343716032, 351663383, 361112461, 371489939, 381637097, 390455270, 397373005, 402116438, 404331936, 403796769, 400935730, 396811898, 392493848, 388474406, 384613672, 380524255, 376108000, 371852032, 368501760, 366336742, 364942403, 363845676, 363131241, 363178965, 364101658, 365925800, 369102863, 374024374, 379723381, 383694044, 383715477, 379853410, 374316371, 369403346, 365944802, 363658196, 362336385, 362141310, 362966449, 364192447, 365345685, 366630806, 368479535, 370850653, 373422773, 376263989, 379588128, 382682759, 383808898, 381778076, 377326644, 372384893, 368180574, 364595634, 361175905, 357950147]
10899C57950147k916238k937884l386773l782163l786803l568313l351356l116560
10891C31104057k873682k784201k840648k800582k607035k523557k671407k780772
10883C09222173k636295k455819k533976k758575k813938k697418k682435k842815
10875B87800902k954281k887995k808071k884619l031995l063496k957733k830268
10867B64382444k730743k611826k465641k356866k300927k214854k042077j851966
10859B45807544j745173j710157j654348j543172j415058j281006j123201r92313
10851B34343116r73669j025760r90827q27441o94554p14607p87225p60778o70389
10842B26897866o53569p16893p50326p19055o85788o78925o81936p20630q20098
$$ y = [357950147, 355033909, 352096025, 348709252, 344927089, 341140286, 337571973, 334220617, 331104057, 328230375, 325446174, 322605526, 319804944, 317197909, 314674352, 312002945, 309222173, 306585878, 304130059, 301596083, 298837508, 296023570, 293326152, 290643717, 287800902, 284846621, 281958626, 279150555, 276265936, 273233941, 270170445, 267212712, 264382444, 261651701, 259039875, 256574234, 254217368, 251916441, 249701587, 247659510, 245807544, 244062371, 242352214, 240697866, 239154694, 237739636, 236458630, 235335429, 234343116, 233369447, 232343687, 231352860, 230525419, 229830865, 229116258, 228329033, 227568255, 226897866, 226244297, 225527404, 224777078, 224058023, 223372235, 222693310, 222011374, 221290744, 220470646]
10833B20470646r03599q75641p84983p68112q46969r15758r15239q91353q90169
10824B12678823r11339r50515r84783r53755q59232q18981q99937r83527r45244
10815B04371510q68544q96403r73990r62805r14581r67664j050341r90702q68214
10806A95878266r13234j072031j050713q31754p44964r16302j046490r13746p21348
10797A87667684p16987q05332q01362p65723q04109q06042o81931o09017p27611
10788A80949570q28705o82426m60246m60594o01603n88282m39288m19737n37384
10779A75931305n40842l92358l22116l91964m03340k93895k46590l15959l03489
10770A72720752j29398o278r1632k42421k70489k09626j83255k04528k30996k46149
$$ y = [220470646, 219567047, 218691406, 217906423, 217138311, 216291342, 215375584, 214460345, 213568992, 212678823, 211767484, 210816969, 209832186, 208878431, 208019199, 207200218, 206300281, 205316754, 204371510, 203502966, 202606563, 201632573, 200669768, 199755187, 198787523, 197737182, 196746480, 195878266, 194965032, 193893001, 192842288, 192010534, 191265570, 190349268, 189302778, 188389032, 187667684, 186950697, 186145365, 185344003, 184578280, 183774171, 182968129, 182286198, 181677181, 180949570, 180120865, 179438439, 178978193, 178517599, 177915996, 177327714, 176888426, 176468689, 175931305, 175390463, 174998105, 174675989, 174284025, 173880685, 173586790, 173340200, 173024241, 172720752, 172591354, 172585076, 172493444, 172251023, 171980534, 171770908, 171587653, 171383125, 171152129, 170905980]
10760A70905980k05747p9091J7265n8684j96962j48905M4509O2559j67101l11190
10750A69862633j71013j9901j43481l58595l20962q1847J9224j20658k84005l02024
10740A68079371k20977j37456j02621j58559k79759l31513k54798k05104l28503
10731A66060081n10424n57804n20162n80389p10125p11074n68274m93206n99950
10722A60808673p67855q52285q35205p49672o37789n94691o84145q10138q28620
10713A54048273p56489p03336o61195n74138n43330o89740q54839p58242m67025
10704A48039939l64710n74963p63105o59406m54115m53879o16850o91825o19317
10695A42841769n26208m65660m19818m54362o20309p71677p16345n10761l93416
$$ y = [170905980, 170700233, 170621142, 170638407, 170579723, 170382761, 170233856, 170278365, 170340924, 170173823, 169862633, 169691620, 169671719, 169528238, 169169643, 168848681, 168766834, 168786058, 168665400, 168381395, 168079371, 167858394, 167720938, 167618317, 167459758, 167179999, 166848486, 166593688, 166388584, 166060081, 165549657, 164991853, 164471691, 163891302, 163181177, 162470103, 161901829, 161408623, 160808673, 160040818, 159188533, 158353328, 157603656, 156965867, 156371176, 155687031, 154876893, 154048273, 153291784, 152588448, 151927253, 151353115, 150809785, 150120045, 149265206, 148506964, 148039939, 147675229, 147100266, 146337161, 145677755, 145223640, 144769761, 144152911, 143461086, 142841769, 142315561, 141849901, 141430083, 140975721, 140355412, 139583735, 138867390, 138356629, 137963213]
10686A37963213m47161n24597n03877m33132l98897m05946m22114m27250l98137
10677A34002102l36749l06253l45229l73659k98183j83681j83834l06534l92518
10668A31275462l49708k70865k67843l08868k97640k30998j91239k19744k69372
10659A28869185k77411k41040k04635j89101j66079j21788j06134j52663j79287
10650A27231047q0965P7181J08907l715m3928J08893K61484J97962L4645M1112
10640A27932623K07804K77983J78488J13116J82469K07341M9434j46108j93355
10631A28809795j49035j70977k54597l06523l58665n02014o79642p40185o65845
10622A24982312n84791n75723o01072o21208o47691o85502p21960p61678p96593
$$ y = [137963213, 137516052, 136991455, 136487578, 136054446, 135655549, 135249603, 134827489, 134400239, 134002102, 133665353, 133359100, 133013871, 132640212, 132342029, 132158348, 131974514, 131667980, 131275462, 130925754, 130654889, 130387046, 130078178, 129780538, 129549540, 129358301, 129138557, 128869185, 128591774, 128350734, 128146099, 127956998, 127790919, 127669131, 127562997, 127410334, 127231047, 127150082, 127227263, 127336170, 127332455, 127288527, 127397420, 127658904, 127856866, 127891511, 127932623, 128140427, 128418410, 128596898, 128710014, 128892483, 129099824, 129149258, 129003150, 128809795, 128660760, 128489783, 128235186, 127928663, 127569998, 127067984, 126388342, 125648157, 124982312, 124397521, 123821798, 123220726, 122599518, 121951827, 121266325, 120544365, 119782687, 118986094]
10613A18986094p84564p35651p42005q17017q06638o16519m27889m72440o55822
10604A12927549o65878m50345l00550l91180n20527m54345k80866k19433k67573
10595A09376852k75678k38290k58903l05586k55046j45129j35630k14703j90599
10586A07357288k2450Q0069j4538j44295j10088K6435P7186L1258K2311O4430
10576A07367606L4275q6973j49417o7403L6507J2931r0567r8426M0667J73098
10566A07172298J31729m7909j52354l9153J77351K51483J21730M936J03852L13702
10556A08037665L66741K26175J38320K54239M07042L90839K83031K90343L95205
10547A10789600M07325L23906L59698N70589P16687O33008N06325N83426P78333
$$ y = [118986094, 118201530, 117465879, 116723874, 115906857, 115100219, 114483700, 114055811, 113583371, 112927549, 112261671, 111811326, 111510776, 111119596, 110599069, 110144724, 109863858, 109644425, 109376852, 109101174, 108862884, 108603981, 108298395, 108043349, 107898220, 107762590, 107547887, 107357288, 107334838, 107414907, 107400369, 107256074, 107145986, 107172421, 107249607, 107280865, 107303176, 107367606, 107401881, 107314908, 107165491, 107098088, 107134595, 107147526, 107056959, 106958533, 106999200, 107172298, 107304027, 107256118, 107103764, 107064611, 107241962, 107493445, 107615175, 107620111, 107723963, 108037665, 108404406, 108630581, 108768901, 109023140, 109430182, 109821021, 110104052, 110394395, 110789600, 111196925, 111520831, 111880529, 112451118, 113167805, 113800813, 114307138, 114890564, 115668897]
10538A15668897Q20907O96028O59494Q35014J058763J169632J216401J285406
10530A23410542J332305J317792J342344J490896J667658J739204J741135J789187
10522A35831063J876411J931147K010088K243113K605777K926134L137622L377622
10514A55938977L792681M346256M858307N193380N421797N792797O419943O957689
10506A98721827O847846O072721N352707N199022N022875L810793J658577p7185
10498B32609183l91218K31687O18049J81923j132690l493298o787651r861047
10490B11974938j1204152j0585210r242536q281560p628292o814384n954195n377747
10482A46886862m924270m287940l664981l397233l269575k830230k207661j925200
$$ y = [115668897, 116489804, 117185832, 117845326, 118680340, 119739103, 120908735, 122125136, 123410542, 124742847, 126060639, 127402983, 128893879, 130561537, 132300741, 134041876, 135831063, 137707474, 139638621, 141648709, 143891822, 146497599, 149423733, 152561355, 155938977, 159731658, 164077914, 168936221, 174129601, 179551398, 185344195, 191764138, 198721827, 205569673, 211642394, 216995101, 222194123, 227216998, 231027791, 232686368, 232609183, 232217965, 232449652, 233067701, 233249624, 232116934, 228623636, 221835985, 211974938, 200770786, 190185576, 180943040, 172661480, 165033188, 158218804, 152264609, 146886862, 141962592, 137674652, 134009671, 130612438, 127342863, 124512633, 122304972, 120379772]
10474A20379772k004124j942128j589905j364384j468669j551402j372040j211704
10466A07875416j301056j361104j114233q22846q62842j084781j077574q43818
10458I9407162p35589q48686r32588q51792p33187o55259n41087l83694k77270
10449I3448010k05449p2487N4790K1438r4033l6435K10718L68056K80739J00244
10439I4075591l0846j65284l07392k99548j23777k4301j23332j96484q5784o5314
10429I2653529m50505j031712j290361j101988q46705q22744r10319q91670p81724
10420H4525801o92915o16383n10496m33645m25655l88851k42201r0460q4843j85468
10410H0854884k12411r8738L9892Q1932L9018O153M7270J43968K12511J74507
$$ y = [120379772, 118375648, 116433520, 114843615, 113479231, 112010562, 110459160, 109087120, 107875416, 106574360, 105213256, 104099023, 103276177, 102413335, 101328554, 100250980, 99407162, 98671573, 97822887, 96890299, 96038507, 95305320, 94650061, 94108974, 93725280, 93448010, 93242561, 93170074, 93224864, 93246302, 93152269, 93115834, 93326552, 93694608, 93975347, 94075591, 94044745, 93879461, 93572069, 93272521, 93148744, 93124443, 93001111, 92804627, 92718843, 92653529, 92203024, 91171312, 89880951, 88778963, 87932258, 87109514, 86199195, 85307525, 84525801, 83832886, 83216503, 82706007, 82272362, 81846707, 81457856, 81215655, 81125195, 81040352, 80854884, 80642473, 80543735, 80583627, 80665559, 80704577, 80710730, 80758000, 80901968, 81114479, 81288986]
10400H1288986M6079o2159p0377k1562k7l272K2472M6521l2022k08716l19770
10389H0686153k39333o1967J1262o1955j30157r1852m4659j07101j96987j39424
10379G9623980M4121J38219N8288j4302P2666J84527J20476k9094R321K62580
10369H0470782M49167L93038K56553K50552L26259L23096K57889K60512L22660
10360H3310508L24438K67888K84410M08596N15634N12304M55901M49322N17841
10351H7046842O06563O19571M80335K48878J35488K63451M56966M33768J88743
10342I0480605j1113j8361L7101L1892M2275J35517J97125J38007Q5709J74058
10332I1292815K99364K96834K22848K29017K70880K05819J03480J67997L71036
$$ y = [81288986, 81335065, 81272906, 81202529, 81180967, 81180940, 81177668, 81200140, 81246661, 81214639, 81005923, 80686153, 80446820, 80384853, 80396115, 80334160, 80204003, 80112151, 80067492, 79960391, 79763404, 79623980, 79668101, 79806320, 79864608, 79850306, 79922972, 80107499, 80227975, 80198881, 80208202, 80470782, 80919949, 81312987, 81569540, 81820092, 82146351, 82469447, 82727336, 82987848, 83310508, 83634946, 83902834, 84187244, 84595840, 85111474, 85623778, 86079679, 86529001, 87046842, 87653405, 88272976, 88753311, 89002189, 89137677, 89401128, 89858094, 90291862, 90480605, 90469492, 90451131, 90488232, 90520124, 90562399, 90697916, 90895041, 91033048, 91118757, 91292815, 91592179, 91889013, 92111861, 92340878, 92611758, 92817577, 92921057, 93089054, 93460090]
10323I3460090M53942L29295K05095K35179L04223K75824K23834K62635L28318
10314I6078435K95921J85861J04657P9116P0388O0546K9098n2323j22138o0205
10304I6669356R7057J42396J6928n0137J06767K94224K53479Q0890N8925J83208
10294I7853093J97273N5751j437J29994K60993K60177K47725L07996L06330J72329
10284I9790224R6960K22247L64967L10501J89825K61904M58090M82430L09211
10275A02486359K34367L99665N82833N65862M48322M42074N53514O42046O58175
10266A07013217O58047O70457O93716P61093Q85717R92305J009448R76019R60238
10257A14620257R46251R16438R64385J166417J395710J454448J378781J409209
$$ y = [93460090, 93914032, 94243327, 94448422, 94683601, 94987824, 95263648, 95487482, 95750117, 96078435, 96374356, 96560217, 96664874, 96743990, 96814378, 96874924, 96904022, 96851699, 96729561, 96669356, 96766413, 96908809, 96925737, 96875600, 96982367, 97276591, 97530070, 97610960, 97669885, 97853093, 98050366, 98106117, 98104680, 98234674, 98495667, 98755844, 99003569, 99311565, 99617895, 99790224, 99887184, 100109431, 100474398, 100784899, 100974724, 101236628, 101694718, 102177148, 102486359, 102720726, 103120391, 103703224, 104269086, 104717408, 105159482, 105712996, 106355042, 107013217, 107671264, 108341721, 109035437, 109796530, 110682247, 111674552, 112684000, 113660019, 114620257, 115566508, 116482946, 117447331, 118613748, 120009458, 121463906, 122842687, 124251896]
10249A24251896J629072J848973J933251K021419K269301K561291K707444K800973
10241A42023620L107803L638444M097058M279917M270032M169950L910264L487400
10233A72984488L177662L268131L639756L791568L271271K050363O17218k41070
10225A92559387j8982R12337J515343J204748N35331L15434K09586j041950l809967
10216A92381267o677788p891281p288505o182975n606015n404512n055630m569930
10208A43704631m220116l926720l436314k843381k454937k254214j931866j429053
10200A21208030j046929r40784q61459n65395j99636m9017r1085n9557J51264
10191A17545432L93458N32435N70253N05946L12829J00831N4300R0055j93704
$$ y = [124251896, 125880968, 127729941, 129663192, 131684611, 133953912, 136515203, 139222647, 142023620, 145131423, 148769867, 152866925, 157146842, 161416874, 165586824, 169497088, 172984488, 176162150, 179430281, 183070037, 186861605, 190132876, 192183239, 192800457, 192559387, 192540405, 193452742, 194968085, 196172833, 196708164, 197023598, 197233184, 196191234, 192381267, 185703479, 177812198, 170523693, 164340718, 158734703, 153330191, 148274561, 143704631, 139484515, 135557795, 132121481, 129278100, 126823163, 124568949, 122637083, 121208030, 120161101, 119220317, 118358858, 117793463, 117593827, 117544810, 117453725, 117394168, 117545432, 117938890, 118471325, 119041578, 119547524, 119860353, 119961184, 120015484, 120105539, 119911835]
10182A19911835j025265k068751k747649k860207k653995k387554k108385j843198
10174A02216831j682695j585747j369410j021232p80995p65245p54987n57060
10166I3699460l46737l83896n70134o07791m87621m70080o14458o80197n51009
10157H8987537m35411n19097o74870o79317n31226l95922l64830m08354m76970
10148H4501540n46863o25397p44598q65819q22124n31179k50657l67951q76009
10139G8870943j324698j400570j273788j211760j159117r66690p68048p74503
10131F9991769q74256q13901o65409p11442r12476r12734o24930l99453m73468
10122F3603700o17616n42699l54185l29683m61025n18192m46651m06484m51542
$$ y = [119911835, 118886570, 116817819, 114070170, 111209963, 108555968, 106168414, 104060029, 102216831, 100534136, 98948389, 97578979, 96557747, 95776752, 95011507, 94256520, 93699460, 93352723, 92968827, 92398693, 91790902, 91303281, 90833201, 90218743, 89538546, 88987537, 88552126, 88033029, 87358159, 86678842, 86147616, 85751694, 85386864, 84978510, 84501540, 83954677, 83329280, 82584682, 81718863, 80896739, 80365560, 80114903, 79746952, 78870943, 77546245, 76145675, 74871887, 73660127, 72501010, 71534320, 70766272, 69991769, 69117513, 68303612, 67638203, 66926761, 66014285, 65101551, 64476621, 64077168, 63603700, 62986084, 62443385, 62089200, 61759517, 61298492, 60780300, 60333649, 59927165, 59475623]
10113E9475623m33236k68803j08399j39624l30935m62204l81931j79838q7500
10104E7083153k10154l89355l83735j71493J6424j0520j73277k53928j79845q0322
10094E5246948q7803j76621k22426j69766r3822q9446j34375j21813l3776Q080
10084E4125180p5267j77819j56788n0736q513n2188p8437o6445r1672j33851q3891
10073E3149573K5904K3230j08728j71690q6921m3090j62994k70148j94510q5484
10063E2075142j58099l11189l02116j72037j69400l20782m07787l50323k92256
10054D9591153k92493k47799j69202k16461l69086l76824j75116n3110k18544
10045D7472518m55440m47289k34257r5880j31234k10570k38982k26129j67379
$$ y = [59475623, 59042387, 58773584, 58665185, 58525561, 58194626, 57732422, 57350491, 57170653, 57083153, 56872999, 56483644, 56099909, 55928416, 55944840, 55934320, 55761043, 55507115, 55327270, 55246948, 55159145, 54982524, 54760098, 54590332, 54496510, 54407064, 54272689, 54150876, 54117100, 54125180, 54049913, 53872094, 53715306, 53664570, 53656057, 53603869, 53525432, 53458987, 53367315, 53233464, 53149573, 53175477, 53198707, 53089979, 52918289, 52831368, 52788278, 52625284, 52355136, 52160626, 52075142, 51917043, 51605854, 51303738, 51131701, 50962301, 50641519, 50233732, 49883409, 49591153, 49298660, 49050861, 48881659, 48665198, 48296112, 47919288, 47744172, 47691062, 47472518, 47017078, 46569789, 46335532, 46239652, 46108418, 45897848, 45658866, 45432737, 45265358]
10036D5265358p8621q4150k47880l77621k42070M9240J46738m4419k39255k11370
10026D3935950r6137j21958k59787l29323k99930k76991k78754k31899j49175
10017D1891996j19899j29346p0727L8570L9494r6634j56463J6815K49691K54188
10007D1917685M6497p0686N1245K09834J80933M4771K3435J33676K03698J67171
9997D2908259J33481J73443K22348K25340K19042K25480K07898J80071K22134
9988D4717496L31866L93203L54559L06299L14417L16676K64581K25690K48451
9979D7473238K67871K52679K93613M15790M64980L47825K31469L00627M49765
9970E0497857M50454L17115K48890K86292L01440K82425L36979M26956L97746
$$ y = [45265358, 45186737, 45102587, 44854707, 44477086, 44235016, 44284256, 44430994, 44386575, 44147320, 43935950, 43839813, 43717855, 43458068, 43128745, 42828815, 42551824, 42273070, 42041171, 41891996, 41772097, 41642751, 41572024, 41610594, 41650088, 41553454, 41396991, 41413806, 41663497, 41917685, 41964182, 41893496, 41944741, 42154575, 42335508, 42380279, 42403714, 42537390, 42741088, 42908259, 43041740, 43215183, 43437531, 43662871, 43881913, 44107393, 44315291, 44495362, 44717496, 45049362, 45442565, 45797124, 46103423, 46417840, 46734516, 46999097, 47224787, 47473238, 47741109, 47993788, 48287401, 48703191, 49168171, 49515996, 49747465, 50048092, 50497857, 50948311, 51265426, 51514316, 51800608, 52102048, 52384473, 52721452, 53148408, 53546154]
9961E3546154K91032L25030N14463O20845N63841N60727P24170Q41507P47905
9952E8735674O27197O95300Q26929P74050N71718M48883M74216N52706O56406
9943F4363079Q03076R04490Q83404Q57533R77603J172051J276060J305931J367026
9934G3910253J415156J382779J412371J646658J906961J945343J914432K160744
9926H7694697K613520K873112K921964L202913L870371M527831M947535N495780
9918A18147723O482332P614716Q611608R904786J2002326J4316910J5360685J4233768
9910B06674854J1411496P930144M320988O86101k553498m586625n057047m696703
9902B14129710m738984n576778o268760n696714m024194k467257j647294r37948
$$ y = [53546154, 53837186, 54162216, 54676679, 55297524, 55861365, 56422092, 57146262, 57987769, 58735674, 59362871, 60058171, 60885100, 61659150, 62230868, 62679751, 63153967, 63706673, 64363079, 65166155, 66070645, 66954049, 67811582, 68789185, 69961236, 71237296, 72543227, 73910253, 75325409, 76708188, 78120559, 79767217, 81674178, 83619521, 85533953, 87694697, 90308217, 93181329, 96103293, 99306206, 103176577, 107704408, 112651943, 118147723, 124630055, 132244771, 140856379, 150761165, 162763491, 177080401, 192441086, 206674854, 218086350, 226016494, 230337482, 231023583, 228470085, 223883460, 218826413, 214129710, 209390726, 203813948, 197545188, 191848474, 187824280, 185357023, 183709729, 182771781]
9894A82771781K73480J593033K648392M253986P132260R705324Q858497L615887
9886B20852640l073158p172215p514645o055395m826165l944162k641536j004512
9878A84620852P4793K02893J5794L34946J183330J941352K386838L066142M172032
9869A97998972M403244J956086k972571p548845r011721p566296n719115n109467
9861A66430287n145149m768452m239997m473477n451069o219330o150096n491542
9853A24491175m778762m257501l900964l592608l217933k787753k470507k376988
9845I7108159k401082k380245k267211k048109j707884j395060j343264j466792
9837H2098512j364163r52231p15742r80137j317984j164797p11994n84099q24132
$$ y = [182771781, 183045261, 184638294, 187286686, 191540672, 198672932, 208378256, 217236753, 220852640, 217779482, 210607267, 203092622, 197037227, 192211062, 188266900, 185625364, 184620852, 184695645, 184898538, 184914332, 185249278, 186432608, 188373960, 190760798, 193826940, 197998972, 202402216, 204358302, 201385731, 193836886, 184825165, 177258869, 171539754, 166430287, 161285138, 156516686, 152276689, 147803212, 142352143, 136132813, 129982717, 124491175, 119712413, 115454912, 111553948, 107961340, 104743407, 101955654, 99485147, 97108159, 94707077, 92326832, 90059621, 88011512, 86303628, 84908568, 83565304, 82098512, 80734349, 79782118, 79066376, 78086239, 76768255, 75603458, 74891464, 74307365, 73483233]
9828G3483233q84014n83890l73816n10335o30903m20240j40001j31879k43003
9819F9565152j59550K7414K2990j35939j63651p488J22674J28229J07357J13742
9809F9620930J01769Q5683J31812K23972L13893M32886N77330N94497L98631J88705
9799G2670108J97982L22433K84770R6778K9111J36830J70543K5036o6048P4180
9789G3941723K66950K62798R5585n0573j41504k44638l23939l07579k68811l29137
9779G2900875m38039m40444l26304k35467k40255k95603l87461n47732p12415
9770F9277155p48975o67107o32794p12339p67988o94416n95321n95759o20235
9761F3242221n29352l80333l53373m58796n15955m31117l11120k60512k42042
$$ y = [73483233, 72599219, 72015329, 71641513, 71131178, 70500275, 70080035, 69940034, 69808155, 69565152, 69405602, 69433016, 69456006, 69320067, 69156416, 69148928, 69271602, 69399831, 69507188, 69620930, 69722699, 69808382, 69940194, 70164166, 70478059, 70910945, 71488275, 72082772, 72481403, 72670108, 72868090, 73190523, 73475293, 73572071, 73601182, 73738012, 73908555, 73933591, 73867543, 73941723, 74208673, 74471471, 74567056, 74516483, 74374979, 74130341, 73806402, 73498823, 73230012, 72900875, 72462836, 72022392, 71696088, 71460621, 71220366, 70924763, 70537302, 69989570, 69277155, 68528180, 67861073, 67228279, 66515940, 65747952, 65053536, 64458215, 63862456, 63242221, 62712869, 62332536, 61979163, 61520367, 61004412, 60573295, 60262175, 60001663, 59759621]
9752E9759621k12030k27121l01282k96991j10021J31380K10966J11807O543j663
9742E9071209L1635N2677R5373J71532K10983J69460R9600O3360M9679J8233m1187
9731E9992554j20811k06334k62699k66318k45808k27418j73058o3779N557n0683
9721E8381203j38802j17482o6205j88651m36088n05540l02843j23494k07488l78412
9711E5916198l57680k10634j84719k65501k28915o0456J2212q8475j60611m6532
9701E4324887J50916K56161K43501J99337K01319K82890M04631M52441L81019
9692E6897102L32533M65514P00180Q09665P40142O52084O64935P63258R33125
9683F2958538J161873J314378J265019J156581J246082J468630J473142J159478
$$ y = [59759621, 59547591, 59320470, 59019188, 58722197, 58612176, 58743556, 58954522, 59066329, 59072872, 59071209, 59102844, 59155521, 59250894, 59422426, 59633409, 59802869, 59902469, 59965829, 60015508, 60033741, 59992554, 59871743, 59665409, 59402710, 59136392, 58890584, 58663166, 58490108, 58426329, 58431886, 58381203, 58242401, 58124919, 58058714, 57870063, 57433975, 56928435, 56625592, 56502098, 56294610, 55916198, 55558518, 55347884, 55163165, 54897664, 54668749, 54608293, 54620505, 54532030, 54371419, 54324887, 54475803, 54731964, 54975465, 55174802, 55376121, 55659011, 56063642, 56516083, 56897102, 57229635, 57695149, 58395329, 59204994, 59945136, 60597220, 61262155, 62025413, 62958538, 64120411, 65434789, 66699808, 67856389, 69102471, 70571101, 72044243, 73203721]
9675G3203721Q33919P00655N53936J82689k48238m94245o33848q67291j129761
9666G2101537j230578j217281j277981j395834j410286j340321j350295j442673
9658F1436288j453637j326815j164705j046989r94042j035930j122295j077880
9650E2213995q65202p39626q74941j010598q22567m88130m43878o73310p33241
9641D5562502m88571k96239l59189m15873k69428j48175k63139m16418l66207
9632D2539263k36223k33514k64982j77137j01768j99107k98931j81224o311o0140
9622D0779926k41969k35169o4356l3723j79582k43421j79117k23326m05996m47130
9612C8526137k67242j71364l32686m82749l69871j92119k63816n03992n93109
$$ y = [73203721, 74037640, 74738295, 75292231, 75474920, 75226682, 74732437, 74098589, 73231298, 72101537, 70870959, 69653678, 68375697, 66979863, 65569577, 64229256, 62878961, 61436288, 59982651, 58655836, 57491131, 56444142, 55450100, 54414170, 53291875, 52213995, 51348793, 50609167, 49734226, 48723628, 47901061, 47412931, 46969053, 46295743, 45562502, 45073931, 44777692, 44418503, 44002630, 43733202, 43585027, 43321888, 42905470, 42539263, 42303040, 42069526, 41804544, 41627407, 41525639, 41326532, 41027601, 40846377, 40840066, 40779926, 40537957, 40302788, 40238432, 40204709, 40025127, 39781706, 39602589, 39379263, 38973267, 38526137, 38258895, 38087531, 37754845, 37272096, 36902225, 36710106, 36446290, 35942298, 35349189]
9603C5349189m73179l59963l50342l32410k61107k40851l00291l15402k24249
9594C2491395j41173j73714k55482k52309j54723q0765j20608k36261l12934k86266
9584C0477160k08083j75460k03472k11275j46766o7470n7590j14255j70126j90568
9574B8932095j87178j61517j04234m6387m9926j26600k01502j86037q3204K091
9564B7787601j7721r1010q2308K4495O5850o6019k09401j23594J33872K37873
9554B7659638N6984j44949j07281L7958L188j76622k00410O927J67289P5598j14983
9543B7263337j62947p6959j2265P433N9906J17347Q3573j816J306Q9370R1907
9532B7460192o5403k41659k99804k97892l49857m10301l47523j77708p3746j32828
$$ y = [35349189, 34876010, 34516047, 34165705, 33833295, 33572188, 33331337, 33031046, 32715644, 32491395, 32350222, 32176508, 31921026, 31668717, 31513994, 31433229, 31312621, 31076360, 30763426, 30477160, 30269077, 30093617, 29890145, 29678870, 29532104, 29464634, 29407044, 29292789, 29122663, 28932095, 28744917, 28583400, 28479166, 28432779, 28382853, 28256253, 28054751, 27868714, 27785510, 27787601, 27769880, 27678870, 27596562, 27621057, 27686907, 27620888, 27411487, 27287893, 27421765, 27659638, 27716622, 27571673, 27464392, 27502350, 27505538, 27328916, 27128506, 27135433, 27302722, 27378320, 27263337, 27100390, 27023431, 27011166, 27018599, 27078505, 27195852, 27279425, 27277609, 27278915, 27368285, 27460192, 27394789, 27153130, 26853326, 26555434, 26205577, 25795276, 25447753, 25270045, 25196299, 25063471]
9522B5063471k55289k92061k24446j45232j19883j27725j20998r5871r3682j38869
9512B3449415j85639j55673m6932L8132K4021j8852K9115J43733J73926O4964
9502B3516210n7248p3594k5112k701Q91J8965n067j13684j90738r6919Q6235J36518
9490B3193756J5004q6991n8006j1202l4372j4288J28065K15308O2857j66270j38196
9479B3105665J42010K89018Q6912j79555j21546K07470M02927K73587O1591O1352
9469B4329431K35050L37258K85788K30647K92574M04294M53162M52279M83200
9460B7503683N48391N84856N88110O16137O69381O63948N54134M02562K81853
9451C2413055J68879l080k27967m28232n54405o24197o65312o73145o40985n94407
$$ y = [25063471, 24808182, 24516121, 24291675, 24146443, 24026560, 23898835, 23777837, 23681966, 23588284, 23449415, 23263776, 23108103, 23061171, 23099303, 23123324, 23104472, 23133587, 23277320, 23451246, 23516210, 23458962, 23385368, 23360256, 23357555, 23358446, 23377411, 23372344, 23258660, 23067922, 22971003, 23057238, 23193756, 23208760, 23121769, 23063763, 23052561, 23018189, 23003901, 23131966, 23347274, 23410131, 23243861, 23105665, 23247675, 23536693, 23623605, 23444050, 23322504, 23529974, 23932901, 24206488, 24268079, 24329431, 24564481, 24901739, 25187527, 25418174, 25710748, 26115042, 26568204, 27020483, 27503683, 28052074, 28636930, 29225040, 29841177, 30510558, 31174506, 31728640, 32131202, 32413055, 32581934, 32578854, 32350887, 31922655, 31368250, 30744053, 30078741, 29405596, 28764611, 28170204]
9441B8170204n67790n57788n21810m30783l15781k42942k32667k28807j77740
9432B4894096j14836j19665j93257k47070k26760j75765j46076j21841q4372p8982
9422B3385472j36201j83974j39977n7807o8144j82324k71985k60239k13457k01471
9412B1669893j86689j27025p9804r7151j08487m1813P682r8220k76171k82931
9402B0379284p8416P7982m031j71125j85843r9372j29195k60591k58185p6976
9392A9193532K8847r7463k62048k22517m4422L9670j6245p1174o0106m9432p5098
9381A8363544j07645j49835k11475k24335j37019m5947o5695j25209q2342J6092
9371A7230134J1370p3295p1000J2677K785j08347j29536l1371j8811j42409j69456
$$ y = [28170204, 27602414, 27044626, 26522816, 26092033, 25776252, 25533310, 25300643, 25071836, 24894096, 24779260, 24659595, 24466338, 24219268, 23992508, 23816743, 23670667, 23548826, 23464454, 23385472, 23249271, 23065297, 22925320, 22867513, 22799369, 22617045, 22345060, 22084821, 21871364, 21669893, 21483204, 21356179, 21276375, 21179224, 21070737, 21028924, 21036606, 20938386, 20662215, 20379284, 20300868, 20378850, 20374819, 20203694, 20017851, 19918479, 19789284, 19528693, 19270508, 19193532, 19222379, 19124916, 18862868, 18640351, 18595929, 18635599, 18619354, 18548180, 18488074, 18438642, 18363544, 18255899, 18106064, 17894589, 17670254, 17533235, 17487288, 17421593, 17296384, 17214042, 17230134, 17241504, 17168209, 17097209, 17109886, 17112671, 17004324, 16874788, 16843417, 16824606, 16682197, 16512741]
9360A6512741r93J13744k838j36531n4827Q5039L0715j04075n0385J21968J25946
9349A6640504l4029q0808N1002J38922Q9309O6599J56921K30800K14567K07276
9339A7681063K46803K23375J07856K7694M2310O1528L8354K4307L732q9837j73114
9328A8194071r4066O2068M0170j68506k89830k09027j16793j26939j07142k0526
9318A7163480o0104k55356l14858j03487P2213n4996k65853k23789j9410K5204
9308A5963044j08256j71310q5345M012J7552p658p4164j75879j95393p8886J7353
9297A5105070k3604n6710N3947J47866M5181r7540m6918Q5016M8363r2899j14674
9286A5053098p0956j45051k15520n2488J68983P7496k33328l01509n2096J05744
$$ y = [16512741, 16511748, 16625492, 16622654, 16486123, 16431296, 16516335, 16547050, 16442975, 16392590, 16514558, 16640504, 16606475, 16525667, 16576669, 16715591, 16804900, 16871499, 17028420, 17259220, 17473787, 17681063, 17927866, 18151241, 18259097, 18286791, 18329101, 18390629, 18428983, 18453290, 18457022, 18367185, 18194071, 18100005, 18162073, 18202243, 18033737, 17743907, 17534880, 17418087, 17291148, 17184006, 17163480, 17103376, 16848020, 16533162, 16429675, 16501888, 16446892, 16181039, 15957250, 15937840, 15963044, 15854788, 15683478, 15598133, 15602145, 15619697, 15612039, 15537875, 15361996, 15166603, 15087717, 15105070, 15081466, 15024756, 15078703, 15226569, 15271750, 15174210, 15127292, 15212308, 15260671, 15167772, 15053098, 14982142, 14837091, 14621571, 14569083, 14738066, 14815562, 14582234, 14280725, 14228629, 14334373]
9276A4334373o994r4480K0055J03805L747p6660m986L6995m5463n9042O3006R1328
9264A4365684l5329m3883J32762J48384j24691k71632k2288K36289R3908j90851
9254A4288353j61952O1341O7773r6146p4851J09121J27073k3851m0363J00411
9244A4356909J13574n4872j52549q4734j2875L786N2136P7842l4114j32576J8879
9233A4151406K74869K70513K2056j03427o052N5212N613O2342K27411K11071j016
9222A5169998l0010K49085M40122K60115q318L878K04970K90137K22955J62942
9212A6965874J58476J75844K29211K81298K22959R9342J12528K74709L45759K41848
9202A9107848J78556K60724K89156J59686Q5943K04935L21251K80591K39173L13681
$$ y = [14334373, 14327379, 14232899, 14252954, 14356759, 14360506, 14283846, 14278860, 14315855, 14270392, 14211350, 14274356, 14365684, 14330355, 14286472, 14419234, 14567618, 14442927, 14171295, 14149007, 14385296, 14479204, 14288353, 14126401, 14187742, 14255515, 14159369, 14084518, 14193639, 14320712, 14296861, 14256498, 14356909, 14470483, 14415611, 14263062, 14178328, 14165453, 14169239, 14221375, 14299217, 14265103, 14132527, 14151406, 14426275, 14696788, 14718844, 14615417, 14609365, 14664577, 14670190, 14732532, 14959943, 15171014, 15169998, 15139988, 15389073, 15829195, 16089310, 16080992, 16084870, 16289840, 16579977, 16802932, 16965874, 17124350, 17300194, 17529405, 17810703, 18033662, 18133004, 18245532, 18520241, 18866000, 19107848, 19286404, 19547128, 19836284, 19995970, 20081913, 20286848, 20608099, 20888690, 21127863, 21441544]
9192B1441544L32077K02721J58047L37924N00268M48611L71219M48600N23813
9183B4764824M79831N08726O74693P03758N67097O86990J130056J291413R51842
9174C1759230Q52624J444379J946316J729349J731201K984593M489858M558959
9166E1496509L923031N007386P662999Q243392M435072j018232l479073k045209
9158G4225875J20464L06790j182381k793410l750398l746041k468376n00694M73284
9149F0685113n76060k708212m185067m371398l829532l145678k481758j951197
9141C7436211j669676j509236j297672j148805j212892j297136j143928q97075
9133B7259791q63603r71030r03549o61698n32380n59623m99356l11226k55813
$$ y = [21441544, 21773621, 21976342, 22134389, 22472313, 22972581, 23421192, 23792411, 24241011, 24764824, 25244655, 25753381, 26428074, 27131832, 27698929, 28385919, 29515975, 30807388, 31759230, 32611854, 34056233, 36002549, 37731898, 39463099, 42447692, 46937550, 51496509, 55419540, 60426926, 68089925, 76333317, 80768389, 79750157, 76271084, 74225875, 74346339, 74653129, 73470748, 70677338, 66926940, 63180899, 60712523, 60211829, 60685113, 60109053, 57400841, 53215774, 48844376, 45014844, 41869166, 39387408, 37436211, 35766535, 34257299, 32959627, 31810822, 30597930, 29300794, 28156866, 27259791, 26396188, 25425158, 24521609, 23859911, 23327531, 22767908, 22268552, 21957326, 21701513]
9124B1701513m13335n00597l25883j05785j29168l38325m50955l51066j79198
9115A8907201j14718j94221l01887k82668j15929K3907k5708j72677j88460n9489
9105A7475351j1859j40001k43981j55617j0374j3201j07422j01876j0281j4206
9095A6666533j38996k12124j50452o7863n5617n5554k0847k2385r8898j56098
9085A5687699j28602j08202j80652k49815j79000k6092K9869m6211j19791j13154
9075A4566049r2944j10013j06724m2284J5659J407m3713n5947n7625r3795j25662
9064A3854408q7256r886J2131l1635n1889k486N0103L7350o127j0204J0110j3025
9052A3751594o5798n2324M3484R6027J4809r7120q0176L4249O5538l2411j04535
$$ y = [21701513, 21288178, 20787581, 20461698, 20355913, 20226745, 19888420, 19437465, 19086399, 18907201, 18792483, 18598262, 18296375, 18013707, 17897778, 17921685, 17895977, 17723300, 17534840, 17475351, 17463492, 17323491, 17079510, 16923893, 16913519, 16900318, 16792896, 16691020, 16680739, 16666533, 16527537, 16315413, 16164961, 16097098, 16041481, 15985927, 15965080, 15942695, 15843797, 15687699, 15559097, 15450895, 15270243, 15020428, 14841428, 14815336, 14845205, 14798994, 14679203, 14566049, 14473105, 14363092, 14256368, 14214084, 14229743, 14231150, 14187437, 14131490, 14073865, 13980070, 13854408, 13767152, 13757266, 13769397, 13737762, 13685873, 13683387, 13733490, 13770840, 13764713, 13754509, 13764619, 13751594, 13685796, 13633472, 13676956, 13772983, 13787792, 13690672, 13610496, 13644745, 13710283, 13677872, 13573337]
9041A3573337n6960j303l8339p8630l0210J645r5665j95151j24212M018m6047
9030A2912483j99293j50593J05843K04833k0801k61393k14380k3854K0974n0178
9020A2323641l8649K3440k8312j35217j13913k4217q2285k43462k32889j5922
9010A1432215J10755j8525j99824k08492j08959n8772m2750J0071L3285n2350
9000A0896654j54288j37168m3408j5432o6987q9037l8892J8390L4527K3189q612
8989A0418936o7588j07281m7989J02107K06009J33536p0242k03948j36362K1995
8979A0249173N7434n0211j07361k1542M4567m4069j42867o5623P7417N1540r4923
8968I953535j12499P672K3940j09216j50663r789Q4804j1034j24262j03408o0355
$$ y = [13573337, 13516377, 13515074, 13476735, 13398105, 13367895, 13369540, 13273875, 13078724, 12954512, 12958530, 12912483, 12713190, 12562597, 12668440, 12873273, 12852472, 12591079, 12376699, 12352845, 12373819, 12323641, 12284992, 12308432, 12280120, 12144903, 12030990, 12006773, 11924488, 11681026, 11448137, 11432215, 11542970, 11524445, 11324621, 11116129, 11007170, 10948398, 10905648, 10915719, 10949004, 10896654, 10742366, 10605198, 10561790, 10546358, 10479371, 10390334, 10351442, 10369832, 10404359, 10427548, 10418936, 10351348, 10244067, 10196078, 10298185, 10504194, 10637730, 10567488, 10363540, 10227178, 10249173, 10306607, 10256396, 10149035, 10127493, 10172060, 10127991, 9985124, 9919501, 9996918, 10048458, 9953535, 9841036, 9848708, 9872648, 9763432, 9612769, 9602980, 9687784, 9676750, 9552488, 9449080, 9388725]
8957I388725p9146k0284J45263J48901j25682l31226j64194J08076N8444k03452
8947H925425k37374j0065J03396j6990j04554m7063m3701j46151j34612J9742
8937H308053L7241j50606k15002P176J90370N3184j66640j21649P5104Q3943q7087
8926H014087j51435m6716K2786k3264o1262n0018p9937j28333n3823J23579J89250
8915G754914N1194j14382j17389M302Q0741L4966o1625r4867k6377O5952P5020
8904G652449Q217k2354J3141J823j05809j71197q6135K2125p934q4683j4042J42079
8892G347680J35970n2388j61288o0414N5993M546r8703n7500P4589Q7941n5411
8881G221015j79908j52873l3344L9951M351r7458j73299j51728m1214O9659R3615
$$ y = [9388725, 9309579, 9289295, 9434558, 9583459, 9457777, 9126551, 8962357, 9070433, 9128877, 8925425, 8688051, 8677986, 8781382, 8764392, 8659838, 8612775, 8569074, 8422923, 8288311, 8308053, 8345294, 8194688, 7979686, 7986862, 8177232, 8230416, 8063776, 7942127, 8017231, 8101174, 8014087, 7862652, 7815936, 7838722, 7815458, 7754196, 7704178, 7624241, 7495908, 7442085, 7565664, 7754914, 7806108, 7691726, 7574337, 7578639, 7659380, 7694346, 7632721, 7537854, 7511477, 7577429, 7652449, 7660666, 7638312, 7651453, 7653276, 7547467, 7376270, 7290135, 7312260, 7304326, 7219643, 7205601, 7347680, 7483650, 7431262, 7269974, 7209560, 7265553, 7270099, 7171396, 7113896, 7188485, 7276426, 7221015, 7041107, 6888234, 6854890, 6894841, 6899192, 6801734, 6628435, 6476707, 6435493, 6505152, 6598767]
8870F598767K6850o0019j00094q5218n2174l0322j6956j1820m6211j25969j65232
8859E931602p3162P9306J05425k6596j13967k4085P1161m6975k67950k83261m9137
8848E302361J51599J32424K2426j5318l1111j14596j84356j31083k0658K3517
8838E135205K5624P3696J27585Q6782j8273p2772o8613q8443j31455j11840k0671
8827D936825N0427M9705J4873j2347k0301K159K8733k6647j72575k38509p8524
8816D533819J61978J92785k762j30793l1529Q5809l203j69439j41142N8641J51500
8805D705664L0771j11247j10519n2081p1178j19783p2682M8936J08165N1934m3076
8794D364904r5560q8107l0605M8477Q2405K6459o2077q3254l0572J3355R766m382
$$ y = [6598767, 6625617, 6565598, 6465504, 6380286, 6328112, 6297790, 6280834, 6269014, 6222803, 6096834, 5931602, 5858440, 5937746, 6043171, 6016575, 5902608, 5878523, 5949684, 5902709, 5634759, 5351498, 5302361, 5453960, 5586384, 5608810, 5593492, 5562381, 5447785, 5263429, 5132346, 5111688, 5135205, 5160829, 5234525, 5362110, 5448892, 5430619, 5357847, 5289234, 5200791, 5069336, 4957496, 4936825, 4987252, 5036957, 5051830, 5039483, 5019182, 5021341, 5050074, 5023427, 4850852, 4612343, 4533819, 4695797, 4888582, 4885820, 4755027, 4723498, 4809307, 4806104, 4636665, 4495523, 4554164, 4705664, 4736435, 4625188, 4514669, 4462588, 4391410, 4271627, 4198945, 4247881, 4356046, 4407980, 4364904, 4269344, 4181237, 4150632, 4199109, 4281514, 4307973, 4245896, 4162642, 4132070, 4145425, 4155191, 4150809]
8782D150809j7545o1327j07075p2161K5530N3412k4743o4956K3254J02244K1487
8771D028929j15239j02839K4397M3987q4644j53935n2960O4939N5313K868K5001
8760C735817M4914m7156j44114o1618J34205J69932m2931k52960j93390O4178
8750C406877K03223O7778j47834j63206J3814J04719l6054j97667j21860R6681
8740C226471J46110k0304j20925p001J10796L5844q9551n3541N5580K6393r0290
8729C219582q1407M0150O5552l2577o8181P126K9862n0398p1924K3139N9015n4523
8717C085416j35028l2667J03519O8872o9247j08169l7696m933m2724n1307q72
8706B775164L9233M2592L3441r359r5906j19083J4705J80625J61517k4912j38410
$$ y = [4150809, 4133264, 4071937, 3964862, 3892701, 3918231, 3971643, 3946900, 3881944, 3905198, 4007442, 4028929, 3913690, 3810851, 3835248, 3879235, 3794591, 3640656, 3587696, 3652635, 3707948, 3710816, 3735817, 3780731, 3733575, 3589461, 3527843, 3662048, 3831980, 3789049, 3536089, 3342699, 3406877, 3610100, 3677878, 3530044, 3366838, 3380652, 3485371, 3449317, 3251650, 3129790, 3226471, 3372581, 3352277, 3231352, 3224351, 3335147, 3370991, 3281440, 3227899, 3283479, 3309872, 3219582, 3138175, 3178325, 3243877, 3211300, 3143119, 3150245, 3180107, 3129709, 3057785, 3080924, 3139939, 3085416, 2950388, 2917721, 3021240, 3090112, 3020865, 2912696, 2875000, 2870067, 2827343, 2776036, 2775164, 2814397, 2856989, 2890430, 2881071, 2785165, 2666082, 2680787, 2861412, 3022929, 2998017, 2859607]
8695B859607q4010l3827r4700r7914R6320K81065J61775j58467k62721j6797K18818
8684B869149J15494j42316j54382Q2334J89219K131j94305j27508O9506J15045
8674B824367m657j12355j56656j87218j45098L1194J76920Q5916j24854j57147
8664B230412j2576K7245q4134p5955J09574J49822q5845k29189l831K57951J18865
8653B402339k32011k58101P9337K89588J31944q7555p8776K9207J3913p9605j09298
8642B100982q8737p1080l842J19075J52722K2664j12484q4035L9970Q0873J654
8631B157762j01592j52972j24226j0661J18084J41211M3384n3785p3766o8540
8621A874899o9432k1175O3464O7597j7375l7478N4005Q3755m0320j36458m7351
$$ y = [2859607, 2775597, 2741770, 2647070, 2549156, 2645476, 2926541, 3088316, 2929849, 2667128, 2650331, 2869149, 2984643, 2842327, 2687945, 2770279, 2959498, 2961629, 2767324, 2639816, 2709322, 2824367, 2819710, 2707355, 2550699, 2363481, 2218383, 2249577, 2426497, 2512413, 2387559, 2230412, 2217836, 2245081, 2160947, 2084992, 2194566, 2344388, 2258543, 2029354, 2025523, 2283474, 2402339, 2170328, 1912227, 1991564, 2281152, 2413096, 2325541, 2246765, 2275972, 2289885, 2210280, 2100982, 2012245, 1941165, 1937323, 2056398, 2209120, 2231784, 2119300, 2035265, 2075235, 2156108, 2157762, 2056170, 1903198, 1778972, 1768311, 1886395, 2027606, 2070990, 2017205, 1943439, 1874899, 1805467, 1784292, 1847756, 1915353, 1897978, 1860500, 1914505, 1998260, 1957940, 1821482, 1774131]
8610A774131P9690M1868p5234o4591M5267P9287L6167L0478K2461q5865j71558
8599A712101m3799J73664J68693n5458j67193l7431Q8240M1310j6356N2395R8754
8588B014920k683q8845r764O7031n1779k03017j08749J43385K09843J6570j58625
8577A828287j29859k3447K216j0501K7206O9935M1541j9550l3417j282L1170N0612
8565A832911M7753m722p8838p8406K4458J13134P3486m0377q2490j9147M5408
8554A833170L4614j3285m0977n7343p9021o8065k684M8891K0078k5477K4983J31328
8542A806212J24160k7142j25298l0052J07158O1282j11099j51019p1J12184K7317
8531A793632j14810j13113N647P3172L4112k3993k0907M3960J11343Q8691n9005
$$ y = [1774131, 1853821, 1895689, 1820455, 1755864, 1801131, 1880418, 1916585, 1947063, 1969524, 1883659, 1712101, 1668302, 1841966, 2010659, 1955201, 1788008, 1750577, 1838817, 1880127, 1863771, 1916166, 2014920, 2012237, 1923392, 1913628, 1980659, 1928880, 1725863, 1617114, 1760499, 1970342, 1986912, 1828287, 1698428, 1674981, 1677197, 1666696, 1693902, 1763837, 1805378, 1785828, 1752411, 1751129, 1782299, 1832911, 1880664, 1875942, 1797104, 1718698, 1743156, 1856290, 1929776, 1889399, 1806909, 1787762, 1833170, 1867784, 1854499, 1813522, 1756179, 1677158, 1609093, 1606409, 1655300, 1675378, 1649901, 1674884, 1806212, 1930372, 1903230, 1777932, 1747880, 1855038, 1916320, 1805221, 1654202, 1654131, 1766315, 1793632, 1678822, 1565709, 1571356, 1644528, 1678640, 1654647, 1633740, 1677700, 1789043, 1877734, 1818729]
8520A818729j97024j30436J04843K25608Q6732r9445r0170K8096L1277n5976n1544
8509A670690J9645k1997j42445j17327O4212J51967M9147m9289k3985q578o4521
8498A527519j4991J90749K64954J5548k70374k13334Q0878J96190L6659j01457
8488A712341m6329L8572K962o3772n2788j1478J2113P0203J49935J20643l2889
8477A899513j23307m2468N4232k9j15372j11649j5890J2403l8147l8538L3513
8466A514261N8475n760m5047K7012J37076J58535O2982p4010j52658j13481J4379
8455A581764J13506Q6396k6114r2872o1452q352q284l3164j9522K8719N9647N6045
8443A676317M3803L5415J3634k5699m8236j7376N1544R0909N0595l4308p1476
$$ y = [1818729, 1621705, 1491269, 1596112, 1821720, 1908452, 1809007, 1718837, 1746933, 1778210, 1722234, 1670690, 1690335, 1668338, 1525893, 1408566, 1472778, 1624745, 1673892, 1624603, 1600618, 1592040, 1527519, 1512528, 1703277, 1968231, 1983779, 1713405, 1500071, 1580949, 1777139, 1813798, 1712341, 1666012, 1704584, 1707546, 1643774, 1590986, 1579508, 1591621, 1661824, 1811759, 1932402, 1899513, 1776206, 1733738, 1787970, 1787941, 1672569, 1560920, 1545030, 1557433, 1519286, 1480748, 1514261, 1572736, 1566976, 1521929, 1548941, 1686017, 1844552, 1907534, 1833524, 1680866, 1567385, 1581764, 1695270, 1781666, 1755552, 1662680, 1601228, 1592876, 1584592, 1551428, 1531906, 1560625, 1620272, 1676317, 1720120, 1755535, 1769169, 1743470, 1695234, 1677858, 1729402, 1820311, 1870906, 1836598, 1765122]
8432A765122k1489M6906M2911k3819n3058J0304R6004R3384o220r2157o7455L2337
8420A822770Q6376M1032l7991p8360r5219j17161q9595L7490J63657J29720l0128
8409A832591r2525K9328J28974R203j96109j97125K6991J98003J37461j2203l6336
8398A828253M8417O1447o0784j76878j26052O6248J95569J01947j19736k01343
8388A617088m0202J41934R6570q8065j17009N9071J70811N3161j12511j05410
8378A675438O345L0082k6096j4682O5352P1860k4993q8044k2935J03165J65109
8367A940601J00570n7018j80072j32343M9310J37073L531j63290j11566R1439
8357A678235J55608J0033j06490k4984J26555J55810O3018l4967p5320n1272J9145
$$ y = [1765122, 1743633, 1790539, 1833450, 1809631, 1756573, 1766877, 1862881, 1956265, 1950045, 1857888, 1790433, 1822770, 1909146, 1950178, 1912187, 1833827, 1738608, 1621447, 1531852, 1569342, 1732999, 1862719, 1832591, 1740066, 1769394, 1898368, 1907571, 1711462, 1514337, 1541328, 1739331, 1876792, 1864589, 1828253, 1876670, 1938117, 1877333, 1700455, 1574403, 1640651, 1836220, 1938167, 1818431, 1617088, 1576886, 1718820, 1815390, 1727325, 1610316, 1669387, 1840198, 1893359, 1780848, 1675438, 1681783, 1711865, 1685769, 1671087, 1736439, 1808299, 1783306, 1695262, 1672327, 1775492, 1940601, 2041171, 1984153, 1804081, 1671738, 1721048, 1858121, 1861652, 1698362, 1586796, 1678235, 1833843, 1843876, 1737386, 1712402, 1838957, 1994767, 2057785, 2022818, 1947498, 1896226, 1915371]
8346A915371N5695j7473j20552r2207M4982R0410m423m7007N1309J00519k7228
8335A949396j34288j6704J63810J20738r3301j80543o9126K9961O032k1601K1559
8324A775933M4389M701J26O6723R4496K2271o2830q6382p9666o1794j399O0101
8312A776669L0881m1470l453J27380J42709j7208j40290p8110K9345J9673k7211
8301A818915J3843N6613k0543j07648l1119J30119J57735M0533m6606m8599n8757
8290A904486q1215k7243O0256L8149o3959n8009P3943J23213L357r5399k0022
$$ y = [1915371, 1971066, 1953593, 1833041, 1740834, 1785816, 1876226, 1871803, 1824796, 1876105, 1976624, 1949396, 1815108, 1798404, 1962214, 2082952, 1989651, 1809108, 1739982, 1769943, 1775975, 1754374, 1775933, 1820322, 1825023, 1825149, 1891872, 1986368, 2008639, 1945809, 1859427, 1779761, 1717967, 1716568, 1776669, 1807550, 1766080, 1762627, 1890007, 2032716, 2015508, 1875218, 1797108, 1826453, 1846126, 1818915, 1832758, 1889371, 1868828, 1761180, 1730061, 1860180, 2017915, 2058448, 2011842, 1963243, 1904486, 1823271, 1796028, 1856284, 1894433, 1830474, 1772465, 1846408, 1969621, 1972978, 1877579, 1857557]
$$ [...]
##END NTUPLES=NMR SPECTRUM
##END=
