##TITLE=1H ikalashn
CG-1213-A3
14.10.2024
##JCAMPDX= 6.0         $$ Bruker NMR JCAMP-DX V2.0
##DATA TYPE= NMR SPECTRUM
##DATA CLASS= NTUPLES
##ORIGIN= UXNMR, Bruker Analytische Messtechnik GmbH
##OWNER= root
$$ TOPSPIN		Version 1.3
$$ 2024-10-14 11:14:17.984 +0400  Irina@DPX200
$$ Compression mode = diff/dup
##.OBSERVE FREQUENCY= 200.131392401
##.OBSERVE NUCLEUS= ^1H
##.ACQUISITION MODE= SIMULTANEOUS
##.ACQUISITION SCHEME= undefined
##.AVERAGES= 16
##.DIGITISER RES= 18
##SPECTROMETER/DATA SYSTEM= spect
##.PULSE SEQUENCE= zg
##.SOLVENT NAME= CDCl3
##.SHIFT REFERENCE= INTERNAL, CDCl3, 1, 17.95386
##AUDIT TRAIL= $$ (NUMBER, WHEN, WHO, WHERE, WHAT)
$$ ##TITLE= Audit trail, TOPSPIN		Version 1.3
$$ ##JCAMPDX= 5.01
$$ ##ORIGIN= Bruker BioSpin GmbH
$$ ##OWNER= Irina
$$ $$ F:/spectra/data/iren/nmr/1H/4/pdata/1/auditp.txt
$$ ##AUDIT TRAIL=  $$ (NUMBER, WHEN, WHO, WHERE, VERSION, WHAT)
(   1,<2024-10-14 11:13:46.046 +0400>,<Irina>,<DPX200>,<TOPSPIN 1.3>,
      <created by zg
	started at 2024-10-14 11:12:37.906 +0400,
	POWCHK disabled, PULCHK disabled
       configuration hash MD5:
       BE 6D 3F 07 2A EA 11 49 91 17 2B D3 AF B3 58 0D
       data hash MD5: 16K
       CA DF 12 03 41 5E 24 A9 61 13 4D 3F 2F B1 EC 76>)
(   2,<2024-10-14 11:13:47.718 +0400>,<Irina>,<DPX200>,<TOPSPIN 1.3>,
      <Start of raw data processing
       efp BC_mod = 2 LB = 0.05 FT_mod = 6 PKNL = 1 PHC0 = 297.5983 PHC1 = 48.1313 SI = 32K 
       data hash MD5: 32K
       E6 CE 33 88 CF 5D 7A BE C0 72 2C 22 C2 48 44 67>)
(   3,<2024-10-14 11:13:50.093 +0400>,<Irina>,<DPX200>,<TOPSPIN 1.3>,
      <apk 
       data hash MD5: 32K
       22 3B 51 CF 22 28 BD 27 50 C4 87 1F 49 D9 27 79>)
(   4,<2024-10-14 11:14:05.609 +0400>,<Irina>,<DPX200>,<TOPSPIN 1.3>,
      <pk fgphup PHC0 = 5.131934 PHC1 = -6 
       data hash MD5: 32K
       09 21 55 9D 55 1D A6 2E C3 5A F6 B2 21 80 71 C5>)
(   5,<2024-10-14 11:14:07.718 +0400>,<Irina>,<DPX200>,<TOPSPIN 1.3>,
      <abs n ABSG = 5 
       data hash MD5: 32K
       BC 12 41 F0 6C 18 D4 05 E1 F8 EE 1A F6 06 23 76>)
$$ ##END=
$$ 
$$ $$ hash MD5
$$ $$ A4 D2 3B FF 9E 30 EA 2C D5 2C 9D 2C 50 EB FE CA
##$RELAX= 
##$RELAX= 
##$RELAX= 
##$RELAX= 
##$RELAX= 
##$RELAX= 
##$RELAX= 
##$RELAX= 
##$RELAX= 
$$ Bruker specific parameters
$$ --------------------------
##$DU= <F:/spectra>
##$EXPNO= 4
##$NAME= <1H>
##$PROCNO= 1
##$TYPE= <nmr>
##$USER= <iren>
##$AMP= (0..31)
100 100 100 100 100 100 100 100 100 100 100 100 100 100 100 100 100 100 
100 100 100 100 100 100 100 100 100 100 100 100 100 100 
##$ANAVPT= -1
##$AQSEQ= 0
##$AQ_mod= 1
##$AUNM= <au_zg>
##$AUTOPOS= <>
##$BF1= 200.13
##$BF2= 200.13
##$BF3= 200.13
##$BF4= 200.13
##$BF5= 200.13
##$BF6= 200.13
##$BF7= 200.13
##$BF8= 200.13
##$BYTORDA= 1
##$CFDGTYP= 0
##$CFRGTYP= 5
##$CHEMSTR= <none>
##$CNST= (0..63)
1 1 145 1 1 1 1 1 1 1 1 1 1 1 1 1 1 1 1 1 1 1 1 1 1 1 1 1 1 1 1 1 1 1 
1 1 1 1 1 1 1 1 1 1 1 1 1 1 1 1 1 1 1 1 1 1 1 1 1 1 1 1 1 1 
##$CPDPRG= <>
##$CPDPRG1= <>
##$CPDPRG2= <>
##$CPDPRG3= <>
$$ [...]
##$SW_h= 4401.40845070422
##$TD= 16384
##$TD0= 1
##$TE= 300
##$TE2= 300
##$TE3= 300
##$TEG= 300
##$TL= (0..7)
0 120 120 120 120 120 120 120 
##$TP= (0..7)
150 150 150 150 150 150 150 150 
##$TP07= 0
##$TPNAME0= <>
##$TPNAME1= <>
##$TPNAME2= <>
##$TPNAME3= <>
##$TPNAME4= <>
##$TPNAME5= <>
##$TPNAME6= <>
##$TPNAME7= <>
##$TPOAL= (0..7)
0.5 0.5 0.5 0.5 0.5 0.5 0.5 0.5 
##$TPOFFS= (0..7)
0 0 0 0 0 0 0 0 
##$TUNHIN= 0
##$TUNHOUT= 0
##$TUNXOUT= 0
##$USERA1= <user>
##$USERA2= <user>
##$USERA3= <user>
##$USERA4= <user>
##$USERA5= <user>
##$V9= 5
##$VALIST= <valist>
##$VCLIST= <CCCCCCCCCCCCCCC>
##$VD= 0
##$VDLIST= <DDDDDDDDDDDDDDD>
##$VPLIST= <PPPPPPPPPPPPPPP>
##$VTLIST= <TTTTTTTTTTTTTTT>
##$WBST= 1024
##$WBSW= 25
##$XGAIN= (0..3)
0 0 0 0 
##$XL= 0
##$YL= 0
##$YMAX_a= 368532
##$YMIN_a= -608836
##$ZGOPTNS= <>
##$ZL1= 120
##$ZL2= 120
##$ZL3= 120
##$ZL4= 120
##$ABSF1= 17.95386
##$ABSF2= -4.038887
##$ABSG= 5
##$ABSL= 3
##$ALPHA= 0
##$AQORDER= 0
##$ASSFAC= 0
##$ASSFACI= 0
##$ASSFACX= 0
##$ASSWID= 0
##$AUNMP= <proc_1d>
##$AXLEFT= 0
##$AXRIGHT= 0
##$AXTYPE= 0
##$AXUNIT= <>
##$AZFE= 0.1
##$AZFW= 0.1
##$BCFW= 0
##$BC_mod= 2
##$BYTORDP= 0
##$COROFFS= 0
##$CY= 7568.61572265625
##$DATMOD= 1
##$DC= 0
##$DFILT= <>
##$DTYPP= 0
##$F1P= 17.9538593292236
##$F2P= -4.03888763876832
##$FCOR= 0.5
##$FTSIZE= 32768
##$FT_mod= 6
##$GAMMA= 0
##$GB= 0
##$INTBC= 0
##$INTSCL= 1.483618e-010
##$ISEN= 128
##$LB= 0.05
##$LEV0= 0
##$LPBIN= 0
##$MAXI= 945.577
##$MC2= 0
##$MEAN= 0
##$ME_mod= 0
##$MI= -402.1523
##$NCOEF= 0
##$NC_proc= -7
##$NLEV= 6
##$NOISF1= 8.587773
##$NOISF2= 6.764455
##$NSP= 0
##$NTH_PI= 0
##$NZP= 0
##$OFFSET= 17.95386
##$PC= 1
##$PHC0= 324.8383
##$PHC1= 8.73467
##$PH_mod= 1
##$PKNL= yes
##$PPARMOD= 0
##$PPDIAG= 0
##$PPIPTYP= 0
##$PPMPNUM= 100
##$PPRESOL= 1
##$PSCAL= 0
##$PSIGN= 0
##$REVERSE= no
##$SF= 200.13
##$SI= 32768
##$SIGF1= 16.12182
##$SIGF2= -4.496377
##$SINO= 3.521527
##$SIOLD= 32768
##$SREGLST= <1H.CDCl3>
##$SSB= 0
##$STSI= 32768
##$STSR= 0
##$SW_p= 4401.40845070423
##$SYMM= 0
##$S_DEV= 0
##$TDeff= 16384
##$TDoff= 0
##$TI= <>
##$TILT= no
##$TM1= 0
##$TM2= 0
##$TOPLEV= 0
##$USERP1= <user>
##$USERP2= <user>
##$USERP3= <user>
##$USERP4= <user>
##$USERP5= <user>
##$WDW= 1
##$XDIM= 32768
##$YMAX_p= 482302961
##$YMIN_p= -919800
$$ End of Bruker specific parameters
$$ ---------------------------------
##NTUPLES= NMR SPECTRUM
##VAR_NAME=  FREQUENCY,     SPECTRUM/REAL,   SPECTRUM/IMAG
##SYMBOL=    X,             R,               I
##VAR_TYPE=  INDEPENDENT,   DEPENDENT,       DEPENDENT
##VAR_FORM=  AFFN,          ASDF,            ASDF
##VAR_DIM=   32768,         32768,           32768
##UNITS=     HZ,            ARBITRARY UNITS, ARBITRARY UNITS
##FACTOR=    0.134324425510551, 1,           1
##FIRST=     4401.40845070423, 100477,       -2347628
##LAST=      0,             391078,          -2611873
##MIN=       0,             -919800,         0
##MAX=       4401.40845070423, 482302961,    0
$$ Real data points
##PAGE= N=1
##DATA TABLE= (X++(R..R)), XYDATA
$$ [...]
$$ plain form
12194 26187492 25886723 25690127 25646893 25514881 25134323 24734563 24607474 24658806 24592378 24403078
12184 24403078 24328973 24372708 24256898 23904682 23608776 23588324 23672088 23602246 23411658 23280858
12174 23280858 23204969 23057291 22878278 22837378 22922008 22893488 22609089 22227116 22008318 22010199
12164 22010199 22058784 21972606 21744882 21514814 21405170 21408677 21427768 21398306 21339980 21293530 21262418
12153 21262418 21231853 21190385 21107449 20952217 20773680 20686603 20707427 20677174 20459105 20168549
12143 20168549 20062533 20194576 20331295 20275078 20128783 20113388 20219772 20221145 20014242 19758399
12133 19758399 19613737 19515094 19344803 19196338 19248090 19418038 19398550 19103487 18846838 18915412
12123 18915412 19145188 19150007 18858954 18555326 18416881 18316117 18140440 18024381 18100036 18233953
$$ packed form
12194B6187492l00769j96596m3234j32012l80558l99760j27089N1332o6428j89300
12184B4403078p4105M3735j15810l52216k95906k0452Q3764o9842j90588j30800
12174B3280858p5889j47678j79013m0900Q4630k8520k84399l81973k18798J881
12164B2010199M8585q6178k27724k30068j09644L507J9091k9462n8326m6450l1112
12153B1262418l0565m1468q2936j55232j78537q7077K0824l0253k18069k90556
12143B0168549j06016J32043J36719n6217j46295j5395J06384J373k06903k55843
12133A9758399j44662r8643j70291j48465N1752J69948j9488k95063k56649O8574
12123A8915412K29776M819k91053l03628j38445j00764j75677j16059P5655J33917
$$ plain form
12113 18233953 18224538 18115716 18088051 18130490 18061537 17850560 17688111 17699116 17770657 17733314 17579927
12102 17579927 17435842 17408710 17518606 17693256 17792438 17714357 17513093 17347253 17299026 17312895
12092 17312895 17307221 17253162 17147664 17019925 16966170 17047928 17143269 17049971 16770592 16528691
12082 16528691 16443334 16376760 16213047 16090992 16175891 16348980 16352816 16165803 16002434 15972272
12072 15972272 15962654 15871783 15746088 15631635 15474924 15258901 15090783 15054510 15084469 15077208
12062 15077208 15034706 15005610 14968530 14877960 14769463 14718354 14725487 14727654 14696179 14650577 14598558
12051 14598558 14538347 14502526 14519503 14538162 14475622 14351024 14284388 14326050 14372575 14325905 14269536
12040 14269536 14366805 14594177 14713981 14575922 14331083 14228508 14279008 14289337 14205437 14208644
$$ packed form
12113A8233953r415j08822k7665M2439o8953k10977j62449J1005P1541l7343j53387
12102A7579927j44085k7132J09896J74650R9182p8081k01264j65840m8227J3869
12092A7312895n674n4059j05498j27739n3755Q1758R5341r3298k79379k41901
12082A6528691q5357o6574j63713j22055Q4899J73089L836j87013j63369l0162
12072A5972272r618r0871j25695j14453j56711k16023j68118l6273K9959p261
12062A5077208m2502k9096l7080r0570j08497n1109P133K167l1475m5602n2019
12051A4598558o0211l5821J6977J8659o2540j24598o6636M1662M6525m6670n6369
12040A4269536R7269K27372J19804j38059k44839j02575N0500J0329q3900L207
$$ plain form
12030 14208644 14398507 14584088 14560172 14449783 14540207 14828948 14983821 14806420 14521456 14476386
12020 14476386 14691534 14867800 14784688 14540406 14378771 14382104 14407627 14306235 14130250 14061094
12010 14061094 14148685 14226337 14138980 13956774 13851927 13840602 13801514 13709470 13664691 13684557 13663644
11999 13663644 13591883 13613715 13771395 13874241 13766640 13573065 13506159 13554709 13559404 13515046
11989 13515046 13577991 13790625 13996095 14056052 14001806 13933219 13891394 13871915 13868408 13867449 13865316
11978 13865316 13895227 13978330 14071643 14134627 14195509 14252182 14179359 13892890 13561479 13456673
11968 13456673 13588171 13695250 13640186 13585774 13680928 13787357 13699465 13487651 13412715 13568030
11958 13568030 13793347 13914399 13906869 13835599 13781044 13828383 13985478 14094213 13971630 13687513
$$ packed form
12030A4208644J89863J85581k3916j10389R0424K88741J54873j77401k84964m5070
12020A4476386K15148J76266q3112k44282j61635L333K5523j01392j75985o9156
12010A4061094Q7591P7652q7357j82206j04847j1325l9088r2044m4779J9866k0913
11999A3663644p1761K1832J57680J02846j07601j93575o6906M8550M695m4358
11989A3515046O2945K12634K05470N9957n4246o8587m1825j9479l507r59k133
11978A3865316K9911Q3103R3313O2984O0882N6673p2823k86469l31411j04806
11968A3456673J31498J07079n5064n4412R5154J06429q7892k11814p4936J55315
11958A3568030K25317J21052p530p1270n4555M7339J57095J08735j22583k84117
$$ plain form
11948 13687513 13553669 13739676 14022799 14070523 13901637 13870827 14169910 14537555 14595353 14344809
11938 14344809 14135632 14182726 14339169 14399610 14404834 14489491 14594519 14557737 14414450 14371253
11928 14371253 14486659 14598960 14608354 14621515 14739631 14891850 14983491 15042582 15100479 15088844
11918 15088844 15004088 15025926 15282498 15603546 15714383 15611668 15536681 15608141 15704264 15727290
11908 15727290 15766802 15917659 16104229 16197453 16195784 16183445 16182423 16142679 16040980 15919728 15848333
11897 15848333 15878528 16001029 16124303 16148912 16088823 16057335 16101182 16126184 16049115 15951946 15987038
11886 15987038 16160435 16315830 16345369 16321780 16373614 16501383 16599445 16631443 16683958 16813741
11876 16813741 16920917 16855469 16628314 16439031 16476565 16738370 17059635 17280590 17371358 17427280
$$ packed form
11948A3687513j33844J86007K83123M7724j68886l0810K99083L67645N7798k50544
11938A4344809k09177M7094J56443O0441N224Q4657J05028l6782j43287m3197
11928A4371253J15406J12301R394J3161J18116J52219R1641N9091N7897j1635
11918A5088844q4756K1838K56572L21048J10837j02715p4987P1460R6123K3026
11908A5727290L9512J50857J86570R3224j669j2339j022l9744j01699j21252p1395
11897A5848333L0195J22501J23274K4609o0089l1488M3847K5002p7069r7169L5092
11886A5987038J73397J55395K9539k3589N1834J27769R8062L1998N2515J29783
11876A6813741J07176o5448k27155j89283L7534K61805L21265K20955R0768N5922
$$ plain form
11866 17427280 17555843 17751708 17901207 17942428 17974713 18130507 18375560 18551448 18603345 18627958
11856 18627958 18684763 18720584 18729244 18815053 19006817 19167840 19207427 19233379 19359402 19505990
11846 19505990 19550106 19533098 19542060 19526801 19445874 19452602 19671615 19903818 19862398 19631494 19548370
11835 19548370 19656093 19657414 19463496 19385959 19628966 19951463 20058041 20021646 20056426 20131489
11825 20131489 20120182 20141610 20414454 20866741 21200559 21310902 21377248 21547511 21765911 21937918
11815 21937918 22075131 22235646 22450652 22726557 23027804 23283570 23493812 23758924 24110839
11806 24110839 24428180 24651269 24937961 25407796 25870817 26085236 26195352 26581757 27279688
11797 27279688 27893602 28182162 28406129 28911528 29618125 30164889 30414450 30565921 30824515
$$ packed form
11866A7427280J28563J95865J49499M1221L2285J55794K45053J75888N1897K4613
11856A8627958N6805L5821Q660Q5809J91764J61023L9587K5952J26023J46588
11846A9505990M4116j7008Q962j5259q0927O728K19013K32203m1420k30904q3124
11835A9548370J07723J321j93918p7537K43007L22497J06578l6395L4780P5063
11825B0131489j1307K1428K72844M52287L33818J10343O6346J70263K18400J72007
11815B1937918J37213J60515K15006K75905L01247K55766K10242K65112L51915
11806B4110839L17341K23089K86692M69835M63021K14419J10116L86405O97931
11797B7279688O13914K88560K23967N05399P06597N46764K49561J51471K58594
$$ plain form
11788 30824515 31175250 31497114 31739117 31926862 32094223 32278632 32534905 32875515 33194700
11779 33194700 33329867 33259008 33182734 33307178 33577300 33774570 33876180 34103057 34534674 34920526
11769 34920526 35054956 35123864 35423520 35903517 36296719 36582610 36962823 37426098 37727301
11760 37727301 37842396 38073358 38585616 39165732 39587038 39925783 40338337 40777505 41128232
11751 41128232 41430834 41794865 42251278 42810462 43480586 44131473 44577103 44909426 45477680
11742 45477680 46387523 47321834 48049458 48780716 49760401 50853556 51880174 53025870 54464213
11733 54464213 55836258 56647719 57033324 57561682 58342795 58921999 59111866 59336939 59958668
11724 59958668 60764800 61398229 61880384 62415878 63028081 63705596 64617347 65837299 67070073
$$ packed form
11788C0824515L50735L21864K42003J87745J67361J84409K56273L40610L19185
11779C3194700J35167p0859p6274J24444K70122J97270J01610K26877M31617L85852
11769C4920526J34430O8908K99656M79997L93202K85891L80213M63275L01203
11760C7727301J15095K30962N12258N80116M21306L38745M12554M39168L50727
11751D1128232L02602L64031M56413N59184O70124O50887M45630L32323N68254
11742D5477680R09843R34311P27624P31258R79685J093155J026618J145696J438343
11733E4464213J372045Q11461L85605N28358P81113N79204J89867K25073O21729
11724E9958668Q06132O33429M82155N35494O12203O77515R11751J219952J232774
$$ plain form
11715 67070073 67989439 68702297 69567221 70667095 71761114 72684896 73516657 74387597 75388982
11706 75388982 76656754 78307748 80264187 82328767 84453714 86771703 89353978 92110207
11698 92110207 94955520 97914398 101004280 104142549 107221410 110167183 112873382 115171036
11690 115171036 116929895 118128256 118783352 118889077 118493781 117794241 117055610 116399177 115699626
11681 115699626 114739569 113481348 112156375 111060914 110302765 109800245 109482420 109384547 109556323
11672 109556323 110007684 110786516 111984712 113580900 115365511 117120003 118818204 120571283
11664 120571283 122429265 124332089 126229324 128160047 130216933 132500380 135127464 138250351
11656 138250351 142022631 146487818 151445392 156451093 161020996 164829409 167659792 169247995
$$ packed form
11715F7070073R19366P12858Q64924J099874J094019R23782Q31761Q70940J001385
11706G5388982J267772J650994J956439K064580K124947K317989K582275K756229
11698I2110207K845313K958878L089882L138269L078861K945773K706199K297654
11690A15171036J758859J198361O55096J05725l95296o99540p38631o56433o99551
11681A15699626r60057j258221j324973j095461p58149n02520l17825r7873J71776
11672A09556323M51361P78832J198196J596188J784611J754492J698201J753079
11664A20571283J857982J902824J897235J930723K056886K283447K627084L122887
11656A38250351L772280M465187M957574N005701M569903L808413K830383J588203
$$ plain form
11648 169247995 169351777 167994104 165491286 162207782 158408966 154345258 150271901 146314279
11640 146314279 142487924 138908758 135777506 133082825 130573613 128162817 126097940 124540271
11632 124540271 123248043 121954081 120815299 120128574 119773159 119348253 118784737 118396503 118322949
11623 118322949 118342371 118329129 118508689 119088055 119944085 120879295 121944608 123303913 124963091
11614 124963091 126817622 128809611 130856163 132745775 134271412 135377775 136060443 136234597
11606 136234597 135834254 134945253 133722612 132261521 130636205 128947404 127222296 125377788
11598 125377788 123390666 121389349 119466087 117529764 115490944 113475662 111676431 110063840
11590 110063840 108429902 106695273 105017836 103589240 102440331 101464542 100554914 99703855
$$ packed form
11648A69247995J03782j357673k502818l283504l798816m063708m073357l957622
11640A46314279l826355l579166l131252k694681k509212k410796k064877j557669
11632A24540271j292228j293962j138782o86725l55415m24906n63516l88234p3554
11623A18322949J9422j3242J79560N79366Q56030R35210J065313J359305J659178
11614A24963091J854531J991989K046552J889612J525637J106363O82668J74154
11606A36234597m00343q89001j222641j461091j625316j688801j725108j844508
11598A25377788j987122k001317j923262j936323k038820k015282j799231j612591
11590A10063840j633938j734629j677437j428596j148909r75789r09628q51059
$$ plain form
11582 99703855 99004862 98543779 98277767 98074294 97879891 97764817 97777430 97861799 97964056 98108984
11572 98108984 98317124 98562265 98870255 99331709 99942187 100558238 101095109 101643718 102316423
11563 102316423 103115720 104027484 105074980 106190510 107226392 108209661 109377907 110823241
11555 110823241 112334381 113771189 115336493 117228141 119275053 121235656 123234439 125533823
11547 125533823 128068210 130633542 133384998 136641206 140255353 143720291 146939233 150354145
11539 150354145 154180933 158051419 161649411 165210077 169049634 172998778 176695020 180136394
11531 180136394 183537601 186847081 189791054 192234240 194125764 195221471 195253519 194319770
11523 194319770 192750938 190626808 187781097 184292947 180601010 177016945 173415976 169549865
$$ packed form
11582I9703855o98993m61083k66012k03473j94403j15074J2613Q4369J02257J44928
11572I8108984K08140K45141L07990M61454O10478O16051N36871N48609O72705
11563A02316423P99297R11764J047496J115530J035882R83269J168246J445334
11555A10823241J511140J436808J565304J891648K046912J960603J998783K299384
11547A25533823K534387K565332K751456L256208L614147L464938L218942L414912
11539A50354145L826788L870486L597992L560666L839557L949144L696242L441374
11531A80136394L401207L309480K943973K443186J891524J095707L2048r33749
11523A94319770j568832k124130k845711l488150l691937l584065l600969l866111
$$ plain form
11515 169549865 165430735 161237324 157016476 152671855 148173791 143628269 139152739 134776981
11507 134776981 130476598 126261628 122211803 118414716 114873482 111513745 108291882 105240170
11499 105240170 102391825 99746366 97333717 95191675 93223154 91222194 89145935 87213201
11491 87213201 85589259 84119204 82566448 80985231 79606839 78434815 77238251 75944376
11483 75944376 74761157 73846131 73085565 72295270 71453966 70645094 69928723 69355698 68950696
11474 68950696 68590382 68057527 67333020 66694045 66381839 66278338 66066440 65647067 65239281
11465 65239281 65071717 65106076 65118545 64989525 64835535 64833813 64968779 65044421 64957872 64833396
11455 64833396 64804758 64799548 64693426 64566147 64585859 64698575 64684685 64521448 64430740 64529422
$$ packed form
11515A69549865m119130m193411m220848m344621m498064m545522m475530m375758
11507A34776981m300383m214970m049825l797087l541234l359737l221863l051712
11499A05240170k848345k645459k412649k142042j968521k000960k076259j932734
11491H7213201j623942j470055j552756j581217j378392j172024j196564j293875
11483G5944376j183219r15026p60566p90295q41304q08872p16371n73025m05002
11474F8950696l60314n32855p24507o38975l12206j03501k11898m19373m07786
11465F5239281j67564L4359J2469j29020j53990j722J34966P5642q6549j24476
11455F4833396k8638n210j06122j27279J9712J12716j3890j63237r0708R8682
$$ plain form
11445 64529422 64697775 64864663 65132540 65485711 65673463 65608939 65631848 66078442 66763706 67218448
11435 67218448 67347340 67514065 67981672 68589446 69064722 69395200 69755135 70235172 70789786
11426 70789786 71359875 71939333 72570954 73338608 74317866 75501111 76827529 78310968 80066130
11417 80066130 82165181 84532843 87055001 89772234 92888668 96521347 100416133 103956337
11409 103956337 106542888 108007130 108615118 108670190 108204598 107104344 105433780 103525932
11401 103525932 101774192 100396357 99375503 98581529 97969673 97678277 97894826 98634948 99725840
11392 99725840 100975629 102217264 103199440 103661057 103610705 103346438 103087886 102781437 102403537
11383 102403537 102232468 102598532 103527224 104844660 106465180 108317000 110129178 111577879
$$ packed form
11445F4529422J68353J66888K67877L53171J87752o4524K2909M46594O85264M54742
11435F7218448J28892J66725M67607O07774M75276L30478L59935M80037N54614
11426G0789786N70089N79458O31621P67654R79258J183245J326418J483439J755162
11417H0066130K099051K367662K522158K717233L116434L632679L894786L540204
11409A03956337K586551J464242O07988N5072m65592j100254j670564j907848
11401A03525932j751740j377835j020854p93974o11856k91396K16549P40122J090892
11392I9725840J249789J241635R82176M61617n0352k64267k58552l06449l77900
11383A02403537j71069L66064R28692J317436J620520J851820J812178J448701
$$ plain form
11375 111577879 112544571 112990837 112755915 111809185 110537168 109369313 108237993 106870435
11367 106870435 105515480 104787666 104728057 104616404 103910382 102828471 101740899 100519628 98882873
11358 98882873 96955863 95058614 93270452 91616541 90370482 89721949 89401646 89087542
11350 89087542 88958018 89390773 90340284 91510152 92922038 94708213 96441024 97305518 96987476
11341 96987476 95854684 94221454 92005801 89226802 86257615 83344307 80351496 77235199
11333 77235199 74324939 71854559 69615267 67384839 65343214 63730955 62410223 61113901
11325 61113901 59866233 58809139 57843157 56797955 55776403 54988380 54393147 53818016 53275428
11316 53275428 52842063 52370315 51659257 50802715 50044787 49394854 48709790 48046764 47568589
$$ packed form
11375A11577879R66692M46266k34922r46730j272017j167855j131320j367558
11367A06870435j354955p27814n9609j11653p06022j081911j087572j221271j636755
11358I8882873j927010j897249j788162j653911j246059o48533l20303l14104
11350H9087542j29524M32755R49511J169868J411886J786175J732811Q64494l18042
11341I6987476j132792j633230k215653k778999k969187k913308k992811l116297
11333G7235199k910260k470380k239292k230428k041625j612259j320732j296322
11325F1113901j247668j057094r65982j045202j021552p88023n95233n75131n42588
11316E3275428m33365m71748p11058q56542p57928o49933o85064o63026m78175
$$ plain form
11307 47568589 47167538 46568246 45799982 45204912 44933794 44745533 44363302 43770454 43127458
11298 43127458 42633416 42446551 42479498 42330112 41728791 40984326 40598099 40491121 40105179
11289 40105179 39302676 38596120 38301150 38031974 37377458 36579348 36076304 35757852 35212865
11280 35212865 34478582 33978697 33812632 33633535 33247117 32865368 32667513 32496888 32149823
11271 32149823 31681124 31267677 30973288 30767923 30611235 30427783 30153709 29875322 29766372
11262 29766372 29826917 29840112 29650505 29329950 29001966 28668712 28313646 28030250 27912807 27902146
11252 27902146 27856097 27727217 27586197 27499797 27447083 27345624 27139848 26874101 26653611 26496647
11242 26496647 26283690 25938621 25600807 25483607 25584977 25676375 25574644 25297228 24965651
$$ packed form
11307D7568589m01051n99292p68264n95070k71118j88261l82231n92848o42996
11298D3127458m94042j86865L2947j49386o01321p44465l86227j06978l85942
11289D0105179q02503p06556k94970k69176o54516p98110n03044l18452n44987
11280C5212865p34283m99885j66065j79097l86418l81749j97855j70625l47065
11271C2149823m68699m13447k94389k05365j56688j83452k74074k78387j08950
11262B9766372O0545J3195j89607l20555l27984l33254l55066k83396j17443j0661
11252B7902146m6049j28880j41020q6400n2714j01459k05776k65747k20490j56964
11242B6496647k12957l45069l37814j17200J01370R1398j01731k77416l31577
$$ plain form
11233 24965651 24702283 24601520 24625516 24538905 24156134 23661947 23438648 23528194 23550473 23266624
11223 23266624 22915279 22784013 22738223 22486618 22100099 21884665 21843779 21671838 21291539 21013207
11213 21013207 21042460 21146771 21002704 20654504 20416823 20450974 20621929 20700278 20561076 20243945
11203 20243945 19945774 19904350 20161328 20462538 20502269 20260056 20007869 19990303 20182580 20370612
11193 20370612 20386819 20229629 20003456 19800533 19650997 19560135 19543996 19587343 19591454 19439508
11183 19439508 19135898 18820768 18618375 18532000 18516760 18564531 18642575 18636050 18479249 18302628
11173 18302628 18304746 18475426 18590909 18520029 18385838 18341948 18334882 18236940 18112081 18144979 18323038
11162 18323038 18399903 18242795 18041295 18043771 18207149 18274035 18147153 18014763 18078944 18294457
$$ packed form
11233B4965651k63368j00763K3996q6611l82771m94187k23299Q9546K2279k83849
11223B3266624l51345j31266m5790k51605l86519k15434m0886j71941l80299k78332
11213B1013207K9253J04311j44067l48200k37681L4151J70955P8349j39202l17131
11203B0243945k98171m1424K56978L01210L9731k42213k52187j7566J92277J88032
11193B0370612J6207j57190k26173k02923j49536r0862j6139M3347M111j51946
11183A9439508l03610l15130k02393q6375j5240M7771P8044o525j56801j76621
11173A8302628K118J70680J15483p0880j34191m3890p066r7942j24859L2898J78059
11162A8323038P6865j57108k01500K476J63378O6886j26882j32390O4181K15513
$$ plain form
11152 18294457 18448900 18422328 18285760 18176951 18158066 18206329 18283069 18354894 18359584 18229384
11142 18229384 18001626 17848971 17899382 18045053 18053285 17877027 17702826 17639264 17544440 17294628
11132 17294628 17045724 17011642 17104133 17052251 16817618 16612918 16525497 16426006 16291188 16297746
11122 16297746 16478677 16584539 16458124 16279799 16236234 16201106 16000716 15768501 15725014 15782305
11112 15782305 15714249 15598320 15706986 16004021 16135533 15961543 15744081 15712813 15758054 15692932
11102 15692932 15554637 15478596 15475644 15491208 15527102 15573848 15561898 15483355 15422940 15393822 15314604
11091 15314604 15227775 15328835 15646765 15898439 15836459 15581550 15433661 15496684 15670130 15873767
11081 15873767 16072141 16175262 16122331 16005359 15940116 15884463 15750829 15615461 15619413 15716046
$$ packed form
11152A8294457J54443k6572j36568j08809j8885M8263P6740P1825M690j30200
11142A8229384k27758j52655N0411J45671Q232j76258j74201o3562r4824k49812
11132A7294628k48904l4082R2491n1882k34633k04700q7421r9491j34818O558
11122A6297746J80931J05862j26415j78325m3565l5128k00390k32215m3487N7291
11112A5782305o8056j15929J08666K97035J31512j73990k17462l1268M5241o5122
11102A5692932j38295p6041k952J5564L5894M6746j1950p8543o0415k9118p9218
11091A5314604q6829J01060L17930K51674o1980k54909j47889O3023J73446K03637
11081A5873767J98374J03121n2931j16972o5243n5653j33634j35368L952R6633
$$ plain form
11071 15716046 15718158 15574422 15413040 15314472 15215403 15060391 14903682 14821630 14817443 14829012 14772878
11060 14772878 14608723 14413571 14324703 14349458 14340509 14239832 14190040 14266865 14282227 14069980
11050 14069980 13810947 13795345 13968916 14025081 13885922 13757072 13721799 13641773 13508695 13524054
11040 13524054 13703286 13747548 13504998 13262447 13336020 13611252 13757901 13713160 13658113 13642813
11030 13642813 13551569 13401999 13379308 13524214 13625875 13526595 13359097 13343441 13451241 13439128
11020 13439128 13213387 13004396 13070237 13311746 13361945 13073685 12718692 12596457 12642865 12621197
11010 12621197 12531175 12547886 12657305 12678594 12615080 12641242 12726831 12640037 12395421 12313082 12491209
10999 12491209 12606906 12454842 12308081 12449171 12677992 12652114 12452011 12403516 12529971 12598169
$$ packed form
11071A5716046K112j43736j61382r8568r9069j55012j56709q2052m187J1569n6134
11060A4772878j64155j95152q8868K4755q949j00677m9792P6825J5362k12247
11050A4069980k59033j5602J73571N6165j39159j28850l5273q0026j33078J5359
11040A3524054J79232M4262k42550k42551P3573K75232J46649m4741n5047j5300
11030A3642813r1244j49570k2691J44906J01661r9280j67498j5656J07800j2113
11020A3439128k25741k08991O5841K41509N0199k88260l54993j22235M6408k1668
11010A2621197r0022J6711J09419K1289o3514K6162Q5589q6794k44616q2339J78127
10999A2491209J15697j52064j46761J41090K28821k5878k00103m8495J26455O8198
$$ plain form
10989 12598169 12579290 12641442 12751364 12700322 12524471 12514647 12758318 13001240 13026879 12889392
10979 12889392 12721820 12583287 12541022 12644575 12776049 12765550 12666084 12658338 12701470 12594713
10969 12594713 12390188 12376903 12589202 12712148 12598739 12501859 12610025 12716528 12597143 12400855
10959 12400855 12377648 12474625 12499875 12473887 12514989 12552720 12464529 12360165 12422039 12561612 12535599
10948 12535599 12343367 12223242 12277894 12360627 12335488 12231564 12132557 12097307 12180907 12364650
10938 12364650 12491249 12442698 12347533 12425202 12654903 12802222 12771204 12728335 12846101 13093398
10928 13093398 13322303 13432756 13425485 13391002 13433844 13520890 13481599 13287830 13210803 13477804
10918 13477804 13870099 13961645 13730510 13593552 13776063 14001148 13968065 13818879 13866395 14088647
$$ packed form
10989A2598169j8879O2152J09922n1042j75851r824K43671K42922K5639j37487
10979A2889392j67572j38533m2265J03553J31474j0499r9466p746M3132j06757
10969A2594713k04525j3285K12299J22946j13409r6880J08166J06503j19385j96288
10959A2400855k3207R6977K5250k5988M1102L7731q8191j04364O1874J39573k6013
10948A2535599j92232j20125N4652Q2733k5139j03924r9007l5250Q3600J83743
10938A2364650J26599m8551r5165P7669K29701J47319l1018m2869J17766K47297
10928A3093398K28905J10453p271l4483M2842Q7046l9291j93769p7027K67001
10918A3477804L92295R1546k31135j36958J82511K25085l3083j49186M7516K22252
$$ plain form
10908 14088647 14209106 14153817 14107013 14143430 14110362 13939239 13828409 13984758 14335310 14622817
10898 14622817 14690480 14569280 14380186 14273722 14384654 14687307 14937116 14933940 14834072 14986297
10888 14986297 15413139 15714330 15635664 15470466 15616742 15943784 16000327 15761582 15692462 16004280
10878 16004280 16332534 16365612 16354186 16655041 17115760 17338063 17324761 17418886 17729397 18049563
10868 18049563 18280561 18521893 18763976 18894436 19020168 19381158 19897974 20208527 20244917
10859 20244917 20375453 20836911 21410792 21844521 22224248 22695860 23155104 23504872 23946438
10850 23946438 24702837 25654420 26537362 27329781 28161987 29002047 29722379 30365179 31068504
10841 31068504 31809835 32454535 32965279 33346348 33502839 33404587 33275893 33345680 33495472 33443104
$$ packed form
10908A4088647J20459n5289m6804L6417l3068j71123j10830J56349L50552K87507
10898A4622817O7663j21200j89094j06464J10932L02653K49809l176r9868J52225
10888A4986297M26842L01191p8666j65198J46276L27042N6543k38745o9120L11818
10878A6004280L28254L3078j1426L00855M60719K22303j3302R4125L10511L20166
10868A8049563K30998K41332K42083J30460J25732L60990N16816L10553L6390
10859B0244917J30536M61458N73881M33729L79727M71612M59244L49768M41566
10850B3946438P56399R51583Q82942P92419Q32206Q40060P20332O42800P03325
10841C1068504P41331O44700N10744L81069J56491r8252j28694O9787J49792n2368
$$ plain form
10831 33443104 33211216 33103658 33235506 33400261 33445093 33496360 33728745 34138230 34637036 35192154
10821 35192154 35782675 36357966 36897470 37402624 37820184 38098802 38305745 38535717 38723276
10812 38723276 38718975 38537985 38341867 38174097 37919315 37547712 37192572 36935760 36701068 36409654
10802 36409654 36074054 35716891 35389575 35285239 35585380 36125880 36470802 36445387 36373276 36634184
10792 36634184 37190426 37736993 38153036 38586744 39185761 39940059 40761039 41587909 42441886
10783 42441886 43441380 44696368 46143087 47595604 49008104 50524678 52185264 53774262
10775 53774262 55108763 56299934 57532499 58728452 59657125 60277799 60731213 61053848 61157902
10766 61157902 61088981 61056963 61159867 61277259 61301108 61294348 61343902 61426326 61532345 61782826
$$ packed form
10831C3443104k31888j07558J31848J64755M4832N1267K32385M09485M98806N55118
10821C5192154N90521N75291N39504N05154M17560K78618K06943K29972J87559
10812C8723276m301j80990j96118j67770k54782l71603l55140k56812k34692k91414
10802C6409654l35600l57163l27316j04336L00141N40500L44922k5415p2111K60908
10792C6634184N56242N46567M16043M33708N99017P54298Q20980Q26870Q53977
10783D2441886R99494J254988J446719J452517J412500J516574J660586J588998
10775E3774262J334501J191171J232565J195953R28673O20674M53414L22635J04054
10766F1157902o8921l2018J02904J17392K3849o760M9554Q2424J06019K50481
$$ plain form
10756 61782826 62262898 62812479 63147531 63197770 63194641 63362461 63601561 63575687 63097092 62314549
10746 62314549 61471768 60588857 59514847 58240609 56970673 55845302 54768623 53618837
10738 53618837 52485748 51545609 50790563 50057574 49296410 48645097 48218281 47948175 47686562
10729 47686562 47392144 47173520 47171926 47404330 47712424 47914370 48042839 48360363 49062585 50028912
10719 50028912 50962105 51718668 52386227 53080375 53809248 54532052 55207802 55759510 56115270
10710 56115270 56326620 56537913 56792734 56975025 56998161 56943957 56921399 56869393 56625998 56174965
10700 56174965 55710158 55419121 55265742 55035660 54575143 53942419 53312023 52756830 52166205
10691 52166205 51395799 50461265 49526661 48699382 47907236 47034334 46129553 45371624 44811339
$$ packed form
10756F1782826M80072N49581L35052N0239l129J67820K39100k5874m78595p82543
10746F2314549q42781q82911j074010j274238j269936j125371j076679j149786
10738E3618837j133089r40139p55046p32989p61164o51313m26816k70106k61613
10729D7686562k94418k18624j594K32404L08094K01946J28469L17524P02222R66327
10719E0028912R33193P56563O67559O94148P28873P22804O75750N51708L55760
10710E6115270K11350K11293K54821J82291K3136n4204k2558n2006k43395m51033
10700E6174965m64807k91037j53379k30082m60517o32724o30396n55193n90625
10691E2166205p70406r34534r34604q27279p92146q72902r04781p57929n60285
$$ plain form
10682 44811339 44272297 43602667 42926076 42476499 42228523 41913703 41444045 41072125 40987746
10673 40987746 40980241 40737042 40317905 40044676 40007324 39985925 39837326 39652150 39505901 39352564
10663 39352564 39219877 39222006 39307773 39287112 39188882 39278573 39610093 39897194 39987729 40121845
10653 40121845 40515792 41030403 41492701 42000311 42621996 43146277 43466223 43872392 44579088
10644 44579088 45304885 45774134 46298357 47334392 48778045 50287554 51999710 54232692
10636 54232692 56785151 59402092 62692026 67411602 72722315 76381025 77178019 76185622
10628 76185622 74963973 73511169 70914287 67250475 63628560 60647553 57934771 55195824
10620 55195824 52747735 50832774 49195777 47625728 46314783 45390621 44575836 43602943
$$ packed form
10682D4811339n39042o69630o76591m49577k47976l14820m69658l71920q4379
10673D0987746p505k43199m19137k73229l7352k1399j48599j85176j46249j53337
10663C9352564j32687K129Q5767k0661r8230Q9691L31520K87101R0535J34116
10653D0121845L93947N14611M62298N07610O21685N24281L19946M06169P06696
10644D4579088P25797M69249N24223J036035J443653J509509J712156K232982
10636E4232692K552459K616941L289934M719576N310713L658710P96994r92397
10628G6185622j221649j452804k596882l663812l621915k981007k712782k738947
10620E5195824k448089j914961j636997j570049j310945r24162q14785r72893
$$ plain form
10612 43602943 42588753 41730686 40951746 40118901 39369177 38938716 38789147 38613349 38180167
10603 38180167 37585497 37177544 37202694 37463626 37442033 36903252 36231444 35941198 36013696 36031466
10593 36031466 35839089 35656664 35578551 35420251 35141473 34989209 35062531 35115316 34988703 34898596
10583 34898596 35063076 35347268 35537502 35702462 35991262 36293401 36426858 36517559 36849529
10574 36849529 37390931 37784549 37842257 37797151 37974267 38380786 38737195 38825877 38692554 38512926
10564 38512926 38364873 38215096 38082196 38054150 38093306 38004545 37746612 37612399 37865918 38314648
10554 38314648 38534077 38463313 38454555 38726354 39111520 39419800 39711019 40072788 40434173 40768488
10544 40768488 41206128 41770368 42269305 42636677 43097153 43765752 44370199 44662043 44840797
$$ packed form
10612D3602943j014190q58067p78940q32845p49724m30461j49569j75798m33182
10603C8180167n94670m07953K5150K60932k1593n38781o71808k90246P2498J7770
10593C6031466j92377j82425p8113j58300k78778j52264P3322N2785j26613r0107
10583C4898596J64480K84192J90234J64960K88800L02139J33457R0701L31970
10574C6849529N41402L93618N7708m5106J77116M06519L56409Q8682j33323j79628
10564C8512926j48053j49777j32900k8046L9156q8761k57933j34213K53519M48730
10554C8314648K19429p0764q758K71799L85166L08280K91219L61769L61385L34315
10544D0768488M37640N64240M98937L67372M60476O68599O04447K91844J78754
$$ plain form
10535 44840797 45212119 45634411 45727104 45517803 45437865 45666579 45885868 45789506 45501576 45321702
10525 45321702 45296915 45246741 45082131 44917023 44888243 44968345 44985694 44827729 44609127 44570094
10515 44570094 44782230 45062788 45251875 45441623 45793660 46248193 46609603 46857295 47164879
10506 47164879 47630924 48195566 48838422 49651345 50642532 51639876 52498883 53291847 54185061
10497 54185061 55220999 56339155 57536536 58853868 60240685 61641708 63263535 65502994
10489 65502994 68426232 71581477 74711340 78441090 83558439 89454091 94051640 95869387
10481 95869387 95605435 94943970 94266933 92594416 89590520 86324710 83721330 81433147
10473 81433147 78914462 76631433 75299300 74620377 73785934 72788438 72249757 72241522 72273850
$$ packed form
10535D4840797L71322M22292R2693k09301p9938K28714K19289r6362k87930j79874
10525D5321702k4787n0174j64610j65108k8780Q0102J7349j57965k18602l9033
10515D4570094K12136K80558J89087J89748L52037M54533L61410K47692L07584
10506D7164879M66045N64642O42856Q12923R91187R97344Q59007P92964Q93214
10497E4185061J035938J118156J197381J317332J386817J401023J621827K239459
10489F5502994K923238L155245L129863L729750N117349N895652M597549J817747
10481I5869387k63952o61465o77037j672517l003896l265810k603380k288183
10473H1433147k518685k283029j332133o78923q34443r97496n38681q235L2328
$$ plain form
10464 72273850 72316016 72837429 73805460 74562580 74847586 75108926 75590834 75880609 75652930
10455 75652930 75176722 74752857 74258491 73599876 73067654 72861077 72713247 72341800 71884123
10446 71884123 71596476 71505761 71607737 71997481 72553378 72916041 73033312 73295339 73891654
10437 73891654 74511976 74941360 75415500 76059689 76540192 76689632 76925769 77547048 78126982
10428 78126982 78183442 77991757 78104557 78462419 78655534 78734033 79036870 79458948 79625992 79651631
10418 79651631 80006022 80708344 81330301 81766956 82342441 83148251 83933149 84703929 85792457
10409 85792457 87212037 88556796 89704073 91045019 92804058 94648825 96235785 97703328
10401 97703328 99348273 101164919 102958898 104648106 106263697 107884650 109677387 111755206
$$ packed form
10464G2273850M2166N21413R68031P57120K85006K61340M81908K89775k27679
10455G5652930m76208m23865m94366o58615n32222k06577j47830l71447m57677
10446G1884123k87647r0715J01976L89744N55897L62663J17271K62027N96315
10437G3891654O20322M29384M74140O44189M80503J49440K36137O21279N79934
10428G8126982N6460j91685J12800L57862J93115P8499L02837M22078J67044K5639
10418G9651631L54391P02322O21957M36655N75485Q05810P84898P70780J088528
10409H5792457J419580J344759J147277J340946J759039J844767J586960J467543
10401I7703328J644945J816646J793979J689208J615591J620953J792737K077819
$$ plain form
10393 111755206 113949295 115994582 117945023 120072141 122367845 124551158 126571202 128640062
10385 128640062 130721835 132503514 133990156 135601944 137497596 139323300 140872172 142477008
10377 142477008 144444306 146588905 148691507 150954902 153573402 156252539 158647834 160966799
10369 160966799 163623565 166527835 169238648 171682443 174206717 176964469 179711520 182255240
10361 182255240 184709088 187195345 189593559 191725280 193609179 195419558 197289091 199226828
10353 199226828 201198064 203251114 205523500 208067470 210734392 213372816 216085915 219080421
10345 219080421 222280449 225344440 228077363 230546241 232749190 234474396 235555043 235954920
10337 235954920 235538743 234120979 231853540 229185407 226285904 222887403 218864099 214550123
$$ packed form
10393A11755206K194089K045287J950441K127118K295704K183313K020044K068860
10385A28640062K081773J781679J486642J611788J895652J825704J548872J604836
10377A42477008J967298K144599K102602K263395K618500K679137K395295K318965
10369A60966799K656766K904270K710813K443795K524274K757752K747051K543720
10361A82255240K453848K486257K398214K131721J883899J810379J869533J937737
10353A99226828J971236K053050K272386K543970K666922K638424K713099K994506
10345B19080421L200028L063991K732923K468878K202949J725206J080647L99877
10337B35954920m16177j417764k267439k668133k899503l398501m023304m313976
$$ plain form
10329 214550123 210266192 205959286 201589656 197460272 193832460 190587980 187606670 185111036
10321 185111036 183288615 181948634 180928799 180454710 180663617 181134901 181360986 181350130 181281185
10312 181281185 180903318 179831009 178156267 176204243 173918783 171059646 167806641 164600362
10304 164600362 161552427 158548630 155736055 153331911 151131558 148808135 146550454 144806473
10296 144806473 143548347 142414851 141428741 140894809 140695634 140400301 140031568 140032517 140485586
10287 140485586 141046936 141653599 142606270 143928442 145325462 146808792 148681772 150886270
10279 150886270 153063451 155277788 157941011 160983594 163869311 166481605 169198727 172030134
10271 172030134 174524044 176624509 178741236 180849993 182436841 183470220 184465075 185433529
$$ packed form
10329B14550123m283931m306906m369630m129384l627812l244480k981310k495634
10321A85111036j822421j339981j019835m74089K08907M71284K26085j0856o8945
10312A81281185l77867j072309j674742j952024k285460k859137l253005l206279
10304A64600362l047935l003797k812575k404144k200353k323423k257681j743981
10296A44806473j258126j133496r86110n33932j99175k95333l68733R49M53069
10287A40485586N61350O06663R52671J322172J397020J483330J872980K204498
10279A50886270K177181K214337K663223L042583K885717K612294K717122K831407
10271A72030134K493910K100465K116727K108757J586848J033379R94855R68454
$$ plain form
10263 185433529 185817218 185652873 185671270 185979083 185864851 185266485 185126960 185817594 186554950
10254 186554950 186946366 187690897 189082109 190360445 191394693 193374391 196784433 200377497
10246 200377497 203394256 207038903 212338369 218528090 225338080 234630376 247376978 261475056
10238 261475056 275929493 294681508 321042383 349205380 367311586 370254823 364269500
10231 364269500 356796083 347129084 330891211 309283254 288252058 270472215 253614658
10224 253614658 236243376 220577442 208478092 198554539 188857419 179684209 172072607
10217 172072607 165604493 159356542 153546261 148765760 144665848 140642545 136960592 134111597
10209 134111597 131775620 129383032 127095933 125348507 123922750 122298307 120518412 118985265
$$ packed form
10263A85433529L83689j64345J8397L07813j14232n98366j39525O90634P37356
10254A86554950L91416P44531J391212J278336J034248J979698L410042L593064
10246B00377497L016759L644647N299466O189721O809990R292296J2746602J4098078
10238B61475056J4454437J8752015K6360875K8162997J8106206K943237n985323
10231C64269500p473417r666999j6237873k1607957k1031196j7779843j6857557
10224B53614658j7371282j5665934j2099350r923553r697120r173210p611602
10217A72072607o468114o247951n810281m780501m099912m023303l681953k848995
10209A34111597k335977k392588k287099j747426j425757j624443j779895j533147
$$ plain form
10201 118985265 117743865 116632551 115832793 115608640 115709605 115646386 115455863 115668799 116557500
10192 116557500 117865766 119330279 121123762 123619443 126791679 129899313 131847011 132024164
10184 132024164 130763370 128791095 126334329 123105890 119094194 114862570 110938221 107345245
10176 107345245 103935336 100781704 98000584 95513829 93238807 91246324 89528846 87882925
10168 87882925 86209382 84662018 83335873 82102646 80914051 79933917 79179304 78383323
10160 78383323 77438445 76608104 76028917 75383377 74408980 73372285 72619789 71968407 71032438
10151 71032438 69933138 69140611 68702043 68156367 67247473 66259494 65528766 65002680 64452162
10142 64452162 63835601 63258663 62762746 62334578 62011988 61823531 61675429 61426505 61081127
$$ packed form
10201A18985265j241400j111314p99758k24153J00965o3219j90523K12936Q88701
10192A16557500J308266J464513J793483K495681L172236L107634J947698J77153
10184A32024164j260794j972275k456766l228439m011696m231624l924349l592976
10176A07345245l409909l153632k781120k486755k275022j992483j717478j645921
10168H7882925j673543j547364j326145j233227j188595r80134p54613p95981
10160G8383323r44878q30341n79187o45540r74397j036695p52496o51382r35969
10151G1032438j099300p92527m38568n45676r08894r87979p30728n26086n50518
10142F4452162o16561n76938m95917m28168l22590j88457j48102k48924l45378
$$ plain form
10133 61081127 60819314 60775641 60818704 60647963 60152299 59566782 59166569 58909424 58559774 58093066
10123 58093066 57740933 57649993 57741410 57928003 58225498 58620507 59085628 59744662 60705684 61670888
10113 61670888 62080063 61785110 61227782 60764764 60184826 59152005 57779729 56434255 55246358
10104 55246358 54160679 53226514 52476062 51712389 50784050 49907527 49363101 49026526 48570221
10095 48570221 47988750 47531723 47219274 46835297 46355111 45982786 45760741 45497452 45100746
10086 45100746 44662736 44206158 43665131 43137216 42840619 42771711 42676438 42404490 42057695 41781958
10076 41781958 41644941 41694343 41886351 41992886 41838289 41568552 41413511 41291479 40998769
10067 40998769 40678050 40650318 40826227 40778942 40427606 40130250 40012898 39765244 39288943 38981016
$$ packed form
10133F1081127k61813m3673M3063j70741m95664n85517m00213k57145l49650m66708
10123E8093066l52133r0940R1417J86593K97495L95009M65121O59034R61022R65204
10113F1670888M09175k94953n57328m63018n79938j032821j372276j345474j187897
10104E5246358j085679r34165p50452p63673r28339q76523n44426l36575m56305
10095D8570221n81471m57027l12449l83977m80186l72325k22045k63289l96706
10086D5100746m38010m56578n41027n27915k96597o8908r5273k71948l46795k75737
10076D1781958j37017M9402J92008J06535j54597k69737j55041j22032k92710
10067D0998769l20719k7732J75909m7285l51336k97356j17352k47654m76301l07927
$$ plain form
10057 38981016 39059125 39119447 38780146 38328681 38229802 38321941 38074969 37470414 37043917 37059839
10047 37059839 37156613 36937692 36515807 36257946 36246989 36244847 36093005 35935744 35999382 36259088
10037 36259088 36447167 36403304 36278299 36277202 36328561 36219810 35983207 35868148 35934919 35980322
10027 35980322 35921356 35934803 36101827 36228504 36186102 36132897 36195761 36220234 36087950 36016957
10017 36016957 36240537 36593337 36745617 36709243 36790300 37122163 37534541 37838344 37996451 38054881
10007 38054881 38117400 38340862 38766614 39212432 39495487 39680568 39951635 40350006 40806531
9998 40806531 41300439 41803455 42212473 42533240 42962293 43563182 44053928 44200047 44242063 44597764
9988 44597764 45275341 45940304 46459615 46988102 47567766 48053531 48464528 49028989 49796006
$$ packed form
10057C8981016P8109O0322l39301m51465r8879R2139k46972o04555m26497J5922
10047C7059839R6774k18921m21885k57861j0957k142j51842j57261O3638K59706
10037C6259088J88079m3863j25005j097N1359j08751k36603j15059O6771M5403
10027C5980322n8966J3447J67024J26677m2402n3205O2864K4473j32284p0993
10017C6016957K23580L52800J52280l6374Q1057L31863M12378L03803J58107N8430
10007C8054881O2519K23462M25752M45818K83055J85081K71067L98371M56525
9998D0806531M93908N03016M09018L20767M29053O00889M90746J46119M2016L55701
9988D4597764O77577O64963N19311N28487N79664M85765M10997N64461P67017
$$ plain form
9979 49796006 50522565 51044981 51496860 52072924 52808403 53656207 54567311 55448642 56242317
9970 56242317 57071622 58122625 59392284 60732065 62067261 63364290 64526873 65634736
9962 65634736 67126072 69303727 71734383 73632322 74857136 76037734 77651267 79515800
9954 79515800 81338481 83213311 85311902 87569329 90004428 92938469 96547237 100543751
9946 100543751 104629272 108904956 113476784 117983551 121915888 125126501 127632003 129187317
9938 129187317 129514669 128768979 127349063 125402878 122921412 120148559 117439771 114819342
9930 114819342 112124277 109514780 107389755 105816268 104479230 103222023 102231310 101634126
9922 101634126 101295032 101098393 101094679 101283504 101567420 102001253 102775328 103861541 104990174
$$ packed form
9979D9796006P26559N22416M51879N76064P35479Q47804R11104Q81331P93675
9970E6242317Q29305J051003J269659J339781J335196J297029J162583J107863
9962F5634736J491336K177655K430656J897939J224814J180598J613533J864533
9954G9515800J822681J874830K098591K257427K435099K934041L608768L996514
9946A00543751M085521M275684M571828M506767L932337L210613K505502J555314
9938A29187317L27352p45690j419916j946185k481466k772853k708788k620429
9930A14819342k695065k609497k125025j573487j337038j257207r90713n97184
9922A01634126l39094j96639l714J88825K83916M33833P74075J086213J128633
$$ plain form
9913 104990174 106093825 107459461 109266999 111252603 113058999 114734428 116648655 119001860
9905 119001860 121613250 124196155 126730612 129511189 132821378 136605094 140567938 144598927
9897 144598927 148889292 153562883 158473423 163569546 169166148 175532166 182472398 189737761
9889 189737761 197640953 206769182 217229139 228720850 241259139 255198509 270558513
9882 270558513 286975591 304285906 322231954 339296907 352784967 360797608 363631828
9875 363631828 362683299 358600922 351311120 341335944 329974141 318172621 306075997 293801713
9867 293801713 281888522 270725787 260166997 250037814 240562955 231990810 224202814
9860 224202814 217019765 210570760 205028039 200215849 195790028 191630137 187787022 184196570
$$ packed form
9913A04990174J103651J365636J807538J985604J806396J675429J914227K353205
9905A19001860K611390K582905K534457K780577L310189L783716L962844M030989
9897A44598927M290365M673591M910540N096123N596602O366018O940232P265363
9889A89737761P903192R128229J0459957J1491711J2538289J3939370J5360004
9882B70558513J6417078J7310315J7946048J7064953J3488060Q012641K834220
9875C63631828r48529m082377p289802r975176j1361803j1801520j2096624j2274284
9867B93801713j1913191j1162735j0558790j0129183r474859q572145p787996
9860B24202814p183049o449005n542721m812190m425821m159891l843115l590452
$$ plain form
9852 184196570 180711223 177309969 174036643 170799518 167441552 163960895 160481091 157046445
9844 157046445 153621407 150267442 147148093 144341057 141777937 139398674 137257220 135429664
9836 135429664 133897632 132585603 131476656 130621367 130013698 129507689 128920217 128201760 127412199
9827 127412199 126509245 125301951 123723669 122030369 120545570 119266411 117925076 116422349
9819 116422349 114966766 113732075 112608528 111428689 110269858 109360596 108776366 108374836
9811 108374836 107985174 107550891 107121008 106780185 106547481 106290784 105812733 105084782 104308712
9802 104308712 103663249 103082940 102398626 101611148 100882289 100309176 99869457 99576873 99523929
9793 99523929 99724436 100040185 100334968 100626169 101031256 101626640 102400413 103272305 104098350
$$ packed form
9852A84196570l485347l401254l273326l237125l357966l480657l479804l434646
9844A57046445l425038l353965l119349k807036k563120k379263k141454j827556
9836A35429664j532032j312029j108947q55289o07669n06009n87472p18457p89561
9827A27412199r02954j207294j578282j693300j484799j279159j341335j502727
9819A16422349j455583j234691j123547j179839j158831r09262n84230m01530
9811A08374836l89662m34283m29883l40823k32704k56697m78051p27951p76070
9802A04308712o45463n80309o84314p87478p28859n73113m39719k92584n2944
9793I9523929K00507L15749K94783K91201M05087N95384P73773Q71892Q26045
$$ plain form
9784 104098350 104717721 105081383 105305218 105506482 105594009 105317428 104548819 103415599 102094770
9775 102094770 100584424 98810436 96889521 95089482 93504925 91965539 90353819 88830808
9767 88830808 87595179 86576181 85581837 84645762 83962343 83515098 83063014 82542510 82191205
9758 82191205 82141858 82155997 81970401 81708424 81686449 81936211 82208095 82405223 82711290 83226349
9748 83226349 83746530 84069308 84337982 84866742 85693679 86525628 87159077 87775178 88702565
9739 88702565 90001059 91445109 92878804 94385155 96045603 97730115 99291156 100835683
9731 100835683 102583445 104506483 106345460 107999159 109665602 111522258 113471408 115309236
9723 115309236 116963965 118437863 119684764 120707927 121643602 122577304 123385633 123918676 124222606
$$ packed form
9784A04098350O19371L63662K23835K01264Q7527k76581p68609j133220j320829
9775A02094770j510346j773988j920915j800039j584557j539386j611720j523011
9767H8830808j235629j018998r94344r36075o83419m47245m52084n20504l51305
9758H2191205m9347J4139j85596k61977k1975K49762K71884J97128L06067N15059
9748H3226349N20181L22778K68674N28760Q26937Q31949O33449O16101R27387
9739H8702565J298494J444050J433695J506351J660448J684512J561041J544527
9731A00835683J747762J923038J838977J653699J666443J856656J949150J837828
9723A15309236J654729J473898J246901J023163R35675R33702Q08329N33043L03930
$$ plain form
9714 124222606 124405491 124404229 124107193 123624795 123195230 122858053 122459031 121977357 121623255 121579206
9704 121579206 121826504 122240978 122682294 122997916 123152121 123362759 123885715 124640384 125293775
9695 125293775 125757859 126324080 127215412 128314018 129511272 131035323 133146359 135695889
9687 135695889 138305051 140907069 143843687 147440312 151700159 156423247 161453173 166781504
9679 166781504 172520163 178774401 185487931 192489763 199777709 207650294 216447949 226277927
9671 226277927 237106465 248961835 261893585 275927273 291268455 308316837 327183760
9664 327183760 347479812 369033624 392456448 418007964 443635651 464997771 478196725
9657 478196725 482302961 478884277 469633102 455246963 436348928 414394487 391176566
$$ packed form
9714A24222606J82885j262k97036m82398m29565l37177l99022m81674l54102m4049
9704A21579206K47298M14474M41316L15622J54205K10638N22956P54669O53391
9695A25293775M64084N66221Q91332J098606J197254J524051K111036K549530
9687A35695889K609162K602018K936618L596625M259847M723088N029926N328331
9679A66781504N738659O254238O713530P001832P287946P872585Q797655R829978
9671B26277927J0828538J1855370J2931750J4033688J5341182J7048382J8866923
9664C27183760K0296052K1553812K3422824K5551516K5627687K1362120J3198954
9657D78196725M106236l418684r251175j4386139j8898035k1954441k3217921
$$ plain form
9650 391176566 367932285 345327020 323935108 304261043 286420908 270179512 255314639
9643 255314639 241763714 229486532 218392117 208377098 199287931 190894631 183048775
9636 183048775 175814436 169292649 163371328 157815247 152558250 147715080 143314662 139220797
9628 139220797 135345735 131749087 128457727 125363758 122405236 119705082 117401865 115439573
9620 115439573 113648267 111961909 110438384 109117805 107980279 107017310 106240723 105630828
9612 105630828 105154866 104817818 104621798 104507334 104424672 104440654 104678884 105169033 105862172 106796755
9602 106796755 108133121 109987908 112324387 115030375 117983796 120961759 123579014 125445842
9594 125445842 126390901 126479581 125853807 124641034 123011241 121216225 119497211 117967004 116616039
$$ packed form
9650C91176566k3244281k2605265k1391912j9674065j7840135j6241396j4864873
9643B55314639j3550925j2277182j1094415j0015019r089167q393300p845856
9636A83048775p234339o521787n921321n556081n256997m843170m400418m093865
9628A39220797l875062l596648l291360l093969k958522k700154k303217j962292
9620A15439573j791306j686358j523525j320579j137526r62969p76587o09895
9612A05630828m75962l37048j96020j14464q2662J5982K38230M90149O93139R34583
9602A06796755J336366J854787K336479K705988K953421K977963K617255J866828
9594A25445842R45059Q8680o25774j212773j629793j795016j719014j530207j350965
$$ plain form
9585 116616039 115417945 114381311 113483358 112600948 111566855 110288491 108754793 106931666
9577 106931666 104751454 102262769 99700986 97305096 95110727 93023938 91043323 89263878
9569 89263878 87687318 86211427 84843543 83747485 82998598 82456429 81997921 81729617 81811763
9560 81811763 82185070 82648703 83119326 83602861 83954651 83903979 83350601 82440354 81292019
9551 81292019 79837457 78024587 76012693 74034978 72178800 70419983 68769906 67250324
9543 67250324 65798419 64345678 62955241 61750935 60734288 59797001 58900299 58111587 57456400
9534 57456400 56864363 56298859 55826625 55500393 55262313 55033076 54831182 54729402 54731919 54766483
9524 54766483 54793236 54878520 55152151 55691785 56433843 57213416 57932143 58663666 59516942 60405852
$$ packed form
9585A16616039j198094j036634q97953q82410j034093j278364j533698j823127
9577A06931666k180212k488685k561783k395890k194369k086789j980615j779445
9569H9263878j576560j475891j367884j096058p48887n42169m58508k68304Q2146
9560H1811763L73307M63633M70623M83535L51790n0672n53378r10247j148335
9551H1292019j454562j812870k011894j977715j856178j758817j650077j519582
9543F7250324j451905j452741j390437j204306j016647r37287q96702p88712o55187
9534E7456400n92037n65504m72234l26232k38080k29237k01894j01780K517L4564
9524E4766483K6753Q5284K73631N39634P42058P79573P18727P31523Q53276Q88910
$$ plain form
9514 60405852 61068474 61349246 61344649 61201954 60898015 60342316 59610819 58918357 58385950 57970690
9504 57970690 57610502 57311786 57113541 57103967 57447685 58211507 59149253 59874672 60328991 60874342
9494 60874342 61792717 62872422 63663769 63995497 64031841 63932682 63699474 63306317 62748591 61979140
9484 61979140 61027693 60181689 59776500 59717152 59441357 58504246 57042334 55528447 54220584
9475 54220584 53019560 51761446 50448543 49192732 48061826 47026133 46033316 45137781
9467 45137781 44514808 44249331 44135227 43848083 43342450 42883247 42612696 42315565 41770339
9458 41770339 41122421 40674664 40450541 40220724 39871089 39480499 39080846 38605125 38074699
9449 38074699 37598368 37164683 36653095 36070298 35554871 35125293 34663168 34187273 33873647
$$ packed form
9514F0405852O62622K80772m597j42695l03939n55699p31497o92462n32407m15260
9504E7970690l60188k98716j98245r574L43718P63822R37746P25419M54319N45351
9494F0874342R18375J079705P91347L31728L6344r9159k33208l93157n57726p69451
9484F1979140r51447q46004m05189n9348k75795r37111j461912j513887j307863
9475E4220584j201024j258114j312903j255811j130906j035693r92817q95535
9467D5137781o22973k65477j14104k87144n05633m59203k70551k97131n45226
9458D1770339o47918m47757k24123k29817l49635l90590l99653m75721n30426
9449C8074699m76331m33685n11588n82797n15427m29578m62125m75895l13626
$$ plain form
9440 33873647 33705649 33376979 32715526 31982800 31544131 31404510 31282508 31015583 30668781
9431 30668781 30327032 30007549 29749940 29593391 29457647 29211665 28882244 28653508 28619063 28644134
9421 28644134 28526273 28224069 27880250 27655431 27576926 27549549 27495505 27443767 27451248 27489145 27494671
9410 27494671 27501840 27599237 27767154 27895217 27962089 28031878 28062424 27931474 27702743 27608329 27649221
9399 27649221 27490651 26955519 26352829 26027414 25819951 25364494 24772192 24541314 24770722
9390 24770722 24922523 24537157 23834679 23368330 23318616 23387693 23265351 22965028 22721058 22698342
9380 22698342 22821563 22852171 22651524 22347246 22164933 22136386 22105799 21991958 21865030 21763442
9370 21763442 21635959 21498575 21443067 21437353 21332136 21135635 21047519 21116704 21114870 20903102 20678458
$$ packed form
9440C3873647j67998l28670o61453p32726m38669j39621j22002k66925l46802
9431C0668781l41749l19483k57609j56549j35744k45982l29421k28736l4445K5071
9421B8644134j17861l02204l43819k24819p8505k7377n4044n1738P481L7897N526
9410B7494671P169R7397J67917J28063O6872O9789L0546j30950k28731r4414M0892
9399B7649221j58570n35132o02690l25415k07463m55457n92302k30878K29408
9390B4770722J51801l85366p02478m66349m9714O9077j22342l00323k43970k2716
9380B2698342J23221L0608k00647l04278j82313k8547l0587j13841j26928j01588
9370B1763442j27483j37384n5508n714j05217j96501q8116O9185j834k11768k24644
$$ plain form
9359 20678458 20651020 20702798 20622963 20484969 20479440 20515141 20345599 20039057 19952432 20191699 20431624
9348 20431624 20392748 20218010 20196845 20327369 20378458 20272956 20180267 20240310 20377007 20441670
9338 20441670 20424117 20425602 20470079 20459352 20350444 20277808 20394583 20644432 20830826 20903708 21014406
9327 21014406 21255037 21524474 21724722 21890232 21999417 21877892 21499946 21196139 21273301 21548534
9317 21548534 21580550 21297509 21039765 20980316 20900650 20660044 20509839 20701421 21063135 21256862
9307 21256862 21266658 21331855 21514043 21641852 21646662 21656461 21719459 21689653 21479734 21229680 21102497
9296 21102497 21054749 20939714 20739941 20564780 20474265 20430120 20393681 20356126 20279581 20128088
9286 20128088 19980489 19994997 20197835 20402287 20427725 20330050 20314363 20479520 20773337 21149177
$$ packed form
9359B0678458k7438N1778p9835j37994n529L5701j69542l06542q6625K39267K39925
9348B0431624l8876j74738k1165J30524N1089j05502r2689O0043J36697O4663
9338B0441670j7553J485M4477j0727j08908p2636J16775K49849J86394P2882J10698
9327B1014406K40631K69437K00248J65510J09185j21525l77946l03807P7162K75233
9317B1548534L2016k83041k57744n9449p9666k40606j50205J91582L61714J93727
9307B1256862R796O5197J82188J27809M810R799O2998k9806k09919k50054j27183
9296B1102497m7748j15035j99773j75161r0515m4145l6439l7555p6545j51493
9286B0128088j47599J4508K02838K04452K5438r7675j5687J65157K93817L75840
$$ plain form
9276 21149177 21594379 22003638 22216534 22245649 22302280 22511336 22759315 22921923 23059458 23232034
9266 23232034 23296070 23105687 22796681 22626343 22602992 22520652 22314632 22116810 21961356 21711083
9256 21711083 21335055 21017932 20902102 20914756 20932268 20939248 20953598 20968135 21030663 21203366 21387055
9245 21387055 21385754 21209968 21094823 21136602 21158407 21052415 20987062 21095801 21210140 21129532
9235 21129532 20945807 20852109 20816087 20715224 20638530 20751036 20964324 21046488 20998081 21026870
9225 21026870 21184399 21318852 21390664 21552188 21862236 22162348 22317436 22401634 22579487 22933953
9215 22933953 23433367 23942120 24273870 24369320 24392363 24511044 24648118 24624150 24466350 24346110
9205 24346110 24273942 24127032 23948748 23919194 24010054 23975727 23748145 23538234 23451110 23303844
$$ packed form
9276B1149177M45202M09259K12896K9115N6631K09056K47979J62608J37535J72576
9266B3232034O4036j90383l09006j70338k3351q2340k06020j97822j55454k50273
9256B1711083l76028l17123j15830J2654J7512O980J4350J4537O2528J72703J83689
9245B1387055j301j75786j15145M1779K1805j05992o5353J08739J14339q0608
9235B1129532j83725r3698l6022j00863p6694J12506K13288Q2164m8407K8789
9225B1026870J57529J34453P1812J61524L10048L00112J55088Q4198J77853L54466
9215B2933953M99414N08753L31750R5450K3043J18681J37074k3968j57800j20240
9205B4346110p2168j46910j78284k9554R0860l4327k27582k09911q7124j47266
$$ plain form
9195 23303844 22970162 22624432 22449593 22335520 22086434 21753810 21544351 21509836 21511974 21423097
9185 21423097 21239326 21069274 21075678 21311331 21574313 21602262 21458480 21492138 21823309 22136939
9175 22136939 22148733 22011007 22036680 22257204 22512896 22774424 23078637 23309022 23359398 23406847
9165 23406847 23707197 24190709 24568353 24795982 25121975 25670321 26266987 26728075 27080277
9156 27080277 27440758 27877838 28435842 29128623 29881443 30619489 31392223 32258794 33115687
9147 33115687 33835638 34499286 35235873 35899469 36218252 36253090 36356070 36611458 36671344 36279249
9137 36279249 35624365 34982693 34314478 33490980 32683388 32184868 31946440 31604108 30973127
9128 30973127 30278221 29838148 29687525 29598944 29400015 29178844 29156366 29385670 29654146 29739238
$$ packed form
9195B3303844l33682l45730j74839j14073k49086l32624k09459l4515K138q8877
9185B1423097j83771j70052O404K35653K62982K7949j43782L3658L31171L13630
9175B2136939J1794j37726K5673K20524K55692K61528L04213K30385N0376M7449
9165B3406847L00350M83512L77644K27629L25993N48346N96666M61088L52202
9156B7080277L60481M37080N58004O92781P52820P38046P72734Q66571Q56893
9147C3115687P19951O63648P36587O63596L18783L4838J02980K55388N9886l92095
9137C6279249o54884o41672o68215q23498q07592m98520k38428l42332o30981
9128C0973127o94906m40073j50623q8581j98929k21171k2478K29304K68476Q5092
$$ plain form
9118 29739238 29689196 29739372 30004879 30402363 30835519 31276899 31685404 32053256 32540436 33324156
9108 33324156 34277213 35060950 35623891 36334592 37485283 38935823 40427761 41969905 43650149
9099 43650149 45298747 46664578 47783580 48855372 49850422 50551754 50921472 51102825 51077734
9090 51077734 50652785 49831402 48891045 47984534 46928237 45532758 43932214 42409290 41043360
9081 41043360 39721223 38414703 37258538 36344649 35571920 34768936 33924944 33230039 32853997
9072 32853997 32725614 32612042 32414321 32273286 32344726 32599225 32927243 33308937 33753288 34190986
9062 34190986 34588233 35059397 35675281 36249200 36540783 36618966 36773407 37078621 37311120 37335544
9052 37335544 37299577 37335379 37304260 37010039 36515595 36082529 35882242 35884616 35956920 35978373 35929574
$$ packed form
9118B9739238n0042N0176K65507L97484M33156M41380M08505L67852M87180P83720
9108C3324156R53057P83737N62941P10701J150691J450540J491938J542144J680244
9099D3650149J648598J365831J119002J071792R95050P01332L69718J81353k5091
9090E1077734m24949q21383r40357r06511j056297j395479j600544j522924j365930
9081D1043360j322137j306520j156165r13889p72729q02984q43992o94905l76042
9072C2853997j28383j13572j97721j41035P1440K54499L28018L81694M44351M37698
9062C4190986L97247M71164O15884N73919K91583P8183J54441L05214K32499K4424
9052C7335544l5967L5802l1119k94221m94444m33066k00287K374P2304K1453m8799
$$ plain form
9041 35929574 35946327 36207965 36700196 37169030 37385920 37385889 37367335 37420438 37436947 37257694 36852466
9030 36852466 36358296 35937135 35574274 35075049 34338422 33553333 32975431 32575256 32121120
9021 32121120 31587799 31218550 31133120 31155948 31157026 31288013 31673627 32098132 32270200 32251122
9011 32251122 32332126 32569551 32740085 32751157 32807353 33080011 33426234 33575191 33474107 33317154
9001 33317154 33280962 33341203 33358022 33266226 33119499 32961258 32736475 32383692 31937856 31442799
8991 31442799 30830529 30037511 29194643 28504507 27934515 27251230 26382292 25497429 24683496
8982 24683496 23839377 23002916 22438534 22184129 21840380 21120293 20326327 19904039 19753998
8973 19753998 19434563 18893197 18495310 18372518 18246414 17953946 17679125 17542388 17388473
$$ packed form
9041C5929574J6753K61638M92231M68834K16890l1j8554N3103J6509j79253m05228
9030C6852466m94170m21161l62861m99225p36627p85089n77902m00175m54136
9021C2121120n33321l69249q5430K2828J078J30987L85614M24505J72068j9078
9011C2251122Q1004K37425J70534J1072N6196K72658L46223J48957j01084j56953
9001C3317154l6192O0241J6819r1796j46727j58241k24783l52783m45836m95057
8991C1442799o12270p93018q42868o90136n69992o83285q68938q84863q13933
8982B4683496q44119q36461n64382k54405l43749p20087p93966m22288j50041
8973A9753998l19435n41366l97887j22792j26104k92468k74821j36737j53915
$$ plain form
8964 17388473 17148294 17019265 17085227 17116909 16977755 16890247 17036744 17210784 17174850 17091709
8954 17091709 17245082 17540132 17665219 17623482 17723642 18089387 18522420 18863010 19188411 19600315
8944 19600315 20049568 20436493 20716801 20872655 20918514 20945503 21037079 21155557 21216550 21205601
8934 21205601 21087424 20711203 20014815 19236673 18669454 18244631 17637826 16788463 16018493
8925 16018493 15564216 15266320 14853196 14303928 13773737 13336685 12967025 12651724 12378837
8916 12378837 12105019 11834223 11627801 11462114 11216107 10894162 10693784 10706871 10714370 10478700
8906 10478700 10118866 9949734 10003839 9978888 9692094 9342368 9207294 9260523 9253285 9074675
8896 9074675 8851263 8709135 8608465 8477594 8382572 8427683 8532819 8474522 8198931 7949986
$$ packed form
8964A7388473k40179j29029O5962L1682j39154q7508J46497J74040l5934q3141
8954A7091709J53373K95050J25087m1737J00160L65745M33033L40590L25401M11904
8944A9600315M49253L86925K80308J55854M5859K6989R1576J18478O0993j0949
8934B1205601j18177l76221o96388p78142n67219m24823o06805q49363p69970
8925A6018493m54277k97896m13124n49268n30191m37052l69660l15301k72887
8916A2378837k73818k70796k06422j65687k46007l21945k00378J3087P499k35670
8906A0478700l59834j69132N4105k4951k86794l49726j35074N3229p238j78610
8896I074675k23412j42128j00670j30871r5022M5111J05136n8297k75591k48945
$$ plain form
8886 7949986 7960257 8110839 8080086 7802628 7568949 7605755 7750799 7691931 7404392 7160401
8876 7160401 7137030 7194048 7096790 6848697 6701824 6843242 7138195 7252000 7037385 6713429
8866 6713429 6574284 6603258 6551044 6368564 6310257 6517056 6744172 6699400 6465871 6340461
8856 6340461 6382439 6406204 6345626 6309900 6286661 6119028 5842180 5725598 5855255 5967063
8846 5967063 5865038 5724970 5759202 5841248 5757440 5620678 5681210 5861607 5861540 5664523 5549957
8835 5549957 5597474 5579763 5424229 5377874 5547383 5649504 5467702 5239834 5282828 5481619
8825 5481619 5499508 5317601 5196585 5215297 5224002 5202931 5285481 5413993 5345146 5069862 4881132
8814 4881132 4910522 4929216 4772905 4650186 4795784 5069766 5173345 5086202 5017720 5044177
$$ packed form
8886G949986J0271J50582l0753k77458k33679L6806J45044n8868k87539k43991
8876G160401k3371N7018r7258k48093j46873J41418K94953J13805k14615l23956
8866F713429j39145K8974n2214j82480n8307K06799K27116m4772k33529j25410
8856F340461M1978K3765o0578l5726k3239j67633k76848j16582J29657J11808
8846E967063j02025j40068L4232Q2046q3808j36762O0532J80397o7j97017j14566
8835E549957M7517j7711j55534m6355J69509J02121j81802k27868M2994J98791
8825E481619J7889j81907j21016J8712Q705k1071Q2550J28512o8847k75284j88730
8814D881132K9390J8694j56311j22719J45598K73982J03579q7143o8482K6457
$$ plain form
8804 5044177 5057225 5006130 4958476 4949234 4951887 4967543 4996644 4983215 4928993 4971747 5183445 5388126
8792 5388126 5373343 5194494 5065380 5040637 5036127 5064015 5167235 5198920 4996887 4743537 4783880
8781 4783880 5061087 5131724 4845355 4600614 4728089 5001888 5053512 4944798 4960657 5066795
8771 5066795 4990461 4726409 4562720 4625738 4748099 4807117 4870909 4947689 4891024 4671333 4492776
8760 4492776 4494653 4537988 4453816 4341101 4416770 4655500 4782843 4630490 4346704 4203704
8750 4203704 4291848 4474263 4590147 4608234 4571492 4486668 4348033 4219058 4181841 4214190 4225912
8739 4225912 4220487 4291813 4434295 4505593 4441644 4359601 4359262 4375942 4343572 4339011 4408742 4413454
8727 4413454 4247883 4076673 4109837 4250773 4240134 4077841 4000646 4067916 4096778 4041234 4095728
$$ packed form
8804E044177J3048n1095m7654r242K653J5656K9101j3429n4222M2754K11698K04681
8792E388126j4783j78849j29114k4743m510K7888J03220L1685k02033k53350M0343
8781D783880K77207P0637k86369k44741J27475K73799N1624j08714J5859J06138
8771E066795p6334k64052j63689O3018J22361N9018O3792P6780n6665k19691j78557
8760D492776J877M3335q4172j12715P5669K38730J27343j52353k83786j43000
8750D203704Q8144J82415J15884J8087l6742q4824j38635j28975l7217L2349J1722
8739D225912n425P1326J42482P1298o3949q2043l39J6680l2370m561O9731M712
8727D413454j65571j71210L3164J40936j0639j62293p7195O7270K8862n5544N4494
$$ plain form
8716 4095728 4309825 4415998 4226936 3952100 3900096 4054189 4166379 4131822 4046704 3989288
8706 3989288 3953270 3944170 3964764 3946656 3848185 3771747 3832662 3960180 3993971 3946006 3982242
8695 3982242 4132102 4200436 4045111 3806705 3746191 3915646 4100902 4089686 3910272 3759377
8685 3759377 3747207 3801745 3826329 3842652 3908643 3987242 4013140 4027718 4107224 4197278 4181533
8674 4181533 4095659 4086155 4147967 4115345 3966387 3912450 4073010 4264657 4268272 4141275 4089105
8663 4089105 4152925 4207080 4181337 4119749 4075948 4081662 4159674 4260900 4266090 4147801 4032462
8652 4032462 4007831 4000711 3957902 3982782 4130071 4232064 4141188 4004038 4051086 4225360 4285704
8641 4285704 4202864 4172767 4266775 4342337 4312795 4261597 4255759 4255561 4243795 4267307 4331062 4399973
$$ packed form
8716D095728K14097J06173j89062k74836n2004J54093J12190l4557q5118n7416
8706C989288l6018r100K0594j8108r8471p6438O0915J27518L3791m7965L6236
8695C982242J49860O8334j55325k38406o0514J69455J85256j1216j79414j50895
8685C759377j2170N4538K4584J6323O5991P8599K5898J4578P9506R0054j5745
8674D181533q5874r504O1812l2622j48958n3937J60560J91647L615j26997n2170
8663D089105O3820N4155k5743o1588m3801N714P8012J01226N190j18289j15339
8652D032462k4631p120m2809K4880J47289J01993r0876j37150M7048J74274O0344
8641D285704q2840l0097R4008P5562k9542n1198n838j98j1766K3512O3755O8911
$$ plain form
8629 4399973 4483439 4569424 4548454 4392885 4312014 4481805 4714624 4694638 4466976 4354256
8619 4354256 4438331 4509426 4513003 4608439 4735459 4601125 4243865 4137906 4497754 4905112
8609 4905112 4925239 4715012 4675043 4830505 4949240 5013249 5157962 5320181 5338630 5285549
8599 5285549 5350616 5494647 5530642 5446695 5358544 5266125 5154279 5187328 5464054 5715998 5629601
8588 5629601 5365636 5352094 5625687 5810434 5738652 5648629 5708969 5776671 5749000 5767026 5905166
8577 5905166 5995869 5947030 5941851 6128682 6357633 6414854 6314272 6191169 6096490 6051924 6131954
8566 6131954 6340177 6551581 6689978 6807295 6905307 6878262 6738073 6685807 6825634 7003433
8556 7003433 7065481 7075123 7115248 7079604 6867167 6634855 6641760 6915863 7225415 7321696 7133527
$$ packed form
8629D399973Q3466Q5985k0970j55569q0871J69791K32819j9986k27662j12720
8619D354256Q4075P1095L577R5436J27020j34334l57260j05959L59848M07358
8609D905112K0127k10227l9969J55462J18735O4009J44713J62219J8449n3081
8599E285549O5067J44031L5995q3947q8151r2419j11846L3049K76726K51944q6397
8588E629601k63965j3542K73593J84747p1782r0023O0340O7702k7671J8026J38140
8577E905166R0703m8839n179J86831K28951N7221j00582j23103r4679m4566Q0030
8566F131954K08223K11404J38397J17317R8012k7045j40189n2266J39827J77799
8556G003433O2048R642M0125l5644k12437k32312O905K74103L09552R6281j88169
$$ plain form
8545 7133527 6828416 6730197 7010548 7404861 7450580 7095356 6810505 6959243 7331289 7515721
8535 7515721 7464632 7398025 7367791 7261250 7116039 7101889 7236026 7376816 7454303 7489694 7463614
8524 7463614 7384585 7395316 7580340 7768930 7771849 7699290 7770696 7927085 7949902 7865568 7873636
8513 7873636 7942315 7876768 7768607 7932584 8330588 8508379 8265537 7977125 8019772 8241225
8503 8241225 8290547 8176414 8154712 8265763 8336051 8328810 8367102 8449755 8429168 8281857 8167946
8492 8167946 8181863 8225229 8177326 8051876 7932434 7859280 7834149 7860393 7922782 7967356 7945306
8481 7945306 7865968 7780852 7712994 7626556 7496651 7389636 7398460 7485643 7502349 7423832 7426007
8470 7426007 7597297 7718104 7549438 7250659 7221858 7526102 7763125 7612903 7255261 7100631
$$ packed form
8545G133527l05111r8219K80351L94313M5719l55224k84851J48738L72046J84432
8535G515721n1089o6607l0234j06541j45211j4150J34137J40790P7487L5391k6080
8524G463614p9029J0731J85024J88590K919p2559P1406J56389K2817q4334Q068
8513G873636O8679o5547j08161J63977L98004J77791k42842k88412M2647K21453
8503H241225M9322j14133k1702J11051P0288p241L8292Q2653k0587j47311j13911
8492H167946J3917M3366m7903j25450j19442p3154k5131K6244O2389M4574k2050
8481G945306p9338q5116o7858q6438j29905j07015Q824Q7183J6706p8517K175
8470G426007J71290J20807j68666k98779k8801L04244K37023j50222l57642j54630
$$ plain form
8460 7100631 7287060 7602114 7779239 7732062 7568681 7461268 7454369 7409064 7238628 7127299
8450 7127299 7293504 7581245 7605257 7335909 7172113 7313453 7456160 7335833 7178734 7272513
8440 7272513 7424765 7286752 6978800 6904266 7068821 7086383 6840385 6656229 6739343 6869589
8430 6869589 6800973 6611834 6479602 6393602 6282256 6202223 6216078 6248410 6218525 6178944 6195608
8419 6195608 6216741 6171733 6088255 6020159 5965270 5927113 5950171 6030767 6094070 6100396 6068539 5982723
8407 5982723 5816930 5660835 5647253 5726422 5706627 5569002 5528103 5688975 5856148 5820476
8397 5820476 5656643 5573991 5606509 5614358 5507276 5335028 5214312 5240816 5394999 5496305
8387 5496305 5375159 5126562 5025634 5138649 5227024 5130917 5008276 5029164 5064352 4917713
$$ packed form
8460G100631J86429L15054J77125m7177j63381j07413o899m5305j70436j11329
8450G127299J66205K87741K4012k69348j63796J41340J42707j20327j57099R3779
8440G272513J52252j38013l07952p4534J64555J7562k45998j84156Q3114J30246
8430F869589o8616j89139j32232q6000j11346q0033J3855L2332k9885l9581J6664
8419F195608K1133m5008q3478o8096n4889l8157K3058Q0596O3303O326l1857q5816
8407E982723j65793j56095j3582P9169j9795j37625m0899J60872J67173l5672
8397E820476j63833q2652L2518P849j07082j72248j20716K6504J54183J01306
8387E496305j21146k48597j00928J13015Q8375r6107j22641K0888L5188j46639
$$ plain form
8377 4917713 4697572 4681813 4904899 5133449 5205225 5165711 5092996 4997123 4900225 4848187 4829049
8366 4829049 4799920 4775406 4779433 4756520 4652386 4531124 4491222 4524032 4571542 4643580 4748612
8355 4748612 4804139 4763455 4725980 4755694 4714213 4487059 4261837 4321219 4629204 4890609 4972482
8344 4972482 4983028 4961706 4811265 4574162 4467205 4547947 4606957 4493793 4321510 4254527
8334 4254527 4311695 4461283 4680948 4836885 4752733 4511873 4438901 4641556 4824262 4727181
8324 4727181 4500773 4430992 4516972 4568779 4538601 4491518 4397392 4222841 4113739 4215955 4404487
8313 4404487 4456119 4411650 4482764 4650935 4667328 4461993 4259515 4227218 4271371 4276640 4309482
8302 4309482 4443129 4562951 4511805 4325340 4183830 4187489 4281421 4365324 4397361 4399547 4402387
$$ packed form
8377D917713k20141j5759K23086K28550P1776l9514p2715r5873r6898n2038j9138
8366D829049k9129k4514M027k2913j04134j21262l9902L2810M7510P2038J05032
8355D748612N5527m0684l7475K9714m1481k27154k25222N9382L07985K61405Q1873
8344D972482J0546k1322j50441k37103j06957Q0742N9010j13164j72283o6983
8334D254527N7168J49588K19665J55937q4152k40860p2972K02655J82706r7081
8324D727181k26408o9781Q5980N1807l0178m7083r4126j74551j09102J02216J88532
8313D404487N1632m4469P1114J68171J6393k05335k02478l2297M4153N269L2842
8302D309482J33647J19822n1146j86465j41510L659R3932Q3903L2037K186K840
$$ plain form
8291 4402387 4391611 4325778 4222148 4171432 4210499 4240184 4157750 4018847 3963261 4027776 4149167
8280 4149167 4299583 4472671 4574420 4499052 4309021 4178599 4158310 4156157 4144348 4194368 4295519
8269 4295519 4345347 4352605 4430594 4542215 4501599 4312963 4228353 4322775 4307776 4004395 3729608
8258 3729608 3876414 4298289 4501112 4353222 4195457 4252009 4352265 4337622 4349958 4509881
8248 4509881 4627931 4507900 4308180 4305779 4455610 4489190 4360405 4280395 4330513 4347744 4248552
8237 4248552 4191659 4303864 4466286 4518564 4498185 4515046 4534713 4473458 4404291 4465151 4616743
8226 4616743 4690641 4661205 4679075 4820405 4981593 5060010 5071321 5036126 4922289 4782821 4786008
8215 4786008 4987945 5208605 5264073 5203595 5175955 5178978 5121519 5049965 5108136 5299082 5468995
$$ packed form
8291D402387j0776o5833j03630n0716L9067K9685q2434j38903n5586O4515J21391
8280D149167J50416J73088J01749p5368j90031j30422k0289k153j1809N0020J01151
8269D295519M9828P258P7989J11621m0616j88636q4610R4422j4999l03381k74787
8258C729608J46806M21875K02823j47890j57765N6552J00256j4643J2336J59923
8248D509881J18050j20031j99720k401J49831L3580j28785q0010N0118J7231r9192
8237D248552n6893J12205J62422N2278k0379J6861J9667o1255o9167O0860J51592
8226D616743P3898k9436J7870J41330J61188P8417J1311l5195j13837j39468L187
8215D786008K01937K20660N5468o0478k7640L023n7459p1554N8171J90946J69913
$$ plain form
8204 5468995 5521096 5485606 5395014 5263872 5181894 5234852 5324395 5271475 5124585 5135463 5364548
8193 5364548 5557422 5532125 5445111 5495416 5591573 5556161 5483987 5601354 5868065 6024652 6003761
8182 6003761 5998572 6102537 6170145 6114229 6075580 6159425 6221213 6092425 5867023 5779888 5897685
8171 5897685 6094671 6260853 6373763 6415714 6382780 6359187 6438660 6575898 6654036 6702718 6887370
8160 6887370 7225361 7467339 7388669 7109416 6968547 7098221 7280049 7278456 7179735 7258904
8150 7258904 7564523 7819410 7795222 7635701 7659370 7915473 8130140 8115981 8043460 8182900
8140 8182900 8504876 8718003 8671120 8541972 8583917 8823404 9095297 9281770 9396127 9469069
8130 9469069 9483656 9455314 9480685 9634921 9865284 10060133 10203471 10375344 10585442 10706748
$$ packed form
8204E468995N2101l5490r0592j31142q1978N2958Q9543n2920j46890J0878K29085
8193E364548J92874k5297q7014N0305R6157l5412p2174J17367K66711J56587k0891
8182F003761n189J03965O7608n5916l8649Q3845O1788j28788k25402q7135J17797
8171E897685J96986J66182J12910M1951l2934k3593P9473J37238P8138M8682J84652
8160F887370L37991K41978p8670k79253j40869J29674J81828j593r8721P9169
8150G258904L05619K54887k4188j59521K3669K56103K14667j4159p2521J39440
8140H182900L21976K13127m6883j29148M1945K39487K71893J86473J14357P2942
8130I469069J4587k8342K5371J54236K30363J94849J43338J71873K10098J21306
$$ plain form
8120 10706748 10654777 10565726 10664022 10952059 11178402 11187942 11169962 11405796 11847054 12155010
8110 12155010 12174487 12145542 12329650 12619443 12728086 12649070 12662421 12899761 13175636 13325981
8100 13325981 13460668 13722064 14001931 14126554 14187770 14425578 14836054 15161239 15279466 15352072
8090 15352072 15516273 15669286 15685874 15663532 15790115 16091859 16460270 16826680 17165529 17416725
8080 17416725 17565863 17741430 18074356 18494801 18812017 18971557 19096147 19290939 19551664
8071 19551664 19864356 20249655 20674446 21036881 21286891 21485623 21719348 22016417 22354643
8062 22354643 22691341 22995189 23299306 23680577 24125836 24504257 24779653 25139900 25731708
8053 25731708 26353905 26670886 26715674 26895675 27433278 28075872 28493310 28717804 29003538 29447977
$$ packed form
8120A0706748n1971q9051R8296K88037K26343R540j7980K35834M41258L07956
8110A2155010J9477k8945J84108K89793J08643p9016J3351K37340K75875J50345
8100A3325981J34687K61396K79867J24623O1216K37808M10476L25185J18227P2606
8090A5352072J64201J53013J6588k2342J26583L01744L68411L66410L38849K51196
8080A7416725J49138J75567L32926M20445L17216J59540J24590J94792K60725
8071A9551664L12692L85299M24791L62435K50010J98732K33725K97069L38226
8062B2354643L36698L03848L04117L81271M45259L78421K75396L60247N91808
8053B5731708O22197L16981M4788J80001N37603O42594M17438K24494K85734M44439
$$ plain form
8043 29447977 29970405 30518232 31060448 31474186 31676364 31824099 32165497 32698387 33168628
8034 33168628 33418468 33563165 33790382 34136545 34515367 34853335 35139863 35414843 35736870
8025 35736870 36112349 36464550 36739653 37016744 37416268 37911987 38342527 38621770 38838366
8016 38838366 39118186 39472069 39823448 40134549 40460570 40882779 41390007 41842966 42115539
8007 42115539 42279468 42549971 43000698 43451808 43734805 43947300 44299972 44803307 45279359
7998 45279359 45628575 45911304 46201606 46531380 46946939 47441924 47864605 48091835 48277109
7989 48277109 48698675 49345766 49896481 50165683 50344230 50704306 51282216 51960073 52653273
7980 52653273 53284510 53766100 54166389 54731483 55584045 56546661 57411767 58223210 59114110
$$ packed form
8043B9447977N22428N47827N42216M13738K02178J47735L41398N32890M70241
8034C3168628K49840J44697K27217L46163L78822L37968K86528K74980L22027
8025C5736870L75479L52201K75103K77091L99524M95719M30540K79243K16596
8016C8838366K79820L53883L51379L11101L26021M22209N07228M52959K72573
8007D2115539J63929K70503M50727M51110K82997K12495L52672N03335M76052
7998D5279359L49216K82729K90302L29774M15559M94985M22681K27230J85274
7989D8277109M21566O47091N50715K69202J78547L60076N77910O77857O93200
7980E2653273O31237M81590M00289N65094Q52562R62616Q65106Q11443Q90900
$$ plain form
7971 59114110 60032936 60863323 61697575 62736129 63973321 65222697 66431123 67740455 69226655
7962 69226655 70785804 72325568 73903483 75617170 77479180 79443977 81464145 83502109
7954 83502109 85577002 87800029 90264897 92906812 95573727 98235949 101020137 104032907
7946 104032907 107254255 110613510 114069312 117591620 121141772 124687286 128182544 131540390
7938 131540390 134663925 137467107 139817848 141537616 142535575 142852613 142466194 141158173
7930 141158173 138740989 135351962 131360816 127037723 122467520 117708857 112825226 107810023
7922 107810023 102718767 97853117 93549213 89750778 86044969 82190714 78384663 74930661
7914 74930661 71880568 69109538 66526953 64072688 61682031 59390848 57330003 55513324
$$ packed form
7971E9114110R18826Q30387Q34252J038554J237192J249376J208426J309332J486200
7962F9226655J559149J539764J577915J713687J862010J964797K020168K037964
7954H3502109K074893K223027K464868K641915K666915K662222K784188L012770
7946A04032907L221348L359255L455802L522308L550152L545514L495258L357846
7938A31540390L123535K803182K350741J719768R97959L17038l86419j308021
7930A41158173k417184l389027l991146m323093m570203m758663m883631n015203
7922A07810023n091256m865650m303904l798435l705809l854255l806051l454002
7914G4930661l050093k771030k582585k454265k390657k291183k060845j816679
$$ plain form
7906 55513324 53790929 52100140 50561102 49201868 47809179 46236198 44673954 43402566
7898 43402566 42406212 41441230 40380973 39298524 38294355 37422492 36712993 36106763 35442618
7889 35442618 34648557 33852450 33172926 32530615 31823086 31137951 30591769 30091995 29486697
7880 29486697 28836927 28296091 27812960 27216261 26534951 25979619 25637809 25407957 25181347
7871 25181347 24871185 24350871 23627466 22993204 22706336 22589668 22270496 21752629 21365880
7862 21365880 21175217 20886877 20405047 20024918 19915205 19826214 19521892 19123080 18782539 18382668
7852 18382668 17846770 17425804 17340389 17396693 17290015 17060301 16910121 16789661 16536202 16251727
7842 16251727 16147958 16133119 15938629 15579525 15316815 15213726 15094122 14912127 14799563 14747624
$$ packed form
7906E5513324j722395j690789j539038j359234j392689j572981j562244j271388
7898D3402566r96354r64982j060257j082449j004169q71863p09499o06230o64145
7889C5442618p94061p96107o79524o42311p07529o85135n46182m99774o05298
7880B9486697o49770n40836m83131n96699o81310n55332l41810k29852k26610
7871B5181347l10162n20314p23405o34262k86868j16668l19172n17867l86749
7862B1365880j90663k88340m81830l80129j09713q8991l04322l98812l40541l99871
7852A8382668n35898m20966q5415N6304j06678k29714j50180j20460k53459k84475
7842A6251727j03769j4839j94490l59104k62710j03089j19604j81995j12564n1939
$$ plain form
7832 14747624 14594619 14347766 14174973 14055009 13789905 13405064 13168551 13144274 13104601 12979152
7822 12979152 12976850 13106434 13011917 12546129 12112351 12089395 12241386 12101754 11698953 11455150
7812 11455150 11506636 11574497 11467508 11296678 11157211 10965303 10700447 10510674 10473703 10494452
7802 10494452 10511590 10557361 10544149 10284203 9856577 9660828 9884673 10163230 10053479 9668264
7792 9668264 9496275 9679514 9850381 9723510 9479141 9391882 9382865 9212544 8927095 8793875
7782 8793875 8866091 8923860 8858492 8816056 8876326 8872652 8692291 8514561 8529259 8607734 8517892
7771 8517892 8326442 8279311 8353311 8263674 7937608 7663045 7676428 7869211 8011419 8022664
7761 8022664 7903675 7645933 7362811 7280597 7421212 7504794 7352983 7167328 7185679 7290496
$$ packed form
7832A4747624j53005k46853j72793j19964k65104l84841k36513k4277l9673j25449
7822A2979152k302J29584r4517m65788m33778k2956J51991j39632m02801k43803
7812A1455150N1486O7861j06989j70830j39467j91908k64856j89773l6971K0749
7802A0494452J7138M5771j3212k59946m27626j95749K23845K78557j09751l85215
7792I668264j71989J83239J70867j26871k44369q7259r017j70321k85449j33220
7782H793875P2216N7769o5368m2436O0270l674j80361j77730J4698P8475q9842
7771H517892j91450m7131P4000q9637l26066k74563J3383J92783J42208J1245
7761H022664j18989k57742k83122q2214J40615Q3582j51811j85655J8351J04817
$$ plain form
7751 7290496 7245200 7121506 7146901 7268713 7249362 7115315 7113181 7238086 7213972 6988836 6843261
7740 6843261 6895488 6894689 6689594 6536011 6678448 6924665 6939740 6741907 6593603 6561197 6499880
7729 6499880 6375554 6295551 6263812 6183502 6096605 6169447 6406528 6582434 6508596 6224051 5903177
7718 5903177 5704514 5706495 5853746 5966592 5928423 5844442 5882370 5995237 5975470 5772076 5567025
7707 5567025 5511071 5553465 5575955 5546112 5491913 5452433 5483678 5590653 5650571 5550300 5392041
7696 5392041 5375843 5473620 5450188 5252047 5113994 5175110 5256998 5193586 5126224 5230802 5364533
7685 5364533 5283926 5071199 5016634 5147063 5202254 5074641 4950352 4957362 4974144 4900446 4854012
7674 4854012 4938433 5025569 4951486 4775786 4670894 4674713 4719854 4798397 4916633 4970481 4860637
$$ packed form
7751G290496m5296j23694K5395J21812j9351j34047k134J24905k4114k25136j45575
7740F843261N2227p99k05095j53583J42437K46217J5075j97833j48304l2406o1317
7729F499880j24326q0003l1739q0310q6897P2842K37081J75906p3838k84545l20874
7718E903177j98663J981J47251J12846l8169q3981L7928J12867j9767k03394k05051
7707E567025n5954M2394K2490k9843n4199l9480L1245J06975N9918j00271j58259
7696E392041j6198R7777k3432j98141j38053O1116Q1888o3412o7362J04578J33731
7685E364533q0607k12727n4565J30429N5191j27613j24289P010J6782p3698m6434
7674D854012Q4421Q7136p4083j75700j04892L819M5141P8543J18236N3848j09844
$$ plain form
7663 4860637 4689361 4658016 4781935 4877122 4833679 4737972 4698597 4707731 4723904 4752486 4779096
7652 4779096 4745039 4661554 4636759 4706377 4743667 4639496 4479404 4418924 4455168 4466254 4434022
7641 4434022 4459032 4544511 4537187 4362599 4189220 4232257 4455493 4597005 4488230 4242247
7631 4242247 4093412 4129740 4243071 4296112 4259365 4185618 4126545 4115835 4181132 4301623 4371570
7620 4371570 4288138 4096946 3978072 4038647 4173671 4197898 4080304 3969868 3996508 4119683
7610 4119683 4191378 4120515 3958497 3849443 3890165 4012215 4035602 3891632 3742704 3781111
7600 3781111 3944186 3979245 3809602 3665884 3764265 3999453 4098491 3984440 3827492 3783615
7590 3783615 3843105 3930659 4006330 4036789 3982500 3859507 3741030 3674444 3655621 3678298 3730717
$$ packed form
7663D860637j71276l1345J23919R5187m3443r5707l9375R134J6173K8582K6610
7652D779096l4057q3485k4795O9618L7290j04171j60092o0480L6244J1086l2232
7641D434022K5010Q5479p324j74588j73379M3037K23236J41512j08775k45983
7631D242247j48835L6328J13331N3041l6747p3747n9073j0710O5297J20491O9947
7620D371570q3432j91192j18874O0575J35024K4227j17594j10436K6640J23175
7610D119683P1695p0863j62018j09054M0722J22050K3387j43970j48928L8407
7600C781111J63075L5059j69643j43718R8381K35188R9038j14051j56948m3877
7590C783615N9490Q7554P5671L0459n4289j22993j18477o6586j8823K2677N2419
$$ plain form
7579 3730717 3756467 3715766 3678341 3744308 3870795 3902472 3794561 3676109 3657246 3705884 3760950
7568 3760950 3824099 3869773 3811745 3659505 3574719 3654758 3782052 3818205 3825734 3934817 4089485
7557 4089485 4114770 3980364 3819023 3719089 3666513 3659537 3708680 3748001 3720135 3722067 3875078
7546 3875078 4074835 4096626 3950397 3875445 3940291 3931393 3746943 3611570 3708666 3854165 3796543
7535 3796543 3646314 3694314 3916082 3995359 3824402 3660591 3720648 3896078 3993387 4025464
7525 4025464 4089091 4122382 4006773 3839460 3879038 4183487 4471541 4450581 4190867 4034213
7515 4034213 4144411 4306125 4255098 4075075 4080473 4348055 4597196 4598149 4477996 4472142 4555679
7504 4555679 4543205 4441986 4445435 4597304 4704946 4629697 4468595 4383384 4407718 4491730 4601711
$$ packed form
7579C730717K5750m0701l7425O5967J26487L1677j07911j18452j8863M8638N5066
7568C760950O3149M5674n8028j52240q4786Q0039J27294L6153P529J09083J54668
7557D089485K5285j34406j61341r9934n2576o976M9143L9321k7866J932J53011
7546C875078J99757K1791j46229p4952O4846q898j84450j35373R7096J45499n7622
7535C796543j50229M8000K21768P9277j70957j63811O0057J75430R7309L2077
7525D025464O3627L3291j15609j67313L9578L04449K88054k0960k59714j56654
7515D034213J10198J61714n1027j80023N398K67582K49141R53j20153n854Q3537
7504D555679j2474j01219L449J51869J07642p5249j61102q5211K4334Q4012J09981
$$ plain form
7493 4601711 4705030 4765343 4806057 4879876 4949085 4915070 4791418 4713756 4750046 4846064 4979515
7482 4979515 5184041 5375366 5370211 5174132 5037429 5098475 5189860 5162107 5168380 5390158 5676213
7471 5676213 5748944 5638235 5601663 5701332 5781290 5813657 5921603 6055203 6003464 5800222 5770740
7460 5770740 6040744 6318311 6345122 6270664 6345228 6502692 6544550 6542237 6713001 6997963 7113189
7449 7113189 7011466 6975050 7188778 7494993 7683711 7798928 7998021 8266258 8453183 8514426
7439 8514426 8555683 8661970 8814179 8979182 9174220 9410336 9652446 9882540 10143031 10454138
7429 10454138 10728267 10855425 10874037 10960907 11210637 11513792 11723023 11848562 11975342 12069227
7419 12069227 12042220 11978228 12076114 12322910 12440716 12275033 12049433 12067211 12302879 12487932
$$ packed form
7493D601711J03319O0313M0714P3819O9209l4015j23652p7662L6290R6018J33451
7482D979515K04526J91325n155j96079j36703O1046R1385k7753O273K21778K86055
7471E676213P2731j10709l6572R9669P9958L2367J07946J33600n1739k03242k9482
7460E770740K70004K77567K6811p4458P4564J57464M1858k313J70764K84962J15226
7449G113189j01723l6416K13728L06215J88718J15217J99093K68237J86925O1243
7439H514426M1257J06287J52209J65003J95038K36116K42110K30094K60491L11107
7429A0454138K74129J27158J8612Q6870K49730L03155K09231J25539J26780R3885
7419A2069227k7007o3992R7886K46796J17806j65683k25600J7778K35668J85053
$$ plain form
7409 12487932 12503967 12470798 12489220 12523412 12558372 12673598 12888566 13076193 13112254 13029931 12977949
7398 12977949 13084737 13373301 13738296 14010904 14127256 14219184 14450693 14799208 15118533 15381072
7388 15381072 15693769 16081166 16443963 16772706 17209892 17811828 18414205 18845319 19134645
7379 19134645 19389708 19586749 19619612 19470158 19203553 18859359 18454061 18026706 17585462 17080718
7369 17080718 16524407 16047339 15726381 15447146 15074002 14669810 14382120 14181157 13915159
7360 13915159 13607329 13472915 13578008 13673864 13504261 13165355 13004093 13181517 13468251 13524145
7350 13524145 13305312 13094995 13128964 13304535 13352534 13216094 13097644 13146017 13286666 13411853
7340 13411853 13546585 13715953 13818724 13784995 13726535 13772294 13873666 13934551 14006022 14158066
$$ packed form
7409A2487932J6035l3169J8422L4192L4960J15226K14968J87627L6061q2323n1982
7398A2977949J06788K88564L64995K72608J16352R1928K31509L48515L19325K62539
7388A5381072L12697L87397L62797L28743M37186O01936O02377M31114K89326
7379A9134645K55063J97041L2863j49454k66605l44194m05298m27355m41244n04744
7369A7080718n56311m77068l20958k79235l73144m04192k87690k00963k65998
7360A3915159l07830j34414J05093R5856j69603l38906j61262J77424K86734N5894
7350A3524145k18833k10317L3969J75571M7999j36440j18450M8373J40649J25187
7340A3411853J34732J69368J02771l3729n8460M5759J01372O0885P1471J52044
$$ plain form
7330 14158066 14276201 14206752 14005127 13808176 13567452 13183910 12806796 12658686 12616737 12353996
7320 12353996 11901337 11637631 11633485 11470939 10932725 10433311 10418488 10674176 10649228 10245612
7310 10245612 9854477 9723705 9713099 9657282 9588798 9540693 9433108 9247956 9089241 8994883
7300 8994883 8876259 8697959 8542582 8451789 8369364 8283198 8259788 8288765 8245024 8061964 7816837
7289 7816837 7604991 7449400 7358820 7344542 7346985 7267240 7100749 6930571 6780813 6598733
7279 6598733 6382322 6188903 6014070 5805704 5599610 5488036 5455564 5414376 5392574 5482203
7269 5482203 5595572 5521032 5273776 5128924 5203083 5264611 5111660 4885693 4798440 4768583
7259 4768583 4599407 4363802 4313616 4473677 4605985 4573817 4498319 4512110 4554651 4486647 4277739
$$ packed form
7330A4158066J18135o9449k01625j96951k40724l83542l77114j48110m1949k62741
7320A2353996m52659k63706m146j62546n38214m99414j4823K55688k4948m03616
7310A0245612l91135j30772j0606n5817o8484m8105j07585j85152j58715r4358
7300H994883j18624j78300j55377r0793q2425q6166k3410K8977m3741j83060k45127
7289G816837k11846j55591r0580j4278K443p9745j66491j70178j49758j82080
7279F598733k16411j93419j74833k08366k06094j11574l2472m1188k1802Q9629
7269E482203J13369p4540k47256j44852P4159O1528j52951k25967q7253k9857
7259D768583j69176k35605n0186J60061J32308l2168p5498J3791M2541o8004k08908
$$ plain form
7248 4277739 4015812 3811614 3729299 3749110 3781919 3760904 3703177 3644260 3563878 3441064 3329544
7237 3329544 3297595 3330721 3363500 3367999 3352843 3329016 3329634 3389114 3446421 3369477 3153919 2983856
7225 2983856 2990289 3064113 3036632 2931567 2883234 2906326 2923600 2940406 3002341 3040483 2954985
7214 2954985 2815628 2788389 2882104 2943924 2888094 2762947 2619844 2488891 2450541 2542764 2624384
7203 2624384 2527799 2327277 2252391 2350581 2446810 2429342 2359874 2305723 2280285 2334409 2476469
7192 2476469 2537683 2387804 2237888 2386425 2682676 2660294 2261112 1961341 2026595 2128520
7182 2128520 1969948 1818283 2011744 2314879 2260950 1894209 1671268 1759829 1905323 1925630
7172 1925630 1900375 1888460 1857224 1895048 2118994 2358212 2302912 2003002 1840602 1939216 1989026
$$ packed form
7248D277739k61927k04198q2315J9811L2809k1015n7727n8917q0382j22814j11520
7237C329544l1949L3126L2779M499j5156k3827O18N9480N7307p6944k15558j70063
7225B983856O433P3824k7481j05065m8333K3092J7274J6806O1935L8142q5498
7214B954985j39357k7239R3715O1820n5830j25147j43103j30953l8350R2223Q1620
7203B624384r6585k00522p4886R8190R6229j7468o9468n4151k5438N4124J42060
7192B476469O1214j49879j49916J48537K96251k2382l99182k99771O5254J01925
7182B128520j58572j51665J93461L03135n3929l66741k22941Q8561J45494K0307
7172A925630k5255j1915l1236L7824K23946K39218n5300k99910j62400R8614M9810
$$ plain form
7161 1989026 1789353 1587724 1664535 1884948 1925044 1737296 1541398 1486528 1541367 1636662
7151 1636662 1734125 1789815 1772116 1699761 1612083 1545889 1548871 1627324 1679872 1598072 1432790
7140 1432790 1332092 1328299 1345152 1393976 1553538 1745886 1766506 1587636 1406584 1338501 1304002
7129 1304002 1286429 1413446 1656470 1740966 1549113 1351368 1402025 1532735 1427753 1129417
7119 1129417 961207 1042865 1174254 1172651 1082447 1042338 1122047 1292143 1432407 1410280 1258373
7108 1258373 1191188 1325088 1492676 1484074 1352385 1297586 1354350 1399268 1386113 1367172 1339600
7097 1339600 1261773 1172300 1130061 1110605 1111233 1228904 1444390 1493386 1216296 890260 894129
7086 894129 1154473 1282213 1179831 1102821 1136132 1062245 836136 758415 999432 1311746
$$ packed form
7161A989026j99673k01629P6811K20413M0096j87748j95898n4870N4839R5295
7151A636662R7463N5690j7699p2355q7678o6194K982P8453N2548q1800j65282
7140A432790j00698l793J6853M8824J59562J92348K0620j78870j81052o8083l4499
7129A304002j7573J27017K43024Q4496j91853j97745N0657J30710j04982k98336
7119A129417j68210Q1658J31389j603r0204m0109P9709J70096J40264k2127j51907
7108A258373o7185J33900J67588q602j31689n4799N6764M4918j3155j8941k7572
7097A339600p7827q9473m2239j9456O28J17671K15486M8996k77090l26036L869
7086H94129K60344J27740j02382p7010L3311p3887k26109p7721K41017L12314
$$ plain form
7076 1311746 1414955 1352566 1268017 1135209 945134 876610 1013119 1126705 1016040 845867
7066 845867 863886 976124 927940 761391 744987 922683 1067702 1070071 1061804 1120706 1119896 957355
7054 957355 737357 632324 692436 845938 984132 1019534 952672 888823 908954 951157 916123
7043 916123 845640 867557 988254 1076361 1054105 985466 961916 995624 1034122 1010524 894478
7032 894478 755122 728766 849701 974278 963697 871682 841838 894139 946488 981760 1041177
7021 1041177 1097596 1087240 1032419 989786 925460 802325 737436 871487 1100251 1151492 956585
7010 956585 748352 738889 880066 1009428 1064129 1055782 969165 800062 621774 533905 578253
6999 578253 721568 872356 933104 907772 919484 1034264 1139310 1126215 1100541 1208031 1327218
$$ packed form
7076A311746J03209o2389q4549j32808j90075o8524J36509J13586j10665j70173
7066H45867J8019J12238m8184j66549j6404J77696J45019K369q267N8902q10j62541
7054I57355k19998j05033O0112J53502J38194L5402o6862o3849K0131M2203l5034
7043I16123p0483K1917J20697Q8107k2256o8639k3550L3708L8498k3598j16046
7032H94478j39356k6356J20935J24577j0581r2015k9844N2301N2349L5272N9417
7021A041177N6419j0356n4821m2633o4326j23135o4889J34051K28764N1241j94907
7010I56585k08233r463J41177J29362N4701q347q6617j69103j78288q7869M4348
6999E78253J43315J50788O0748k5332J1712J14780J05046j3095k5674J07490J19187
$$ plain form
6988 1327218 1205133 889155 726195 870339 1080418 1118761 1067642 1075632 1045431 819468
6978 819468 508020 379832 508248 722229 844048 817128 673798 533120 563504 798117
6968 798117 1044256 1106026 1027801 985519 1018695 1030669 997206 1000383 1064441 1102743 1044733 917833
6956 917833 793881 720880 703608 709069 706692 710654 734603 727871 660232 636341 753844 866260
6944 866260 736582 463552 443318 778474 1058364 955017 717473 748862 967442 1002973
6934 1002973 839125 790517 919034 944214 755199 581428 571454 583553 510507 470939 538153
6923 538153 578841 512690 475964 584035 751760 862478 905998 874724 755397 675676 784826
6912 784826 941053 847894 571389 524411 799538 959973 731097 454860 516278 732164
$$ packed form
6988A327218j22085l15978j62960J44144K10079L8343n1119P990l0201k25963
6978H19468l11448j28188J28416K13981J21819k6920j43330j40678L0384K34613
6968G98117K46139O1770p8225m2282L3176J1974l3463L177O4058L8302n8010j26900
6956I17833j23952p3001j7272N461k377L962K3949o732o7639k3891J17503J12416
6944H66260j29678k73030k0234L35156K79890j03347k37544L1389K18580L5531
6934A002973j63848m8608J28517K5180j89015j73771r974J2099p3046l9568O7214
6923E38153M0688o6151l6726J08071J67725J10718M3520l1274j19327p9721J09150
6912G84826J56227r3159k76505m6978K75127J60435k28876k76237O1418K15886
$$ plain form
6902 732164 746697 676170 828435 1041888 904225 505929 373774 654379 922590 883683
6892 883683 750121 766004 820470 756012 683208 741842 839047 845732 810942 802898 781009 781370
6880 781370 949212 1204485 1183413 765606 371238 416661 715348 786436 573857 440257
6870 440257 539891 639046 580787 518983 577308 623062 551945 513278 635292 741545 591479
6859 591479 276114 125982 272548 516040 629134 602478 543880 494063 438741 405270 433754
6848 433754 483822 460885 338829 197356 131131 171615 302631 486105 640338 661432 540183
6837 540183 422139 462966 626691 714831 617485 450479 393510 463620 526241 490689 406539
$$ packed form
6902G32164J4533p0527J52265K13453j37663l98296j32155K80605K68211l8907
6892H83683j33562J5883N4466o4458p2804N8634R7205O685l4790q044k1889L61
6880G81370J67842K55273k1072m17807l94368M5423K98687P1088k12579j33600
6870D40257R9634R9155n8259o1804N8325M5754p1117l8667J22014J06253j50066
6859E91479l15365j50132J46566K43492J13094k6656n8598m9817n5322l3471K8484
6848D33754N0068k2937j22056j41473o6225M0484J31016J83474J54233K1094j21249
6837E40183j18044M0827J63725Q8140r7346j67006n6969P0110O2621l5552q4150
$$ [...]
##END NTUPLES=NMR SPECTRUM
##END=
