##TITLE=1H ikalashn
CG-1213-A-2
14.10.2024
##JCAMPDX= 6.0         $$ Bruker NMR JCAMP-DX V2.0
##DATA TYPE= NMR SPECTRUM
##DATA CLASS= NTUPLES
##ORIGIN= UXNMR, Bruker Analytische Messtechnik GmbH
##OWNER= root
$$ TOPSPIN		Version 1.3
$$ 2024-10-14 11:08:29.046 +0400  Irina@DPX200
$$ Compression mode = diff/dup
##.OBSERVE FREQUENCY= 200.131392401
##.OBSERVE NUCLEUS= ^1H
##.ACQUISITION MODE= SIMULTANEOUS
##.ACQUISITION SCHEME= undefined
##.AVERAGES= 16
##.DIGITISER RES= 18
##SPECTROMETER/DATA SYSTEM= spect
##.PULSE SEQUENCE= zg
##.SOLVENT NAME= CDCl3
##.SHIFT REFERENCE= INTERNAL, CDCl3, 1, 17.95386
##AUDIT TRAIL= $$ (NUMBER, WHEN, WHO, WHERE, WHAT)
$$ ##TITLE= Audit trail, TOPSPIN		Version 1.3
$$ ##JCAMPDX= 5.01
$$ ##ORIGIN= Bruker BioSpin GmbH
$$ ##OWNER= Irina
$$ $$ F:/spectra/data/iren/nmr/1H/4/pdata/1/auditp.txt
$$ ##AUDIT TRAIL=  $$ (NUMBER, WHEN, WHO, WHERE, VERSION, WHAT)
(   1,<2024-10-14 11:07:36.625 +0400>,<Irina>,<DPX200>,<TOPSPIN 1.3>,
      <created by zg
	started at 2024-10-14 11:06:28.625 +0400,
	POWCHK disabled, PULCHK disabled
       configuration hash MD5:
       BE 6D 3F 07 2A EA 11 49 91 17 2B D3 AF B3 58 0D
       data hash MD5: 16K
       28 9A 03 74 E6 2A 0B C2 1F CD 93 5F D2 92 47 F3>)
(   2,<2024-10-14 11:07:36.953 +0400>,<Irina>,<DPX200>,<TOPSPIN 1.3>,
      <Start of raw data processing
       efp BC_mod = 2 LB = 0.05 FT_mod = 6 PKNL = 1 PHC0 = 208.1562 PHC1 = 15.75882 SI = 32K 
       data hash MD5: 32K
       23 74 87 18 4F 1E 24 24 9F 91 7F 08 14 99 0B 48>)
(   3,<2024-10-14 11:07:39.125 +0400>,<Irina>,<DPX200>,<TOPSPIN 1.3>,
      <apk 
       data hash MD5: 32K
       EC 4E 1F D0 14 42 42 90 0F CE 01 66 8B 3E CB DC>)
(   4,<2024-10-14 11:08:13.781 +0400>,<Irina>,<DPX200>,<TOPSPIN 1.3>,
      <pk fgphup PHC0 = 52.97585 PHC1 = -74.4 
       data hash MD5: 32K
       62 54 E9 54 1B 54 44 BD AB 9A A6 E5 C6 F4 0A BB>)
(   5,<2024-10-14 11:08:15.890 +0400>,<Irina>,<DPX200>,<TOPSPIN 1.3>,
      <abs n ABSG = 5 
       data hash MD5: 32K
       D7 01 1B 56 34 B8 B7 47 EA 23 F8 D9 89 B2 66 B8>)
$$ ##END=
$$ 
$$ $$ hash MD5
$$ $$ E0 7E 50 46 D1 E4 FD D4 A1 82 6E FD 6E F3 D9 CC
##$RELAX= 
##$RELAX= 
##$RELAX= 
##$RELAX= 
##$RELAX= 
##$RELAX= 
##$RELAX= 
##$RELAX= 
##$RELAX= 
$$ Bruker specific parameters
$$ --------------------------
##$DU= <F:/spectra>
##$EXPNO= 4
##$NAME= <1H>
##$PROCNO= 1
##$TYPE= <nmr>
##$USER= <iren>
##$AMP= (0..31)
100 100 100 100 100 100 100 100 100 100 100 100 100 100 100 100 100 100 
100 100 100 100 100 100 100 100 100 100 100 100 100 100 
##$ANAVPT= -1
##$AQSEQ= 0
##$AQ_mod= 1
##$AUNM= <au_zg>
##$AUTOPOS= <>
##$BF1= 200.13
##$BF2= 200.13
##$BF3= 200.13
##$BF4= 200.13
##$BF5= 200.13
##$BF6= 200.13
##$BF7= 200.13
##$BF8= 200.13
##$BYTORDA= 1
##$CFDGTYP= 0
##$CFRGTYP= 5
##$CHEMSTR= <none>
##$CNST= (0..63)
1 1 145 1 1 1 1 1 1 1 1 1 1 1 1 1 1 1 1 1 1 1 1 1 1 1 1 1 1 1 1 1 1 1 
1 1 1 1 1 1 1 1 1 1 1 1 1 1 1 1 1 1 1 1 1 1 1 1 1 1 1 1 1 1 
##$CPDPRG= <>
##$CPDPRG1= <>
##$CPDPRG2= <>
##$CPDPRG3= <>
$$ [...]
##$SW_h= 4401.40845070422
##$TD= 16384
##$TD0= 1
##$TE= 300
##$TE2= 300
##$TE3= 300
##$TEG= 300
##$TL= (0..7)
0 120 120 120 120 120 120 120 
##$TP= (0..7)
150 150 150 150 150 150 150 150 
##$TP07= 0
##$TPNAME0= <>
##$TPNAME1= <>
##$TPNAME2= <>
##$TPNAME3= <>
##$TPNAME4= <>
##$TPNAME5= <>
##$TPNAME6= <>
##$TPNAME7= <>
##$TPOAL= (0..7)
0.5 0.5 0.5 0.5 0.5 0.5 0.5 0.5 
##$TPOFFS= (0..7)
0 0 0 0 0 0 0 0 
##$TUNHIN= 0
##$TUNHOUT= 0
##$TUNXOUT= 0
##$USERA1= <user>
##$USERA2= <user>
##$USERA3= <user>
##$USERA4= <user>
##$USERA5= <user>
##$V9= 5
##$VALIST= <valist>
##$VCLIST= <CCCCCCCCCCCCCCC>
##$VD= 0
##$VDLIST= <DDDDDDDDDDDDDDD>
##$VPLIST= <PPPPPPPPPPPPPPP>
##$VTLIST= <TTTTTTTTTTTTTTT>
##$WBST= 1024
##$WBSW= 25
##$XGAIN= (0..3)
0 0 0 0 
##$XL= 0
##$YL= 0
##$YMAX_a= 361785
##$YMIN_a= -909323
##$ZGOPTNS= <>
##$ZL1= 120
##$ZL2= 120
##$ZL3= 120
##$ZL4= 120
##$ABSF1= 17.95386
##$ABSF2= -4.038887
##$ABSG= 5
##$ABSL= 3
##$ALPHA= 0
##$AQORDER= 0
##$ASSFAC= 0
##$ASSFACI= 0
##$ASSFACX= 0
##$ASSWID= 0
##$AUNMP= <proc_1d>
##$AXLEFT= 0
##$AXRIGHT= 0
##$AXTYPE= 0
##$AXUNIT= <>
##$AZFE= 0.1
##$AZFW= 0.1
##$BCFW= 0
##$BC_mod= 2
##$BYTORDP= 0
##$COROFFS= 0
##$CY= 7568.61572265625
##$DATMOD= 1
##$DC= 0
##$DFILT= <>
##$DTYPP= 0
##$F1P= 17.9538593292236
##$F2P= -4.03888763876832
##$FCOR= 0.5
##$FTSIZE= 32768
##$FT_mod= 6
##$GAMMA= 0
##$GB= 0
##$INTBC= 0
##$INTSCL= 1.483618e-010
##$ISEN= 128
##$LB= 0.05
##$LEV0= 0
##$LPBIN= 0
##$MAXI= 945.577
##$MC2= 0
##$MEAN= 0
##$ME_mod= 0
##$MI= -402.1523
##$NCOEF= 0
##$NC_proc= -5
##$NLEV= 6
##$NOISF1= 8.587773
##$NOISF2= 6.764455
##$NSP= 0
##$NTH_PI= 0
##$NZP= 0
##$OFFSET= 17.95386
##$PC= 1
##$PHC0= 297.5983
##$PHC1= 48.1313
##$PH_mod= 1
##$PKNL= yes
##$PPARMOD= 0
##$PPDIAG= 0
##$PPIPTYP= 0
##$PPMPNUM= 100
##$PPRESOL= 1
##$PSCAL= 0
##$PSIGN= 0
##$REVERSE= no
##$SF= 200.13
##$SI= 32768
##$SIGF1= 16.12182
##$SIGF2= -4.496377
##$SINO= 3.521527
##$SIOLD= 32768
##$SREGLST= <1H.CDCl3>
##$SSB= 0
##$STSI= 32768
##$STSR= 0
##$SW_p= 4401.40845070423
##$SYMM= 0
##$S_DEV= 0
##$TDeff= 16384
##$TDoff= 0
##$TI= <>
##$TILT= no
##$TM1= 0
##$TM2= 0
##$TOPLEV= 0
##$USERP1= <user>
##$USERP2= <user>
##$USERP3= <user>
##$USERP4= <user>
##$USERP5= <user>
##$WDW= 1
##$XDIM= 32768
##$YMAX_p= 483068222
##$YMIN_p= -257035
$$ End of Bruker specific parameters
$$ ---------------------------------
##NTUPLES= NMR SPECTRUM
##VAR_NAME=  FREQUENCY,     SPECTRUM/REAL,   SPECTRUM/IMAG
##SYMBOL=    X,             R,               I
##VAR_TYPE=  INDEPENDENT,   DEPENDENT,       DEPENDENT
##VAR_FORM=  AFFN,          ASDF,            ASDF
##VAR_DIM=   32768,         32768,           32768
##UNITS=     HZ,            ARBITRARY UNITS, ARBITRARY UNITS
##FACTOR=    0.134324425510551, 1,           1
##FIRST=     4401.40845070423, -73671,       -566946
##LAST=      0,             104941,          -1137487
##MIN=       0,             -257035,         0
##MAX=       4401.40845070423, 483068222,    0
$$ Real data points
##PAGE= N=1
##DATA TABLE= (X++(R..R)), XYDATA
$$ [...]
$$ plain form
13466 1110688 1149348 1132469 1096854 1057572 1020507 1023502 1081427 1132040 1115794 1071760 1074066 1109456
13454 1109456 1108754 1075120 1081586 1145028 1198394 1201246 1191238 1201715 1207035 1185827 1171997 1197459
13442 1197459 1232718 1228918 1185334 1138128 1110041 1103807 1121355 1158540 1197336 1225896 1250262 1271222
13430 1271222 1273485 1256177 1247670 1265787 1286765 1281616 1263246 1265778 1291390 1312141 1317821 1327310
13418 1327310 1350416 1370048 1371827 1365960 1366812 1371629 1374197 1379663 1386205 1371115 1324587 1284357 1297081
13405 1297081 1346276 1364645 1330359 1299757 1314911 1334131 1309069 1281625 1321100 1392844 1392201 1311408
13393 1311408 1263446 1308568 1365780 1356010 1329849 1362481 1408197 1378189 1307335 1310251 1391909 1434238
13381 1434238 1380807 1312772 1308477 1334945 1329280 1300185 1289018 1296046 1302712 1316225 1342297 1357731
$$ packed form
13466A110688L8660j6879l5615l9282l7065K995N7925N0613j6246m4034K306L5390
13454A109456p02l3634O466O3442N3366K852j0008J0477N320k1208j3830K5462
13442A197459L5259l800m3584m7206k8087o234J7548L7185L8796K8560K4366K0960
13430A271222K263j7308q507J8117K0978n149j8370K532K5612K0751N680R489
13418A327310K3106J9632J779n867Q52M817K568N466O542j5090m6528m0230J2724
13405A297081M9195J8369l4286l0602J5154J9220k5062k7444L9475P1744o43q0793
13393A311408m7962M5122N7212r770k6161L2632M5716l0008p0854K916Q1658M2329
13381A434238n3431o8035m295K6468n665k9095j1167P028O666J3513K6072J5434
$$ plain form
13369 1357731 1352348 1353702 1370745 1361752 1304025 1248705 1252907 1295690 1317862 1315552 1335409 1392554
13357 1392554 1446032 1452753 1410378 1352119 1323376 1350577 1411907 1454511 1454864 1438154 1428805 1421390
13345 1421390 1417095 1440284 1490959 1529027 1537685 1550956 1583228 1592645 1562937 1556218 1617733 1687760
13333 1687760 1688304 1645803 1637412 1660049 1656076 1635782 1657592 1700015 1676435 1587665 1541396 1590487
13321 1590487 1660036 1676006 1665446 1675866 1686978 1670085 1661949 1706978 1777231 1812491 1799683
13310 1799683 1764764 1729954 1720722 1762914 1828481 1841274 1785843 1747558 1786632 1841559 1833743 1800122
13298 1800122 1822200 1876219 1872690 1818028 1811044 1877414 1929208 1913190 1886637 1902052 1918995 1894700
13286 1894700 1877904 1931284 2017258 2045944 2006885 1976144 2004103 2062464 2103519 2116645 2115465
$$ packed form
13369A357731n383J354J7043q993n7727n5320M202M2783K2172k310J9857N7145
13357A392554N3478O721m2375n8259k8743K7201O1330M2604L53j6710r349p415
13345A421390m295K3189N0675L8068Q658J3271L2272R417k9708o719O1515P0027
13333A687760N44m2501q391K2637l973k0294K1810M2423k3580q8770m6269M9091
13321A590487O9549J5970j0560J0420J1112j6893q136M5029P0253L5260j2808
13310A799683l4919l4810r232M2192O5567J2793n5431l8285L9074N4927p816l3621
13298A800122K2078N4019l529n4662o984O6370N1794j6018k6553J5415J6943k4295
13286A894700j6796N3380Q5974K8686l9059l0741K7959N8361M1055J3126j180
$$ plain form
13275 2115465 2111589 2117532 2147975 2201929 2256847 2288264 2289582 2275983 2276037 2309947 2365734 2408948
13263 2408948 2426926 2445345 2484630 2523733 2536405 2543110 2585130 2654902 2698551 2694308 2685234 2716721
13251 2716721 2778421 2832296 2867185 2895459 2919578 2937748 2969117 3036228 3124134 3188553 3209965
13240 3209965 3216227 3245950 3308434 3384583 3450442 3494732 3526950 3571329 3641509 3723731 3799202
13229 3799202 3875577 3973157 4084626 4178623 4246594 4316129 4410777 4526664 4657592 4809328
13219 4809328 4974334 5127761 5270592 5444027 5674715 5935921 6190791 6442998 6713929
13210 6713929 7005571 7326566 7718591 8201740 8720737 9208524 9686888 10235275 10862854
13201 10862854 11478931 11996655 12401018 12701447 12883441 12934363 12863764 12672323 12349435 11924007
$$ packed form
13275B115465l876N943L0443N3954N4918L1417J318j3599N4L3910N5787M3214
13263B408948J7978J8419L9285L9103J2672O705M2020O9772M3649m243r074L1487
13251B716721O1700N3875L4889K8274K4119J8170L1369O7111Q7906O4419K1412
13240C209965O262K9723O2484P6149O5859M4290L2218M4379P0180Q2222P5471
13229C799202P6375R7580J11469R3997O7971O9535R4648J15887J30928J51736
13219D809328J65006J53427J42831J73435K30688K61206K54870K52207K70931
13210F713929K91642L20995L92025M83149N18997M87787M78364N48387O27579
13201A0862854O16077N17724M04363L00429J81994N0922p0599j91441l22888m25428
$$ plain form
13191 11924007 11465017 11004738 10513498 9978373 9448426 8963410 8495720 8013369 7549272
13182 7549272 7151243 6808537 6490326 6216434 6018300 5858700 5666932 5440912 5244031
13173 5244031 5106946 4998759 4893452 4799439 4718489 4636352 4562918 4525672 4514840 4490099 4450035
13162 4450035 4436162 4454792 4456743 4416890 4373089 4354703 4330960 4273758 4221328 4224063 4260647 4266037
13150 4266037 4225929 4189720 4193649 4217964 4227564 4219191 4214820 4231554 4271178 4324494 4373020 4394245
13138 4394245 4378590 4344183 4327573 4350898 4398508 4436157 4455067 4480980 4531163 4582766 4603829
13127 4603829 4599999 4604735 4632532 4667605 4691875 4699559 4692284 4685545 4708784 4768670 4825026 4840698
13115 4840698 4843292 4890349 4978782 5043761 5054132 5053757 5090931 5157595 5222074 5275903 5320743 5351279
$$ packed form
13191A1924007m58990m60279m91240n35125n29947m85016m67690m82351m64097
13182G549272l98029l42706l18211k73892j98134j59600j91768k26020j96881
13173E244031j37085j08187j05307r4013q0950q2137p3434l7246j0832k4741m0064
13162D450035j3873J8630J951l9853m3801j8386k3743n7202n2430K735L6584N390
13150D266037m0108l6209L929K4315R600q373m371J6734L9624N3316M8526K1225
13138D394245j5655l4407j6610K3325M7610L7649J8910K5913N0183N1603K1063
13127D603829l830M736K7797L5073K4270P684p275o739K3239N9886N6356J5672
13115D840698K594M7057Q8433O4979J0371l75L7174O6664O4479N3829M4840L0536
$$ plain form
13103 5351279 5381677 5450158 5563539 5671565 5731771 5769937 5839499 5946053 6048614 6116552
13093 6116552 6152125 6172711 6199504 6249045 6312947 6363469 6397172 6447211 6532519 6627491 6708059
13082 6708059 6790290 6887517 6967509 7001833 7029657 7116862 7266649 7421861 7545124 7646471
13072 7646471 7740619 7832163 7944640 8110189 8317186 8513075 8676781 8850919 9081748 9358422
13062 9358422 9637144 9905546 10196750 10545669 10951307 11386658 11835611 12308823 12822872
13053 12822872 13381064 13990460 14680432 15472016 16338888 17243466 18211381 19314071 20562065
13044 20562065 21875426 23187849 24512907 25853104 27097762 28080682 28708846 28977983
13036 28977983 28901454 28498324 27827396 26957587 25915391 24723024 23462872 22224188 21001337
$$ packed form
13103E351279L0398O8481J13381J08026O0206L8166O9562J06554J02561O7938
13093F116552L5573K0586K6793M9541O3902N0522L3703N0039Q5308R4972Q0568
13082F708059Q2231R7227P9992L4324K7824Q7205J49787J55212J23263J01347
13072G646471R4148R1544J12477J65549K06997J95889J63706J74138K30829K76674
13062I358422K78722K68402K91204L48919M05638M35351M48953M73212N14049
13053A2822872N58192O09396O89972P91584Q66872R04578R67915J102690J247994
13044B0562065J313361J312423J325058J340197J244658R82920O28164K69137
13036B8977983p6529m03130o70928q69809j042196j192367j260152j238684j222851
$$ plain form
13027 21001337 19733816 18446346 17258422 16240384 15345422 14508277 13730664 13034888 12405713
13018 12405713 11822484 11294771 10829310 10407811 10022802 9684790 9374092 9047006 8714501
13009 8714501 8444899 8251755 8051276 7783590 7510634 7327360 7226721 7124092 6978631
13000 6978631 6818382 6668898 6527355 6398128 6292881 6195739 6077880 5948027 5845786 5780541
12990 5780541 5713085 5607215 5475519 5364455 5304617 5279197 5241470 5168384 5087423 5032323 4987512
12979 4987512 4913690 4818529 4750760 4723297 4699981 4667127 4653551 4660971 4644506 4594415 4567793
12968 4567793 4594661 4616768 4572801 4487725 4420761 4376227 4325893 4274010 4239180 4210315 4175644
12957 4175644 4156037 4159797 4150881 4112075 4084739 4092087 4088454 4047728 4025547 4052935 4051651 3961717
$$ packed form
13027B1001337j267521j287470j187924j018038q94962q37145p77613o95776o29175
13018A2405713n83229n27713m65461m21499l85009l38012l10698l27086l32505
13009H714501k69602j93144k00479k67686k72956j83274j00639j02629j45461
13000F978631j60249j49484j41543j29227j05247r7142j17859j29853j02241o5245
12990E780541o7456j05870j31696j11064n9838k5420l7727p3086q0961n5100m4811
12979D987512p3822r5161o7769k7463k3316l2854j3576P420j6465n0091k6622
12968D567793K6868K2107m3967q5076o6964m4534n0334n1883l4830k8865l4671
12957D175644j9607L760q916l8806k7336P348l633m0726k2181K7388j284q9934
$$ plain form
12945 3961717 3873811 3901385 3984424 3974956 3876743 3830233 3872914 3892740 3838308 3800627 3836469
12934 3836469 3869180 3835441 3792265 3797750 3805392 3760768 3698656 3664000 3634716 3600040 3614332 3688983
12922 3688983 3730972 3681998 3622557 3637787 3676957 3660932 3633654 3667598 3699131 3621488 3492324
12911 3492324 3475347 3589528 3684596 3677689 3650573 3671613 3676824 3604695 3524069 3529819 3597067 3635130
12899 3635130 3625963 3617011 3618203 3597866 3563287 3562304 3601320 3628951 3616893 3603751 3632028 3679456
12887 3679456 3689006 3650818 3617982 3636402 3686555 3713563 3699391 3678127 3681885 3701781 3714894 3724341
12875 3724341 3748770 3784985 3806139 3796652 3772276 3761175 3772429 3788340 3790382 3789496 3814617 3863599
12863 3863599 3891306 3871745 3845633 3863596 3903215 3901459 3860204 3848637 3893230 3939058 3941092 3920206
$$ packed form
12945C961717q7906K7574Q3039r468r8213m6510M2681J9826n4432l7681L5842
12934C836469L2711l3739m3176N485P642m4624o2112l4656k9284l4676J4292P4651
12922C688983M1989m8974n9441J5230L9170j6025k7278L3944L1533p7643j29164
12911C492324j6977J14181R5068o907k7116K1040N211p2129q0626N750O7248L8063
12899C635130r167q952J192k0337l4579r83L9016K7631j2058j3142K8277M7428
12887C679456R550l8188l2836J8420N0153K7008j4172k1264L758J9896J3113R447
12875C724341K4429L6215K1154r487k4376j1101J1254J5911K042q86K5121M8982
12863C863599K7707j9561k6112J7963L9619j756m1255j1567M4593M5828K034k0886
$$ plain form
12851 3920206 3899733 3865569 3831642 3860915 3956759 4011041 3945918 3846954 3857738 3982204 4092218
12840 4092218 4109448 4079874 4071051 4087563 4103608 4108447 4101669 4092617 4108179 4157739 4200756 4196777
12828 4196777 4170347 4173427 4205262 4227898 4235485 4242782 4234210 4200175 4193481 4259932 4338436 4333228
12816 4333228 4270197 4267909 4353727 4427504 4423667 4391591 4386469 4395717 4413105 4472961 4559349 4588218
12804 4588218 4540456 4513003 4572279 4653904 4682093 4693907 4755610 4837214 4869170 4861437 4869578 4892217
12792 4892217 4893745 4887023 4907022 4939384 4955582 4979243 5034818 5071580 5032212 4966666 4979291 5077174
12780 5077174 5164840 5186464 5185406 5215247 5270956 5326076 5374405 5413877 5435576 5444471 5458670 5484493
12768 5484493 5518450 5564558 5621584 5668946 5694757 5719449 5766507 5835190 5920774 6019538 6094141
$$ packed form
12851C920206k0473l4164l3927K9273R5844N4282o5123r8964J0784J24466J10014
12840D092218J7230k9574q823J6512J6045M839o778r052J5562M9560M3017l979
12828D196777k6430L080L1835K2636P587P297q572l4035o694O6451P8504n208
12816D333228o3031k288Q5818P3777l837l2076n122R248J7388N9856Q6388K8869
12804D588218m7762k7453N9276Q1625K8189J1814O1703Q1604L1956p733Q141K2639
12792D892217J528o722J9999L2362J6198K3661N5575L6762l9368o5546J2625R7883
12780E077174Q7666K1624j058K9841N5709N5120M8329L9472K1699Q895J4199K5823
12768E484493L3957M6108N7026M7362K5811K4692M7058O8683Q5584R8764P4603
$$ plain form
12757 6094141 6098921 6074363 6134371 6299217 6429524 6416474 6355176 6409751 6570407 6685938 6701280
12746 6701280 6710871 6780387 6862630 6913109 6958921 7017432 7059746 7091436 7164818 7275182 7348054
12735 7348054 7367836 7414310 7525100 7627255 7665665 7701636 7810961 7966101 8095005 8187525
12725 8187525 8270086 8337679 8386900 8464496 8608752 8782331 8926790 9044537 9168214 9291635
12715 9291635 9394686 9500438 9643403 9808057 9955048 10082670 10210584 10329217 10417619 10490815
12705 10490815 10583193 10702557 10836789 10983034 11139098 11294539 11457116 11650091 11857227
12696 11857227 12022796 12143462 12300602 12547744 12821582 13030413 13182929 13355313 13569692
12687 13569692 13787136 13997219 14231546 14494623 14753021 14995529 15246453 15517432 15792747
$$ packed form
12757F094141M780k4558O0008J64846J30307j3050o1298N4575J60656J15531J5342
12746F701280R591O9516Q2243N0479M5812N8511M2314L1690P3382J10364P2872
12735G348054J9782M6474J10790J02155L8410L5971J09325J55140J28904R2520
12725H187525Q2561O7593M9221P7596J44256J73579J44459J17747J23677J23421
12715I291635J03051J05752J42965J64654J46991J27622J27914J18633Q8402P3196
12705A0490815R2378J19364J34232J46245J56064J55441J62577J92975K07136
12696A1857227J65569J20666J57140K47142K73838K08831J52516J72384K14379
12687A3569692K17444K10083K34327K63077K58398K42508K50924K70979K75315
$$ plain form
12678 15792747 16058524 16306846 16525512 16725668 16957794 17251762 17565221 17846312 18120696
12669 18120696 18448468 18815298 19147308 19431924 19741852 20121113 20518660 20866628 21170280
12660 21170280 21485468 21846016 22246798 22671849 23108029 23543337 23973789 24409998 24869004
12651 24869004 25360701 25882069 26423518 26983218 27567527 28164862 28735168 29256886 29771506
12642 29771506 30336652 30945331 31551311 32166619 32851752 33601291 34337625 35048476 35825962
12633 35825962 36718758 37652678 38567108 39522257 40583384 41707037 42851601 44096822 45520985
12624 45520985 47050082 48577210 50155769 51918901 53877441 55964019 58211169 60708121
12616 60708121 63453295 66452524 69881210 73893039 78340852 83015748 88115560 93998452
$$ packed form
12678A5792747K65777K48322K18666K00156K32126K93968L13459K81091K74384
12669A8120696L27772L66830L32010K84616L09928L79261L97547L47968L03652
12660B1170280L15188L60548M00782M25051M36180M35308M30452M36209M59006
12651B4869004M91697N21368N41449N59700N84309N97335N70306N21718N14620
12642B9771506N65146O08679O05980O15308O85133P49539P36334P10851P77486
12633C5825962Q92796R33920R14430R55149J061127J123653J144564J245221J424163
12624D5520985J529097J527128J578559J763132J958540K086578K247150K496952
12616F0708121K745174K999229L428686M011829M447813M674896N099812N882892
$$ plain form
12608 93998452 100308411 105804672 109437058 111334708 112367240 112952086 112781348 111677006
12600 111677006 110170470 108969425 108146952 107190760 105784829 104272113 103274507 103047664
12592 103047664 103416038 104300235 105994822 108667815 111744809 114213518 115655159 116636204
12584 116636204 117875256 119357311 120635554 121762928 123392212 125930798 129044333 132128666
12576 132128666 134881808 137182814 138744489 139268218 138831082 137803613 136407132 134621179
12568 134621179 132550288 130588005 129033397 127721885 126309918 124902061 124075426 124082774
12560 124082774 124260496 123610560 121952635 120084221 118662385 117391736 115705358 113863417
12552 113863417 112727098 112544434 112658863 112568671 112628639 113381166 114792655 116667584 119297992
$$ packed form
12608I3998452O309959N496261L632386J897650J032532N84846j70738j104342
12600A11677006j506536j201045q22473r56192j405931j512716r97606k26843
12592A03047664L68374Q84197J694587K672993L076994K468709J441641R81045
12584A16636204J239052J482055J278243J127374J629284K538586L113535L084333
12576A32128666K753142K301006J561675N23729m37136j027469j396481j785953
12568A34621179k070891j962283j554608j311512j411967j407857q26635P348
12560A24082774J77722o49936j657925j868414j421836j270649j686378j841941
12552A13863417j136319j82664J14429r0192N9968P52527J411489J874929K630408
$$ plain form
12543 119297992 122900016 126584669 128742212 128643002 127034281 124898186 122222970 118465687
12535 118465687 113766780 109008836 104732595 100568654 95896536 90677493 85412818 80538436
12527 80538436 76134957 72125994 68498234 65282814 62465624 59991648 57807184 55861419
12519 55861419 54101275 52492615 51021868 49652701 48304260 46908420 45483237 44113895
12511 44113895 42852680 41669695 40518134 39412957 38409567 37527662 36742341 36042550
12503 36042550 35444817 34932912 34427185 33846895 33183686 32487720 31796496 31107516 30418148
12494 30418148 29760426 29174967 28658426 28159606 27639916 27127237 26693123 26381570 26179473
12485 26179473 26049642 25955568 25843431 25641599 25311225 24875251 24371367 23802560 23164441
$$ packed form
12543A19297992L602024L684653K157543r9210j608721k136095k675216l757283
12535A18465687m698907m757944m276241m163941m672118n219043n264675m874382
12527H0538436m403479m008963l627760l215420k817190k473976k184464j945765
12519E5861419j760144j608660j470747j369167j348441j395840j425183j369342
12511D4113895j261215j182985j151561j105177j003390q81905p85321o99791
12503C6042550n97733n11905n05727n80290o63209o95966o91224o88980o89368
12494C0418148o57722n85459n16541m98820n19690n12679m34114l11553k02097
12485B6179473j29831r4074j12137k01832l30374m35974n03884n68807o38119
$$ plain form
12476 23164441 22490187 21822786 21163082 20491888 19824440 19190246 18575958 17951450 17344032
12467 17344032 16815166 16360188 15907646 15434710 15004047 14655753 14343750 14026898 13742925
12458 13742925 13522434 13300816 13008205 12696649 12470767 12317676 12120377 11841462 11578543
12449 11578543 11407870 11280072 11126054 10972853 10873979 10792373 10647704 10445300 10267148 10147767
12439 10147767 10042529 9920556 9810309 9734733 9667725 9582796 9492492 9411854 9328860 9238158
12429 9238158 9158871 9088607 8985578 8834777 8690077 8605447 8561064 8507434 8446626 8406481 8361596
12418 8361596 8258484 8115358 8018245 8000228 7993212 7930685 7839974 7789018 7784992 7777866 7742896
12407 7742896 7709936 7711708 7738909 7759196 7764909 7785910 7847528 7921002 7939233 7875742 7782423 7723045
$$ packed form
12476B3164441o74254o67401o59704o71194o67448o34194o14288o24508o07418
12467A7344032n28866m54978m52542m72936m30663l48294l12003l16852k83973
12458A3742925k20491k21618k92611l11556k25882j53091j97299k78915k62919
12449A1578543j70673j27798j54018j53201r8874q1606j44669k02404j78152j19381
12439A0147767j05238j21973j10247p5576o7008q4929r0304q0638q2994r0702
12429I238158p9287p0264j03029j50801j44700q4630m4383n3630o0808m0145m4885
12418H361596j03112j43126r7113j8017p016o2527r0711n0956m026p126l4970
12407G742896l2960J772K7201K0287N713K1001O1618P3474J8231o3491r3319n9378
$$ plain form
12395 7723045 7698959 7681624 7683715 7727540 7762021 7703429 7569978 7482388 7494679 7510642 7422504
12384 7422504 7256855 7115468 7033987 6975910 6919002 6867762 6811360 6740600 6679943 6640383 6576595
12373 6576595 6460169 6355288 6337436 6369207 6350295 6268236 6198950 6170418 6136085 6089513 6092647
12362 6092647 6160652 6217588 6206866 6162085 6130360 6107372 6090196 6111825 6168819 6187458 6123094
12351 6123094 6033820 5996846 6005353 6006716 5992634 5987849 5988290 5971022 5937536 5899247 5850609 5797414
12339 5797414 5772808 5782157 5775455 5721713 5663581 5644152 5629739 5572598 5505901 5497288 5538043 5559144
12327 5559144 5539403 5520362 5525236 5537690 5554032 5582524 5594058 5549297 5478736 5458748 5493919
12316 5493919 5498873 5424061 5331098 5303999 5340389 5376006 5376834 5358378 5335384 5297249 5232834 5154495
$$ packed form
12395G723045k4086j7335K091M3825L4481n8592j33451q7590J2291J5963q8138
12384G422504j65649j41387q1481n8077n6908n1240n6402p0760o0657l9560o3788
12373F576595j16426j04881j7852L1771j8912q2059o9286k8532l4333m6572L134
12362F092647O8005N6936j0722m4781l1725k2988j7176K1629N6994J8639o4364
12351F123094q9274l6974Q507J363j4082m785M41j7268l3486l8289m8638n3195
12339E797414k4606R349o702n3742n8132j9429j4413n7141o6697q613M0755K1101
12327E559144j9741j9041M874J2454J6342K8492J1534m4761p0561j9988L5171
12316E493919M954p4812r2963k7099L6390L5617Q28j8456k2994l8135o4415p8339
$$ plain form
12304 5154495 5091021 5059786 5044235 5007249 4939027 4878673 4865536 4881557 4874196 4830724 4792863
12293 4792863 4793708 4814088 4813132 4777323 4727259 4691920 4684232 4693390 4701069 4707803 4728678 4756787 4759242
12280 4759242 4727695 4699160 4696226 4681626 4615528 4527247 4476802 4467761 4455127 4421800 4385909 4345598
12268 4345598 4283739 4222659 4205515 4220545 4211222 4168165 4141897 4153094 4162883 4152716 4160083 4201232
12256 4201232 4225444 4190262 4129186 4100350 4110669 4130270 4142767 4143546 4123514 4089973 4072969 4082410
12244 4082410 4090586 4080851 4076390 4095065 4113211 4100805 4058953 4003837 3952059 3933642 3967012 4005732
12232 4005732 3975146 3887567 3847761 3904184 3971587 3958390 3897480 3877032 3904613 3925944 3930639
12221 3930639 3947384 3965296 3949931 3919808 3925485 3965076 3995090 4011575 4045391 4088494 4101406
$$ packed form
12304E154495o3474l1235j5551l6986o8222o0354j3137J6021p361m3472l7861
12293D792863Q45K0380r56l5809n0064l5339p688R158P679O734K0875K8109K455
12280D759242l1547k8535k934j4600o6098q8281n0445r041j2634l3327l5891m0311
12268D345598o1859o1080j7144J5030r323m3057k6268J1197R789j0167P367M1149
12256D201232K4212l5182o1076k8836J0319J9601J2497P79k0032l3541j7004R441
12244D082410Q176r735m461J8675J8146j2406m1852n5116n1778j8417L3370L8720
12232D005732l0586q7579l9806N6423O7403j3197o0910k0448K7581K1331M695
12221C930639J6745J7912j5365l0123N677L9591L0014J6485L3816M3103J2912
$$ plain form
12210 4101406 4087118 4082784 4083717 4052107 3998205 3972495 3973581 3945678 3879279 3833476 3838330 3852203
12198 3852203 3842438 3835337 3852682 3864520 3842829 3806239 3776918 3745103 3708390 3693931 3708622 3717930
12186 3717930 3706081 3703810 3721417 3712148 3648195 3579736 3563597 3578168 3568833 3540393 3538153 3562191
12174 3562191 3569909 3556124 3566580 3623669 3688667 3713391 3695511 3668046 3656978 3662002 3667766 3666497
12162 3666497 3668533 3683055 3692537 3671650 3637344 3644300 3708032 3766695 3756511 3701593 3684979 3741498
12150 3741498 3823276 3870957 3877181 3869032 3863422 3861202 3863184 3868289 3865328 3846548 3826127 3825996 3839262
12137 3839262 3828142 3775724 3725099 3736087 3803955 3858198 3854232 3825261 3817091 3816809 3793864 3773108
12125 3773108 3798721 3846917 3852359 3816231 3804923 3831891 3830625 3775778 3742392 3790063 3863473 3877348
$$ packed form
12210D101406j4288m334R33l1610n3902k5710J086k7903o6399m5803M854J3873
12198C852203r765p101J7345J1838k1691l6590k9321l1815l6713j4459J4691R308
12186C717930j1849k271J7607r269o3953o8459j6139J4571r335k8440k240K4038
12174C562191P718j3785J0456N7089O4998K4724j7880k7465j1068N024N764j269
12162C666497K036J4522R482k0887l4306O956O3732N8663j0184n4918j6614N6519
12150C741498Q1778M7681O224q149n610k220J982N105k961j8780k0421j31J3266
12137C839262j1120n2418n0625J0988O7868N4243l966k8971q170k82k2945k0756
12125C773108K5613M8196N442l6128j1308K6968j266n4847l3386M7671P3410J3875
$$ plain form
12113 3877348 3841410 3824473 3839445 3846110 3839260 3851292 3880028 3890100 3882574 3892906 3917239 3907928
12101 3907928 3853661 3804549 3801089 3828359 3855898 3875586 3882952 3865666 3832083 3813487 3817017 3810146
12089 3810146 3773333 3737521 3744931 3794474 3847600 3872797 3868395 3854349 3853518 3871464 3889791 3889413
12077 3889413 3878089 3879496 3899610 3923933 3943270 3958590 3965050 3959155 3959601 3989620 4036342 4059704
12065 4059704 4048203 4034435 4045048 4065254 4068798 4059181 4063257 4098688 4159676 4223421 4265373 4280921
12053 4280921 4293486 4327377 4376353 4417368 4448520 4487190 4534323 4570757 4589632 4602528 4612276
12042 4612276 4612154 4614785 4644853 4693566 4716654 4693196 4654977 4641042 4652463 4669716 4687118 4709644
12030 4709644 4736959 4767035 4797328 4814597 4809071 4804608 4839198 4902797 4935423 4910631 4881553 4911233
$$ packed form
12113C877348l5938j6937J4972O665o850J2032K8736J0072p526J0332K4333r311
12101C907928n4267m9112l460K7270K7539J9688P366j7286l3583j8596L530o871
12089C810146l6813l5812P410M9543N3126K5197m402j4046q31J7946J8327l78
12077C889413j1324J407K0114K4323J9337J5320O460n895M46L0019M6722K3362
12065D059704j1501j3768J0613K0206L544r617M076L5431O0988O3745M1952J5548
12053D280921J2565L3891M8976M1015L1152L8670M7133L6434J8875J2896R748
12042D612276j22K631L0068M8713K3088k3458l8219j3935J1421J7253J7402K2526
12030D709644K7315L0076L0293J7269n526m463L4590O3599L2626k4792k9078K9680
$$ plain form
12018 4911233 4990679 5063794 5104492 5125143 5130571 5114654 5095307 5104331 5136679 5148385 5116238 5070436
12006 5070436 5055300 5078333 5108819 5111377 5073156 5011878 4965248 4962523 4998905 5042277 5066913 5075372
11994 5075372 5087333 5113939 5146153 5165620 5165149 5157695 5164435 5196309 5248913 5308842 5359402 5389454
11982 5389454 5407720 5438233 5486068 5519430 5508700 5472849 5456415 5466835 5472942 5465768 5473735 5502379
11970 5502379 5506770 5456326 5390097 5365670 5376729 5366985 5316258 5267338 5261040 5281295 5283879 5258853
11958 5258853 5240492 5257910 5295620 5315622 5308592 5299835 5301813 5292116 5259046 5237738 5262495 5306039
11946 5306039 5316197 5300194 5313984 5369108 5414624 5423946 5434163 5473758 5513898 5528285 5544847
11935 5544847 5592209 5641464 5649635 5624095 5600436 5592593 5604948 5651652 5718540 5750156 5726761 5710464
$$ packed form
12018D911233P9446P3115M0698K0651N428j5917j9347R024L2348J1706l2147m5802
12006E070436j5136K3033L0486K558l8221o1278m6630k725L6382M3372K4636Q459
11994E075372J1961K6606L2214J9467m71p454O740L1874N2604N9929N0560L0052
11982E389454J8266L0513M7835L3362j0730l5851j6434J0420O107p174P967K8644
11970E502379M391n0444o6229k4427J1059r744n0727m8920o298K0255K584k5026
11958E258853j8361J7418L7710K0002p030q757J978r697l3070k1308K4757M3544
11946E306039J0158j6003J3790N5124M5516R322J0217L9595M0140J4387J6562
11935E544847M7362M9255Q171k5540k3659p843J2355M6704O6888L1616k3395j6297
$$ plain form
11923 5710464 5757220 5828681 5859571 5867581 5912168 5978000 5995613 5963010 5949989 5981964 6012992
11912 6012992 6023671 6052961 6110696 6147523 6147055 6167294 6244374 6324708 6347958 6343727 6386647 6489945
11900 6489945 6596617 6657102 6675675 6691373 6738382 6814874 6881096 6906724 6919424 6972448 7062899
11889 7062899 7128316 7136305 7130287 7166507 7248083 7341433 7416903 7454496 7453003 7453364 7508188 7608424
11877 7608424 7689309 7729518 7785884 7898816 8025466 8112029 8174580 8251696 8327393 8367994 8397777
11866 8397777 8466259 8563184 8635078 8673740 8723066 8802184 8882938 8947740 9015008 9096786 9178359
11855 9178359 9254888 9349046 9473869 9608024 9728127 9845766 9991513 10168278 10336778 10456253
11845 10456253 10537333 10637722 10791681 10963319 11100468 11215828 11362732 11539002 11686168
$$ packed form
11923E710464M6756P1461L0890Q010M4587O5832J7613l2603j3021L1975L1028
11912F012992J0679K9290N7735L6827m68K0239P7080Q0334K3250m231M2920J03298
11900F489945J06672O0485J8573J5698M7009P6492O6222K5628J2700N3024R0451
11889G062899O5417P989o018L6220Q1576R3350P5470L7593j493L61N4824J00236
11877G608424Q0885M0209N6366J12932J26650Q6563O2551P7116P5697M0601K9783
11866H397777O8482R6925P1894L8662M9326P9118Q0754O4802O7268Q1778Q1573
11855I178359P6529R4158J24823J34155J20103J17639J45747J76765J68500J19475
11845A0456253Q1080J00389J53959J71638J37149J15360J46904J76270J47166
$$ plain form
11836 11686168 11796309 11937093 12131611 12295980 12363285 12399727 12510366 12680801 12813087 12887786
11826 12887786 12980427 13122760 13258352 13356920 13472601 13646661 13835633 13991227 14146129 14355860
11816 14355860 14600135 14810265 14972947 15144426 15364437 15608548 15838711 16062300 16315173
11807 16315173 16604344 16897059 17169263 17439827 17737579 18051106 18343468 18611724 18890481
11798 18890481 19188895 19473572 19739214 20044586 20431598 20849803 21221640 21555090 21923820
11789 21923820 22349622 22777504 23171098 23562878 23990129 24440714 24892143 25358310 25862868
11780 25862868 26396093 26928366 27448686 27969714 28508005 29071613 29657373 30256261 30866800
11771 30866800 31491312 32108055 32675510 33194348 33734595 34353874 35013273 35634168 36221716
$$ packed form
11836A1686168J10141J40784J94518J64369O7305L6442J10639J70435J32286P4699
11826A2887786R2641J42333J35592R8568J15681J74060J88972J55594J54902K09731
11816A4355860K44275K10130J62682J71479K20011K44111K30163K23589K52873
11807A6315173K89171K92715K72204K70564K97752L13527K92362K68256K78757
11798A8890481K98414K84677K65642L05372L87012M18205L71837L33450L68730
11789B1923820M25802M27882L93594L91780M27251M50585M51429M66167N04558
11780B5862868N33225N32273N20320N21028N38291N63608N85760N98888O10539
11771C0866800O24512O16743N67455N18838N40247O19279O59399O20895N87548
$$ plain form
11762 36221716 36860523 37590318 38362248 39131577 39920686 40766029 41669796 42633946 43679469
11753 43679469 44799033 45951456 47139188 48430032 49862763 51397694 53010352 54763355
11745 54763355 56718387 58845652 61107844 63573654 66342554 69412413 72761462 76526300
11737 76526300 80913361 85918015 91352361 97229924 103817768 110993220 117722936 122661147
11729 122661147 125390085 126706952 127490935 127675844 126739307 124894506 123126369 121992916
11721 121992916 121010549 119521667 117684091 116179272 115332760 115093496 115635343 117238322
11713 117238322 119494095 121304606 122010291 122076220 122303865 122754702 122941129 122838279 123103165
11704 123103165 124240027 126029197 127987067 130053936 132519698 135405907 138210156 140294699
$$ packed form
11762C6221716O38807P29795P71930P69329P89109Q45343R03767R64150J045523
11753D3679469J119564J152423J187732J290844J432731J534931J612658J753003
11745E4763355J955032K127265K262192K465810K768900L069859L349049L764838
11737G6526300M387061N004654N434346N877563O587844P175452O729716M938211
11729A22661147K728938J316867P83983J84909r36537j844801j768137j133453
11721A21992916r82367j488882j837576j504819q46512k39264N41847J602979
11713A17238322K255773J810511P05685O5929K27645M50837J86427j02850K64886
11704A23103165J136862J789170J957870K066869K465762K886209K804249K084543
$$ plain form
11696 140294699 141365372 141514318 140936717 139770527 138199768 136523651 134982618 133602498
11688 133602498 132354161 131358743 130669019 129873326 128292813 125759198 122904388 120405655
11680 120405655 118183360 115717426 112999961 110674599 109161104 108097224 106908668 105632077
11672 105632077 104836769 104880670 105615140 106852327 108764230 111523643 114633982 116946130
11664 116946130 117554077 116572671 114811742 112731577 110042869 106438822 102328969 98449871
11656 98449871 94921160 91153380 86722017 81925176 77342440 73203032 69422626 65983261
11648 65983261 62959949 60301216 57864843 55633419 53691965 52021352 50485795 49007674
11640 49007674 47611174 46309683 45078658 43928066 42889787 41942773 41041135 40193246
$$ packed form
11696A40294699J070673J48946n77601j166190j570759j676117j541033j380120
11688A33602498j248337r95418o89724p95693j580513k533615k854810k498733
11680A20405655k222295k465934k717465k325362j513495j063880j188556j276591
11672A05632077p95308M3901P34470J237187J911903K759413L110339K312148
11664A16946130O07947r81406j760929k080165k688708l604047m109853l879098
11656I8449871l528711l767780m431363m796841m582736m139408l780406l439365
11648F5983261l023312k658733k436373k231424j941454j670613j535557j478121
11640D9007674j396500j301491j231025j150592j038279r47014r01638q47889
$$ plain form
11632 40193246 39429131 38725709 38051587 37442576 36938308 36489058 36027013 35585645 35239512
11623 35239512 34968774 34703050 34461588 34315014 34229706 34093666 33897130 33745562 33675726 33599591
11613 33599591 33468785 33358146 33321099 33281761 33159184 33008118 32937314 32949198 32963517 32968707
11603 32968707 33046514 33239761 33482579 33702447 33936647 34287472 34779974 35330382 35872745
11594 35872745 36449252 37112495 37781389 38288813 38571747 38721819 38829074 38873243 38809519 38659786
11584 38659786 38448215 38134612 37700403 37230810 36817376 36437445 36026303 35612242 35271309
11575 35271309 34992418 34702789 34396357 34119692 33851146 33515089 33112945 32729006 32405239
11566 32405239 32115832 31864709 31695627 31596282 31503821 31423241 31430715 31531321 31615200 31589436
$$ packed form
11632D0193246p64115p03422o74122o09011n04268m49250m62045m41368l46133
11623C5239512k70738k65724k41462j46574q5308j36040j96536j51568o9836p6135
11613C3599591j30806j10639l7047l9338j22577j51066p0804J1884J4319N190
11603C2968707P7807J93247K42818K19868K34200L50825M92502N50408N42363
11594C5872745N76507O63243O68894N07424K82934J50072J07255M4169o3724j49733
11584C8659786k11571l13603m34209m69593m13434l79931m11142m14061l40933
11575C5271309k78891k89629l06432k76665k68546l36057m02144l83939l23767
11566C2405239k89407k51123j69082r9345r2461q0580P474J00606Q3879k5764
$$ plain form
11556 31589436 31464572 31283912 31060916 30819439 30604199 30411041 30188054 29941809 29761079
11547 29761079 29695007 29681687 29635827 29540257 29420891 29301154 29211678 29181130 29196881 29237803 29346730
11536 29346730 29585750 29922468 30270968 30655237 31199879 31920060 32652520 33253595 33735992
11527 33735992 34131340 34344857 34258144 33884295 33311088 32564006 31633691 30581097 29507758
11518 29507758 28453149 27401824 26358504 25350056 24392454 23512508 22754761 22115370 21526057
11509 21526057 20952871 20442792 20022994 19639061 19257083 18934594 18709058 18506957 18258525
11500 18258525 18017033 17859473 17750509 17620663 17503249 17462914 17448809 17357425 17203188 17097620
11490 17097620 17087744 17132259 17204246 17298440 17370159 17389607 17427014 17563059 17749924 17889980 18011577
$$ packed form
11556C1589436j24864j80660k22996k41477k15240j93158k22987k46245j80730
11547B9761079o6072j3320m5860r5570j19366j19737q9476l0548J5751M0922J08927
11536B9346730K39020L36718L48500L84269N44642P20181P32460O01075M82397
11527C3735992L95348K13517q6713l73849n73207p47082r30315j052594j073339
11518B9507758j054609j051325j043320j008448r57602q79946p57747o39391n89313
11509B1526057n73186n10079m19798l83933l81978l22489k25536k02101k48432
11500A8258525k41492j57560j08964j29846j17414m0335j4105r1384j54237j05568
11490A7097620r876M4515P1987R4194P1719J9448L7407J36045J86865J40056J21597
$$ plain form
11479 18011577 18214932 18469944 18635024 18673675 18682675 18689945 18598062 18369563 18101565 17851548
11469 17851548 17541054 17115226 16664007 16286570 15943949 15550376 15128576 14772576 14512226
11460 14512226 14301034 14097360 13888439 13669959 13460130 13303834 13217544 13157617 13074060 12964652
11450 12964652 12855173 12762555 12693066 12639735 12576299 12494402 12437743 12445037 12476587 12469630 12447267
11439 12447267 12480652 12556795 12594337 12589857 12623728 12703058 12731921 12678005 12638006 12678521 12735865
11428 12735865 12746974 12763317 12846620 12953223 13018100 13068052 13155229 13251248 13299656 13307780 13299033
11417 13299033 13238752 13096636 12924124 12782416 12648370 12474880 12287213 12133359 11995748
11408 11995748 11842384 11710482 11642555 11587183 11462233 11277399 11099219 10935162 10752353 10572849
$$ packed form
11479A8011577K03355K55012J65080L8651R000P270r1883k28499k67998k50017
11469A7851548l10494m25828m51219l77437l42621l93573m21800l56000k60350
11460A4512226k11192k03674k08921k18480k09829j56296q6290n9927q3557j09408
11450A2964652j09479r2618o9489n3331o3436q1897n6659P294L1550o957k2363
11439A2447267L3385P6143L7542m480L3871P9330K8863n3916l9999M0515N7344
11428A2735865J1109J6343Q3303J06603O4877M9952Q7177R6019M8408Q124q747
11417A3299033o0281j42116j72512j41708j34046j73490j87667j53854j37611
11408A1995748j53364j31902o7927n5372j24950j84834j78180j64057j82809j79504
$$ plain form
11398 10572849 10439405 10310999 10106927 9847955 9644243 9534755 9438051 9282061 9094794
11389 9094794 8935726 8808501 8680645 8543798 8419023 8322610 8244108 8153663 8036914 7922739
11379 7922739 7848906 7797974 7715969 7606391 7539463 7538656 7531288 7457646 7355768 7280901 7214705
11368 7214705 7122998 7032132 6970401 6901527 6799547 6721462 6712755 6707215 6624755 6509589 6459486
11357 6459486 6468773 6457184 6409371 6365676 6314623 6221605 6133321 6122601 6148709 6101437 5972329
11346 5972329 5856883 5795770 5739746 5668033 5615803 5581992 5529846 5479211 5478531 5488878 5423162
11335 5423162 5299871 5225153 5219959 5204852 5162141 5158941 5187104 5141984 5007552 4910698 4928211
11324 4928211 4975883 4956821 4894135 4846658 4810412 4774844 4768173 4778883 4736500 4634895 4570750
$$ packed form
11398A0572849j33444j28406k04072k58972k03712j09488r6704j55990j87267
11389I094794j59068j27225j27856j36847j24775r6413p8502r0445j16749j14175
11379G922739p3833n0932q2005j09578o6928q07p368p3642j01878p4867o6196
11368G214705r1707r0866o1731o8874j01980p8085q707n540q2460j15166n0103
11357F459486R287j1589m7813m3695n1053r3018q8284j0720K6108m7272j29108
11346E972329j15446o1113n6024p1713n2230l3811n2146n0635o80J0347o5716
11335E423162j23291p4718n194j5107m2711l200K8163m5120j34432r6854J7513
11324D928211M7672j9062o2686m7477l6246l5568o671J0710m2383j01605o4145
$$ plain form
11313 4570750 4595734 4633701 4608129 4548485 4506641 4472105 4435179 4430507 4453575 4438059 4377114
11302 4377114 4356811 4408979 4451286 4437339 4433188 4469712 4464399 4385701 4346770 4416701 4480225 4423043
11290 4423043 4324706 4312243 4341755 4299066 4219083 4219492 4285472 4302248 4254645 4223751 4221366 4190668
11278 4190668 4144312 4145730 4172201 4143311 4069544 4032804 4035969 4010046 3956064 3941875 3967946 3970911
11266 3970911 3952091 3969220 4007564 3994649 3941795 3936344 3988210 4015812 3994910 3993302 4040936 4085405
11254 4085405 4094074 4088482 4065177 3995478 3917065 3913677 3987210 4054064 4077975 4100931 4136749 4145623
11242 4145623 4125452 4121256 4134162 4123094 4096707 4098032 4107807 4080049 4057879 4119056 4217913 4233009
11230 4233009 4171701 4163540 4236416 4274158 4231605 4213166 4277564 4334754 4316563 4295718 4345491
$$ packed form
11313D570750K4984L7967k5572n9644m1844l4536l6926m672K3068j5516o0945
11302D377114k0303N2168M2307j3947m151L6524n313p8698l8931O9931O3524n7182
11290D423043r8337j2463K9512m2689p9983M09O5980J6776m7603l0894k385l0698
11278D190668m6356J418K6471k8890p3767l6740L165k5923n3982j4189K6071K965
11266C970911j8820J7129L8344j2915n2854n451N1866K7602k0902j608M7634M4469
11254D085405Q669n592k3305o9699p8413l388P3533O6854K3911K2956L5818Q874
11242D145623k0171m196J2906j1068k6387J325R775k7758k2170O1177R8857J5096
11230D233009o1308q161P2876L7742m2553j8439O4398N7190j8191k0845M9773
$$ plain form
11219 4345491 4418163 4453513 4482584 4535860 4568035 4560332 4581114 4659224 4712625 4690165 4669767
11208 4669767 4724762 4803848 4836562 4849827 4886849 4919158 4934621 5002083 5146530 5269028 5299521
11197 5299521 5324069 5445961 5620198 5743695 5815626 5889657 5958696 6006830 6084714 6212527
11187 6212527 6302159 6302157 6320388 6461888 6642513 6721125 6727657 6786523 6887590 6919605 6879452 6860022
11175 6860022 6863218 6812005 6730932 6727488 6790383 6785498 6674546 6574520 6567944 6601951 6611360 6606805
11163 6606805 6604679 6593731 6602800 6682265 6792217 6832540 6811791 6856443 7013950 7178337 7266242
11152 7266242 7341242 7490916 7690909 7877506 8067502 8313483 8601655 8884434 9179933 9558343
11142 9558343 10033074 10516552 10895295 11133497 11296447 11464713 11629125 11706005 11664888 11576115
$$ packed form
11219D345491P2672L5350K9071N3276L2175p703K0782P8110N3401k2460k0398
11208D669767N4995P9086L2714J3265L7022L2309J5463O7462J44447J22498L0493
11197E299521K4548J21892J74237J23497P1931P4031O9039M8134P7884J27813
11187F212527Q9632kJ8231J41500J80625P8612O532N8866J01067L2015m0153j9430
11175F860022L196n1213q1073l444O2895m885j10952j00026o576L4007R409m555
11163F606805k126j0948R069P9465J09952M0323k0749M4652J57507J64387Q7905
11152G266242P5000J49674J99993J86597J89996K45981K88172K82779K95499L78410
11142I558343M74731M83478L78743K38202J62950J68266J64412P6880m1117q8773
$$ plain form
11132 11576115 11491991 11358684 11122313 10850198 10639707 10459145 10201502 9863894 9545423
11123 9545423 9282785 9018655 8733876 8484063 8290903 8113460 7943690 7820132 7732646 7624746
11113 7624746 7504905 7440660 7425020 7369331 7254647 7167939 7151996 7139777 7084531 7040595 7058151
11102 7058151 7098873 7114756 7123133 7151670 7189600 7235815 7314332 7406833 7455391 7464733 7511417 7617711
11090 7617711 7708544 7727544 7702274 7661486 7584565 7467442 7342343 7202355 7007287 6787923
11080 6787923 6629248 6522979 6365148 6137123 5950316 5858995 5771057 5613132 5445787 5334925
11070 5334925 5241171 5123191 5023160 4960252 4866554 4722925 4628954 4634982 4634740 4539387 4429528
11059 4429528 4405299 4407855 4335483 4231358 4200688 4224405 4206326 4140095 4091312 4072387 4058279
$$ packed form
11132A1576115q4124j33307k36371k72115k10491j80562k57643l37608l18471
11123I545423k62638k64130k84779k49813j93160j77443j69770j23558q7486j07900
11113G624746j19841o4245j5640n5689j14684q6708j5943j2219n5246m3936J7556
11102G058151M0722J5883Q377K8537L7930M6215P8517R2501M8558R342M6684J06294
11090G617711R0833J9000k5270m0788p6921j17123j25099j39988j95068k19364
11080F787923j58675j06269j57831k28025j86807r1321q7938j57925j67345j10862
11070E334925r3754j17980j00031o2908r3698j43629r3971O028k42r5353j09859
11059D429528k4229K556p2372j04125l0670K3717j8079o6231m8783j8925j4108
$$ plain form
11048 4058279 4062963 4085149 4052929 3940426 3856570 3891902 3963845 3949075 3879265 3856422 3862853
11037 3862853 3822002 3770769 3792772 3841827 3813519 3741992 3740372 3786553 3761066 3673455 3654405
11026 3654405 3725212 3764512 3719744 3675855 3687443 3704083 3695500 3705048 3743324 3756499 3729518 3708568
11014 3708568 3708330 3704782 3714594 3766172 3808911 3779028 3732819 3772121 3861016 3876623 3825995 3835999
11002 3835999 3925958 3974096 3932450 3895743 3920084 3945429 3943792 3978630 4062580 4111025 4091997
10991 4091997 4075474 4085751 4057663 3991019 3988237 4071648 4118633 4057665 3984771 3998641 4050546
10980 4050546 4048194 3995958 3948184 3920216 3912424 3930335 3934228 3869340 3779238 3773395 3854115 3907862
10968 3907862 3896959 3908030 3969013 3984099 3914913 3864908 3904597 3962406 3968960 3964598 3984774 3984562
$$ packed form
11048D058279M684K2186l2220j12503q3856L5332P1943j4770o9810k2843O431
11037C862853m0851n1233K2003M9055k8308p1527j620M6181k5487q7611j9050
11026C654405P0807L9300m4768m3889J1588J6640q583R548L8276J3175k6981k0950
11014C708568k38l548R812N1578M2739k9883m6209L9302Q8895J5607n0628J0004
11002C835999Q9959M8138m1646l6707K4341K5345j637L4838Q3950M8445j9028
10991D091997j6523J0277k8088o6644k782Q3411M6985o0968p2894J3870N1905
10980D050546k352n2236m7774k7968p792J7911L893o4888r0102n843Q0720N3747
10968C907862j0903J1071O0983J5086o9186n0005L9689N7809O554m362K0176k12
$$ plain form
10956 3984562 3957253 3981235 4067760 4110184 4064889 4029276 4059753 4076645 4037706 4032254 4102120
10945 4102120 4145391 4108424 4093795 4158563 4192478 4130419 4093030 4162930 4214924 4144089 4072918
10934 4072918 4132090 4213338 4162812 4062533 4080746 4174726 4188299 4138021 4157516 4241307 4280362
10923 4280362 4284178 4342972 4429471 4452694 4450802 4522719 4626199 4648276 4616852 4638458 4688728
10912 4688728 4674134 4639671 4697803 4806364 4837298 4815741 4867699 4976347 5017995 5001228 5041512
10901 5041512 5132716 5173438 5185937 5271845 5381343 5374656 5293122 5314226 5444823 5517881 5497586
10890 5497586 5522403 5624219 5672213 5638318 5659080 5773957 5847548 5821321 5811001 5879738 5933922
10879 5933922 5920764 5922225 5977580 6008282 5987452 5995362 6047418 6054761 6007544 6008264 6076979 6113624
$$ packed form
10956C984562k7309K3982Q6525M2424m5295l5613L0477J6892l8939n452O9866
10945D102120M3271l6967j4629O4768L3915o2059l7389O9900N1994p0835p1171
10934D072918N9172Q1248n0526j00279J8213R3980J3573n0278J9495Q3791L9055
10923D280362L816N8794Q6499K3223j892P1917J03480K2077l1424K1606N0270
10912D688728j4594l4463N8132J08561L0934k1557N1958J08648M1648j6767M0284
10901E041512R1204M0722J2499Q5908J09498o687q1534K1104J30597P3058k0295
10890E497586K4817J01816M7994l3895K0762J14877P3591k6227j0320O8737N4184
10879E933922j3158J461N5355L0702k0830P910N2056P343m7217P20O8715L6645
$$ plain form
10867 6113624 6090928 6089774 6117373 6099601 6073244 6156916 6308427 6355971 6297447 6307900 6419356
10856 6419356 6478788 6468198 6554450 6747815 6837783 6775135 6787571 6977979 7138527 7135642 7156155
10845 7156155 7361462 7596468 7677834 7704730 7837969 8009386 8098500 8184368 8378241 8595998
10835 8595998 8723884 8830366 9005352 9173202 9260806 9353839 9493711 9535163 9408340 9294434
10825 9294434 9323405 9334945 9177939 9003784 8994576 9034870 8945785 8826362 8851607 8929500 8880007
10814 8880007 8778696 8800804 8885612 8875713 8835890 8912682 9025226 9019062 8982361 9080460 9218913
10803 9218913 9211531 9147697 9239813 9428679 9501829 9493987 9601150 9791859 9877394 9889868 10017961
10792 10017961 10232036 10342300 10373743 10517204 10756546 10906918 10978198 11139831 11369335 11497782
$$ packed form
10867F113624k2696j154K7599j7772k6357Q3672J51511M7544n8524J0453J11456
10856F419356N9432j0590Q6252J93365Q9968o2648J2436J90408J60548k885K0513
10845G156155K05307K35006Q1366K6896J33239J71417Q9114Q5868J93873K17757
10835H595998J27886J06482J74986J67850Q7604R3033J39872M1452j26823j13906
10825I294434K8971J1540j57006j74155r208M0294q9085j19423K5245P7893m9493
10814H880007j01311K2108Q4808r899l9823P6792J12544o164l6701R8099J38453
10803I218913p382o3834R2116J88866P3150p842J07163J90709Q5535J2474J28093
10792A0017961K14075J10264L1443J43461K39342J50372P1280J61633K29504J28447
$$ plain form
10782 11497782 11559547 11730662 11965252 12066341 12072490 12191982 12398941 12490648 12502237 12650394
10772 12650394 12900069 13018287 13036056 13209033 13523729 13703400 13720857 13838064 14101494 14271858
10762 14271858 14310099 14457708 14760471 14984007 15085326 15294400 15636019 15853297 15912803 16099159
10752 16099159 16487783 16813029 16989050 17262369 17703950 18059668 18267810 18609473 19163439
10743 19163439 19630142 19894002 20238563 20794801 21308105 21676046 22170943 22885382 23516901
10734 23516901 23965539 24559014 25381705 25982591 26110039 26151617 26453790 26784901 26896731
10725 26896731 27039732 27446214 27848583 28007269 28196132 28662065 29122641 29322088 29565697
10716 29565697 30149108 30767795 31075404 31331255 31887160 32518988 32902054 33275291 33970202
$$ packed form
10782A1497782O1765J71115K34590J01089O149J19492K06959R1707J1589J48157
10772A2650394K49675J18218J7769J72977L14696J79671J7457J17207K63430J70364
10762A4271858L8241J47609L02763K23536J01319K09074L41619K17278N9506J86356
10752A6099159L88624L25246J76021K73319M41581L55718K08142L41663N53966
10743A9163439M66703K63860L44561N56238N13304L67941M94897P14439O31519
10734B3516901M48638N93475Q22691O00886J27448M1578L02173L31111J11830
10725B6896731J43001M06482M02369J58686J88863M65933M60576J99447K43609
10716B9565697N83411O18687L07609K55851N55905O31828L83066L73237O94911
$$ plain form
10707 33970202 34736782 35222527 35681457 36505565 37481764 38231901 38957756 39998238 41077114
10698 41077114 41786550 42411874 43452685 44714042 45721773 46657533 47993244 49563129
10690 49563129 50923435 52282579 54108221 56146628 57850277 59468555 61630707 64094171
10682 64094171 66020147 67300489 68494259 69625502 70216134 70403229 70842059 71543193 71939084
10673 71939084 72035605 72347798 72789791 72839406 72715443 73127747 73942800 74421968 74694279 75566729
10663 75566729 76931145 77889008 78461889 79569870 81254790 82617915 83634956 85250627
10655 85250627 87501700 89430952 91093602 93638345 97082083 100140448 102670097 106002804
10647 106002804 110366701 114445563 118123431 122989118 129310704 135396977 140965429 148012658
$$ packed form
10707C3970202P66580M85745M58930Q24108R76199P50137P25855J040482J078876
10698D1077114P09436O25324J040811J261357J007731R35760J335711J569885
10690D9563129J360306J359144J825642K038407J703649J618278K162152K463464
10682F4094171J925976J280342J193770J131243N90632J87095M38830P01134L95891
10673G1939084R6521L12193M41993M9615j23963M12304Q15053M79168K72311Q72450
10663G5566729J364416R57863N72881J107981J684920J363125J017041J615671
10655H5250627K251073J929252J662650K544743L443738L058365K529649L332707
10647A06002804M363897M078862L677868M865687O321586O086273N568452P047229
$$ plain form
10639 148012658 157112146 166280740 175023486 185692686 199037655 212885833 227647703
10632 227647703 247741409 273884618 300236321 325029700 357313106 403459376 451260487
10625 451260487 479520433 483068222 476409337 470872348 460958128 438989912 411218383
10618 411218383 388919102 371021512 347276707 315353704 283958627 259588230 239755276
10611 239755276 220665436 203449425 189922312 178356671 166845188 156534970 148648413
10604 148648413 141729405 134323013 127453114 122203694 117414745 111864157 106470505 102371073
10596 102371073 98814893 94783734 90877914 87857042 84986004 81518946 78302757 76266131
10588 76266131 74693870 72579603 70413557 69072074 68106439 66687013 65206737 64427145
$$ packed form
10639A48012658R099488R168594Q742746J0669200J3344969J3848178J4761870
10632B27647703K0093706K6143209K6351703K4793379L2283406M6146270M7801111
10625D51260487K8259946L547789o658885n536989r914220k1968216k7771529
10618D11218383k2299281j7897590k3744805l1923003l1395077k4370397j9832954
10611B39755276j9089840j7216011j3527113j1565641j1511483j0310218p886557
10604A48648413o919008p406392o869899n249420m788949n550588n393652m099432
10596A02371073l556180m031159l905820l020872k871038l467058l216189k036626
10588G6266131j572261k114267k166046j341483r65635j419426j480276p79592
$$ plain form
10580 64427145 63949884 63007878 61953733 61533234 61415655 60839000 60061087 59806060 59835181
10571 59835181 59388075 58558990 57975108 57549256 56780818 55903292 55524809 55454113 55045892
10562 55045892 54423499 54220486 54358827 54217183 53825228 53777467 54078005 54144692 53904258 53859185
10552 53859185 54077062 54090216 53832119 53751260 53930615 53958723 53752989 53691505 53840710 53834628
10542 53834628 53615799 53547407 53691766 53700485 53522257 53515288 53748720 53880747 53847132 53993770
10532 53993770 54392489 54685772 54759115 54923878 55269565 55463706 55379614 55320220 55423034 55422505
10522 55422505 55205503 55040676 55044197 54958830 54677267 54455667 54388127 54190926 53741067 53319849
10512 53319849 53077397 52752843 52183713 51608517 51192848 50728273 50090850 49543126 49275237
$$ packed form
10580F4427145m77261r42006j054145m20499j17579n76655p77913k55027K9121
10571E9835181m47106q29085n83882m25852p68438q77526l78483p0696m08221
10562E5045892o22393k03013J38341j41644l91955m7761L00538O6687k40434m5073
10552E3859185K17877J3154k58097q0859J79355K8108k05734o1484J49205o082
10542E3834628k18829o8392J44359Q719j78228o969K33432J32027l3615J46638
10532E3993770L98719K93283P3343J64763L45687J94141q4092n9394J02814n29
10522E5422505k17002j64827L521q5367k81563k21600o7540j97201m49859m21218
10512E3319849k42452l24554n69130n75196m15669m64575o37423n47724k67889
$$ plain form
10503 49275237 49077942 48781240 48595330 48691530 48857360 48918286 49111782 49667801 50374507 50948369
10493 50948369 51508259 52279108 53114162 53722072 54123507 54488633 54753492 54799411 54803248 54994223
10483 54994223 55244484 55337447 55500735 56188760 57350808 58337214 58589584 58096331 57120679
10474 57120679 55808729 54198049 52378912 50474987 48546945 46597371 44635484 42725601
10466 42725601 40993269 39539434 38321505 37199022 36129887 35211897 34489087 33858509
10458 33858509 33237162 32673027 32207325 31780528 31371965 31076005 30927721 30803730 30613867
10449 30613867 30443977 30387952 30387405 30368216 30390578 30521247 30685132 30782649 30840327 30920587 30995263
10438 30995263 31021265 31023640 30999484 30867088 30613098 30355837 30161765 29942733 29638695 29347295
$$ packed form
10503D9275237j97295k96702j85910R6200J65830O0926J93496N56019P06706N73862
10493E0948369N59890P70849Q35054O07910M01435L65126K64859M5919L837J90975
10483E4994223K50261R2963J63288O88025J162048R86406K52370m93253r75652
10474E7120679j311950j610680j819137j903925j928042j949574j961887j909883
10466D2725601j732332j453835j217929j122483j069135r17990p22810o30578
10458C3858509o21347n64135m65702m26797m08563k95960j48284j23991j89863
10449C0613867j69890n6025n47j9189K2362J30669J63885R7517N7678Q0260P4676
10438C0995263K6002K375k4156j32396k53990k57261j94072k19032l04038k91400
$$ plain form
10428 29347295 29154155 28986581 28765040 28561271 28476228 28483650 28513481 28580540 28731723 28968573
10418 28968573 29292936 29725215 30241889 30811469 31489527 32344226 33348646 34526120 36069828
10409 36069828 38043230 40157630 42287318 44987984 48777180 52894090 55626242 56163282
10401 56163282 55363953 54308842 52938405 50760610 48105041 45701243 43482048 40830100
10393 40830100 37806752 35172617 33227155 31515183 29758699 28258377 27190985 26238756
10385 26238756 25174496 24208709 23496761 22831533 22075675 21419605 20968424 20512037 19933034
10376 19933034 19426435 19096922 18742979 18257954 17849190 17635601 17412594 17047007 16731618
10367 16731618 16608176 16499641 16264567 16065476 16024660 15951885 15689624 15412928 15306102 15239471
$$ packed form
10428B9347295j93140j67574k21541k03769q5043P422K9831O7059J51183K36850
10418B8968573L24363M32279N16674N69580O78058Q54699J004420J177474J543708
10409C6069828J973402K114400K129688K700666L789196M116910K732152N37040
10401E6163282p99329j055111j370437k177795k655569k403798k219195k651948
10393D0830100l023348k634135j945462j711972j756484j500322j067392r52229
10385B6238756j064260r65787p11948o65228p55858o56070m51181m56387n79003
10376A9933034n06599l29513l53943m85025m08764k13589k23007l65587l15389
10367A6731618j23442j08535k35074j99091m0816p2775k62261k76696j06826o6631
$$ plain form
10357 15239471 15049166 14850859 14784435 14716496 14493546 14242730 14128051 14043432 13838764 13622754
10347 13622754 13546128 13499110 13319978 13101986 13002573 12946448 12809091 12696561 12742321 12816674
10337 12816674 12744825 12628761 12637233 12657550 12490999 12229992 12092318 12023512 11821880 11538757
10327 11538757 11388802 11351931 11225628 11008656 10881349 10849638 10750402 10582453 10502127 10505050
10317 10505050 10431067 10281278 10222549 10271967 10270867 10179874 10114663 10082794 9971221 9807636 9748373
10306 9748373 9783774 9736232 9580788 9488577 9510695 9494599 9372793 9273399 9275113 9293520 9278865
10295 9278865 9301212 9377069 9425826 9449404 9543379 9688949 9750725 9717863 9725004 9799648 9820308
10284 9820308 9762113 9742937 9780816 9750804 9633868 9560270 9553116 9488773 9371217 9366961 9486776
$$ packed form
10357A5239471j90305j98307o6424o7939k22950k50816j14679q4619k04668k16010
10347A3622754p6626m7018j79132k17992r9413n6125j37357j12530M5760P4353
10337A2816674p1849j16064Q472K0317j66551k61007j37674o8806k01632k83123
10327A1538757j49955l6871j26303k16972j27307l1711r9236j67949q0326K923
10317A0505050p3983j49789n8729M9418j100r0993o5211l1869j11573j63585n9263
10306I748373L5401m7542j55444r2211K2118j6096j21806r9394J714J8407j4655
10295I278865K2347P5857M8757K3578R3975J45570O1776l2862P141P4644K0660
10284I820308n8195j9176L7879l0012j16936p3598p154o4343j17556m256J19815
$$ plain form
10273 9486776 9522880 9411216 9361385 9483563 9576281 9468767 9309958 9303400 9381663 9371236 9291399
10262 9291399 9260179 9258068 9207014 9160478 9208981 9295282 9305602 9261754 9270645 9365708 9523449
10251 9523449 9739277 9972740 10128771 10202059 10316924 10520375 10680173 10702720 10693152 10763562
10241 10763562 10840721 10817647 10748316 10731266 10736721 10706005 10682592 10683932 10589350 10330263 10050133
10230 10050133 9892168 9769446 9541886 9278794 9122226 9013396 8798642 8517193 8340990
10221 8340990 8290823 8241355 8159589 8120571 8125383 8109746 8098067 8153624 8215317 8177862 8092384
10210 8092384 8090443 8150319 8141952 8067201 8044910 8083013 8077964 8025394 8019053 8045757 7992751 7864615
10198 7864615 7785990 7775231 7718832 7591857 7502502 7485432 7444072 7338268 7247103 7204923 7150678
$$ packed form
10273I486776L6104j11664m9831J22178R2718j07514j58809o558P8263j0427p9837
10262I291399l1220k111n1054m6536M8503Q6301J0320m3848Q891R5063J57741
10251I523449K15828K33463J56031P3288J14865K03451J59798K2547r568P0410
10241A0763562P7159k3074o9331j7050N455l0716k3413J340r4582k59087k80130
10230A0050133j57965j22722k27560k63092j56568j08830k14754k81449j76203
10221H340990n0167m9468q1766l9018M812j5637j1679N5557O1693l7455q5478
10210H092384j941N9876q367p4751k2291L8103n049n2570o341K6704n3006j28136
10198G864615p8625j0759n6399j26975q9355j7070m1360j05804r1165m2180n4245
$$ plain form
10187 7150678 7078591 7063214 7093544 7059006 6948606 6889714 6932853 6967889 6919549 6865810 6888208
10176 6888208 6946908 6974846 6970238 6941004 6879432 6831078 6861203 6926071 6917473 6852878 6859223 6945131
10164 6945131 6974811 6912409 6896081 6997999 7102342 7113814 7107387 7166334 7240364 7277775 7339977
10153 7339977 7464493 7561499 7570760 7584903 7692420 7828339 7906693 7975642 8110156 8267603
10143 8267603 8383364 8503298 8691783 8910850 9116292 9367035 9707156 10048695 10320972
10134 10320972 10638019 11149048 11785793 12317221 12618714 12758894 12860311 12990152 13145859
10125 13145859 13244366 13176785 12971030 12832730 12915463 13114243 13194813 13058568 12768244 12393274
10115 12393274 11971753 11571914 11250791 10978748 10711423 10491756 10378017 10329246 10271866 10216013
$$ packed form
10187G150678p2087j5377L0330l4538j10400n8892M3139L5036m8340n3739K2398
10176F888208N8700K7938m608k9234o1572m8354L0125O4868q598o4595O345Q5908
10164F945131K9680o2402j6328J01918J04343J1472o427N8947P4030L7411O2202
10153G339977J24516R7006R261J4143J07517J35919P8354O8949J34514J57447
10143H267603J15761J19934J88485K19067K05442K50743L40121L41539K72277
10134A0320972L17047N11029O36745N31428L01493J40180J01417J29841J55707
10125A3145859R8507o7581k05755j38300Q2733J98780Q0570j36245k90324l74970
10115A2393274m21521l99839l21123k72043k67325k19667j13739m8771n7380n5853
$$ plain form
10105 10216013 10189804 10127911 9954655 9713128 9479991 9221869 8881167 8533410 8291612 8107116
10095 8107116 7840963 7496554 7203974 6997750 6790871 6559615 6374003 6240415 6088863
10086 6088863 5929445 5849197 5832765 5758126 5601992 5479438 5437071 5376583 5243700 5130903
10076 5130903 5113607 5126596 5088510 5024375 4979406 4924972 4838596 4777993 4787277 4812110 4787011
10065 4787011 4732297 4693684 4659030 4605916 4565600 4568489 4578187 4542056 4468011 4406807 4393491 4429185
10053 4429185 4477537 4473462 4394931 4322769 4350569 4440533 4468925 4416166 4389843 4437789 4472842
10042 4472842 4432287 4381414 4387272 4407205 4388111 4374162 4422761 4497454 4535479 4551122 4588281
10031 4588281 4634962 4661509 4680977 4701933 4689254 4640285 4624814 4675323 4717559 4694218 4674241
$$ packed form
10105A0216013k6209o1893j73256k41527k33137k58122l40702l47757k41798j84496
10095H107116k66153l44409k92580k06224k06879k31256j85612j33588j51552
10086F088863j59418q0248j6432p4639j56134j22554m2367o0488j32883j12797
10076E130903j7296J2989l8086o4135m4969n4434q6376o0603R284K4833k5099
10065D787011n4714l8613l4654n3114m0316K889R698l6131p4045o1204j3316L5694
10053D429185M8352m075p8531p2162K7800Q9964K8392n2759k6323M7946L5053
10042D472842m0555n0873N858J9933j9094j3949M8599P4693L8025J5643L7159
10031D588281M6681K6547J9468K0956j2679m8969j5471N0509M2236k3341j9977
$$ plain form
10020 4674241 4737188 4824854 4828329 4767427 4755972 4821169 4883259 4902579 4927352 4986537 5040229
10009 5040229 5061968 5088372 5156531 5251237 5339524 5413702 5482427 5553009 5634921 5738069 5863653
9998 5863653 6008362 6165457 6310750 6412536 6471895 6523943 6582673 6621130 6625752 6627979 6657019
9987 6657019 6704064 6758768 6835342 6935245 7030683 7110887 7196134 7286217 7353758 7405901 7479517
9976 7479517 7555974 7573327 7554847 7613913 7773481 7898078 7890736 7844650 7889337 7991375 8045790
9965 8045790 8079212 8197130 8376848 8484442 8491478 8520423 8655303 8838916 8988879 9104117
9955 9104117 9220684 9356018 9531397 9767833 10026838 10226459 10346519 10457162 10619495 10815227
9945 10815227 10996245 11150149 11292005 11432524 11576484 11728933 11896904 12098525 12352415
$$ packed form
10020D674241O2947Q7666L475o0902j1455O5197O2090J9320K4773N9185N3692
10009E040229K1739K6404O8159R4706Q8287P4178O8725P0582Q1912J03148J25584
9998E863653J44709J57095J45293J01786N9359N2048N8730L8457M622K227K9040
9987F657019M7045N4704P6574R9903R5438Q0204Q5247R0083O7541N2143P3616
9976G479517P6457J7353j8480N9066J59568J24597p342m6086M4687J02038N4415
9965H045790L3422J17918J79718J07594P036K8945J34880J83613J49963J15238
9955I104117J16567J35334J75379K36436K59005J99621J20060J10643J62333J95732
9945A0815227J81018J53904J41856J40519J43960J52449J67971K01621K53890
$$ plain form
9936 12352415 12639720 12912588 13167896 13462284 13814713 14158913 14453573 14770290 15187431
9927 15187431 15659969 16098879 16528729 17047296 17661338 18288842 18914049 19620711 20467647
9918 20467647 21438764 22523488 23745578 25097563 26526250 27977553 29373041 30565632
9910 30565632 31427119 31975035 32317419 32495484 32496070 32392000 32319582 32307634 32271187 32198079 32206985
9899 32206985 32391801 32742348 33258159 34013495 35061490 36382569 37962710 39817498 41921786
9890 41921786 44230050 46754486 49449576 51997541 53913242 54952582 55264394 55079718
9882 55079718 54448571 53386334 52065393 50672371 49207896 47600408 45908342 44240658
9874 44240658 42572773 40816866 39007441 37256519 35583582 33942941 32362813 30899739
$$ packed form
9936A2352415K87305K72868K55308K94388L52429L44200K94660L16717M17141
9927A5187431M72538M38910M29850N18567O14042O27504O25207P06662Q46936
9918B0467647R71117J084724J222090J351985J428687J451303J395488J192591
9910C0565632Q61487N47916L42384J78065N86j04070p2418j1948l6447p3108Q906
9899C2206985J84816L50547N15811P55336J047995J321079J580141J854788K104288
9890D1921786K308264K524436K695090K547965J915701J039340L11812j84676
9882E5079718o31147j062237j320941j393022j464475j607488j692066j667684
9874D4240658j667885j755907j809425j750922j672937j640641j580128j463074
$$ plain form
9866 30899739 29500566 28069154 26641539 25343548 24194651 23100962 22032450 21063500
9858 21063500 20232730 19490939 18798069 18158280 17552911 16947153 16370338 15888994 15495466
9849 15495466 15117178 14734193 14392077 14102063 13827142 13567206 13361338 13202879 13044229
9840 13044229 12886482 12773380 12698495 12613011 12525776 12498011 12530637 12548846 12508957 12435875 12350047
9829 12350047 12244361 12137551 12060660 11982593 11837538 11636066 11462140 11348761 11241860 11099601
9819 11099601 10942757 10790881 10629293 10458367 10305329 10174415 10048877 9942328 9880549 9839886
9809 9839886 9776752 9706146 9673294 9665945 9640689 9613017 9624820 9649476 9640275 9645353 9742840 9878874
9797 9878874 9919179 9864022 9855128 9946302 10024425 9998675 9914680 9826286 9703811 9539728 9404996
$$ packed form
9866C0899739j399173j431412j427615j297991j148897j093689j068512r68950
9858B1063500q30770p41791o92870o39789o05369o05758n76815m81344l93528
9849A5495466l78288l82985l42116k90014k74921k59936k05868j58459j58650
9840A3044229j57747j13102p4885q5484q7235k7765L2626J8209l9889p3082q5828
9829A2350047j05686j06810p6891p8067j45055k01472j73926j13379j06901j42259
9819A1099601j56844j51876j61588j70926j53038j30914j25538j06549o1779m0663
9809I839886o3134p0606l2852p349k5256k7672J1803K4656r201N078R7487J36034
9797I878874M0305n5157q894R1174P8123k5750q3995q8394j22475j64083j34732
$$ plain form
9786 9404996 9318376 9185777 8953023 8701209 8508717 8337315 8143009 7979802 7890711 7804654
9776 7804654 7652166 7488243 7389861 7319271 7201530 7057883 6948368 6854037 6730904 6617039
9766 6617039 6570789 6555684 6496731 6404236 6337197 6288424 6209983 6115724 6060592 6048448 6044450 6042671
9754 6042671 6044411 6015943 5947090 5899979 5918197 5945073 5918395 5882245 5906976 5961420 5973581 5961596
9742 5961596 5989276 6041361 6060910 6065458 6105761 6153091 6154451 6158679 6248954 6379706 6428090 6395752
9730 6395752 6411847 6529713 6661902 6737810 6796279 6891262 7019294 7171409 7355936 7543980
9720 7543980 7685324 7794774 7929714 8075034 8154094 8161984 8172750 8195804 8147860 8005731 7869795
9709 7869795 7818784 7799948 7725513 7596808 7471341 7372715 7290432 7219408 7155122 7088164 7028802
$$ packed form
9786I404996q6620j32599k32754k51814j92492j71402j94306j63207q9091q6057
9776G804654j52488j63923r8382p0590j17741j43647j09515r4331j23133j13865
9766F617039m6250j5105n8953r2495o7039m8773p8441r4259n5132j2144l998j779
9754F042671J740k8468o8853m7111J8218K6876k6678l6150K4731N4444J2161j1985
9742E961596K7680N2085J9549M548M0303M7330J360M228R0275J30752M8384l2338
9730F395752J6095J17866J32189P5908N8469R4983J28032J52115J84527J88044
9720G543980J41344J09450J34940J45320P9060P890J0766K3054m7944j42129j35936
9709G869795n1011j8836p4435j28705j25467r8626q2283p1024o4286o6958n9362
$$ plain form
9698 7028802 6996721 6975374 6923535 6836631 6746981 6667295 6587728 6515756 6459245 6393367 6312104
9687 6312104 6275035 6316518 6354671 6303081 6228942 6261825 6379525 6448346 6460762 6547789 6742882
9676 6742882 6931162 7075276 7286134 7589327 7820533 7870824 7861564 7937564 8038765 8031401 7937341
9665 7937341 7865883 7816026 7715157 7584107 7502289 7455472 7365705 7241372 7165371 7155007 7149355
9654 7149355 7120160 7097112 7100044 7127519 7185994 7259390 7291176 7265968 7253360 7296452 7325265 7268801
9642 7268801 7179574 7141373 7120576 7027544 6872730 6742297 6661049 6593133 6536985 6506681 6460477
9631 6460477 6361037 6265116 6241626 6249058 6212493 6166559 6186822 6232353 6209687 6153292 6178186 6277514
9619 6277514 6336616 6338134 6380267 6486831 6573513 6621837 6712951 6855313 6951181 6983442 7069210
$$ packed form
9698G028802l2081k1347n1839q6904q9650p9686p9567p1972n6511o5878q1263
9687F312104l7069M1483L8153n1590p4139L2883J17700O8821J2416Q7027J95093
9676F742882J88280J44114K10858L03193K31206N0291r260P6000J01201p364r4060
9665G937341p1458m9857j00869j31050q1818m6817q9767j24333p6001j0364n652
9654G149355k9195k3048K932K7475N8475P3396L1786k5208j2608M3092K8813n6464
9642G268801q9227l8201k0797r3032j54814j30433q1248o7916n6148l0304m6204
9631F460477r9440r5921k3490P432l6565m5934K0263M5531k2666n6395K4894R9328
9619F277514N9102J518M2133J06564Q6682M8324R1114J42362R5868L2261Q5768
$$ plain form
9608 7069210 7264704 7475498 7633958 7812138 8071629 8347926 8588016 8871447 9277105 9739999
9598 9739999 10163233 10583329 11103316 11734321 12422221 13172710 14028733 14954595 15842973 16615284
9588 16615284 17233270 17639098 17773442 17651645 17358876 16965794 16483098 15888850 15175907
9579 15175907 14386327 13604353 12885246 12199281 11500067 10835253 10304901 9908266 9534700
9570 9534700 9127988 8748639 8434304 8117419 7748471 7395026 7137488 6954811 6789805 6639213
9560 6639213 6499492 6314791 6070619 5855209 5732215 5634144 5483247 5334355 5279063 5279894
9550 5279894 5229703 5122763 5037199 4988485 4929599 4867117 4849119 4853669 4809143 4717885 4651747
9539 4651747 4633418 4623635 4612646 4621195 4624750 4581572 4522141 4504450 4497606 4424940 4307123 4234786
$$ packed form
9608G069210J95494K10794J58460J78180K59491K76297K40090K83431M05658M62894
9598I739999M23234M20096N19987O31005O87900P50489Q56023R25862Q88378P72311
9588A6615284O17986M05828J34344j21797k92769l93082m82696n94248p12943
9579A5175907p89580p81974p19107o85965o99214o64814n30352l96635l73566
9570I534700m06712l79349l14335l16885l68948l53445k57538j82677j65006j50592
9560F639213j39721j84701k44172k15410j22994r8071j50897j48892n5292Q31
9550E279894n0191j06940q5564m8714n8886o2482j7998M550m4526r1258o6138
9539D651747j8329r783j0989Q549L555m3178n9431j7691o844p2666j17817p2337
$$ plain form
9527 4234786 4205311 4125838 3987982 3893011 3871437 3823080 3692818 3572156 3549833 3575160 3555509
9516 3555509 3494980 3447282 3409659 3354883 3307474 3300844 3306345 3284704 3265523 3295515 3340730 3322326
9504 3322326 3234769 3155994 3142453 3174041 3207612 3234023 3265659 3299582 3314436 3297181 3263933
9493 3263933 3248302 3264614 3293229 3313859 3334117 3360375 3364546 3322342 3266351 3247618 3255394 3236316
9481 3236316 3188966 3167964 3184075 3175581 3107695 3032957 3010898 3021130 3003989 2950422 2905449 2902673
9469 2902673 2929273 2945189 2920145 2862714 2814844 2802067 2802140 2789705 2784874 2808206 2816554 2758522
9457 2758522 2678562 2675985 2756437 2817322 2799167 2757494 2753496 2766883 2762546 2757578 2768485 2768904 2753222
9444 2753222 2766019 2812718 2821344 2758782 2704553 2729762 2777861 2759181 2700511 2694615 2744499 2767076
$$ packed form
9527D234786k9475p9473j37856r4971k1574m8357j30262j20662k2323K5327j9651
9516C555509o0529m7698l7623n4776m7409o630N501k1641j9181K9992M5215j8404
9504C322326q7557p8775j3541L1588L3571K6411L1636L3923J4854j7255l3248
9493C263933j5631J6312K8615K0630K0258K6258M171m2204n5991j8733P776j9078
9481C236316m7350k1002J6111q494o7886p4738k2059J0232j7141n3567m4973k776
9469B902673K6600J5916k5044n7431m7870j2777P3j2435m831K3332Q348n8032
9457B758522p9960k577Q0452O0885j8155m1673l998J3387m337m968J0907M19j5682
9444B753222J2797M6699Q626o2562n4229K5209M8099j8680n8670n896M9884K2577
$$ plain form
9432 2767076 2730519 2687388 2677329 2683526 2686187 2686146 2675272 2645262 2619290 2618219 2612524 2570567 2532692
9419 2532692 2561385 2631403 2652937 2605122 2565270 2591885 2652738 2691628 2700987 2698216 2684290 2662027
9407 2662027 2657561 2688566 2731241 2743478 2711972 2666123 2650586 2682629 2732288 2756175 2752946 2758703
9395 2758703 2781336 2782587 2746684 2717596 2731136 2757283 2757284 2753288 2784266 2831857 2854233 2862782 2898734
9382 2898734 2956438 2993157 2995735 2980740 2952874 2919329 2912991 2939642 2940284 2875548 2802387 2782719
9370 2782719 2765511 2669276 2543327 2514703 2587386 2633889 2597875 2564288 2592296 2616083 2576964
9359 2576964 2536390 2571919 2647123 2671524 2630389 2580943 2565019 2585556 2630028 2669510 2673202 2658729
9347 2658729 2681453 2745358 2783973 2763752 2739466 2762021 2798040 2797236 2779903 2793075 2826608 2837450
$$ packed form
9432B767076l6557m3131j0059O197K661m1j0874l0010k5972j071n695m1957l7875
9419B532692K8693P0018K1534m7815l9852K6615O0853L8890R359k771j3926k2263
9407B662027m466L1005M2675J2237l1506m5849j5537L2043M9659K3887l229N757
9395B758703K2633J251l5903k9088J3540K6147Jl996L0978M7591K2376Q549L5952
9382B898734N7704L6719K578j4995k7866l3545o338K6651O42o4736p3161j9668
9370B782719j7208r6235j25949k8624P2683M6503l6014l3587K8008K3787l9119
9359B576964m0574L5529P5204K4401m1135m9446j5924K0537M4472L9482L692j4473
9347B658729K2724O3905L8615k0221k4286K2555L6019q04j7333J3172L3533J0842
$$ plain form
9335 2837450 2823117 2813869 2819867 2835307 2869074 2927329 2986901 3019434 3021837 3005842 2989813 3009502
9323 3009502 3087460 3180603 3219280 3212324 3239569 3320805 3382663 3391750 3420225 3519236 3624357 3666634
9311 3666634 3691325 3773221 3886832 3960802 4001639 4061727 4133823 4177978 4210141 4264487 4308150
9300 4308150 4295061 4266596 4291952 4341295 4330809 4269310 4243178 4269611 4283880 4269670 4283201
9289 4283201 4337405 4375447 4379779 4402531 4462255 4509620 4525727 4560648 4638202 4706968 4723810 4711421
9277 4711421 4699950 4683794 4666851 4678001 4709130 4707834 4664754 4640193 4670184 4712384 4720549 4709500
9265 4709500 4709446 4714180 4710304 4704831 4693366 4652598 4589376 4545334 4534692 4533484 4539672 4573743 4609763
9252 4609763 4591729 4539376 4543488 4622537 4682716 4666900 4640839 4666871 4691943 4646631 4570890 4544437
$$ packed form
9335B837450j4333r248N998J5440L3767N8255N9572L2533K403j5995j6029J9689
9323C009502P7958R3143L8677o956K7245Q1236O1858R087K8475R9011J05121M2277
9311C666634K4691Q1896J13611P3970M0837O0088P2096M4155L2163N4346M3663
9300D308150j3089k8465K5356M9343j0486o1499k6132K6433J4269j4210J3531
9289D283201N4204L8042M332K2752N9724M7365J6107L4921P7554O8766J6842j2389
9277D711421j1471j6156j6943J1150L1129j296m3080k4561K9991M2200Q165j1049
9265D709500n4M734l876n473j1465m0768o3222m4042j0642j208O188L4071L6020
9252D609763j8034n2353M112P9049O0179j5816k6061K6032K5072m5312p5741k6453
$$ plain form
9240 4544437 4557617 4548474 4515715 4500480 4499220 4484197 4471164 4481242 4477880 4431275 4401789 4458605
9228 4458605 4552598 4581268 4554759 4577231 4671209 4745101 4749500 4745635 4783346 4819950 4812985 4801772
9216 4801772 4833100 4878263 4891062 4891983 4925326 4972747 4978815 4940968 4911393 4916351 4925799 4905739
9204 4905739 4859338 4807805 4763254 4733620 4729208 4744635 4748243 4712014 4650052 4606237 4598141 4595138
9192 4595138 4566282 4524823 4496740 4468458 4412281 4351290 4338040 4362307 4345598 4252802 4148599
9181 4148599 4106242 4116321 4129503 4133530 4132297 4101238 4032740 3984612 4008383 4061395 4068317 4042713
9169 4042713 4059975 4125848 4167434 4156474 4146526 4169647 4186850 4175032 4181641 4243817 4316746 4337118
9157 4337118 4312932 4298544 4312186 4325877 4318051 4296246 4275233 4258874 4241656 4219032 4201702 4212850
$$ packed form
9240D544437J3180r143l2759j5235j260j5023j3033J0078l362m6605k9486N6816
9228D458605R3993K8670k6509K2472R3978P3892M399l865L7711L6604o965j1213
9216D801772L1328M5163J2799R21L3343M7421O068l7847k9575M958R448k0060
9204D905739m6401n1533m4551k9634m412J5427L608l6229o1962m3815q096l003
9192D595138k8856m1459k8083k8282n6177o0991j3250K4267j6709r2796j04203
9181D148599m2357J0079J3182M027j233l1059o8498m8128K3771N3012O922k5604
9169D042713J7262O5873M1586j0960r948K3121J7203j1818O609O2176P2929K0372
9157D337118k4186j4388J3642J3691p826k1805k1013j6359j7218k2624j7330J1148
$$ plain form
9145 4212850 4252586 4278014 4252061 4202386 4189290 4220374 4245991 4239220 4224901 4220782 4207659 4176507
9133 4176507 4151003 4138939 4111109 4055462 4005791 3988359 3983816 3970126 3958746 3957256 3940212 3892640
9121 3892640 3842936 3817234 3799261 3771009 3753817 3768893 3793625 3800021 3803368 3828409 3858617 3866398
9109 3866398 3866189 3887772 3919252 3927154 3915924 3917395 3933364 3936530 3919740 3899523 3878917 3851106
9097 3851106 3831878 3841101 3855943 3831862 3772675 3731026 3730402 3734756 3712899 3687628 3691383 3707082
9085 3707082 3690181 3632976 3573883 3547471 3549829 3552261 3529056 3471240 3393166 3331172 3316627 3339318
9073 3339318 3354768 3341850 3331340 3351605 3370569 3339064 3278092 3256475 3276304 3261709 3192809
9062 3192809 3160143 3218870 3274763 3218680 3109380 3091625 3168441 3203081 3144636 3096415 3128008
$$ packed form
9145D212850L9736K5428k5953m9675j3096L1084K5617o771j4319m119j3123l1152
9133D176507k5504j2064k7830n5647m9671j7432m543j3690j1380j490j7044m7572
9121C892640m9704k5702j7973k8252j7192J5076K4732O396L347K5041L0208P781
9109C866398k09K1583L1480P902j1230J471J5969L166j6790k0217k0606k7811
9097C851106j9228R223J4842k4081n9187m1649o24M354k1857k5271L755J5699
9085C707082j6901n7205n9093k6412K358K432k3205n7816p8074o1994j4545K2691
9073C339318J5450j2918j0510K0265J8964l1505o0972k1617J9829j4595o8900
9062C192809l2666N8727N5893n6083j09300j7755P6816L4640n8445m8221L1593
$$ plain form
9051 3128008 3169631 3155328 3134816 3159615 3177654 3137366 3091945 3096560 3097424 3036269 2978834 3014387
9039 3014387 3099079 3129731 3112659 3122069 3141443 3094954 3005603 2970936 2993523 2981939 2919426 2885996
9027 2885996 2901081 2888663 2826000 2789373 2812968 2830769 2804079 2783959 2794988 2776172 2699854
9016 2699854 2639778 2652104 2686922 2686168 2676168 2693137 2706106 2686859 2673276 2691010 2693058 2648727
9004 2648727 2610115 2615582 2612740 2560058 2518013 2543616 2576193 2536283 2466889 2459862 2501181 2511296
8992 2511296 2491246 2501091 2526722 2498894 2429705 2405173 2442919 2471686 2458008 2445571 2456398 2452792
8980 2452792 2415593 2373495 2340346 2302561 2273537 2278861 2288233 2250761 2194782 2193538 2232761 2225975
8968 2225975 2170734 2162122 2220712 2240879 2167022 2093477 2108647 2153814 2136188 2085926 2086778 2124697
$$ packed form
9051C128008M1623j4303k0512K4799J8039m0288m5421M615Q64o1155n7435L5553
9039C014387Q4692L0652j7072R410J9374m6489q9351l4667K2587j1584o2513l3430
9027B885996J5085j2418o2663l6627K3595J7801k6690k0120J1029j8816p6318
9016B699854o0076J2326L4818p54j0000J6969J2969j9247j3583J7734K048m4331
9004B648727l8612N467k842n2682m2045K5603L2577l9910o9394p027M1319J0115
8992B511296k0050R845K5631k7828o9189k4532L7746K8767j3678j2437J0827l606
8980B452792l7199m2098l3149l7785k9024N324R372l7472n5979j244L9223o786
8968B225975n5241q612N8590K0167p3857p3545J5170M5167j7626n0262Q52L7919
$$ plain form
8956 2124697 2126846 2099734 2105097 2128826 2097433 2018210 1986828 2039563 2097590 2087499 2034831 2001896
8944 2001896 2000277 2005787 2007858 2002701 1975950 1930426 1903592 1923657 1966949 1985986 1966029 1932673
8932 1932673 1915149 1920388 1935051 1938823 1920630 1889527 1863988 1848320 1830300 1804129 1781104 1771547
8920 1771547 1770122 1767945 1767469 1773705 1777611 1760863 1718831 1673393 1658605 1688955 1739067 1761064 1730498
8907 1730498 1671815 1630147 1624089 1640122 1666249 1703560 1738154 1733385 1676795 1615397 1608466 1650630
8895 1650630 1679636 1664616 1644398 1659231 1686429 1680383 1644042 1613836 1597166 1580305 1581414 1626023
8883 1626023 1671630 1638395 1537402 1485703 1547284 1634528 1634524 1568943 1542551 1579097 1607806 1590919
8871 1590919 1562880 1544153 1513924 1482813 1499849 1558821 1582440 1537700 1490357 1500016 1532530 1530364
$$ packed form
8956B124697K149k7112N363K3729l1393p9223l1382N2735N8027j0091n2668l2935
8944B001896j619N510K071n157k6751m5524k6834K0065M3292J9037j9957l3356
8932A932673j7524N239J4663L772j8193l1103k5539j5668j8020k6171k3025r557
8920A771547j425k177m76O236L906j6748m2032m5438j4788L0350N0112K1997l0566
8907A730498n8683m1668o058J6033K6127L7311L4594m769n6590o1398o931M2164
8895A650630K9006j5020k0218J4833K7198o046l6341l0206j6670j6861J109M4609
8883A626023M5607l3235j00993n1699O1581Q7244mo5581k6392L6546K8709j6887
8871A590919k8039j8727l0229l1111J7036N8972K3619m4740m7343R659L2514k166
$$ plain form
8859 1530364 1506134 1502911 1512653 1502259 1484815 1498522 1536994 1558168 1547238 1523940 1504026 1494609
8847 1494609 1507289 1536234 1546104 1520206 1493623 1499613 1516723 1513977 1509564 1528525 1541266 1513350
8835 1513350 1483428 1511198 1570333 1580781 1536523 1508434 1519243 1514267 1475109 1463799 1513862 1564648
8823 1564648 1557374 1524024 1521879 1541428 1543171 1535156 1546919 1565284 1561799 1552881 1568241 1585614 1563415
8810 1563415 1519082 1506286 1524885 1523703 1492118 1478032 1501667 1518057 1492828 1460954 1473858 1525992
8798 1525992 1568747 1571478 1541263 1504489 1491477 1517017 1555917 1561601 1527907 1503564 1522428 1553221
8786 1553221 1551945 1530274 1525205 1527756 1501271 1458247 1453843 1498299 1538053 1539548 1532406 1544612 1553313
8773 1553313 1537006 1523503 1539109 1556153 1544648 1534173 1560996 1589781 1564785 1516438 1530315
$$ packed form
8859A530364k4230l223R742j0394j7444J3707L8472K1174j0930k3298j9914r417
8847A494609J2680K8945R870k5898k6583N990J7110k746m413J8961J2741k7916
8835A513350k9922K7770N9135J0448m4258k8089J0809m976l9158j1310N0063N0786
8823A564648p274l3350k145J9549J743q015J1763J8365l485q918J5360J7373k2199
8810A563415m4333j2796J8599j182l1585j4086K3635J6390k5229l1874J2904N2134
8798A525992M2755K731l0215l6774j3012K5540L8900N684l3694k4343J8864L0793
8786A553221j276k1671n069K551k6485m3024m404M4456L9754J495p142J2206Q701
8773A553313j6307j3503J5606J7044j1505j0475K6823K8785k4996m8347J3877
$$ plain form
8762 1530315 1612201 1670131 1646173 1587071 1557683 1557071 1556862 1559118 1573086 1585459 1592939 1618335 1661244
8749 1661244 1682493 1669774 1662633 1677103 1670545 1627395 1609117 1656021 1707009 1694635 1659289 1678290
8737 1678290 1731886 1741764 1706891 1693691 1713055 1716313 1704135 1730264 1793792 1831846 1828700 1831501
8725 1831501 1847061 1828508 1782752 1781729 1836812 1869688 1846011 1830088 1860412 1881548 1860224 1860143
8713 1860143 1924362 1983016 1966608 1922880 1926953 1955964 1953309 1942908 1970915 2000376 1980777 1964477
8701 1964477 2026859 2115526 2114947 2034509 1994310 2034874 2079619 2089997 2115779 2165696 2165980 2097231
8689 2097231 2051815 2093094 2160975 2182844 2182784 2206074 2221495 2186967 2146053 2165876 2223831 2245751
8677 2245751 2227893 2234616 2286493 2330058 2325771 2303787 2314276 2362526 2410636 2422163 2396473 2368018
$$ packed form
8762A530315Q1886N7930k3958n9102k9388o12k09K256J3968J2373P480K5396M2909
8749A661244K1249j2719p141J4470o558m3150j8278M6904N0988j2374l5346J9001
8737A678290N3596R878l4873j3200J9364L258j2178K6129O3528L8054l146K801
8725A831501J5560j8553m5756j023N5083L2876k3677j5923L0324K1136k1324q1
8713A860143O4219N8654j6408m3728M073K9011k655j0401K8007K9461j9599j6300
8701A964477O2382Q8667n79q0438m0199M0564M4745J0378K5782M9917K84o8749
8689B097231m5416M1279O7881K1869o0K3290J5421l4528m0914J9823N7955K1920
8677B245751j7858O723N1877M3565m287k1984J0489M8250M8110J1527k5690k8455
$$ plain form
8665 2368018 2368163 2385309 2382418 2359544 2364921 2423743 2491892 2515468 2508698 2529127 2589517 2638989
8653 2638989 2633141 2588429 2557354 2570418 2612123 2645347 2654056 2659462 2687526 2726877 2740184 2718140
8641 2718140 2694748 2699947 2725193 2750358 2775647 2804913 2822802 2816189 2801850 2807130 2834400 2865144
8629 2865144 2887663 2901596 2905612 2898406 2884274 2867033 2850043 2848547 2881791 2942470 2996530 3025743
8617 3025743 3045589 3067180 3072341 3049285 3023469 3023064 3037516 3041780 3040261 3051506 3066125 3058974 3035808
8604 3035808 3031877 3063728 3109802 3139775 3141867 3122889 3100852 3096519 3117590 3153437 3192389 3232170
8592 3232170 3265196 3273096 3250296 3215084 3185281 3165586 3168032 3207444 3256006 3248319 3171749 3111218
8580 3111218 3149941 3254798 3320877 3309544 3275448 3266424 3270945 3273610 3290663 3322492 3329670 3294176
$$ packed form
8665B368018J45J7146k891k2874N377N8822O8149K3576o770K0429O0390M9472
8653B638989n848m4712l1075J3064M1705L3224Q709N406K8064L9351J3307k2044
8641B718140k3392N199K5246K5165K5289K9266J7889o613j4339N280K7270L0744
8629B865144K2519J3933M016p206j4132j7241j6990j496L3244O0679N4060K9213
8617C025743J9846K1591N161k3056k5816m05J4452M264j519J1245J4619p151k3166
8604C035808l931L1851M6074K9973K092j8978k2037m333K1071L5847L8952L9781
8592C232170L3026P900k2800l5212k9803j9695K446L9412M8562p687p6570o0531
8580C111218L8723J04857O6079j1333l4096r024M521K665J7053L1829P178l5494
$$ plain form
8568 3294176 3261158 3279822 3333344 3366152 3359992 3345691 3350147 3365554 3372840 3371941 3379109 3402047 3425615
8555 3425615 3426974 3404561 3381786 3376538 3381806 3387200 3398499 3415076 3411901 3378264 3354296 3382802
8543 3382802 3436172 3446972 3412819 3408605 3473227 3542746 3537381 3472921 3435157 3465574 3521240 3542786
8531 3542786 3521341 3491034 3482697 3497426 3514354 3516452 3509113 3510938 3527831 3546562 3554584 3551717 3539487
8518 3539487 3517004 3494255 3489877 3503888 3510480 3493340 3473149 3481240 3515224 3539833 3528973 3492188
8506 3492188 3459603 3452210 3468603 3491774 3503132 3493254 3467002 3443573 3446005 3478357 3513235 3517355
8494 3517355 3492940 3474692 3479183 3482864 3465121 3443606 3440440 3441343 3425146 3410703 3428366 3459017
8482 3459017 3452862 3406080 3369279 3375744 3407587 3439812 3471671 3502413 3518721 3520526 3522284 3520485
$$ packed form
8568C294176l3018J8664N3522L2808o160j4301M456J5407P286q99P168K2938K3568
8555C425615J359k2413k2775n248N268N394J1299J6577l175l3637k3968K8506
8543C382802N3370J0800l4153m214O4622O9519n365o4460l7764L0417N5666K1546
8531C542786k1445l0307q337J4729J6928K098p339J825J6893J8731Q022k867j2230
8518C539487k2483k2749m378J4011O592j7140k0191Q091L3984K4609j0860l6785
8506C492188l2585p393J6393K3171J1358r878k6252k3429K432L2352L4878M120
8494C517355k4415j8248M491L681j7743k1515l166R03j6197j4443J7663L0651
8482C459017o155m6782l6801O465L1843L2225L1859L0742J6308J805J758j799
$$ plain form
8470 3520485 3500523 3480014 3493051 3520739 3498866 3420067 3366524 3400047 3473471 3502905 3484658
8459 3484658 3480464 3515021 3551661 3560981 3557890 3563490 3569650 3555689 3521204 3492344 3497294 3531851 3555495
8446 3555495 3540370 3516650 3535596 3589827 3615980 3585565 3543508 3537753 3560189 3583257 3606822 3636119
8434 3636119 3655708 3658497 3663742 3680753 3695303 3709913 3743548 3773255 3747956 3689697 3695151 3786857
8422 3786857 3854048 3812472 3734953 3733716 3795417 3839578 3866031 3919153 3965605 3946200 3907217 3935638
8410 3935638 3993670 3971244 3887244 3872485 3945925 3980804 3927112 3894813 3952207 4004735 3966478
8399 3966478 3910325 3936391 4006681 4029222 4014179 4026300 4054934 4050062 4033645 4062435 4118113 4136342
8387 4136342 4116653 4112697 4136788 4155509 4159659 4167424 4178423 4184124 4196678 4216920 4215650 4197652
$$ packed form
8470C520485j9962k0509J3037K7688k1873p8799n3543L3523P3424K9434j8247
8459C484658m194L4557L6640R320l091N600O160j3961l4485k8860M950L4557K3644
8446C555495j5125k3720J8946N4231K6153l0415m2057n755K2436K3068K3565K9297
8434C636119J9589K789N245J7011J4550J4610L3635K9707k5299n8259N454R1706
8422C786857O7191m1576p7519j237O1701M4161K6453N3122M6452j9405l8983K8421
8410C935638N8032k2426q4000j4759P3440L4879n3692l2299N7394N2528l8257
8399C966478n6153K6066P0290K2541j5043J2121K8634m872j6417K8790N5678J8229
8387D136342j9689l956K4091J8721M150P765J0999N701J2554K0242j270j7998
$$ plain form
8375 4197652 4225491 4315910 4380859 4353361 4302770 4324996 4384219 4384706 4346001 4365604 4437504 4458003
8363 4458003 4409216 4389597 4442529 4492527 4486996 4473208 4487495 4487583 4453741 4447896 4502319 4544678
8351 4544678 4510058 4447292 4436090 4466875 4481357 4475189 4481814 4499073 4504765 4509087 4527364 4536116
8339 4536116 4516884 4506428 4540580 4584320 4585315 4565540 4586924 4647748 4686974 4679846 4658508 4642852
8327 4642852 4621052 4602614 4622795 4678432 4718252 4718939 4719739 4754865 4797150 4805115 4792792 4809071
8315 4809071 4861082 4899246 4884505 4841416 4826023 4854085 4884929 4879623 4851902 4842651 4859975 4874182
8303 4874182 4866997 4852071 4842899 4835465 4833950 4857538 4901654 4925918 4907984 4881251 4887934 4918169
8291 4918169 4930488 4915330 4901577 4909381 4929928 4947787 4955545 4949763 4935957 4932850 4951735 4980298
$$ packed form
8375D197652K7839R0419O4949k7498n0591K2226N9223M87l8705J9603P1900K0499
8363D458003m8787j9619N2932M9998n531j3788J4287Q8l3842n845N4423M2359
8351D544678l4620o2766j1202L0785J4482o168O625J7259N692M322J8277Q752
8339D536116j9232j0456L4152M3740R95j9775K1384O0824L9226p128k1338j5656
8327D642852k1800j8438K0181N5637L9820O87Q00L5126M2285P965j2323J6279
8315D809071N2011L8164j4741m3089j5393K8062L0844n306k7721r251J7324J4207
8303D874182p185j4926r172p434j515K3588M4116K4264j7934k6733O683L0235
8291D918169J2319j5158j3753P804K0547J7859P758n782j3806l107J8885K8563
$$ plain form
8279 4980298 5004911 5031745 5061199 5064265 5023562 4981449 4997704 5063121 5108221 5105208 5104270 5143789
8267 5143789 5179989 5155156 5098924 5096412 5163496 5219559 5203624 5160963 5170105 5221320 5231678 5174506
8255 5174506 5125858 5155781 5228363 5259209 5237941 5231850 5278205 5335421 5352501 5334156 5313518 5301319
8243 5301319 5291363 5287086 5294429 5308677 5329501 5367738 5417338 5443685 5423688 5380390 5357679 5375633
8231 5375633 5423671 5476256 5502887 5490228 5469239 5487717 5538726 5558512 5523202 5498465 5545389
8220 5545389 5620261 5634608 5589785 5576088 5639809 5723996 5760427 5759622 5774238 5814459 5842892 5837246
8208 5837246 5821185 5828552 5857763 5877371 5875214 5882700 5930807 5994747 6018699 5996573 5983872 6015762
8196 6015762 6062824 6093565 6125929 6173974 6197031 6163170 6120900 6137444 6198170 6242298 6269328
$$ packed form
8279D980298K4613K6834K9454L066m0703m2113J6255O5417M5100l013r38L9519
8267E143789L6200k4833n6232k512O7084N6063j5935m2661R142N1215J0358n7172
8255E174506m8648K9923P2582L0846k1268o091M6355N7216J7080j8345k0638j2199
8243E301319r956m277P343J4248K0824L8237M9600K6347j9997m3298k2711J7954
8231E375633M8038N2585K6631j2659k0989J8478N1009J9786l5310k4737M6924
8220E545389P4872J4347m4823j3697O3721Q4187L6431q05J4616M0221K8433n646
8208E837246j6061P367K9211J9608k157P486M8107O3940K3952k2126j2701L1890
8196F015762M7062L0741L2364M8045K3057l3861m2270J6544O0726M4128K7030
$$ plain form
8185 6269328 6322530 6386023 6399814 6378471 6409079 6507915 6581292 6572107 6551285 6601174 6686770 6720753
8173 6720753 6701044 6700717 6751973 6817082 6862973 6899043 6937822 6967663 6976883 6977803 6997668 7053259
8161 7053259 7128856 7180458 7184034 7178642 7225092 7317207 7383026 7390376 7395429 7454565 7542297 7602162
8149 7602162 7632396 7667134 7709517 7741691 7774869 7833167 7907040 7973154 8039104 8117315 8179967
8138 8179967 8200698 8220188 8299408 8416838 8488038 8492945 8507578 8587257 8689129 8749638 8781016
8127 8781016 8838284 8927646 9004465 9047376 9083671 9138281 9196840 9234460 9257033 9293743 9357891
8116 9357891 9433973 9504148 9570342 9641115 9711065 9769419 9818904 9867165 9910495 9951748 10021955
8105 10021955 10144567 10281941 10365587 10388032 10414620 10489188 10584088 10669508 10769703 10903787
$$ packed form
8185F269328N3202O3493J3791k1343L0608R8836P3377r185k0822M9889Q5596L3983
8173F720753j9709l27N1256O5109M5891L6070L8779K9841R220R20J9865N5591
8161G053259P5597N1602L576n392M6450R2115O5819P350N053N9136Q7732N9865
8149G602162L0234L4738M2383L2174L3178N8298P3873O6114O5950P8211O2652
8138H179967K0731J9490P9220J17430P1200M907J4633P9679J01872O0509L1378
8127H781016N7268Q9362P6819M2911L6295N4610N8559L7620K2573L6710O4148
8116I357891P6082P0175O6194P0773O9950N8354M9485M8261M3330M1253P0207
8105A0021955J22612J37374Q3646K2445K6588P4568R4900Q5420J00195J34084
$$ plain form
8095 10903787 11026555 11091247 11130566 11207484 11315121 11396779 11446404 11515747 11627848 11751777
8085 11751777 11864732 11976536 12088025 12184964 12281248 12411582 12570694 12712925 12823521 12938984
8075 12938984 13084293 13240594 13389998 13542715 13700903 13840831 13952188 14057697 14177407
8066 14177407 14308303 14448704 14603601 14757412 14884812 14999107 15144487 15326902 15497804
8057 15497804 15622766 15724174 15841425 15990582 16175112 16390966 16607723 16790620 16953293
8048 16953293 17141030 17353941 17544088 17700465 17871338 18082028 18299293 18505667 18737856
8039 18737856 19011785 19277593 19497334 19706160 19945308 20192169 20411251 20620710 20852285
8030 20852285 21095800 21337646 21600019 21883528 22129315 22308377 22495236 22775479 23125722
$$ packed form
8095A0903787J22768O4692L9319P6918J07637Q1658M9625O9343J12101J23929
8085A1751777J12955J11804J11489R6939R6284J30334J59112J42231J10596J15463
8075A2938984J45309J56301J49404J52717J58188J39928J11357J05509J19710
8066A4177407J30896J40401J54897J53811J27400J14295J45380J82415J70902
8057A5497804J24962J01408J17251J49157J84530K15854K16757J82897J62673
8048A6953293J87737K12911J90147J56377J70873K10690K17265K06374K32189
8039A8737856K73929K65808K19741K08826K39148K46861K19082K09459K31575
8030B0852285K43515K41846K62373K83509K45787J79062J86859K80243L50243
$$ plain form
8021 23125722 23462887 23766295 24066654 24360234 24631628 24925609 25291490 25681288 26010865
8012 26010865 26302967 26652552 27057522 27411712 27682042 27965630 28330928 28717392 29050229
8003 29050229 29355721 29694617 30062037 30425019 30794728 31191312 31588670 31959226 32330380
7994 32330380 32737255 33159484 33562099 33961977 34395686 34852304 35294058 35718476 36149538
7985 36149538 36591842 37041468 37516050 38024840 38535586 39023966 39529511 40101682 40710083
7976 40710083 41276429 41789205 42317878 42907377 43526671 44143779 44788935 45500837 46252159
7967 46252159 46979920 47674334 48392878 49184323 50033060 50892780 51752985 52648696 53610730
7958 53610730 54632283 55694500 56803619 57979877 59221071 60506697 61838397 63247068
$$ packed form
8021B3125722L37165L03408L00359K93580K71394K93981L65881L89798L29577
8012B6010865K92102L49585M04970L54190K70330K83588L65298L86464L32837
8003B9050229L05492L38896L67420L62982L69709L96584L97358L70556L71154
7994C2330380M06875M22229M02615L99878M33709M56618M41754M24418M31062
7985C6149538M42304M49626M74582N08790N10746M88380N05545N72171O08401
7976D0710083N66346N12776N28673N89499O19294O17108O45156P11902P51322
7967D6252159P27761O94414P18544P91445Q48737Q59720Q60205Q95711R62034
7958E3610730J021553J062217J109119J176258J241194J285626J331700J408671
$$ plain form
7950 63247068 64751947 66340360 68002037 69756975 71626575 73596313 75635526 77747393
7942 77747393 79973070 82341910 84834287 87402545 90021676 92710142 95498440 98383818
7934 98383818 101325268 104278886 107218156 110112389 112906426 115535430 117938762 120043807
7926 120043807 121764521 123041830 123856586 124172105 123904554 123006917 121556748 119699291 117525164
7917 117525164 115073398 112431010 109729786 107034520 104327469 101625730 99020677 96565004
7909 96565004 94212849 91923999 89743576 87717445 85807820 83964016 82205688 80558704
7901 80558704 78976701 77414296 75917302 74542963 73243959 71940609 70667024 69524966
7893 69524966 68513329 67525697 66514367 65537758 64634732 63770559 62934678 62177622 61504839
$$ packed form
7950F3247068J504879J588413J661677J754938J869600J969738K039213K111867
7942G7747393K225677K368840K492377K568258K619131K688466K788298K885378
7934I8383818K941450K953618K939270K894233K794037K629004K403332K105045
7926A20043807J720714J277309Q14756L15519k67551q97637j450169j857457k174127
7917A17525164k451766k642388k701224k695266k707051k701739k605053k455673
7909I6565004k352155k288850k180423k026131j909625j843804j758328j646984
7901H0558704j582003j562405j496994j374339j299004j303350j273585j142058
7893F9524966j011637r87632j011330r76609r03026q64173q35881p57056o72783
$$ plain form
7884 61504839 60835527 60126277 59448993 58877543 58366363 57815001 57204064 56598086 56046984
7875 56046984 55544129 55058201 54558153 54026631 53485360 52982322 52521230 52035848 51472682
7866 51472682 50867963 50297797 49775765 49247642 48674555 48076092 47491451 46932399 46381453
7857 46381453 45817605 45237851 44657298 44085957 43512929 42929470 42356065 41815860 41290282
7848 41290282 40744287 40193241 39691495 39246009 38799214 38317311 37837170 37396245 36972846
7839 36972846 36535085 36098548 35691670 35307746 34933218 34579499 34244952 33893587 33517604
7830 33517604 33167631 32866991 32556351 32194177 31849420 31597547 31374439 31055142 30655957
7821 30655957 30324986 30120098 29927420 29643272 29317657 29047218 28825946 28593548 28357402
$$ packed form
7884F1504839o69312p09250o77284n71450n11180n51362o10937o05978n51102
7875E6046984n02855m85928n00048n31522n41271n03038m61092m85382n63166
7866E1472682o04719n70166n22032n28123n73087n98463n84641n59052n50946
7857D6381453n63848n79754n80553n71341n73028n83459n73405n40205n25578
7848D1290282n45995n51046n01746m45486m46795m81903m80141m40925m23399
7839C6972846m37761m36537m06878l83924l74528l53719l34547l51365l75983
7830C3517604l49973l00640l10640l62174l44757k51873k23108l19297l99185
7821C0655957l30971k04888j92678k84148l25615k70439k21272k32398k36146
$$ plain form
7812 28357402 28160767 27973565 27723911 27425688 27173792 27000906 26827916 26587634 26322623
7803 26322623 26110633 25947242 25764065 25535263 25304616 25112882 24950728 24790134 24618171
7794 24618171 24426300 24207090 23983457 23803974 23677745 23545850 23358379 23153977 23009585
7785 23009585 22923360 22809270 22616062 22393815 22220156 22109774 22025968 21937095 21824767 21674012
7775 21674012 21498641 21349136 21253213 21170734 21048433 20897061 20767801 20669380 20561384 20424944
7765 20424944 20288789 20178016 20079482 19971253 19854504 19741906 19635538 19526878 19407830 19282029
7755 19282029 19171721 19098121 19042261 18951676 18810950 18675147 18594041 18532012 18417631 18254055
7745 18254055 18114809 18032206 17957753 17848357 17729125 17640240 17572018 17492674 17406038 17337987 17281607
$$ packed form
7812B8357402j96635j87202k49654k98223k51896j72886j72990k40282k65011
7803B6322623k11990j63391j83177k28802k30647j91734j62154j60594j71963
7794B4618171j91871k19210k23633j79483j26229j31895j87471k04402j44392
7785B3009585q6225j14090j93208k22247j73659j10382q3806q8873j12328j50755
7775B1674012j75371j49505r5923q2479j22301j51372j29260r8421j07996j36440
7765B0424944j36155j10773r8534j08229j16749j12598j06368j08660j19048j25801
7755A9282029j10308p3600n5860r0585j40726j35803q1106o2029j14381j63576
7745A8254055j39246q2603p4453j09396j19232q8885o8222p9344q6636o8051n6380
$$ plain form
7734 17281607 17195690 17061198 16914587 16810392 16755879 16700449 16603782 16497002 16437714 16410304
7724 16410304 16333616 16188796 16066420 16034829 16032305 15968881 15872315 15826195 15808296 15722100 15574747
7713 15574747 15482180 15480089 15468222 15382966 15290714 15247540 15195178 15082587 14975709 14941470 14919931
7702 14919931 14828664 14714050 14672231 14681423 14645248 14559472 14501103 14477965 14423816 14333517 14271957
7691 14271957 14245418 14192496 14116237 14093902 14125014 14102134 13987345 13893588 13910538 13955330 13898126
$$ packed form
7734A7281607q5917j34492j46611j04195n4513n5430r6667j06780n9288k7410
7724A6410304p6688j44820j22376l1591k524o3424r6566m6120j7899q6196j47353
7713A5574747r2567k091j1867q5256r2252m3174n2362j12591j06878l4239k1539
7702A4919931r1267j14614m1819R192l6175q5776n8369k3138n4149r0299o1560
7691A4271957k6539n2922p6259k2335L1112k2880j14789r3757J6950M4792n7204
$$ [...]
##END NTUPLES=NMR SPECTRUM
##END=
