##TITLE=1H ikalashn
CG-1212-x5
19.9.2024
##JCAMPDX= 6.0         $$ Bruker NMR JCAMP-DX V2.0
##DATA TYPE= NMR SPECTRUM
##DATA CLASS= NTUPLES
##ORIGIN= UXNMR, Bruker Analytische Messtechnik GmbH
##OWNER= root
$$ TOPSPIN		Version 1.3
$$ 2024-09-19 10:53:01.234 +0400  Irina@DPX200
$$ Compression mode = diff/dup
##.OBSERVE FREQUENCY= 200.131392401
##.OBSERVE NUCLEUS= ^1H
##.ACQUISITION MODE= SIMULTANEOUS
##.ACQUISITION SCHEME= undefined
##.AVERAGES= 32
##.DIGITISER RES= 18
##SPECTROMETER/DATA SYSTEM= spect
##.PULSE SEQUENCE= zg
##.SOLVENT NAME= CDCl3
##.SHIFT REFERENCE= INTERNAL, CDCl3, 1, 17.95386
##AUDIT TRAIL= $$ (NUMBER, WHEN, WHO, WHERE, WHAT)
$$ ##TITLE= Audit trail, TOPSPIN		Version 1.3
$$ ##JCAMPDX= 5.01
$$ ##ORIGIN= Bruker BioSpin GmbH
$$ ##OWNER= Irina
$$ $$ F:/spectra/data/iren/nmr/1H/4/pdata/1/auditp.txt
$$ ##AUDIT TRAIL=  $$ (NUMBER, WHEN, WHO, WHERE, VERSION, WHAT)
(   1,<2024-09-19 10:52:00.515 +0400>,<Irina>,<DPX200>,<TOPSPIN 1.3>,
      <created by zg
	started at 2024-09-19 10:49:52.812 +0400,
	POWCHK disabled, PULCHK disabled
       configuration hash MD5:
       BE 6D 3F 07 2A EA 11 49 91 17 2B D3 AF B3 58 0D
       data hash MD5: 16K
       94 39 12 35 E8 97 B8 09 98 45 12 7D 3B 69 B6 A3>)
(   2,<2024-09-19 10:52:33.390 +0400>,<Irina>,<DPX200>,<TOPSPIN 1.3>,
      <Start of raw data processing
       efp BC_mod = 2 LB = 0.02 FT_mod = 6 PKNL = 1 PHC0 = 110.0707 PHC1 = -2.738612 SI = 32K 
       data hash MD5: 32K
       83 DC C5 E9 37 94 9E 9F 29 86 22 DF 1C FC 45 D0>)
(   3,<2024-09-19 10:52:35.906 +0400>,<Irina>,<DPX200>,<TOPSPIN 1.3>,
      <apk 
       data hash MD5: 32K
       90 30 E3 EE 72 78 AA 20 B7 D5 74 CA 49 27 56 C2>)
(   4,<2024-09-19 10:52:46.062 +0400>,<Irina>,<DPX200>,<TOPSPIN 1.3>,
      <pk fgphup PHC0 = -3.373486 PHC1 = 2.8 
       data hash MD5: 32K
       E8 6F BD A4 E8 F9 57 EB EC 1B 90 3F 1C B6 3C AA>)
(   5,<2024-09-19 10:52:52.234 +0400>,<Irina>,<DPX200>,<TOPSPIN 1.3>,
      <abs n ABSG = 5 
       data hash MD5: 32K
       80 50 57 65 A2 A6 16 03 5A B3 28 DE A2 EB 6D 98>)
$$ ##END=
$$ 
$$ $$ hash MD5
$$ $$ D0 30 E8 7C DD 51 6E 65 D7 E1 D4 EA 44 D7 19 63
##$RELAX= 
##$RELAX= 
##$RELAX= 
##$RELAX= 
##$RELAX= 
##$RELAX= 
##$RELAX= 
##$RELAX= 
##$RELAX= 
$$ Bruker specific parameters
$$ --------------------------
##$DU= <F:/spectra>
##$EXPNO= 4
##$NAME= <1H>
##$PROCNO= 1
##$TYPE= <nmr>
##$USER= <iren>
##$AMP= (0..31)
100 100 100 100 100 100 100 100 100 100 100 100 100 100 100 100 100 100 
100 100 100 100 100 100 100 100 100 100 100 100 100 100 
##$ANAVPT= -1
##$AQSEQ= 0
##$AQ_mod= 1
##$AUNM= <au_zg>
##$AUTOPOS= <>
##$BF1= 200.13
##$BF2= 200.13
##$BF3= 200.13
##$BF4= 200.13
##$BF5= 200.13
##$BF6= 200.13
##$BF7= 200.13
##$BF8= 200.13
##$BYTORDA= 1
##$CFDGTYP= 0
##$CFRGTYP= 5
##$CHEMSTR= <none>
##$CNST= (0..63)
1 1 145 1 1 1 1 1 1 1 1 1 1 1 1 1 1 1 1 1 1 1 1 1 1 1 1 1 1 1 1 1 1 1 
1 1 1 1 1 1 1 1 1 1 1 1 1 1 1 1 1 1 1 1 1 1 1 1 1 1 1 1 1 1 
##$CPDPRG= <>
##$CPDPRG1= <>
##$CPDPRG2= <>
##$CPDPRG3= <>
$$ [...]
##$SW_h= 4401.40845070422
##$TD= 16384
##$TD0= 1
##$TE= 300
##$TE2= 300
##$TE3= 300
##$TEG= 300
##$TL= (0..7)
0 120 120 120 120 120 120 120 
##$TP= (0..7)
150 150 150 150 150 150 150 150 
##$TP07= 0
##$TPNAME0= <>
##$TPNAME1= <>
##$TPNAME2= <>
##$TPNAME3= <>
##$TPNAME4= <>
##$TPNAME5= <>
##$TPNAME6= <>
##$TPNAME7= <>
##$TPOAL= (0..7)
0.5 0.5 0.5 0.5 0.5 0.5 0.5 0.5 
##$TPOFFS= (0..7)
0 0 0 0 0 0 0 0 
##$TUNHIN= 0
##$TUNHOUT= 0
##$TUNXOUT= 0
##$USERA1= <user>
##$USERA2= <user>
##$USERA3= <user>
##$USERA4= <user>
##$USERA5= <user>
##$V9= 5
##$VALIST= <valist>
##$VCLIST= <CCCCCCCCCCCCCCC>
##$VD= 0
##$VDLIST= <DDDDDDDDDDDDDDD>
##$VPLIST= <PPPPPPPPPPPPPPP>
##$VTLIST= <TTTTTTTTTTTTTTT>
##$WBST= 1024
##$WBSW= 25
##$XGAIN= (0..3)
0 0 0 0 
##$XL= 0
##$YL= 0
##$YMAX_a= 581596
##$YMIN_a= -402119
##$ZGOPTNS= <>
##$ZL1= 120
##$ZL2= 120
##$ZL3= 120
##$ZL4= 120
##$ABSF1= 17.95386
##$ABSF2= -4.038887
##$ABSG= 5
##$ABSL= 3
##$ALPHA= 0
##$AQORDER= 0
##$ASSFAC= 0
##$ASSFACI= 0
##$ASSFACX= 0
##$ASSWID= 0
##$AUNMP= <proc_1d>
##$AXLEFT= 0
##$AXRIGHT= 0
##$AXTYPE= 0
##$AXUNIT= <>
##$AZFE= 0.1
##$AZFW= 0.1
##$BCFW= 0
##$BC_mod= 2
##$BYTORDP= 0
##$COROFFS= 0
##$CY= 7568.61572265625
##$DATMOD= 1
##$DC= 0
##$DFILT= <>
##$DTYPP= 0
##$F1P= 17.9538593292236
##$F2P= -4.03888763876832
##$FCOR= 0.5
##$FTSIZE= 32768
##$FT_mod= 6
##$GAMMA= 0
##$GB= 0
##$INTBC= 0
##$INTSCL= 1.483618e-010
##$ISEN= 128
##$LB= 0.02
##$LEV0= 0
##$LPBIN= 0
##$MAXI= 945.577
##$MC2= 0
##$MEAN= 0
##$ME_mod= 0
##$MI= -402.1523
##$NCOEF= 0
##$NC_proc= -6
##$NLEV= 6
##$NOISF1= 8.587773
##$NOISF2= 6.764455
##$NSP= 0
##$NTH_PI= 0
##$NZP= 0
##$OFFSET= 17.95386
##$PC= 1
##$PHC0= 107.5554
##$PHC1= 0.06138802
##$PH_mod= 1
##$PKNL= yes
##$PPARMOD= 0
##$PPDIAG= 0
##$PPIPTYP= 0
##$PPMPNUM= 100
##$PPRESOL= 1
##$PSCAL= 0
##$PSIGN= 0
##$REVERSE= no
##$SF= 200.13
##$SI= 32768
##$SIGF1= 16.12182
##$SIGF2= -4.496377
##$SINO= 3.521527
##$SIOLD= 32768
##$SREGLST= <1H.CDCl3>
##$SSB= 0
##$STSI= 32768
##$STSR= 0
##$SW_p= 4401.40845070423
##$SYMM= 0
##$S_DEV= 0
##$TDeff= 16384
##$TDoff= 0
##$TI= <>
##$TILT= no
##$TM1= 0
##$TM2= 0
##$TOPLEV= 0
##$USERP1= <user>
##$USERP2= <user>
##$USERP3= <user>
##$USERP4= <user>
##$USERP5= <user>
##$WDW= 1
##$XDIM= 32768
##$YMAX_p= 452900643
##$YMIN_p= -1048594
$$ End of Bruker specific parameters
$$ ---------------------------------
##NTUPLES= NMR SPECTRUM
##VAR_NAME=  FREQUENCY,     SPECTRUM/REAL,   SPECTRUM/IMAG
##SYMBOL=    X,             R,               I
##VAR_TYPE=  INDEPENDENT,   DEPENDENT,       DEPENDENT
##VAR_FORM=  AFFN,          ASDF,            ASDF
##VAR_DIM=   32768,         32768,           32768
##UNITS=     HZ,            ARBITRARY UNITS, ARBITRARY UNITS
##FACTOR=    0.134324425510551, 1,           1
##FIRST=     4401.40845070423, 242657,       -1857868
##LAST=      0,             55008,           -1796987
##MIN=       0,             -1048594,        0
##MAX=       4401.40845070423, 452900643,    0
$$ Real data points
##PAGE= N=1
##DATA TABLE= (X++(R..R)), XYDATA
$$ [...]
$$ plain form
10073 1341138 1408815 1333743 1313004 1454787 1593281 1563532 1455503 1455956 1568034 1631909 1565724
10062 1565724 1465619 1471079 1605669 1764117 1820728 1746024 1637020 1622874 1714791 1768403 1646503
10051 1646503 1411296 1273676 1327467 1441540 1490787 1564023 1774087 1959613 1835995 1440924
10041 1440924 1147200 1159738 1286494 1332704 1403095 1594460 1705174 1570610 1412524 1462394
10031 1462394 1483229 1156511 758649 848764 1340123 1544316 1226744 940332 1081923 1293565
10021 1293565 1197515 1111009 1467162 1989630 2087822 1774505 1552531 1583024 1593543 1500305
10011 1500305 1499639 1570238 1479139 1307428 1390679 1667907 1678454 1345134 1168319 1408554 1645891
10000 1645891 1490824 1223338 1284147 1534671 1534276 1292639 1226785 1485291 1772991 1827660
$$ packed form
10073A341138O7677p5072k0739J41783J38494k9749j08029M53J12078O3875o6185
10062A565724j00105N460J34590J58448N6611p4704j09004j4146R1917N3612j21900
10051A646503k35207j37620N3791J14073M9247P3236K10064J85526j23618l95071
10041A440924k93724J2538J26756M6210P0391J91365J10714j34564j58086M9870
10031A462394K0835l26718l97862R0115M91359K04193l17572k86412J41591K11642
10021A293565r6050q6506L56153N22468R8192l13317k21974L0493J0519r3238
10011A500305o66P0599r1099j71711Q3251K77228J0547l33320j76815K40235K37337
10000A645891j55067k67486O0809K50524l95k41637o5854K58506K87700N4669
$$ plain form
9990 1827660 1700050 1536619 1380233 1238729 1144821 1109167 1134225 1238847 1371253 1408956
9980 1408956 1367907 1445713 1681401 1771934 1488875 1100825 1047543 1310933 1480886 1387992
9970 1387992 1266975 1271237 1243989 1096731 1032809 1179929 1307955 1180265 961400 978246
9960 978246 1212386 1335748 1212044 1079012 1170860 1375921 1408188 1211206 1029521 1070813
9950 1070813 1228339 1242660 1077414 967477 1058943 1185913 1140624 1007578 1009092 1117541
9940 1117541 1102482 948672 918290 1114130 1274288 1172943 981427 993398 1166595 1221543
9930 1221543 1108230 1070255 1220369 1321902 1124856 757813 616590 899060 1370388 1623858
9920 1623858 1521547 1309588 1279817 1401638 1411711 1240298 1141333 1295831 1484113 1382572
$$ packed form
9990A827660j27610j63431j56386j41504r3908l5654K5058J04622J32406L7703
9980A408956m1049P7806K35688R0533k83059l88050n3282K63390J69953r2894
9970A387992j21017M262k7248j47258o3922J47120J28026j27690k18865J6846
9960I78246K34140J23362j23704j33032R1848K05061L2267j96982j81685M1292
9950A070813J57526J4321j65246j09937R1466J26970m5289j33046J514J08449
9940A117541j5059j53810l0382J95840J60158j01345j91516J1971J73197N4948
9930A221543j13313l7975J50114J01533j97046l67043j41223K82470M71328K53470
9920A623858j02311k11959k9771J21821J0073j71413r8965J54498J88282j01541
$$ plain form
9910 1382572 1078096 987249 1251042 1518852 1462728 1228672 1140004 1164199 1015712 706161
9900 706161 605409 881635 1228884 1332882 1309390 1407695 1526321 1409883 1191101 1266381
9890 1266381 1608510 1694738 1313027 985456 1227256 1734973 1807469 1382324 1084264 1253015
9880 1253015 1506113 1450778 1300510 1415207 1621814 1491592 1095671 952690 1233861 1509906
9870 1509906 1422836 1187794 1174439 1318296 1299025 1105315 1025727 1141873 1225173 1181624 1214319
9859 1214319 1391755 1419219 1119735 846830 1023068 1445362 1516147 1125598 809666 929934
9849 929934 1182712 1171748 1040928 1153252 1442855 1536821 1361151 1191293 1175256 1213755
9839 1213755 1282783 1464976 1631579 1498731 1104557 871724 1050557 1407251 1612712 1643397
$$ packed form
9910A382572l04476r0847K63793K67810n6124k34056q8668K4195j48487l09551
9900G06161j00752K76226L47249J03998k3492R8305J18626j16438k18782P5280
9890A266381L42129Q6228l81711l27571K41800N07717P2496m25145k98060J68751
9880A253015K53098n5335j50268J14697K06607j30222l95921j42981K81171K76045
9870A509906q7070k35042j3355J43857j9271j93710p9588J16146Q3300m3549L2695
9859A214319J77436K7464k99484k72905J76238M22294P0785l90549l15932J20268
9849I29934K52778j0964j30820J12324K89603R3966j75670j69858j6037L8499
9839A213755O9028J82193J66603j32848l94174k32833J78833L56694K05461L0685
$$ plain form
9829 1643397 1620191 1531366 1343300 1176252 1150684 1211219 1264702 1324570 1374987 1293503 1080250
9818 1080250 966215 1105668 1345299 1479919 1532709 1578127 1511994 1262409 1037111 1065727
9808 1065727 1247419 1349949 1409866 1596285 1788754 1680922 1298393 1057264 1234802 1650487
9798 1650487 1945732 1961837 1776587 1553447 1427565 1424620 1463976 1501852 1598261 1759139 1856787
9787 1856787 1839973 1836902 1874579 1743526 1407916 1269165 1620490 2075664 2047395 1638201
9777 1638201 1478019 1743978 1978529 1925573 1876991 2008354 2020530 1745956 1528351 1619309
9767 1619309 1716678 1534943 1356889 1513635 1729896 1564499 1190844 1127719 1401371 1588157
9757 1588157 1566464 1610555 1769036 1752692 1510648 1373654 1489727 1596916 1519862 1448337
$$ packed form
9829A643397k3206q8825j88066j67048k5568O0535N3483N9868N0417q1484k13253
9818A080250j14035J39453K39631J34620N2790M5418o6133k49585k25298K8616
9808A065727J81692J02530N9917J86419J92469j07832l82529k41129J77538M15685
9798A650487K95245J6105j85250k23140j25882k945L9356L7876R6409J60878R7648
9787A856787j6814l071L7677j31053l35610j38751L51325M55174k8269m09194
9777A638201j60182K65959K34551n2956m8582J31363J2176k74574k17605R0958
9767A619309R7369j81735j78054J56746K16261j65397l73655o3125K73652J86786
9757A588157k1693M4091J58481j6344k42044j36994J16073J07189p7054p1525
$$ plain form
9747 1448337 1524278 1566966 1455054 1407464 1587817 1751387 1633389 1437606 1543320 1875562
9737 1875562 1980698 1696221 1356186 1260854 1290352 1218038 1129104 1250757 1510602 1579101
9727 1579101 1353041 1118459 1138389 1314297 1418836 1461362 1579954 1708742 1653403 1448318
9717 1448318 1333522 1375329 1423130 1470281 1689507 2004101 2029266 1665211 1368504 1509477
9707 1509477 1793343 1735162 1443353 1420391 1726088 1895010 1697163 1451617 1444369 1500255
9697 1500255 1383544 1263039 1451093 1888637 2207922 2220989 2082992 1989206 1940885 1877338
9687 1877338 1865114 1996698 2160606 2113626 1852909 1718656 1929702 2179794 2022004 1575331
9677 1575331 1415417 1715369 1991223 1892400 1727045 1854815 2046089 1941170 1748295 1888453
$$ packed form
9747A448337P5941M2688j11912m7590J80353J63570j17998j95783J05714L32242
9737A875562J05136k84477l40035r5332K9498p2314q8934J21653K59845O8499
9727A579101k26060k34582J9930J75908J04539M2526J18592J28788n5339k05085
9717A448318j14796M1807M7801M7151K19226L14594K5165l64055k96707J40973
9707A509477K83866n8181k91809k2962L05697J68922j97847k45546p248N5886
9697A500255j16711j20505J88054M37544L19285J3067j37997r3786m8321o3547
9687A877338j2224J31584J63908m6980k60717j34253K11046K50092j57790m46673
9677A575331j59914K99952K75854r8823j65355J27770J91274j04919j92875J40158
$$ plain form
9667 1888453 2228588 2302817 2106883 2028453 2116682 2082555 1953453 2052251 2340754 2449875
9657 2449875 2360009 2361405 2348301 1944367 1389047 1408530 2007584 2315183 1962798 1671194
9647 1671194 1985909 2375488 2258742 2054797 2356485 2781155 2618938 2092894 1964787 2252080
9637 2252080 2332281 2085504 1963537 2055174 2019165 1903749 2134071 2644743 2867313 2671193
9627 2671193 2522070 2589599 2494372 2133360 1986966 2312457 2698261 2741225 2592021 2520666
9617 2520666 2468113 2341227 2287285 2385536 2478918 2539343 2768311 3124402 3216721 2920724 2658178
9606 2658178 2790763 3129723 3302238 3236216 3060235 2887037 2880257 3151390 3439767 3327072
9596 3327072 2909800 2764728 3090075 3439948 3509584 3555572 3749825 3778872 3483895 3266565
$$ packed form
9667A888453L40135P4229j95934p8430Q8229l4127j29102R8798K88503J09121
9657B449875q9866J396j3104m03934n55320J9483N99054L07599l52385k91604
9647A671194L14715L89579j16746k03945L01688M24670j62217n26044j28107K87293
9637B252080Q0201k46777j21967R1637l6009j15416K30322N10672K22570j96120
9627B671193j49123O7529r5227l61012j46394L25491L85804M2964j49204p1355
9617B520666n2553j26886n3942R8251R3382O0425K28968L56091R2319k95997k62546
9606B658178J32585L38960J72515o6022j75981j73198o780K71133K88377j12695
9596C327072m17272j45072L25347L49873O9636M5988J94253K9047k94977k17330
$$ plain form
9586 3266565 3397063 3532718 3430722 3497179 4009976 4425126 4212347 3828600 3989289 4417739
9576 4417739 4302499 3717512 3540982 4028942 4480429 4435809 4287636 4446110 4697843 4753164
9566 4753164 4783529 5007469 5227265 5171756 4959008 4887766 5007884 5145098 5184574 5178804 5287200
9555 5287200 5615555 5980572 5974712 5525231 5188569 5476771 6059053 6166824 5714237 5404503
9545 5404503 5664636 6086392 6122733 5819650 5591373 5663677 5980710 6353088 6522457 6355151
9535 6355151 6072815 6011855 6136873 6137541 5983231 5939792 6037447 6031989 5934203 6018265 6219304
9524 6219304 6133838 5775051 5686402 6063107 6400666 6334304 6201926 6380060 6652841 6699189
9514 6699189 6668040 6771380 6792723 6520615 6232382 6225154 6277194 6093061 5870732 5889673 5954305
$$ packed form
9586C266565J30498J35655j01996O6457N12797M15150k12779l83747J60689M28450
9576D417739j15240n84987j76530M87960M51487m4620j48173J58474K51733N5321
9566D753164L0365K23940K19796n5509k12748p1242J20118J37214L9476n770J08396
9555E287200L28355L65017n860m49481l36662K88202N82282J07771m52587l09734
9545E404503K60133M21756L6341l03083k28277P2304L17033L72378J69369j67306
9535F355151k82336o0960J25018O68j54310m3439R7655n458r7786Q4062K01039
9524F219304q5466l58787q8649L76705L37559o6362j32378J78134K72781M6348
9514F699189l1149J03340K1343k72108k88233p228N2040j84133k22329J8941O4632
$$ plain form
9503 5954305 5816954 5723977 5915221 6022103 5688403 5374712 5697120 6289188 6273450 5687426
9493 5687426 5437682 5843744 6221141 6066764 5728926 5614511 5566248 5408608 5391808 5659736
9483 5659736 5873400 5787485 5680095 5804258 5903937 5702614 5429929 5409522 5498543 5398496
9473 5398496 5218512 5269673 5519716 5672638 5634219 5544498 5485981 5465544 5547969 5727813 5805055
9462 5805055 5653249 5485945 5603782 5973335 6270409 6260067 5980647 5658421 5555794 5762895
9452 5762895 6051120 6114761 6011641 6092251 6416026 6610205 6488571 6404378 6676572 7022279
9442 7022279 6974448 6618281 6467795 6736684 7135558 7342564 7332235 7238793 7156502 7099171
9432 7099171 7015900 6886845 6852796 7067245 7360569 7363398 7097955 7040432 7353117 7536153
$$ packed form
9503E954305j37351r2977J91244J06882l33700l13691L22408N92068j5738n86024
9493E687426k49744M06062L77397j54377l37838j14415m8263j57640j6800K67928
9483E659736K13664q5915j07390J24163R9679k01323k72685k0407Q9021j00047
9473E398496j79984N1161K50043J52922l8419q9721n8517k0437Q2425J79844P7242
9462E805055j51806j67304J17837L69553K97074j0342k79420l22226j02627K07101
9452E762895K88225O3641j03120Q0610L23775J94179j21634q4193K72194L45707
9442G022279m7831l56167j50486K68889L98874K07006j0329r3442q2291n7331
9432G099171q3271j29055l4049K14449K93324K829k65443n7523L12685J83036
$$ plain form
9422 7536153 7251974 7002734 7376202 8020298 8145688 7803319 7773701 8235257 8487277 8181656
9412 8181656 7922858 8238772 8736235 8827593 8655547 8652151 8691542 8426147 8129079 8400318
9402 8400318 9154073 9656144 9609380 9510143 9762691 10082488 10098225 10016092 10236132 10663414
9392 10663414 10896193 10906327 11037635 11378776 11609453 11560455 11528197 11836242 12373062 12799004
9382 12799004 13008868 13149317 13329647 13564310 13889545 14279794 14538145 14553036 14598715 15048068
9372 15048068 15790734 16302624 16373092 16396449 16782387 17419911 17950691 18270092 18491467 18688782
9362 18688782 18978395 19599987 20553311 21364810 21630764 21653632 22097738 23076496 24026195 24496061
9352 24496061 24640981 24867083 25383177 26201285 27202207 28060687 28465307 28600260 29082285
$$ packed form
9422G536153k84179k49240L73468O44096J25390l42369k9618M61556K52020l05621
9412H181656k58798L15914M97463R1358j72046l396L9391k65395k97068K71239
9402H400318P53755N02071m6764r9237K52548L19797J5737q2133K20040M27282
9392A0663414K32779J0134J31308L41141K30677m8998l2258L08045N36820M25942
9382A2799004K09864J40449J80330K34663L25235L90249K58351J4891M5679M49353
9372A5048068P42666N11890P0468K3357L85938O37524N30780L19401K21375J97315
9362A8688782K89613O21592R53324Q11499K65954K2868M44106R78758R49699M69866
9352B4496061J44920K26102N16094Q18108J000922Q58480M04620J34953M82025
$$ plain form
9343 29082285 30184389 31401399 32072421 32239994 32582430 33575947 35000539 36297036 37210854
9334 37210854 37968154 38877765 39906852 40777720 41430504 42139915 43080078 44058406 44899121
9325 44899121 45800648 46987722 48310387 49644135 51387096 53924554 56846860 59556132
9317 59556132 62538401 66864359 72069586 75698694 75824899 73269544 70408383 68391668
9309 68391668 66612284 64469587 62288320 60381093 58404728 56139240 54078176 52695081
9301 52695081 51701411 50556429 49286912 48298646 47674765 47129770 46477521 45755085 45010937
9292 45010937 44301446 43797057 43591725 43463903 43074381 42360385 41535247 40763869 40052919
9283 40052919 39414438 38895026 38408430 37744785 36849715 35968852 35383918 35045411 34595651
$$ packed form
9343B9082285J102104J217010O71022J67573L42436R93517J424592J296497R13818
9334C7210854P57300R09611J029087Q70868O52784P09411R40163R78328Q40715
9325D4899121R01527J187074J322665J333748J742961K537458K922306K709272
9317E9556132K982269M325958N205227L629108J26205k555355k861161k016715
9309F8391668j779384k142697k181267j907227j976365k265488k061064j383095
9301E2695081r93670j144982j269517r88266o23881n44995o52249p22436p44148
9292D5010937p09491n04389k05332j27822l89522p13996q25138p71378p10950
9283D0052919o38481n19412m86596o63645q95070q80863n84934l38507m49760
$$ plain form
9274 34595651 33794165 32814089 32010283 31470697 30983551 30430754 29942674 29554576 29002873
9265 29002873 28122916 27229817 26751125 26593877 26257050 25550228 24819131 24394738 24168000
9256 24168000 23839505 23304498 22644100 21968650 21403689 21028267 20723172 20284749 19760437
9247 19760437 19416044 19279414 19023018 18462614 17862562 17504056 17228756 16734555 16127562
9238 16127562 15802855 15840329 15864989 15555440 15035930 14661123 14564000 14532079 14288292 13818705
9228 13818705 13379742 13180981 13147168 13075077 12922124 12772238 12604508 12338565 12061491 11919291
9218 11919291 11798743 11460248 11014021 10861140 11054946 11150887 10877177 10517647 10370655 10275718
9208 10275718 10028268 9830665 9881843 9907371 9628074 9357413 9515101 9816404 9662995 9190728
$$ packed form
9274C4595651q01486r80076q03806n39586m87146n52797m88080l88098n51703
9265B9002873q79957q93099m78692j57248l36827p06822p31097m24393k26738
9256B4168000l28495n35007o60398o75450n64961l75422l05095m38423n24312
9247A9760437l44393j36630k56396n60404o00052l58506k75300m94201o06993
9238A6127562l24707L7474K4660l09549n19510l74807r7123l1921k43787m69587
9228A3818705m38963j98761l3813p2091j52953j49886j67730k65943k77074j42200
9218A1919291j20548l38495m46227j52881J93806R5941k73710l59530j46992r4937
9208A0275718k47450j97603N1178K5528k79297k70661J57688L01303j53409m72267
$$ plain form
9198 9190728 9131572 9605046 9854419 9409443 8780442 8614899 8771165 8729305 8481147 8445422
9188 8445422 8719994 8930015 8777589 8387571 8094522 8100775 8339395 8552606 8546410 8409669
9178 8409669 8363525 8393726 8263130 7935042 7685962 7670755 7682949 7541975 7424385 7546874
9168 7546874 7761360 7764763 7541566 7315874 7201077 7164425 7216984 7367957 7477940 7406818
9158 7406818 7239978 7153679 7140939 7085086 7011980 7036342 7125916 7141367 7060651 6974125 6922396
9147 6922396 6908458 6967129 7042902 6942698 6633108 6423516 6570929 6851685 6866523 6654106
9137 6654106 6600429 6791786 6905431 6792655 6724184 6894201 7065129 6949619 6666826 6556180
9127 6556180 6714166 6944662 7057249 7032639 6958212 6916816 6893857 6769024 6496771 6268547
$$ packed form
9198I190728n9156M73474K49373m44976o29001j65543J56266m1860k48158l5725
9188H445422K74572K10021j52426l90018k93049O253K38620K13211o196j36741
9178H409669m6144L0201j30596l28088k49080j5207J2194j40974j17590J22489
9168G546874K14486L403k23197k25692j14797l6652N2559J50973J09983p1122
9158G406818j66840q6299j2740n5853p3106K4362Q9574J5451q0716q6526n1729
9147F922396j3938N8671P5773j00204l09590k09592J47413K80756J4838k12417
9137F654106n3677J91357J13645j12776o8471J70017J70928j15510k82793j10646
9127F556180J57986K30496J12587k4610p4427m1396k2959j24833k72253k28224
$$ plain form
9117 6268547 6311446 6538593 6650008 6604051 6675586 6947757 7098356 6910020 6678337 6794675
9107 6794675 7145827 7288811 7093250 6840845 6732945 6668637 6565826 6569955 6782845 7011106
9097 7011106 6990719 6757053 6604032 6691623 6849741 6840586 6716442 6761652 7057045 7277668
9087 7277668 7085239 6616593 6346224 6483219 6764722 6892569 6892825 6918549 6969694 7008152 7122682
9076 7122682 7343753 7480295 7385250 7214872 7170495 7161272 7022812 6898092 7031713 7306817
9066 7306817 7398927 7324770 7390382 7596542 7581988 7254046 6996889 7067338 7226919 7220871 7204681
9055 7204681 7375832 7552715 7500004 7367034 7391604 7430999 7244423 7028532 7152108 7480144
9045 7480144 7521368 7241347 7164938 7547382 7959367 7933385 7610642 7456318 7633960 7944231
$$ packed form
9117F268547M2899K27147J11415m5957P1535K72171J50599j88336k31683J16338
9107F794675L51152J42984j95561k52405j07900o4308j02811M129K12890K28261
9097G011106k0387k33666j53021Q7591J58118r155j24144M5210K95393K20623
9087G277668j92429m68646k70369J36995K81503J27847K56K5724N1145L8458J14530
9076G122682K21071J36542r5045j70378m4377r223j38460j24720J33621K75104
9066G306817R2110p4157O5612K06160j4554l27942k57157P0449J59581o048j6190
9055G204681J71151J76883n2711j32970K4570L9395j86576k15891J23576L28036
9045G480144M1224k80021p6409L82444M11985k5982l22743j54324J77642L10271
$$ plain form
9035 7944231 8158988 8167516 7977866 7783537 7849265 8155471 8369461 8340979 8346891 8598429 8808313
9024 8808313 8609320 8164646 7937645 8021773 8159076 8309212 8671309 9141354 9297421 9057982
9014 9057982 8858763 8970077 9103704 8981208 8857826 9085806 9490456 9640023 9527250 9517608
9004 9517608 9725513 9888103 9845577 9755330 9791169 9959489 10248818 10640823 10923720 10826702
8994 10826702 10444463 10231731 10449271 10880881 11218187 11432634 11597251 11641451 11545156 11545137
8984 11545137 11845786 12276327 12530225 12629738 12842102 13204807 13471989 13545293 13634486 13899552
8974 13899552 14214777 14438541 14687996 15136852 15679580 16023820 16085253 16112713 16385236 16882562
8964 16882562 17302003 17374564 17150561 16963081 17079345 17411546 17656594 17711552 17795011 18083765
$$ packed form
9035G944231K14757Q528j89650j94329O5728L06206K13990k8482N912K51538K09884
9024H808313j98993m44674k27001Q4128J37303J50136L62097M70045J56067k39439
9014I057982j99219J11314J33627j22496j23382K27980M04650J49567j12773r642
9004I517608K07905J62590m2526r0247L5839J68320K89329L92005K82897r7018
8994A0826702l82239k12732K17540M31610L37306K14447J64617M4200r6295j9
8984A1545137L00649M30541K53898R9513K12364L62705K67182P3304Q9193K65066
8974A3899552L15225K23764K49455M48856N42728L44240O1433K7460K72523M97326
8964A6882562M19441P2561k24003j87480J16264L32201K45048N4958Q3459K88754
$$ plain form
8954 18083765 18404231 18474571 18346225 18340643 18547681 18675753 18521988 18328893 18430255 18715439
8944 18715439 18772053 18520104 18359670 18590049 18973733 19075461 18837864 18584581 18556028 18669016
8934 18669016 18702484 18536076 18209222 17881697 17720581 17718712 17679141 17488256 17292376 17234018
8924 17234018 17151885 16816767 16377803 16227624 16420625 16588230 16506337 16370871 16354427 16266386
8914 16266386 15921604 15542185 15460114 15624509 15726945 15662842 15559336 15476148 15391625 15379662
8904 15379662 15490902 15558256 15443737 15374880 15655917 16105071 16210247 15871762 15556287 15601685
8894 15601685 15779002 15734613 15512453 15389748 15462416 15642105 15862702 16071598 16189420 16263207
8884 16263207 16479326 16851254 17101790 17060103 16965382 17123071 17438427 17580453 17483598 17389751
$$ packed form
8954A8083765L20466P0340j28346n582K07038J28072j53765j93095J01362K85184
8944A8715439N6614k51949j60434K30379L83684J01728k37597k53283k8553J12988
8934A8669016L3468j66408l26854l27525j61116j869l9571j90885j95880n8358
8924A7234018q2133l35118m38964j50179J93001J67605q1893j35466j6444q8041
8914A6266386l44782l79419q2071J64395J02436o4103j03506q3188q4523j1963
8904A5379662J11240O7354j14519o8857K81037M49154J05176l38485l15475M5398
8894A5601685J77317m4389k22160j22705P2668J79689K20597K08896J17822P3787
8884A6263207K16119L71928K50536m1687r4721J57689L15356J42026r6855r3847
$$ plain form
8874 17389751 17466187 17663973 17909013 18154361 18259936 18107528 17877117 17944396 18402624 18892967
8864 18892967 19038803 18899267 18845545 19072312 19390185 19515008 19445050 19446096 19679457 19988986
8854 19988986 20158386 20249797 20473857 20793567 20959210 20964378 21116594 21514286 21814687 21781958
8844 21781958 21737680 22093250 22680852 22998346 22980676 23049069 23419230 23822213 23983740 23980681
8834 23980681 24004803 24111460 24324661 24685152 25071335 25257609 25266651 25383636 25716453 26052047
8824 26052047 26278734 26610550 27192052 27794293 28150007 28323028 28491372 28620755 28641765 28723125
8814 28723125 29043069 29453262 29684618 29756955 29887584 30121586 30365048 30669635 31135999 31598461
8804 31598461 31765461 31677191 31695801 32003044 32407140 32705883 32951751 33254500 33568068 33805347
$$ packed form
8874A7389751P6436J97786K45040K45348J05575j52408k30411O7279M58228M90343
8864A8892967J45836j39536n3722K26767L17873J24823o9958J046K33361L09529
8854A9988986J69400R1411K24060L19710J65643N168J52216L97692L00401l2729
8844B1781958m4278L55570N87602L17494j7670O8393L70161M02983J61527l059
8834B3980681K4122J06657K13201L60491L86183J86274R042J16985L32817L35594
8824B6052047K26687L31816N81502O02241L55714J73021J68344J29383K1010Q1360
8814B8723125L19944M10193K31356P2337J30629K34002K43462L04587M66364M62462
8804C1598461J67000q8270J8610L07243M04096K98743K45868L02749L13568K37279
$$ plain form
8794 33805347 33987158 34171192 34376561 34648858 35053715 35543324 35967246 36263531 36506313
8785 36506313 36748963 36992307 37330235 37910135 38668101 39310210 39684101 40000548 40541459
8776 40541459 41287874 42007576 42624848 43323771 44284755 45434735 46502725 47303608 47950567
8767 47950567 48744071 49824086 51026082 52176126 53393815 54880860 56495604 57868738
8759 57868738 58986987 60314888 62167138 64262615 66158479 67883127 69799122 71981336
8751 71981336 74119057 76029704 77905968 79938168 81977999 83769396 85326852 86860593
8743 86860593 88413249 89793197 90873252 91763350 92606290 93346796 93849020 94170843 94533006
8734 94533006 94989501 95306853 95281877 95051010 94926988 94998803 95064702 94941560 94675849 94424578
$$ packed form
8794C3805347J81811J84034K05369K72297M04857M89609M23922K96285K42782
8785C6506313K42650K43344L37928N79900P57966O42109L73891L16447N40911
8776D0541459P46415P19702O17272O98923R60984J149980J067990Q00883O46959
8767D7950567P93504J080015J201996J150044J217689J487045J614744J373134
8759E7868738J118249J327901J852250K095477J895864J724648J915995K182214
8751G1981336K137721J910647J876264K032200K039831J791397J557456J533741
8743H6860593J552656J379948J080055Q90098Q42940P40506N02224L21823L62163
8734I4533006M56495L17352k4976k30867j24022P1815O5899j23142k65711k51271
$$ plain form
8724 94424578 94256150 94102187 93821071 93316461 92676640 92138879 91785501 91350915 90518439
8715 90518439 89341768 88128561 86950702 85580255 83931444 82218082 80566739 78814425
8707 78814425 76862346 74912632 73129966 71353753 69407177 67443983 65710939 64184377
8699 64184377 62714045 61295633 59903295 58311513 56468562 54825732 53836314 53262387
8691 53262387 52449980 51212498 49956803 48965979 48078503 47147335 46319122 45693625 45109100
8682 45109100 44433523 43731066 43022399 42233314 41484050 41036366 40823694 40450889 39823231
8673 39823231 39331279 39194414 39084565 38697982 38251855 38041214 37913185 37617630 37325293
8664 37325293 37313369 37421269 37319002 37084713 37008923 37024607 36865585 36638052 36673765 36901545
$$ packed form
8724I4424578j68428j53963k81116n04610o39821n37761l53378m34586q32476
8715I0518439j176671j213207j177859j370447j648811j713362j651343j752314
8707G8814425j952079j949714j782666j776213j946576j963194j733044j526562
8699F4184377j470332j418412j392338j591782j842951j642830r89418n73927
8691E3262387q12407j237482j255695r90824q87476r31168q28213o25497n84525
8682D5109100o75577p02457p08667p89085p49264m47684k12672l72805o27658
8673C9823231m91952j36865j09849l86583m46127k10641j28029k95555k92337
8664C7325293j1924J07900j02267k34289p5790J5684j59022k27533L5713K27780
$$ plain form
8654 36901545 36925677 36699926 36579128 36700370 36858153 37016557 37366467 37794217 37899804 37712260
8644 37712260 37790186 38361255 38940051 39138153 39304951 39910514 40744043 41258716 41404346 41588810
8634 41588810 42014678 42552076 43141352 43848688 44567691 45073937 45377575 45699745 46115284
8625 46115284 46501818 46801192 47051881 47209337 47211174 47170704 47228792 47270975 47086099 46752659
8615 46752659 46542065 46456148 46201320 45656155 45039691 44540439 44075071 43524132 42953780 42473905
8605 42473905 42062747 41635234 41146410 40584458 39997547 39513333 39166342 38765915 38159382
8596 38159382 37545452 37221955 37083023 36749788 36197539 35808592 35715516 35564290 35123300 34673962
8586 34673962 34512660 34473653 34295944 34100412 34091198 34090018 33836406 33520430 33507996 33678660
$$ packed form
8654C6901545K4132k25751j20798J21242J57783J58404L49910M27750J05587j87544
8644C7712260P7926N71069N78796J98102J66798O05563Q33529N14673J45630J84464
8634D1588810M25868N37398N89276P07336P19003N06246L03638L22170M15539
8625D6115284L86534K99374K50689J57456J837m0470N8088M2183j84876l33440
8615D6752659k10594q5917k54828n45165o16464m99252m65368n50939n70352m79875
8605D2473905m11158m27513m88824n61952n86911m84214l46991m00427o06533
8596C8159382o13930l23497j38932l33235n52249l88947r3076j51226m40990m49338
8586C4673962j61302l9007j77709j95532r214j180k53612l15976j2434J70664
$$ plain form
8576 33678660 33565670 33112500 32775833 32829400 33039274 33138772 33185489 33273556 33282576 33147778
8566 33147778 33071196 33212690 33411746 33464007 33472290 33654058 33938875 34040756 33893805 33781161
8556 33781161 33987800 34464220 34898863 35074764 35099843 35245895 35573650 35844257 35890034 35911570
8546 35911570 36195544 36666663 37028399 37279039 37694280 38273370 38659434 38768361 39032285
8537 39032285 39719609 40433979 40716376 40814228 41323208 42264394 43096547 43587611 44089966 44866576
8527 44866576 45687666 46309338 46904422 47731612 48714717 49645494 50532506 51449218 52267237
8518 52267237 52868815 53454537 54294550 55270448 56000825 56385316 56698760 57121016 57482757
8509 57482757 57580764 57494138 57427080 57399041 57259400 56933577 56520165 56165243 55921356 55724750
$$ packed form
8576C3678660j12990m53170l36667N3567K09874R9498M6717Q8067R020j34798
8566C3147778p6582J41494J99056N2261Q283J81768K84817J01881j46951j12644
8556C3781161K06639M76420M34643J75901K5079J46052L27755K70607M5777K1536
8546C5911570K83974M71119L61736K50640M15241N79090L86064J08927K63924
8537C9032285O87324P14370K82397R7852N08980R41186Q32153M91064N02355P76610
8527D4866576Q21090O21672N95084Q27190R83105R30777Q87012R16712Q18019
8518E2267237O01578N85722Q40013R75898P30377L84491L13444M22256L61741
8509E7482757R8007q6626o7058k8039j39641l25823m13412l54922k43887j96606
$$ plain form
8499 55724750 55470257 55111501 54696908 54304082 53969981 53714160 53569860 53513474 53416020 53180919
8489 53180919 52903546 52761709 52759008 52737475 52662126 52690574 52865622 52947310 52756953 52555791
8479 52555791 52798526 53504458 54139504 54243601 53981935 53892003 54208333 54675656 55008093 55270619
8469 55270619 55689772 56282836 56876210 57394514 57911261 58439058 58897306 59325540 59906725
8460 59906725 60689394 61501370 62269452 63192292 64383736 65570673 66473853 67339178 68673375
8451 68673375 70479083 72202938 73541385 74852698 76552700 78519051 80437288 82394334
8443 82394334 84675399 87187190 89584136 91881711 94440672 97315902 100105943 102580595
8435 102580595 105018948 107704833 110457660 112948254 115192895 117412848 119595818 121509497
$$ packed form
8499E5724750k54493l58756m14593l92826l34101k55821j44300n6386r7454k35101
8489E3180919k77373j41837k701k1533p5349K8448J75048Q1688j90357k01162
8479E2555791K42735P05932O35046J04097k61666q9932L16330M67323L32437K62526
8469E5270619M19153N93064N93374N18304N16747N27797M58248M28234N81185
8460E9906725P82669Q11976P68082R22840J191444J186937R03180Q65325J334197
8451F8673375J805708J723855J338447J311313J700002J966351J918237J957046
8443H2394334K281065K511791K396946K297575K558961K875230K790041K474652
8435A02580595K438353K685885K752827K490594K244641K219953K182970J913679
$$ plain form
8427 121509497 123033432 124208187 125050483 125569999 125885746 126077724 125994309 125465342 124658783
8418 124658783 123948729 123421311 122772555 121752847 120489023 119278029 118240098 117288699 116337015
8409 116337015 115434059 114716274 114234625 113832777 113300649 112706877 112406590 112564153 112853586
8400 112853586 112882556 112753766 112876112 113330901 113819448 114191773 114584776 115006907 115260490
8391 115260490 115392551 115738522 116313876 116634611 116421088 116019465 115769688 115413316 114597536
8382 114597536 113550846 112661697 111698151 110139217 108117167 106300462 104853691 103228390
8374 103228390 101094910 98794087 96641179 94428125 91958330 89511418 87348158 85217364
8366 85217364 82829656 80438919 78429848 76619626 74537746 72223303 70159807 68469869
$$ packed form
8427A21509497J523935J174755Q42296N19516L15747J91978q3415n28967q06559
8418A24658783p10054n27418o48756j019708j263824j210994j037931r51399r51684
8409A16337015r02956p17785m81649m01848n32128n93772l00287J57563K89433
8400A12853586K8970j28790J22346M54789M88547L72325L93003M22131K53583
8391A15260490J32061L45971N75354L20735k13523m01623k49777l56372q15780
8382A14597536j046690q89149r63546j558934k022050j816705j446771j625301
8374A03228390k133480k300823k152908k213054k469795k446912k163260k130794
8366H5217364k387708k390737k009071j810222k081880k314443k063496j689938
$$ plain form
8358 68469869 66748120 64778050 62897706 61438601 60201548 58786165 57187814 55751182
8350 55751182 54638986 53630662 52471236 51220329 50141224 49324028 48565053 47659545 46685284
8341 46685284 45857547 45184077 44477150 43694480 43008752 42478763 41934373 41319337 40851808
8332 40851808 40628479 40349908 39737733 39000693 38550500 38433964 38397583 38344040 38320450 38192873
8322 38192873 37798681 37356324 37240470 37365914 37298734 37001669 36909423 37156249 37329234 37221968
8312 37221968 37241863 37704890 38254755 38444137 38444582 38649899 38946217 38971119 38825350 38896076
8302 38896076 39149849 39245621 39241757 39500816 39897334 39852144 39300428 38908029 39028016 39109500
8292 39109500 38592614 37816897 37445979 37410487 37116088 36467746 35944307 35675565 35171286 34175332
$$ packed form
8358F8469869j721749j970070j880344j459105j237053j415383j598351j436632
8350E5751182j112196j008324j159426j250907j079105q17196p58975r05508r74261
8341D6685284q27737o73470p06927p82670o85728n29989n44390o15036m67529
8332D0851808k23329k78571o12175p37040m50193j16536l6381n3543k3590j27577
8322C8192873l94192m42357j15854J25444o7180k97065r2246K46826J72985j07266
8312C7221968J9895M63027N49865J89382M45K05317K96318K4902j45769P0726
8302C8896076K53773R5772l864K59059L96518m5190n51716l92399J19987Q1484
8292C9109500n16886p75717l70918l5492k94399o48342n23439k68742n04279r95954
$$ plain form
8282 34175332 33183185 32734505 32614469 32204864 31375660 30566078 30087227 29792510 29467092
8273 29467092 29139484 28858544 28483299 27926869 27396435 27134206 27045278 26832011 26421560 26007275
8263 26007275 25702408 25424194 25143209 24969208 24898269 24733837 24407887 24153509 24164412 24273602
8253 24273602 24201624 23974153 23828188 23801945 23707334 23479941 23272706 23169683 23060514 22875130
8243 22875130 22730375 22740117 22835574 22864161 22748225 22497634 22196588 22009672 22041942 22151231
8233 22151231 22077392 21814643 21650963 21741774 21867606 21781572 21597670 21595544 21766328 21822465
8223 21822465 21622701 21336903 21159296 21074810 20990665 20924892 20937940 20989860 21010475 21053995 21222978
8212 21222978 21432981 21429234 21141474 20880475 20988810 21366757 21597699 21549368 21533749 21749176
$$ packed form
8282C4175332r92147m48680j20036m09605q29204q09582m78851k94717l25418
8273B9467092l27608k80940l75245n56430n30434k62229q8928k13267m10451m14285
8263B6007275l04867k78214k80985j74001p0939j64432l25950k54378J0903J09190
8253B4273602p1978k27471j45965k6243r4611k27393k07235j03023j09169j85384
8243B2875130j44755R742R5457K8587j15936k50591l01046j86916L2270J09289
8233B2151231p3839k62749j63680R0811J25832q6034j83902k126J70784N6137
8223B1822465j99764k85798j77607q4486q4145o5773J3048N1920K0615M3520J68983
8212B1222978K10003l747k87760k60999J08335L77947K30942m8331j5619K15427
$$ plain form
8202 21749176 21924978 21816125 21728988 22079501 22612243 22652082 22146907 21849992 22260611 22928355
8192 22928355 23156698 22960319 22890167 23216615 23738323 24196974 24452245 24395810 24111684 24020695
8182 24020695 24462988 25198669 25689208 25801572 25856726 26061962 26331147 26642160 27109696 27650868
8172 27650868 28016607 28248632 28690104 29427469 30133598 30610844 31078766 31736165 32440461
8163 32440461 33057471 33754049 34670331 35637383 36504098 37425868 38530203 39608237 40466405
8154 40466405 41285347 42272642 43251421 43998069 44717125 45718979 46846009 47712305 48333994
8145 48333994 48993416 49625098 49937445 50081054 50536866 51270230 51654856 51441035 51190359
8136 51190359 51438672 51965774 52288487 52414839 52630701 52885615 52920402 52811850 52899281 53253574
$$ packed form
8202B1749176J75802j08853q7137L50513N32742L9839n05175k96915M10619O67744
8192B2928355K28343j96379p0152L26448N21708M58651K55271n6435k84126r0989
8182B4020695M42293P35681M90539J12364N5154K05236K69185L11013M67536N41172
8172B7650868L65739K32025M41472P37365P06129M77246M67922O57399P04296
8163C2440461O17010O96578R16282R67052Q66715R21770J104335J078034Q58168
8154D0466405Q18942R87295R78779P46648P19056J001854J127030Q66296O21689
8145D8333994O59422O31682L12347J43609M55812P33364L84626k13821k50676
8136E1190359K48313N27102L22713J26352K15862K54914L4787j08552Q7431L54293
$$ plain form
8126 53253574 53622032 53834628 53902623 53786900 53451544 53119160 53086721 53252735 53177281 52676033
8116 52676033 52028699 51513592 51063505 50525070 49960119 49487049 49050457 48563490 48108480
8107 48108480 47785598 47498017 47109429 46730794 46626921 46849731 47142591 47240568 47149864 47089932
8097 47089932 47222144 47475206 47646151 47683135 47810878 48269358 48960827 49537643 49873790 50231190
8087 50231190 50846739 51581857 52186981 52726100 53457755 54404026 55347742 56223935 57204804
8078 57204804 58370253 59590747 60807463 62141988 63613525 65021327 66274929 67607867
8070 67607867 69273250 71222809 73271558 75377437 77547975 79680995 81764389 84048815
8062 84048815 86711066 89499579 92070437 94560104 97409746 100660058 103869025 106781434
$$ packed form
8126E3253574L68458K12596O7995j15723l35356l32384l2439J66014p5454n01248
8116E2676033o47334n15107m50087n38435n64951m73070m36592m86967m55010
8107D8108480l22882k87581l88588l78635j03873K22810K92860R7977r0704n9932
8097D7089932J32212K53062J70945L6984J27743M58480O91469N76816L36147L57400
8087E0231190O15549P35118O05124N39119P31655R46271R43716Q76193R80869
8078E7204804J165449J220494J216716J334525J471537J407802J253602J332938
8070F7607867J665383J949559K048749K105879K170538K133020K083394K284426
8062H4048815K662251K788513K570858K489667K849642L250312L208967K912409
$$ plain form
8054 106781434 109623273 112583351 115446822 118005226 120457938 123068223 125693483 128017908
8046 128017908 130064547 132124245 134304920 136488404 138639916 140818160 142924434 144782657
8038 144782657 146485341 148352881 150489765 152640588 154553994 156249548 157833969 159271034
8030 159271034 160464567 161419696 162195323 162780849 163103268 163110636 162827081 162365659 161837960
8021 161837960 161166331 160073948 158421124 156489249 154732254 153263551 151783615 150019119
8013 150019119 148043753 146134439 144462232 142944639 141296527 139280742 137031574 135000677
8005 135000677 133388381 131804206 129789489 127492379 125394347 123495874 121328217 118772381
7997 118772381 116254717 113993939 111671374 109099714 106608142 104395997 102093274 99458680
$$ packed form
8054A06781434K841839K960078K863471K558404K452712K610285K625260K324425
8046A28017908K046639K059698K180675K183484K151512K178244K106274J858223
8038A44782657J702684J867540K136884K150823J913406J695554J584421J437065
8030A59271034J193533R55129P75627N85526L22419P368k83555m61422n27699
8021A61837960o71629j092383j652824j931875j756995j468703j479936j764496
8013A50019119j975366j909314j672207j517593j648112k015785k249168k030897
8005A35000677j612296j584175k014717k297110k098032j898473k167657k555836
7997A18772381k517664k260778k322565k571660k491572k212145k302723k634594
$$ plain form
7989 99458680 96982703 95174274 93669504 91754122 89471178 87456567 85861028 84238068
7981 84238068 82465761 80971588 79906421 78823436 77424739 76004809 74862578 73829970
7973 73829970 72715609 71709166 70947402 70100785 68838420 67405290 66308681 65635185 65057929
7964 65057929 64364563 63624830 62928869 62259916 61587805 60892469 60159515 59478126 59006539
7955 59006539 58710542 58309313 57630516 56846219 56217590 55797207 55513245 55318024 55108180
7946 55108180 54755271 54374615 54271405 54439425 54455451 54104461 53724207 53616121 53529020 53156358
7936 53156358 52744141 52642649 52578079 52037790 51178860 50633338 50484573 50175605 49484240 48856463
7926 48856463 48593857 48396041 47990756 47594328 47379739 47039911 46330557 45608695 45350189
$$ packed form
7989I9458680k475977j808429j504770j915382k282944k014611j595539j622960
7981H4238068j772307j494173j065167j082985j398697j419930j142231j032608
7973G3829970j114361j006443p61764q46617j262365j433130j096609o73496n77256
7964F5057929o93366p39733o95961o68953o72111o95336p32954o81389m71587
7955E9006539k95997m01229o78797p84297o28629m20383k83962j95221k09844
7946E5108180l52909l80656j03210J68020J6026l50990l80254j08086q7101l72662
7936E3156358m12217j01492o4570n40289q58930n45522j48765l08968o91365o27777
7926D8856463k62606j97816m05285l96428k14589l39828p09354p21862k58506
$$ plain form
7917 45350189 45458560 45508599 45396544 45284912 45136562 44806886 44465773 44435252 44641562 44670030
7907 44670030 44398324 44188691 44354533 44739992 44958948 44849561 44587611 44481799 44711776
7898 44711776 45163802 45502887 45486565 45191995 44877644 44704269 44677914 44745548 44807179 44738652
7888 44738652 44545574 44380535 44266308 43968952 43359125 42735384 42491932 42555741 42465579 41973804
7878 41973804 41258681 40540210 39819562 39084800 38474094 38066015 37701981 37181474 36524246
7869 36524246 35925450 35521456 35260434 34950855 34439138 33811604 33373009 33311358 33446472 33452745
7859 33452745 33248956 32985893 32750010 32533077 32417639 32479116 32531930 32320334 31979739 31924189
7849 31924189 32190340 32304080 31982655 31582629 31583386 31957194 32368180 32708314 33055803 33310824
$$ packed form
7917D5350189J08371N0039j12055j11632j48350l29676l41113l0521K06310K8468
7907D4670030k71706k09633J65842L85459K18956j09387k61950j05812K29977
7898D4711776M52026L39085j6322k94570l14351j73375k6355O7634O1631o8527
7888D4738652j93078j65039j14227k97356o09827o23741k43452O3809r0162m91775
7878D1973804p15123p18471p20648p34762o10706m08079l64034n20507o57228
7869C6524246n98796m03994k61022l09579n11717o27534m38595o1651J35114O273
7859C3452745k03789k63063k35883k16933j15438O1477N2814k11596l40595n5550
7849C1924189K66151J13740l21425m00026P57L73808M10986L40134L47489K55021
$$ plain form
7839 33310824 33300278 33166385 33271092 33711664 34224262 34571181 34772134 34957327 35224111 35632506
7829 35632506 36135195 36543439 36766018 37009974 37497865 38074938 38423557 38622861 39098013
7820 39098013 39949470 40732103 41078259 41209777 41596893 42363566 43283608 44171611 45016116
7811 45016116 45855490 46759470 47841708 49094347 50320205 51433119 52694543 54381523
7803 54381523 56306975 57999374 59374400 60899575 62969578 65393768 67707893 69799057
7795 69799057 71958012 74395975 76992958 79577584 82231041 85157265 88357310 91603348
7787 91603348 94727368 97799353 100974669 104258622 107486758 110479682 113155833 115536434
7779 115536434 117696131 119661933 121302656 122380220 122791000 122689230 122265152 121480358 120186910
$$ packed form
7839C3310824j0546j33893J04707M40572N12598L46919K00953J85193K66784M08395
7829C5632506N02689M08244K22579K43956M87891N77073L48619J99304M75152
7820C9098013Q51457P82633L46156J31518L87116P66673R20042Q88003Q44505
7811D5016116Q39374R03980J082238J252639J225858J112914J261424J686980
7803E4381523J925452J692399J375026J525175K070003K424190K314125K091164
7795F9799057K158955K437963K596983K584626K653457K926224L200045L246038
7787I1603348L124020L071985L175316L283953L228136K992924K676151K380601
7779A15536434K159697J965802J640723J077564M10780j01770m24078p84794j293448
$$ plain form
7770 120186910 118446562 116487779 114317756 111648734 108361814 104835368 101588039 98702341
7762 98702341 95818933 92649082 89281827 85989960 82938760 80147099 77576223 75153984
7754 75153984 72797447 70501381 68361337 66443904 64664188 62858590 60984179 59193374
7746 59193374 57666563 56386783 55149388 53822754 52512995 51385026 50406559 49421268
7738 49421268 48411968 47470053 46518870 45357689 44055963 42976959 42220997 41369093 40091510
7729 40091510 38739530 37910078 37588434 37202227 36466868 35666852 35041104 34401398 33552476
7720 33552476 32655708 31917458 31269694 30625896 30129981 29855904 29545942 28960548 28242022
7711 28242022 27635179 27116421 26625721 26357910 26387841 26273318 25565343 24550961 23928870
$$ packed form
7770A20186910j740348j958783k170023k669022l286920l526446l247329k885698
7762I8702341k883408l169851l367255l291867l051200k791661k570876k422239
7754G5153984k356537k296066k140044j917433j779716j805598j874411j790805
7746E9193374j526811j279780j237395j326634j309759j127969r78467r85291
7738D9421268j009300r41915r51183j161181j301726j079004p55962q51904j277583
7729D0091510j351980q29452l21644l86207p35359q00016o25748o39706q48922
7720C3552476q96768p38250o47764o43798m95915k74077l09962n85394p18526
7711B8242022o06843n18758m90700k67811K9931j14523p07975j014382o22091
$$ plain form
7702 23928870 23834344 23764207 23434339 23076104 22809780 22386744 21771316 21369808 21367913 21373523
7692 21373523 21068992 20713426 20588649 20433845 19943586 19420724 19340519 19542822 19455188 18945380
7682 18945380 18394939 18054856 17859295 17765667 17749420 17566825 17072125 16663650 16806602 17196468
7672 17196468 17094734 16485440 16107716 16217754 16176531 15591392 15038237 15125745 15538959 15639093
7662 15639093 15440901 15311599 15177354 14780453 14375653 14400226 14680761 14703610 14487649 14441408
7652 14441408 14508225 14272781 13862346 13874004 14319145 14494806 14108186 13706647 13694801 13733660
7642 13733660 13525665 13412972 13644623 13754286 13340261 12870084 12943779 13234762 13018145 12423444
7632 12423444 12238872 12605151 12830751 12569721 12316659 12485622 12740253 12619644 12261941
$$ packed form
7702B3928870r4526p0137l29868l58235k66324m23036o15428m01508j895N610
7692B1373523l04531l55566j24777j54804m90259n22862q0205K02303q7634n09808
7682A8945380n50441l40083j95561r3628j6247j82595m94700m08475J42952L89866
7672A7196468j01734o09294l77724J10038m1223n85139n53155Q7508M13214J00134
7662A5639093j98192j29302j34245l96901m04800K4573K80535K2849k15961m6241
7652A4441408O6817k35444m10435J1658M45141J75661l86620m01539j1846L8859
7642A3733660k07995j12693K31651J09663m14025m70177P3695K90983k16617n94701
7632A2423444j84572L66279K25600k61030k53062J68963K54631j20609l57703
$$ plain form
7623 12261941 12078374 12112131 12134365 12103575 12160946 12330795 12498967 12577751 12527460 12351158
7613 12351158 12174108 12148953 12200592 12089882 11810165 11647599 11739228 11873797 11879265 11885487 11998806
7602 11998806 12037611 11863265 11699879 11819738 12123327 12320170 12334724 12262920 12134843 12010023
7592 12010023 12091928 12421515 12659651 12527020 12266672 12283794 12516574 12610661 12554301 12618433
7582 12618433 12759435 12663438 12399759 12431994 12844095 13119397 12922328 12602849 12631444 12957545
7572 12957545 13245535 13375890 13383524 13235361 13012384 13007864 13298364 13518425 13429077 13384533
7562 13384533 13770223 14263987 14232092 13702977 13339485 13472439 13753274 13836860 13836642 13919608
7552 13919608 13963492 13891764 13926563 14185875 14373182 14229096 14027661 14222024 14748298 15085712
$$ packed form
7623A2261941j83567L3757K2234l0790N7371J69849J68172P8784n0291j76302
7613A2351158j77050k5155N1639j10710k79717j62566R1629J34569N468O222J13319
7602A1998806L8805j74346j63386J19859L03589J96843J4554p1804j28077j24820
7592A2010023Q1905L29587K38136j32631k60348J7122K32780R4087n6360O4132
7582A2618433J41002r5997k63679L2235M12101K75302j97069l19479K8595L26101
7572A2957545K87990J30355P634j48163k22977m520K90500K20061q9348m4544
7562A3384533L85690M93764l1895n29115l63492J32954K80835Q3586k18Q2966
7552A3919608M3884p1728L4799K59312J87307j44086k01435J94363N26274L37414
$$ plain form
7542 15085712 14980131 14751695 14807858 15122306 15353167 15332956 15255594 15368347 15609887 15694456
7532 15694456 15554472 15502364 15794187 16199446 16298489 16129606 16152840 16520243 16811155 16691325
7522 16691325 16430840 16441428 16642696 16721694 16765394 17099538 17609465 17799012 17586286 17506733
7512 17506733 17932572 18541423 18835806 18826336 18866489 19078953 19310656 19491677 19686807 19874175
7502 19874175 19983234 20109624 20414339 20832030 21137341 21288971 21459133 21735813 22066569
7493 22066569 22494480 23126487 23807211 24180299 24232221 24433974 25097731 25907513 26426729 26797293
7483 26797293 27471676 28413131 29125402 29494692 30022052 31018984 32101089 32834737 33447872
7474 33447872 34419251 35679164 36788105 37733811 38927446 40431100 41829098 43001153
$$ packed form
7542A5085712j05581k28436N6163L14448K30861k0211p7362J12753K41540Q4569
7532A5694456j39984n2108K91823M05259R9043j68883K3234L67403K90912j19830
7522A6691325k60485J0588K01268P8998M3700L34144N09927J89547k12726p9553
7512A7506733M25839O08851K94383r470M0153K12464K31703J81021J95130J87368
7502A9874175J09059J26390L04715M17691L05311J51630J70162K76680L30756
7493B2066569M27911O32007O80724L73088N1922K01753O63757Q09782N19216L70564
7483B6797293O74383R41455P12271L69290N27360R96932J082105P33648O13135
7474C3447872R71379J259913J108941R45706J193635J503654J397998J172055
$$ plain form
7466 43001153 44410595 46349041 48455938 50395596 52526148 55358502 58707843 61999764
7458 61999764 65190456 68690484 72419190 75620477 77744643 78908298 79272883 78569559
7450 78569559 76639420 74004695 71423411 69113633 66815606 64421515 62128046 60069521
7442 60069521 58189093 56468030 54991656 53778146 52750381 51850533 51021415 50178259 49387597
7433 49387597 48916460 48839035 48751246 48223376 47433408 46956846 46970551 47093973 47044630 46981751
7423 46981751 47058972 47091513 46937114 46847361 47108129 47581609 47938691 48167683 48521169 49065577
7413 49065577 49596988 49971119 50268497 50638330 51152498 51776002 52344309 52670547 52839216
7404 52839216 53252904 54156255 55240953 56009596 56438351 56942682 57726643 58554880 59232791
$$ packed form
7466D3001153J409442J938446K106897J939658K130552K832354L349341L291921
7458F1999764L190692L500028L728706L201287K124166J163655L64585p03324
7450G8569559j930139k634725k581284k309778k298027k394091k293469k058525
7442F0069521j880428j721063j476374j213510j027765q99848q29118q43156p90662
7433D9387597m71137p7425q7789n27870p89968m76562J3705J23422m9343o2879
7423D6981751P7221L2541j54399q9753K60768M73480L57082K28992L53486N44408
7413D9065577N31411L74131K97378L69833N14168O23504N68307L26238J68669
7404E2839216M13688R03351J084698P68643M28755N04331P83961Q28237O77911
$$ plain form
7395 59232791 59925263 60824708 61825964 62767969 63746559 64915985 66164798 67281472 68325386
7386 68325386 69534155 70912269 72208907 73333510 74534524 76077484 77941832 79936472
7378 79936472 81949320 83960297 85942020 87902365 89957635 92226780 94685147 97232233
7370 97232233 99869575 102690093 105709154 108848671 112116337 115661414 119576621 123756946
7362 123756946 128063402 132546316 137376202 142603954 148143978 153988334 160268678 167051349
7354 167051349 174222353 181683101 189557799 198086125 207377113 217388207 228096186 239557232
7346 239557232 251828193 264980852 279212511 294791475 311802403 330010835 349025457
7339 349025457 368495545 388027139 406910245 424022125 438065171 447930488 452900643
$$ packed form
7395E9232791O92472Q99445J001256R42005R78590J169426J248813J116674J043914
7386F8325386J208769J378114J296638J124603J201014J542960J864348J994640
7378G9936472K012848K010977J981723J960345K055270K269145K458367K547086
7370I7232233K637342K820518L019061L139517L267666L545077L915207M180325
7362A23756946M306456M482914M829886N227752N540024N844356O280344O782671
7354A67051349P171004P460748P874698Q528326R290988J0011094J0707979J1461046
7346B39557232J2270961J3152659J4231659J5578964J7010928J8208432J9014622
7339C49025457J9470088J9531594J8883106J7111880J4043046R865317M970155
$$ plain form
7332 452900643 452652803 447256299 437269998 423746113 407906494 390661484 372464527 353662589
7324 353662589 334865136 316824847 299991158 284323169 269568202 255631107 242641627
7317 242641627 230743783 219894673 209880945 200517452 191783081 183701141 176133426 168846849
7309 168846849 161807516 155219531 149185715 143539101 138152848 133167127 128655400 124306149
7301 124306149 119816145 115437010 111664961 108449906 105229246 101784372 98505082 95645915
7293 95645915 92898580 90009007 87276888 85001518 82896046 80595836 78372030 76700902
7285 76700902 75381867 73790247 71891377 70270170 69122395 67944767 66411320 64884463
7277 64884463 63733338 62711658 61423525 59967063 58671496 57517448 56252451 54852099
$$ packed form
7332D52900643k47840n396504r986301j3523885j5839619j7245010j8196957j8801938
7324C53662589j8797453j8040289j6833689j5667989j4754967j3937095j2989480
7317B42641627j1897844j0849110j0013728r363493q734371q081940p567715p286577
7309A68846849p039333o587985o033816n646614n386253m985721m511727m349251
7301A24306149m490004m379135l772049l215055l220660l444874l279290k859167
7293I5645915k747335k889573k732119k275370k105472k300210k223806j671128
7285G6700902j319035j591620j898870j621207j147775j177628j533447j526857
7277F4884463j151125j021680j288133j456462j295567j154048j264997j400352
$$ plain form
7269 54852099 53472783 52126204 50755232 49471595 48384165 47342610 46172514 45005573
7261 45005573 44039040 43131269 42026090 40858476 40007306 39486682 38906545 38064676 37184105
7252 37184105 36485592 35883237 35231069 34574703 34008111 33495505 32953769 32354129 31695363
7243 31695363 31032091 30509337 30173319 29813065 29246945 28668605 28350408 28090951 27448020
7234 27448020 26533051 25991012 26015191 25970674 25330243 24455257 23991236 23922461 23762268 23353412
7224 23353412 22903077 22454481 21919573 21494953 21448180 21553391 21317460 20748765 20323769 20181254
7214 20181254 19974728 19604409 19417253 19473977 19304626 18740827 18335337 18459011 18566277 18008494
7204 18008494 17131221 16798190 17082236 17239867 16923172 16607200 16663663 16736669 16382849 15795237
$$ packed form
7269E4852099j379316j346579j370972j283637j087430j041555j170096j166941
7261D5005573r66533r07771j105179j167614q51170n20624n80137q41869q80571
7252C7184105o98513o02355o52168o56366n66592n12606n41736n99640o58766
7243C1695363o63272n22754l36018l60254n66120n78340l18197k59457o42931
7234B7448020r14969n42039K4179m4517o40431q74986m64021o8775j60193m08856
7224B3353412m50335m48596n34908m24620m6773J05211k35931n68695m24996j42515
7214B0181254k06526l70319j87156N6724j69351n63799m05490J23674J07266n57783
7204A8008494q77273l33031K84046J57631l16695l15972N6463P3006l53820n87612
$$ plain form
7194 15795237 15472909 15510364 15591296 15464185 15117639 14664896 14313827 14280924 14497008 14571537
7184 14571537 14288147 13950127 13952145 14177842 14170465 13810506 13445347 13329483 13289085 13060367
7174 13060367 12691031 12436584 12422811 12560032 12686693 12675870 12467666 12100141 11697904 11401697
7164 11401697 11317451 11472319 11720885 11756071 11395977 10868119 10611463 10735431 10874662 10691764
7154 10691764 10323474 10136756 10197181 10243919 10134687 10024473 10041953 10046939 9875481 9651495
7144 9651495 9623080 9751235 9707103 9330995 8887144 8723700 8823717 8887364 8779865 8654098
7134 8654098 8618062 8547406 8353511 8209788 8298894 8486314 8489000 8275385 8046061 7887590
7124 7887590 7736008 7647933 7753551 7888685 7663314 7069808 6659616 6838585 7293515 7466996
$$ packed form
7194A5795237l22328L7455Q0932j27111l46546m52743l51069l2903K16084P4529
7184A4571537k83390l38020K018K25697p377l59959l65159j15864m0398k28718
7174A3060367l69336k54447j3773J37221J26661j0823k08204l67525m02237k96207
7164A1401697q4246J54868K48566L5186l60094n27858k56656J23968J39231j82898
7154A0691764l68290j86718O0425M6738j09232j10214J7480M986j71458k23986
7144I651495k8415J28155m4132l76108m43851j63444J00017O3647j07499j25767
7134H654098l6036p0656j93895j43723Q9106J87420K686k13615k29324j58471
7124G887590j51582q8075J05618J35134k25371n93506m10192J78969M54930J73481
$$ plain form
7114 7466996 7336279 7268031 7277674 7006194 6456165 6172976 6458730 6862878 6804097 6375420
7104 6375420 6126114 6244176 6396188 6318346 6137644 6031488 5936948 5781466 5729164 5941802
7094 5941802 6244811 6299771 6067799 5859980 5896395 6033502 6031087 5902116 5814142 5762801 5590384
7083 5590384 5315206 5184168 5307745 5463406 5415987 5252408 5200026 5265899 5307703 5346759
7073 5346759 5494965 5616400 5428094 4999123 4782973 4989359 5252440 5164414 4857692 4746759
7063 4746759 4905074 5059051 5072190 5053622 5028116 4874059 4631147 4539273 4683940 4877967
7053 4877967 4975862 5034804 5078018 4993604 4801358 4726472 4828186 4839466 4602754 4387304 4476722
7042 4476722 4685516 4655726 4454871 4449940 4673690 4771643 4590503 4371441 4271878 4142780
$$ packed form
7114G466996j30717o8248R643k71480n50029k83189K85754M04148n8781m28677
7104F375420k49306J18062J52012p7842j80702j06156r4540j55482n2302K12638
7094E941802L03009N4960k31972k07819L6415J37107k415j28971q7974n1341j72417
7083E590384k75178j31038J23577J55661m7419j63579n2382O5873M1804L9056
7073E346759J48206J21435j88306m28971k16150K06386K63081q8026l06722j10933
7063D746759J58315J53977J3139j8568k5506j54057k42912r1874J44667J94027
7053D877967R7895N8942M3214q4414j92246p4886J01714J1280k36712k15450Q9418
7042D476722K08794k9790k00855m931K23750R7953j81140k19062r9563j29098
$$ plain form
7032 4142780 3954262 3999769 4382487 4672058 4454665 3949238 3661412 3642475 3569032 3422417
7022 3422417 3533313 3925487 4158821 3995434 3750136 3725794 3726570 3488999 3247956 3404275
7012 3404275 3818012 3929913 3566144 3181192 3200529 3471283 3543365 3265227 2902787 2775869
7002 2775869 2932231 3165920 3287202 3333532 3454184 3604573 3546392 3253762 3081708 3291335
6992 3291335 3615308 3633129 3412778 3346778 3451402 3364318 3065558 3012007 3367811 3661096
6982 3661096 3513326 3206772 3144778 3217248 3170222 3175880 3461061 3714259 3515762 3115402
6972 3115402 3080822 3326807 3262000 2867738 2799869 3259701 3574633 3255262 2767589 2760786
6962 2760786 3077526 3106476 2749392 2466793 2563481 2900213 3183949 3181096 2800082 2293001
$$ packed form
7032D142780j88518M5507L82718K89571k17393n05427k87826j8937p3443j46615
7022C422417J10896L92174K33334j63387k45298k4342P76k37571k41043J56319
7012C404275M13737J11901l63769l84952J9337K70754P2082k78138l62440j26918
7002B775869J56362K33689J21282M6330J20652J50389n8181k92630j72054K09627
6992C291335L23973J7821k20351o6000J04624q7084k98760n3551L55804K93285
6982C661096j47770l06554o1994P2470m7026N658K85181K53198j98497m00360
6972C115402l4580K45985o4807l94262o7869M59832L14932l19371m87673o803
6962B760786L16740K8950l57084k82599R6688L36732K83736k853l81014n07081
$$ plain form
6952 2293001 2184842 2653169 3172681 3154534 2751702 2599227 2895402 3218815 3214137 2991780
6942 2991780 2794850 2673976 2602210 2596882 2614576 2563268 2489738 2545839 2732310 2876387 2878081
6931 2878081 2786419 2644652 2462608 2321860 2307927 2367630 2411390 2477096 2604531 2687096 2683341
6920 2683341 2787273 3077366 3214846 2910199 2486397 2448808 2649856 2527008 2114469 2064025
6910 2064025 2538606 2860905 2575016 2155265 2212862 2590884 2771099 2698651 2644405 2626300
6900 2626300 2523261 2465244 2585846 2657639 2482167 2363881 2645932 3031444 2976500 2566770
6890 2566770 2361502 2492653 2593219 2573349 2757339 3163314 3322605 3025009 2674795 2659437
6880 2659437 2854228 3005618 3152171 3377311 3537811 3544998 3594322 3825179 4028828 3968004
$$ packed form
6952B293001j08159M68327N19512j8147m02832j52475K96175L23413m678k22357
6942B991780j96930j20874p1766n328J7694n1308p3530N6101J86471J44077J694
6931B878081r1662j41767j82044j40748j3933N9703M3760O5706J27435Q2565l755
6920B683341J03932K90093J37480l04647m23802l7589K01048j22848m12539n0444
6910B064025M74581L22299k85889m19751N7597L78022J80215p2448n4246j8105
6900B626300j03039n8017J20602P1793j75472j18286K82051L85512n4944m09730
6890B566770k05268J31151J00566j9870J83990M05975J59291k97596l50214j5358
6880B659437J94791J51390J46553K25140J60500P187M9324K30857K03649o0824
$$ plain form
6870 3968004 3747647 3617195 3618781 3658326 3723801 3821857 3880160 3884061 3915109 3921109 3709283
6859 3709283 3332935 3179639 3430761 3717754 3619830 3264557 3086091 3160830 3161564 2898956
6849 2898956 2562571 2412229 2492500 2687372 2864649 2931857 2880168 2789628 2719287 2628913 2469264
6838 2469264 2282020 2151259 2120600 2172770 2202229 2057966 1779240 1694426 1997294 2313367
6828 2313367 2123946 1612841 1519826 2003805 2301839 1879671 1291066 1322880 1801345 1971996
6818 1971996 1720417 1609721 1852180 2039546 1921909 1747382 1708818 1666505 1570605 1606131
6808 1606131 1753581 1720478 1484618 1412445 1646009 1847622 1766543 1605924 1598525 1652064 1654132
6797 1654132 1706796 1811027 1737615 1471664 1361884 1550459 1693032 1556270 1430685 1569279
$$ packed form
6870C968004k20357j30452J586L9545O5475R8056N8303L901L1048O000k11826
6859C709283l76348j53296K51122K86993r7924l55273j78466P4739P34k62608
6849B898956l36385j50342Q0271J94872J77277O7208n1689r0540p0341r0374j59649
6838B469264j87244j30761l0659N2170K9459j44263k78726q4814L02868L16073
6828B313367j89421n11105r3015M83979K98034m22168n88605L1814M78465J70651
6818A971996k51579j10696K42459J87366j17637j74527l8564m2313r5900L5526
6808A606131J47450l3103k35860p2173K33564K01613q1079j60619p399N3539K068
6797A654132N2664J04231p3412k65951j09780J88575J42573j36762j25585J38594
$$ plain form
6787 1569279 1683228 1475196 1252110 1434198 1783906 1754371 1390430 1236545 1449292 1630718
6777 1630718 1551497 1459403 1563625 1699657 1665785 1520274 1397525 1318831 1293201 1364594 1489682
6766 1489682 1567967 1601651 1638757 1618346 1487454 1366554 1349981 1291790 1093484 1011174 1270927
6755 1270927 1563858 1438599 1069282 1029514 1342223 1433961 1123386 939577 1209718 1516494
6745 1516494 1454796 1314102 1488856 1710601 1491692 1006717 879976 1235467 1546571 1425620
6735 1425620 1079700 905668 992853 1135533 1114959 903720 711505 791433 1102200 1293407
6725 1293407 1160970 933253 919842 1086123 1219255 1302023 1411564 1428046 1206945 927377
6715 927377 903603 1112030 1249104 1213856 1187263 1247731 1252278 1134349 1019270 994335 1015267
$$ packed form
6787A569279J13949k08032k23086J82088L49708k9535l63941j53885K12747J81426
6777A630718p9221r2094J04222J36032l3872j45511j22749p8694k5630P1393J25088
6766A489682P8285L3684L7106k0411j30892j20900j6573n8191j98306q2310K59753
6755A270927K92931j25259l69317l9768L12709R1738l10575j83809K70141L06776
6745A516494o1698j40694J74754K21745k18909m84975j26741L55491L11104j20951
6735A425620l45920j74032Q7185J42680k0574k11239j92215P9928L10767J91207
6725A293407j32437k27717j3411J66281J33132Q2768J09541J6482k21101k79568
6715I27377k3774K08427J37074l5248k6593O0468M547j17929j15079k4935K0932
$$ plain form
6704 1015267 1068408 1194023 1338228 1392075 1354824 1266367 1077254 825972 787650 1103299
6694 1103299 1407104 1255514 830406 718277 1028675 1288684 1254308 1220416 1369178 1421786
6684 1421786 1212717 1046598 1131600 1175331 959541 833861 1134448 1516256 1433446 989340
6674 989340 729242 800818 901793 920413 1037850 1238298 1269104 1119347 1059052 1154446 1179636
6663 1179636 1061951 1000719 1077689 1136226 1113294 1123744 1160536 1080869 941601 971174 1156395
6652 1156395 1245625 1205838 1247679 1339830 1188253 821123 682258 945668 1233881 1251699
6642 1251699 1190805 1218978 1104904 742920 543574 816335 1198892 1223632 1053346 1086006
6632 1086006 1210435 1111245 985175 1204090 1503505 1336097 910086 977744 1559955 1812369
$$ packed form
6704A015267N3141J25615J44205N3847l7251q8457j89113k51282l8322L15649
6694A103299L03805j51590m25108j12129L10398K60009l4376l3892J48762N2608
6684A421786k09069j66119Q5002M3731k15790j25680L00587L81808q2810m44106
6674I89340k60098P1576J00975J8620J17437K00448L0806j49757o0295R5394K5190
6663A179636j17685o1232P6970N8537k2932J0450L6792p9667j39268K9573J85221
6652A156395Q9230l9787M1841R2151j51577l67130j38865K63410K88213J7818
6642A251699o0894K8173j14074l61984j99346K72761L82557K4740j70286L2660
6632A086006J24429r9190j26070K18915K99415j67408m26011O7658N82211K52414
$$ plain form
6622 1812369 1371146 920872 1031175 1270654 1051021 650548 689554 1088181 1285559 1171135
6612 1171135 1090058 1129070 1072580 962700 1069410 1320298 1326413 1011820 721051 656015 672765
6601 672765 691975 844031 1102774 1209727 1101215 1025697 1102461 1136507 1013384 905258
6591 905258 918727 903353 801821 829678 1077192 1274974 1219887 1114367 1186712 1276373 1142973
6580 1142973 930155 932906 1089852 1104021 945569 850457 897999 958518 1012726 1159930 1322046
6569 1322046 1294375 1115712 1054672 1180687 1268876 1199700 1135846 1196093 1253794 1204425 1165900
6558 1165900 1238845 1292782 1181578 998994 940567 1044061 1212378 1362472 1419713 1305770
6548 1305770 1077018 949832 1048110 1238959 1336587 1328593 1270113 1122860 883591 723456
$$ packed form
6622A812369m41223m50274J10303K39479k19633m00473L9006L98627J97378j14424
6612A171135q1077L9012n6490j09880J06710K50888O115l14593k90769o5036J6750
6601F72765J9210J52056K58743J06953j08512p5518P6764L4046j23123j08126
6591I05258J3469j5374j01532K7857K47514J97782n5087j05520P2345Q9661j33400
6580A142973k12818K751J56946J4169j58452r5112M7542O0519N4208J47204J62116
6569A322046k7671j78663o1040J26015Q8189o9176o3854O0247N7701m9369l8525
6558A165900P2945N3937j11204j82584n8427J03494J68317J50094N7241j13943
6548A305770k28752j27186R8278J90849R7628p994n8480j47253k39269j60135
$$ plain form
6538 723456 780642 927882 971292 971969 1104027 1271599 1192616 882012 729197 975357 1369621
6527 1369621 1513040 1359042 1188686 1215076 1397710 1578738 1634788 1523278 1320307 1205457
6517 1205457 1293131 1481877 1572770 1524832 1473921 1501735 1541981 1564574 1680022 1926887 2092504
6506 2092504 1952996 1634565 1500370 1657923 1817792 1730440 1529034 1474514 1565333 1629458
6496 1629458 1646441 1702502 1729614 1595936 1406476 1393371 1516133 1509722 1356773 1339137 1535669
6485 1535669 1665987 1582566 1502341 1532206 1414793 1075993 964218 1355654 1720433 1424886
6475 1424886 799415 747050 1368810 1793198 1509045 1075799 1155622 1523049 1569026 1294199
6465 1294199 1181201 1360225 1501526 1424322 1291954 1218531 1123519 1019644 1071152 1274065
$$ packed form
6538G23456N7186J47240M3410O77J32058J67572p8983l10604j52815K46160L94264
6527A369621J43419j53998j70356K6390J82634J81028N6050j11510k02971j14850
6517A205457Q7674J88746R0893m7938n0911K7814M0246K2593J15448K46865J65617
6506B092504j39508l18431j34195J57553J59869q7352k01406n4520R0819O4125
6496A629458J6983N6061K7112j33678j89460j3105J22762o411j52949j7636J96532
6485A535669J30318q3421q0225K9865j17413l38800j11775L91436L64779k95547
6475A424886o25471n2365O21760M24388k84153m33246P9823L67427M5977k74827
6465A294199j12998J79024J41301p7204j32368p3423r5012j03875N1508K02913
$$ plain form
6455 1274065 1372168 1206528 942904 851020 992900 1192210 1227356 1049284 868774 961940
6445 961940 1310027 1555777 1445411 1163336 1044866 1115842 1165704 1140717 1157573 1207025 1170805
6434 1170805 1101127 1158111 1278281 1247015 1121120 1206996 1534848 1731553 1572592 1311288
6424 1311288 1249326 1297609 1231007 1117194 1180485 1411273 1604117 1668421 1650793 1562046 1424769
6413 1424769 1380046 1493908 1565197 1401849 1190357 1263904 1549679 1619306 1342471 1120190
6403 1120190 1297675 1648995 1706113 1410193 1141241 1168652 1353662 1444390 1438192 1496674 1614567
6392 1614567 1582665 1324363 1106868 1253905 1691948 1971766 1802512 1406497 1220639 1362499
6382 1362499 1558614 1543745 1349754 1185342 1170731 1242128 1251184 1141455 1048372 1158430 1422025
$$ packed form
6455A274065R8103j65640k63624r1884J41880J99310L5146j78072j80510R3166
6445I61940L48087K45750j10366k82075j18470P0976M9862k4987J6856M9452l6220
6434A170805o9678N6984J20170l1266j25895Q5876L27852J96705j58961k61304
6424A311288o1962M8283o6602j13813O3291K30788J92844O4304j7628q8747j37277
6413A424769m4723J13862P1289j63348k11492P3547K85775O9627k76835k22281
6403A120190J77485L51320N7118k95920k68952K7411J85010R0728o198N8482J17893
6392A614567l1902k58302k17495J47037M38043K79818j69254l96015j85858J41860
6382A362499J96115j4869j93991j64412j4611P1397R056j09729r3083J10058K63595
$$ plain form
6371 1422025 1549504 1429041 1370951 1665041 2027110 1893980 1279933 871706 1086000 1480878
6361 1480878 1452827 1138317 1108303 1398586 1480186 1189067 1038089 1380412 1815568 1815019 1521392
6350 1521392 1434540 1574409 1518378 1175213 957117 1111472 1378417 1482131 1525948 1653718
6340 1653718 1705091 1538708 1392734 1536734 1787087 1790962 1640210 1729208 2048751 2124984
6330 2124984 1758901 1369402 1389308 1687070 1856258 1795009 1696711 1665190 1648632 1645126 1705457
6319 1705457 1791865 1837296 1869884 1904892 1835877 1643703 1574923 1833924 2196066 2250422 1991316
6308 1991316 1824556 1952921 2107823 2015583 1813391 1791519 1948989 2045943 1968470 1828903
6298 1828903 1771885 1843413 2000608 2124633 2081081 1881924 1727700 1780122 1957562 2068988
$$ packed form
6371A422025J27479j20463n8090K94090L62069j33130o14047m08227K14294L94878
6361A480878k8051l14510l0014K90283Q1600k91119j50978L42323M35156n49k93627
6350A521392q6852J39869n6031l43165k18096J54355K66945J03714M3817J27770
6340A653718N1373j66383j45974J44000K50353L875j50752Q8998L19543P6233
6330B124984l66083l89499J9906K97762J69188o1249r8298l1521j6558l506O0331
6319A705457Q6408M5431L2588L5008o9015j92174o8780K59001L62142N4356k59106
6308A991316j66760J28365J54902r2240k02192k1872J57470R6954p7473j39567
6298A828903n7018P1528J57195J24025m3552j99157j54224N2422J77440J11426
$$ plain form
6288 2068988 2079101 2099886 2167291 2186327 2099056 1968816 1871421 1815867 1808789 1899153 2104984
6277 2104984 2360333 2578546 2719253 2768357 2718646 2612627 2539312 2526283 2488616 2361515
6267 2361515 2236270 2258253 2411100 2530160 2541554 2541538 2590000 2594413 2507472 2467220 2567432
6256 2567432 2652382 2580500 2538662 2756638 3015990 2895137 2509755 2475856 2965272 3347909
6246 3347909 3118799 2676258 2674328 3014454 3123162 2961584 3019846 3385833 3563513 3316710
6236 3316710 3028084 3025907 3146068 3202811 3340242 3618876 3756831 3619120 3514509 3664157
6226 3664157 3813672 3739597 3696858 3931084 4162983 4053757 3821919 3863637 4071952 4098147
6216 4098147 4018885 4135735 4326053 4244390 4036280 4180971 4664293 4960265 4865500 4730260
$$ packed form
6288B068988J0113K0785O7405J9036q7271j30240r7395n5554p078R0364K05831
6277B104984K55349K18213J40707M9104m9711j06019p3315j3029l7667j27101
6267B361515j25245K1983J52847J19060J1394j6M8462M413q6941m0252J00212
6256B567432Q4950p1882m1838K17976K59352j20853l85382l3899M89416L82637
6246C347909k29110m42541j930L40126J08708j61578N8262L65987J77680k46803
6236C316710k88626k177J20161N6743J37431K78634J37955j37711j04611J49648
6226C664157J49515p4075m2739K34226K31899j09226k31838M1718K08315K6195
6216D098147p9262J16850J90318q1663k08110J44691M83322K95972r4765j35240
$$ plain form
6206 4730260 4786228 4853885 4846718 4977032 5268116 5399769 5268737 5226270 5527706 5976748
6196 5976748 6316624 6537140 6607593 6393348 6081378 6188470 6820700 7375026 7339240 6981445
6186 6981445 6860062 7028056 7154229 7121874 7057515 6989386 6884508 6851482 6970247 7104105
6176 7104105 7165216 7325270 7669217 7929420 7904716 7836712 7974930 8083561 7859085 7560306
6166 7560306 7662001 8066550 8251403 8111336 8059698 8281537 8458125 8364257 8263861 8502439
6156 8502439 9020805 9450770 9508263 9226749 8948911 9049696 9515672 9931987 10068919 10226780
6146 10226780 10684275 11108599 11024181 10667768 10756286 11436523 12074421 12176261 11966625 11888497
6136 11888497 12018144 12202069 12388964 12588519 12766135 12941862 13190418 13483398 13738857
$$ packed form
6206D730260N5968O7657p167J30314K91084J31653j31032m2467L01436M49042
6196E976748L39876K20516P0453k14245l11970J07092O32230N54326l5786l57795
6186F981445j21383J67994J26173l2355o4359o8129j04878l3026J18765J33858
6176G104105O1111J60054L43947K60203k4704o8004J38218J08631k24476k98779
6166G560306J01695M04549J84853j40067n1638K21839J76588r3868j00396K38578
6156H502439N18366M29965N7493k81514k77838J00785M65976M16315J36932J57861
6146A0226780M57495M24324q4418l56413Q8518O80237O37898J01840k09636p8128
6136A1888497J29647J83925J86895J99555J77616J75727K48556K92980K55459
$$ plain form
6127 13738857 14000333 14322610 14581286 14708891 14967306 15575406 16226598 16478289 16474772 16695558
6117 16695558 17112653 17304035 17361981 17886851 18963297 19923468 20341804 20546829 20920441
6108 20920441 21408043 21973017 22809062 23820670 24609490 25233869 26214953 27554583 28649908
6099 28649908 29486536 30875443 33034692 35023547 36208733 37199937 38605058 40019217
6091 40019217 41142589 42683437 45023471 47183354 48458575 49923404 52744780 56134611
6083 56134611 58831893 61574329 65921522 71530746 77151250 83614908 92803887 104007051
6075 104007051 115000875 127162099 145023445 168333112 188140078 194528342 186655257
6068 186655257 172162344 158195774 146374849 135526643 125077677 114746124 103934998
$$ packed form
6127A3738857K61476L22277K58676J27605K58415O08100O51192K51691l517K20786
6117A6695558M17095J91382N7946N24870J076446R60171M18336K05025L73612
6108B0920441M87602N64974Q36045J011608P88820O24379R81084J339630J095325
6099B8649908Q36628J388907K159249J988855J185186R91204J405121J414159
6091D0019217J123372J540848K340034K159883J275221J464829K821376L389831
6083E6134611K697282K742436M347193N609224N620504O463658R188979J1203164
6075A04007051J0993824J2161224J7861346K3309667J9806966O388264p873085
6068A86655257j4492913j3966570j1820925j0848206j0448966j0331553j0811126
$$ plain form
6061 103934998 93072822 83870166 77140673 71740370 66494112 61788532 58340822 55657787
6053 55657787 52829737 49958329 47738598 46223082 44885061 43461726 42011233 40499029
6045 40499029 38910078 37442820 36148700 34743317 33127374 31641935 30448762 29173546
6037 29173546 27592776 26160330 25336352 24826927 24037175 22939264 21955478 21240290 20589742
6028 20589742 19895330 19248051 18685194 18144826 17581184 16954994 16289514 15823228 15784261 15913407
6018 15913407 15647409 14931365 14329521 14107734 13824951 13199662 12717569 12816572 13056806 12802957
6008 12802957 12263868 12070930 12169587 11972823 11415855 11005119 10878930 10642208 10192496 9932994
5998 9932994 9990629 9912837 9399924 8767078 8405337 8274725 8208449 8275290 8519391 8679681
$$ packed form
6061A03934998j0862176r202656o729493n400303n246258m705580l447710k683035
6053E5657787k828050k871408k219731j515516j338021j423335j450493j512204
6045D0499029j588951j467258j294120j405383j615943j485439j193173j275216
6037B9173546j580770j432446q23978n09425p89752j097911r83786p15188o50548
6028B0589742o94412o47279n62857n40368n63642o26190o65480m66286l8967J29146
6018A5913407k65998p16044o01844k21787k82783o25289m82093R9003K40234k53849
6008A2802957n39089j92938R8657j96764n56968m10736j26189k36722m49712k59502
5998I932994N7635p7792n12913o32846l61741j30612o6276O6841K44101J60290
$$ plain form
5988 8679681 8484630 8015794 7571801 7355935 7409055 7622419 7729825 7534636 7202206 7052285
5978 7052285 7048728 6865125 6499797 6360291 6578386 6720915 6458915 6088419 6016978 6103095
5968 6103095 5960937 5657079 5591198 5797236 5859782 5553257 5149116 4976253 5007186 5051773
5958 5051773 5112967 5310475 5560172 5576152 5241457 4820448 4670065 4798567 4880304 4728749
5948 4728749 4544465 4559920 4645222 4526491 4263387 4173412 4315781 4412737 4336602 4303697 4433561
5937 4433561 4460231 4134702 3664542 3463882 3613543 3832364 3894718 3837279 3782801 3751775
5927 3751775 3675958 3514713 3354241 3376773 3631330 3861352 3756285 3395450 3194804 3338865
5917 3338865 3546006 3532676 3407630 3385722 3394949 3268047 3101335 3083715 3130943 3045213 2922601
$$ packed form
5988H679681j95051m68836m43993k15866N3120K13364J07406j95189l32430j49921
5978G052285l557j83603l65328j39506K18095J42529k62000l70496p1441Q6117
5968F103095j42158l03858o5881K06038O2546l06525m04141j72863L0933M4587
5958E051773O1194J97508K49697J5980l34695m21009j50383J28502Q1737j51555
5948D728749j84284J5455Q5302j18731k63104q9975J42369R6956p6135l2905J29864
5937D433561K6670l25529m70160k00660J49661K18821O2354n7439n4478l1026
5927C751775p5817j61245j60472K2532K54557K30022j05067l60835k00646J44061
5917C338865K07141j3330j25046k1908R227j26902j66712j7620M7228q5730j22612
$$ plain form
5906 2922601 3019380 3258563 3261922 2925298 2618426 2689523 3030689 3275553 3238579 3020732
5896 3020732 2810668 2713347 2722676 2781000 2853372 2923654 2925490 2789779 2609591 2596535 2758470
5885 2758470 2805069 2559780 2279493 2297806 2501368 2498366 2228657 2033054 2109322 2269004
5875 2269004 2315785 2317704 2352059 2284416 2023335 1783335 1850785 2188429 2463643 2429208 2152337
5864 2152337 1890751 1821626 1890846 1911580 1806429 1685128 1643857 1619074 1556802 1570487 1731517
5853 1731517 1851300 1743017 1576037 1633535 1808753 1754429 1510017 1502688 1834971 2061578
5843 2061578 1879377 1581793 1530350 1583920 1441268 1227932 1287611 1579826 1724772 1563122
5833 1563122 1301983 1157295 1173397 1346570 1613789 1748796 1571666 1258846 1169095 1356757
$$ packed form
5906B922601R6779K39183L359l36624l06872P1097L41166K44864l6974k17847
5896C020732k10064r7321R329N8324P2372P0282J836j35711j80188j3056J61935
5885B758470M6599k45289k80287J8313K03562l002k69709j95603P6268J59682
5875B269004M6781J919L4355o7643k61081k40000O7450L37644K75214l4435k76871
5864B152337k61586o9125O9220K0734j05151j21301m1271k4783o2272J3685J61030
5853A731517J19783j08283j66980N7498J75218n4324k44412p329L32283K26607
5843B061578j82201k97584n1443N3570j42652k13336N9679K92215J44946j61650
5833A563122k61139j44688J6102J73173K67219J35007j77130l12820q9751J87662
$$ plain form
5823 1356757 1521968 1458453 1286828 1197802 1210022 1263808 1351622 1453750 1485595 1398275 1254936
5812 1254936 1173131 1234535 1404701 1481500 1245804 796511 585791 896580 1398141 1502371
5802 1502371 1107446 686256 641767 892595 1156285 1325771 1418463 1404094 1276186 1142903
5792 1142903 1091719 1072006 1018830 976401 994952 1014790 962282 880975 873492 966223 1089751
5781 1089751 1145333 1068462 891015 746034 735202 801805 823309 797868 816165 875046 869284
5770 869284 769860 671301 657039 738314 901679 1083788 1148905 1053547 969973 1052807 1164063
5759 1164063 1079481 891663 888223 1058510 1087742 878187 697736 719418 792023 799934 863634
5748 863634 1001783 985014 764853 667490 865730 1023435 825054 525297 542020 773105
$$ packed form
5823A356757J65211o3515j71625q9026J2220N3786Q7814J02128L1845q7320j43339
5812A254936q1805O1404J70166P6799k35696m49293k10720L10789N01561J04230
5802A502371l94925m21190m4489K50828K63690J69486R2692j4369j27908j33283
5792A142903n1184j9713n3176m2429J8551J9838n2508q1307p483R2731J23528
5781A089751N5582p6871j77447j44981j0832O6603K1504k5441J8297N8881n762
5770H69284r9424r8559j4262Q1275J63365J82109O5117r5358q3574Q2834J11256
5759A164063q4582j87818l440J70287K9232k09555j80451K1682P2605P911O3700
5748H63634J38149j6769k20161r7363J98240J57705j98381k99757J6723K31085
$$ plain form
5738 773105 801572 594943 495254 607656 693513 655824 667770 772900 777985 635445 563355
5727 563355 666611 759087 700044 640055 781629 1082919 1312415 1272980 945736 543644
5717 543644 382496 532787 687506 587921 438455 579586 880321 891290 562528 326698
5707 326698 414985 582362 640826 758735 1001922 1065824 802307 594792 790834 1083541
5697 1083541 929263 384391 53200 262920 686186 805441 472036 -19510 -222280 75023
5687 75023 601769 826606 565864 231924 296330 677266 911251 793430 554727 479191
5677 479191 622975 873432 1042922 942282 589098 300634 361911 654010 827598 770774
5667 770774 658630 608170 567462 526921 569318 692461 797065 838481 801946 607682 273002
$$ packed form
5738G73105K8467k06629r9689J12402Q5857l7689J1946J05130N085j42540p2090
5727E63355J03256R2476n9043n9989J41574L01290K29496l9435l27244m02092
5717E43644j61148J50291J54719r9585j49466J41131L00735J0969l28762k35830
5707C26698Q8287J67377N8464J17909K43187O3902k63517k07515J96042K92707
5697A083541j54278n44872l31191K09720M23266J19255l33405m91546k02770K97303
5687G5023N26746K24837k60742l33940O4406L80936K33985j17821k38703p5536
5677D79191J43784K50457J69490j00640l53184k88464O1277K92099J73588n6824
5667G70774j12144n0460m0708m0541M2397J23143J04604M1416l6535j94264l34680
$$ plain form
5656 273002 53967 129955 273141 203050 141114 508247 1107680 1220845 660974 123924
5646 123924 188216 519072 508008 240550 250270 601993 849775 802353 731897 780892 703975
5635 703975 378482 139586 332792 810920 1157348 1244119 1297443 1476252 1641557 1600417
5625 1600417 1406769 1281023 1280180 1204290 901440 545993 449525 638539 829818 856398 876766
5614 876766 1030398 1116911 867913 412918 188586 388792 739696 874452 751612 612022
5604 612022 630421 712388 630148 330558 65273 128661 465329 692805 588247 370320
5594 370320 344947 457636 452077 344714 406152 678944 847314 687573 383463 248765
5584 248765 337510 483609 564011 551278 420972 188198 -10288 -14336 181633 422741 544455
$$ packed form
5656B73002k19035P5988J43186p0091o1936L67133N99433J13165n59871n37050
5646A23924O4292L30856j1064k67458R720L51723K47782m7422p0456M8995p6917
5635G03975l25493k38896J93206M78128L46428Q6771N3324J78809J65305m1140
5625A600417j93648j25746q43p5890l02850l55447r6468J89014J91279K6580K0368
5614H76766J53632Q6513k48998m54995k24332K00206L50904J34756j22840j39590
5604F12022J8399Q1967q2240k99590k65285O3388L36668K27476j04558k17927
5594C70320k5373J12689n559j07363O1438K72792J68370j59741l04110j34698
5584B48765Q8745J46099Q0402j2733j30306k32774j98486m048J95969K41108J21714
$$ plain form
5573 544455 490100 336084 245616 324825 474576 477162 299299 191660 355669 607149 573402
5562 573402 214837 -72515 26782 312470 343044 49321 -182206 -65038 213289 322161
5552 322161 262355 246171 262720 129378 -60800 33626 417445 612327 332146 -56907
5542 -56907 -79400 158179 238028 150380 229574 487405 558407 333574 141410 196070 327994
5531 327994 398907 524643 694477 627020 277966 73661 298305 602685 503756 85489
5521 85489 -193680 -157375 24212 228975 429563 490697 323539 139989 183457 318802
5511 318802 267626 123450 197346 441631 507917 354599 300429 432511 461666 280534 179514
5500 179514 319193 432211 295903 113407 140600 259862 229430 99170 80095 193330
$$ packed form
5573E44455n4355j54016r0468P9209J49751K586j77863j07639J64009K51480l3747
5562E73402l58565k87352R9297K85688L0574k93723k31527J17168K78327J08872
5552C22161n9806j6184J6549j33342j90178R4426L83819J94882k80181l89053
5542e6907k2493K37579P9849q7648P9194K57831P1002k24833j92164N4660J31924
5531C27994P0913J25736J69834o7457l49054k04305K24644L04380r8929m18267
5521H5489k79169L6305J81587K04763K00588O1134j67158j83550M3468J35345
5511C18802n1176j44176P3896K44285O6286j53318n4170J32082K9155j81132j01020
5500A79514J39679J13018j36308j82496K7193J19262l0432j30260j9075J13235
$$ plain form
5490 193330 302796 328353 227952 -26202 -256347 -114766 429919 873559 753302 270425
5480 270425 18737 214429 510535 510154 182698 -205699 -361274 -191108 88378 150868
5470 150868 -24476 -110380 65771 247185 205454 163014 394873 677875 607309 281673
5460 281673 146458 252055 234425 33411 29044 327125 480208 186333 -206091 -221487
5450 -221487 78653 295080 275905 173023 119592 146750 271030 431316 479194 399689 355826
5439 355826 375338 260874 -5850 -95035 164162 429036 348446 129989 177141 407982
5429 407982 438615 280858 300952 535764 608255 371190 110461 1902 -123624 -306546
5419 -306546 -256938 111320 396967 293693 74241 125494 335042 356120 203902 123251
$$ packed form
5490A93330J09466K5557j00401k54154k30145J41581N44685M43640j20257m82877
5480B70425k51688J95692K96106l81l27456l88397j55575J70166K79486O2490
5470A50868j75344q5904J76151J81414m1731m2440K31859K83002p0566l25636
5460B81673j35215J05597j7630k01014m367K98081J53083k93875l92424j5396
5450b21487L00140K16427j9175j02882n3431K7158J24280J60286M7878p9505m3863
5439C55826J9512j14464k66724q9185K59197K64874q0590k18457M7152K30841
5429D07982L0633j57757K0094K34812P2491k37065k60729j08559j25526j82922
5419c06546M9608L68258K85647j03274k19452N1253K09548K1078j52218q0651
$$ plain form
5409 123251 78634 -104845 -225658 85360 632668 726725 158923 -422967 -403622 -11653
5399 -11653 149874 14476 -23983 115431 104099 -113877 -120929 282752 657237 541177 160611
5388 160611 86808 376217 541519 352915 165067 289262 479890 362545 69278 42878
5378 42878 349907 594611 504876 244086 76661 39632 62193 136553 218735 195672 112313
5367 112313 197841 473835 585227 297942 -54016 8447 371678 458664 95927 -212832
5357 -212832 -33461 385066 516772 277414 7189 -65530 8279 155510 350047 452368
5347 452368 316035 91506 115983 417975 620531 468218 181686 100422 202572 223100
5337 223100 89888 -23798 -917 105044 216854 287671 243311 69185 -75675 -31883
$$ packed form
5409A23251m4617j83479j20813L11018N47308R4057n67802n81890J9345L91969
5399a1653J61527j35398l8459J39414j1332k17976p052M03681L74485j16060l80566
5388A60611p3803K89409J65302j88604j87848J24195J90628j17345k93267k6400
5378D2878L07029K44704q9735k60790j67425l7029K2561P4360Q2182k3063q3359
5367A12313Q5528K75994J11392k87285l51958O2463L63231Q6986l62737l08759
5357b12832J79371M18527J31706k39358k70225p2719P3809J47231J94537J02321
5347D52368j36333k24529K4477L01992K02556j52313k86532q1264J02150K0528
5337B23100j33212j13686K2881J05961J11810P0817m4360j74126j44860M3792
$$ plain form
5327 -31883 100919 90107 -67584 -146286 -50177 85206 168773 244516 255358 41069 -305764
5316 -305764 -409007 -127045 195023 216268 50827 -37519 -83668 -207807 -233631 24550
5306 24550 290223 154512 -228330 -320350 -51650 84087 -135212 -321682 -182592 -9104
5296 -9104 -135258 -375683 -389783 -224382 -86634 86112 385196 552103 336406 16176
5286 16176 43776 321966 368580 113070 -40146 58892 100696 -49559 -82924 158516 323945
5275 323945 120582 -167460 -114984 185704 311687 163623 27034 71296 163797 180872
5265 180872 182193 212625 184919 67516 9892 145798 361742 392079 145812 -146347 -177482
5254 -177482 60800 252028 162153 -41632 -29010 213378 359220 205166 -69102 -176824
$$ packed form
5327c1883J32802j0812j57691p8702R6109J35383Q3567P5743J0842k14289l46833
5316c05764j03243K81962L22068K1245j65441q8346m6149j24139k5824K58181
5306B4550K65673j35711l82842r2020K68700J35737k19299j86470J39090J73488
5296i104j26154k40425j4100J65401J37748J72746K99084J66907k15697l20230
5286A6176K7600K78190M6614k55510j53216R9038M1804j50255l3365K41440J65429
5275C23945k03363k88042N2476L00688J25983j48064j36589M4262R2501J7075
5265A80872J321L0432k7706j17403n7624J35906K15944L0337k46267k92159l1135
5254a77482K38282J91228q9875k03785J2622K42388J45842j54054k74268j07722
$$ plain form
5244 -176824 -72585 73028 102729 -6922 -137288 -105354 115824 272833 134836 -113622
5234 -113622 -94191 143272 139063 -215403 -416687 -130407 231728 148997 -180428 -198590 95509
5223 95509 214204 35110 -66593 47337 44008 -232759 -436747 -278226 41134 203605
5213 203605 205612 171874 92919 -3302 53099 253678 304690 99860 -32302 140130 306664
5202 306664 88186 -318098 -416674 -155445 72956 76264 54973 159351 268160 269715 222870
5191 222870 161448 28723 -116675 -92344 121811 309389 308018 184582 65448 -21453 -83035
5180 -83035 -113630 -154389 -241880 -282870 -151111 90907 256351 312033 374785 434718 340862
5169 340862 103810 -46448 18644 177499 290905 337736 262047 -21538 -361141 -408379
$$ packed form
5244a76824J04239J45613K9701j09651j30366L1934K21178J57009j37997k48458
5234a13622J9431K37463m209l54466k01284K86280L62135q2731l29425j8162K94099
5223I5509J18695j79094j01703J13930l329k76767k03988J58521L19360J62471
5213B03605K007l3738p8955r6221N6401K00579N1012k04830j32162J72432J66534
5202C06664k18478m06284r8576K61229K28401L308k1291J04378J08809J555m6845
5191B22870o1422j32725j45398K4331K14155J87578j371j23436j19134q6901o1582
5180h3035l0595m0759q7491m0990J31759K42018J65444N5682O2752N9933r3856
5169C40862k37052j50258O5092J58855J13406M6831p5689k83585l39603m7238
$$ plain form
5159 -408379 -87478 252484 326028 264082 277382 282229 145668 16610 62583 113868 -39211
5148 -39211 -196665 -50352 201784 63238 -451423 -738384 -451990 33969 206433 53207
5138 53207 -127057 -215412 -264917 -240877 -81537 119263 235621 294615 340760 276996 66765
5127 66765 -73007 44605 238763 215969 55838 83393 299484 338658 57077 -227732
5117 -227732 -245435 -176190 -301253 -523045 -539510 -325326 -127469 -76522 -95754 -137236 -206735
5106 -206735 -174424 107977 446847 406065 -74435 -465043 -305338 155640 303327 1257
5096 1257 -294436 -257187 -123954 -236227 -459252 -371575 83498 450590 325891 -134761
5086 -134761 -407311 -221840 147209 246634 670 -232610 -168469 21731 -1602 -198182
$$ packed form
5159d08379L20901L39962P3544o1946J3300M847j36561j29058M5973N1285j53079
5148c9211j57454J46313K52136j38546n14661k86961K86394M85959J72464j53226
5138E3207j80264q8355m9505K4040J59340K00800J16358N8994M6145o3764k10231
5127F6765j39772J17612J94158k2794j60131K7555K16091L9174k81581k84809
5117b27732j7703O9245j25063k21792j6465K14184J97857N0947j9232m1482o9499
5106b06735L2311K82401L38870m0782m80500l90608J59705M60978J47687l02070
5096A257k95693L7249J33233j12273k23025Q7677M55073L67092j24699m60652
5086a34761k72550J85471L69049R9425k45964k33280O4141J90200k3333j96580
$$ plain form
5076 -198182 -181716 167351 448039 296766 -60020 -131545 105457 194515 -83675 -391079
5066 -391079 -382703 -225582 -284610 -524495 -575922 -302147 44781 236830 319470 367890 288254
5055 288254 33432 -204567 -232859 -138371 -109703 -102436 50914 263719 243471 -43193 -255512
5044 -255512 -155382 63679 111269 32537 45110 112995 10408 -251282 -393756 -299464 -165950
5033 -165950 -143850 -102360 88462 276109 237718 22685 -126473 -107262 -31195 -23907 -105330
5022 -105330 -228675 -314786 -282092 -131238 45526 184467 282409 282482 110095 -107420 -99836
5011 -99836 128031 214482 -7964 -189873 -19926 210169 66642 -251229 -204805 142268
5001 142268 185176 -177397 -316847 65424 381198 93061 -416205 -483350 -181862 -42467
$$ packed form
5076a98182J6466L49067K80688j51273l56786p1525K37002Q9058k78190l07404
5066c91079Q376J57121n9028k39885n1427K73775L46928J92049Q2640M8420p9636
5055B88254k54822k37999k8292R4488K8668P267J53350K12805k0248k86664k12319
5044b55512J00130K19061M7590p8732J2573O7885j02587k61690j42474R4292J33514
5033a65950K2100M1490J90822J87647l8391k15033j49158J9211P6067P288q1423
5022a05330j23345q6111L2694J50854J76764J38941R7942P3j72387k17515P584
5011i9836K27867Q6451k22446j81909J69947K30095j43527l17871M6424L47073
5001A42268M2908l62573j39450L82271L15774k88137n09266o7145L01488J39395
$$ plain form
4991 -42467 -116648 -44429 144043 44165 -331941 -476975 -209198 36291 -74415 -287486
4981 -287486 -241573 -8219 128022 110010 62683 34000 -8929 -87484 -225268 -381309 -353481
4970 -353481 -12358 367150 363700 40111 -104681 88855 201595 -24003 -220601 -24803
4960 -24803 285065 241542 -62436 -176826 -11362 145162 162726 153792 125796 -1506 -100504
4949 -100504 18886 213464 157743 -140732 -357235 -345158 -237315 -96239 134611 353738
4939 353738 381995 306361 340047 382905 183179 -103888 -73935 185741 139195 -284131 -481998
4928 -481998 -147938 205795 87863 -205522 -165798 97428 182479 137644 241862 356391
4918 356391 164577 -143994 -100400 237267 353102 116755 -72544 -20150 1244 -161482
$$ packed form
4991d2467p4181P2219J88472r9878l76106j45034K67777K45489j10706k13071
4981b87486M5913K33354J36241j8012m7327k8683m2929p8555j37784j56041K7828
4970c53481L41123L79508l450l23589j44792J93536J12740k25598j96598J95798
4960b4803L09868m3523l03978j14390J65464J56524J7564q934k7996j27302r8998
4949a00504J19390J94578n5721k98475k16503J2077J07843J41076K30850K19127
4939C53738K8257p5634L3686M2858j99726k87067K9953K59676m6546m23326j97867
4928d81998L34060L53733j17932k93385L9724K63226Q5051m4835J04218J14529
4918C56391j91814l08571M3594L37667J15835k36347j89299N2394K1394j62726
$$ plain form
4908 -161482 -264528 -156552 -34430 -5496 122868 371107 364120 -98649 -620558 -704997
4898 -704997 -407733 -175215 -237062 -435839 -503472 -297392 86883 306421 85301 -360754
4888 -360754 -509746 -260303 -78997 -220496 -279265 100154 514208 362317 -180822 -396736
4878 -396736 -98466 170274 33642 -222843 -220973 -47801 17641 -21185 37491 235522 397399
4867 397399 336124 33248 -293925 -333449 -43711 209344 111450 -129820 -111287 100569
4857 100569 111438 -48973 68302 462868 493338 -120859 -722000 -632433 -147041 532
4847 532 -218296 -229420 105309 308809 147328 -31436 29460 87871 -83462 -270313 -215028
4836 -215028 -57932 -55177 -150157 -149025 -96687 -157038 -275358 -261153 -112576 1542 23945
$$ packed form
4908a61482j03046J07976J22122K8934J28364K48239o987m62769n21909q4439
4898g04997K97264K32518o1847j98777o7633K06080L84275K19538k21120m46055
4888c60754j48992K49443J81306j41499n8769L79419M14054j51891n43139k15914
4878c96736K98270K68740j36632k56485J870J73172O5442l8826N8676J98031J61877
4867C97399o1275l02876l27173l9524K89738K53055r7894k41270J8533K11856
4857A00569J0869j60411J17275L94566L0470o14197o01141Q9567M85392J47573
4847E32k18828j1124L34729K03500j61481j78764O0896N8411j71333j86851N5285
4836b15028J57096K755r4980J132N2338o0351j18320J4205J48577J14118K2403
$$ plain form
4825 23945 54676 154190 275179 350515 316726 128433 -114909 -169055 49099 260445 151619
4814 151619 -163120 -262611 905 299665 287472 45973 -71943 77551 269698 217202
4804 217202 -79414 -347796 -382217 -278901 -261736 -338184 -296006 -61347 147756 142074 43819
4793 43819 62309 149279 125871 38022 84421 231773 222093 306 -169206 -105685 45088
4782 45088 98848 104045 153760 157237 14106 -157881 -190362 -124531 -90669 -52360 93510 251160
4770 251160 211838 -24001 -228357 -244964 -130855 -20442 -16317 -174693 -413330 -479119 -224674
4759 -224674 108811 124766 -206733 -504151 -480053 -240435 -30687 45557 -37471 -291597
4749 -291597 -561438 -557584 -233381 79448 100655 -37218 -59888 34491 90983 131446 254944
$$ packed form
4825B3945L0731R9514J20989P5336l3789j88293k43342n4146K18154K11346j08826
4814A51619l14739r9491K63516K98760j2193k41499j17916J49494J92147n2496
4804B17202k96616k68382l4421J03316J7165p6448M2178K34659K09103n682r8255
4793D3819J8490Q6970k3408q7849M6399J47352r680k21787j69512O3521J50773
4782D5088N3760N197M9715L477j43131j71987l2481O5831L3862L8309J45870J57650
4770B51160l9322k35839k04356j6607J14109J10413M125j58376k38637o5789K54445
4759b24674L33485J5955l31499k97418K4098K39618K09748P6244q3028k54126
4749b91597k69841L854L24203L12829K1207j37873k2670R4379N6492M0463J23498
$$ plain form
4738 254944 342238 207164 -23927 -25584 246514 500946 538828 431173 257078 -6116
4728 -6116 -270766 -335688 -197715 -92670 -140196 -220861 -264105 -328970 -326866 -69539 267421
4717 267421 197268 -307707 -586102 -215614 293530 259281 -128769 -208277 6010 -95051
4707 -95051 -555284 -667472 -135657 390987 324016 -13422 -39306 153671 123330 -77478
4697 -77478 -50865 181672 213589 -31861 -205982 -163221 -161674 -348830 -495247 -383606 -115880
4686 -115880 101658 198859 169986 25700 -101543 -55533 76189 47708 -140644 -201423 4177
4675 4177 267266 350565 236300 -12069 -328972 -499478 -273513 229630 555452 505496
4665 505496 356680 332743 264757 25799 -127049 -10727 71513 -173514 -452347 -330757
$$ packed form
4738B54944Q7294j35074k31091j657K72098K54432L7882j07655j74095k63194
4728f116k64650o4922J37973J05045m7526q0665m3244o4865K104K57327L36960
4717B67421p0153n04975k78395L70488N09144l4249l88050p9508K14287j01061
4707i5051m60233j12188N31815N26644o6971l37438k5884J92977l0341k00808
4697g7478K6613K32537L1917k45450j74121M2761J547j87156j46417J11641K67726
4686a15880K17538R7201k8873j44286j27243M6010J31722k8481j88352o0779K05600
4675D177K63089Q3299j14265k48369l16903j70506K25965N03143L25822m9956
4665E05496j48816k3937o7986k38958j52848J16322Q2240k45027k78833J21590
$$ plain form
4655 -330757 5937 36372 -217375 -244395 59473 215197 -17759 -261586 -177341 31541
4645 31541 52486 -44636 -54906 -13206 -28741 -59873 -108199 -302343 -528319 -363284 269223
4634 269223 751181 534120 -46313 -244535 20528 161830 -86515 -313150 -174992 64903
4624 64903 13571 -246890 -359205 -242668 -127317 -160536 -237741 -189674 25954 301836 455808
4613 455808 366308 102774 -122071 -176974 -134004 -127410 -163487 -140039 -18360 99286 92464
4602 92464 -2093 -11352 119585 182954 -10842 -259840 -173213 189397 261452 -203719 -627981
4591 -627981 -369445 291140 517776 153260 -109340 117143 312124 -41949 -562692 -550694
4581 -550694 -75361 173600 -44356 -236239 187 409483 526904 308962 68006 11943
$$ packed form
4655c30757L36694L0435k53747k7020L03868J55724k32956k43827Q4245K08882
4645C1541K0945r7122j0270M1700j5535l1132m8326j94144k25976J65035O32507
4634B69223M81958k17061n80433j98222K65063J41302k48345k26635J38158K39895
4624F4903n1332k60461j12315J16537J15351l3219p7205M8067K15628K75882J53972
4613D55808q9500k63534k24845n4903M2970O594l6077K3448J21679J17646o822
4602I2464r4557r259J30937O3369j93796k48998Q6627L62610P2055m65171m24262
4591f27981K58536O60585K26636l64516k62600K26483J94981l54073n20743J1998
4581e50694M75333K48961k17956j91883K36426M09296J17421k17942k40956n6063
$$ plain form
4571 11943 88065 166039 178248 110461 -13996 -122054 -123540 6251 169188 198999 31374
4560 31374 -190290 -268543 -211361 -209090 -334100 -440787 -427041 -382278 -353874 -202576 105892
4549 105892 288876 114017 -185393 -191746 106360 355299 399828 407886 424681 235790 -185016
4538 -185016 -472981 -353643 -50096 46534 -87809 -164103 -33251 169448 266845 207854
4528 207854 13977 -258392 -481017 -511382 -339275 -122100 -41531 -126816 -218852 -133122 119707
4517 119707 331740 365250 323792 349875 377820 282219 164570 213724 326939 200173 -168159
4506 -168159 -404543 -299823 -97945 -85382 -193341 -210734 -120807 587 170298 338578
4496 338578 291605 -10034 -225455 -77127 202292 203470 -57375 -234581 -201882 -109916 -8772
$$ packed form
4571A1943P6122P7974J2209o7787j24457j08058j486J29791J62937K9811j67625
4560C1374k21664p8253N7182K271j25010j06687J3746M4763K8404J51298L08468
4549A05892J82984j74859k99410o353K98106K48939M4529Q058J6795j88891m20806
4538a85016k87965J19338L03547R6630j34343p6294J30852K02699R7397n8991
4528B07854j93877k72369k22625l0365J72107K17175Q0569q5285r2036Q5730K52829
4517A19707K12033L3510m1458K6083K7945r5601j17649M9154J13215j26766l68332
4506a68159k36384J04720K01878J2563j07959j7393Q9927J21394J69711J68280
4496C38578m6973l01639k15421J48328K79419J178k60845j77206L2699R1966J01144
$$ plain form
4485 -8772 155939 224757 -46647 -514525 -722481 -514461 -187301 24168 190987 317017
4475 317017 185494 -198138 -414420 -178098 231413 382758 264216 132167 30826 -174746
4465 -174746 -435484 -539730 -435987 -260904 -106864 3823 4741 -103402 -122216 85662
4455 85662 292347 180651 -124244 -173154 121082 314111 101600 -207833 -169192 127457
4445 127457 234775 57119 -31256 202418 500540 534032 368215 262242 219694 62918
4435 62918 -152933 -169351 18320 101752 -26676 -62944 178927 358317 85717 -419560
4425 -419560 -578647 -256285 119817 224494 181464 173406 129971 -21087 -131333 -65287 98189
4414 98189 256283 419840 524980 399169 83508 -109850 -55247 -19799 -191724 -336188
$$ packed form
4485h772J64711O8818k71404m67878k07956K08020L27160K11469J66819J26030
4475C17017j31523l83632k16282K36322M09511J51345j18542j32049j01341k05572
4465a74746k60738j04246J03743J75083J54040J10687R18j08143j8814K07878
4455H5662K06685j11696l04895m8910K94236J93029k12511l09433L8641K96649
4445A27457J07318j77656q8375K33674K98122L3492j65817j05973m2548j56776
4435F2918k15851j6418J87671Q3432j28428l6268K41871J79390k72600n05277
4425d19560j59087L22362L76102J04677m3030q058m3435j51058j10246O6046J63476
4414I8189J58094J63557J05140j25811l15661j93358N4603L5448j71925j44464
$$ plain form
4404 -336188 -209477 4725 21103 -72863 -54037 -10379 -116239 -192500 17668 302249 236110
$$ packed form
4404c36188J26711K14202J6378r3966J8826M3658j05860p6261K10168K84581o6139
$$ [...]
##END NTUPLES=NMR SPECTRUM
##END=
