##TITLE=1H ikalashn
CG-1212-x4
19.9.2024
##JCAMPDX= 6.0         $$ Bruker NMR JCAMP-DX V2.0
##DATA TYPE= NMR SPECTRUM
##DATA CLASS= NTUPLES
##ORIGIN= UXNMR, Bruker Analytische Messtechnik GmbH
##OWNER= root
$$ TOPSPIN		Version 1.3
$$ 2024-09-19 10:59:15.765 +0400  Irina@DPX200
$$ Compression mode = diff/dup
##.OBSERVE FREQUENCY= 200.131392401
##.OBSERVE NUCLEUS= ^1H
##.ACQUISITION MODE= SIMULTANEOUS
##.ACQUISITION SCHEME= undefined
##.AVERAGES= 16
##.DIGITISER RES= 18
##SPECTROMETER/DATA SYSTEM= spect
##.PULSE SEQUENCE= zg
##.SOLVENT NAME= CDCl3
##.SHIFT REFERENCE= INTERNAL, CDCl3, 1, 17.95386
##AUDIT TRAIL= $$ (NUMBER, WHEN, WHO, WHERE, WHAT)
$$ ##TITLE= Audit trail, TOPSPIN		Version 1.3
$$ ##JCAMPDX= 5.01
$$ ##ORIGIN= Bruker BioSpin GmbH
$$ ##OWNER= Irina
$$ $$ F:/spectra/data/iren/nmr/1H/4/pdata/1/auditp.txt
$$ ##AUDIT TRAIL=  $$ (NUMBER, WHEN, WHO, WHERE, VERSION, WHAT)
(   1,<2024-09-19 10:58:53.968 +0400>,<Irina>,<DPX200>,<TOPSPIN 1.3>,
      <created by zg
	started at 2024-09-19 10:57:45.937 +0400,
	POWCHK disabled, PULCHK disabled
       configuration hash MD5:
       BE 6D 3F 07 2A EA 11 49 91 17 2B D3 AF B3 58 0D
       data hash MD5: 16K
       8B A6 FF 51 26 40 BC 5F 81 C2 C1 EC 86 0F F2 A9>)
(   2,<2024-09-19 10:58:57.578 +0400>,<Irina>,<DPX200>,<TOPSPIN 1.3>,
      <Start of raw data processing
       efp BC_mod = 2 LB = 0.02 FT_mod = 6 PKNL = 1 PHC0 = 107.5554 PHC1 = 0.06138802 SI = 32K 
       data hash MD5: 32K
       56 68 52 36 31 51 AC 2B D6 98 71 70 4D 65 7F 3F>)
(   3,<2024-09-19 10:58:59.609 +0400>,<Irina>,<DPX200>,<TOPSPIN 1.3>,
      <apk 
       data hash MD5: 32K
       5C 75 6B C4 4C A1 63 23 84 D4 5B 8A F1 3A CA CF>)
(   4,<2024-09-19 10:59:06.328 +0400>,<Irina>,<DPX200>,<TOPSPIN 1.3>,
      <abs n ABSG = 5 
       data hash MD5: 32K
       BA 68 2C 97 5C 4B F0 B4 AB 2A BA 82 92 F3 8A 42>)
$$ ##END=
$$ 
$$ $$ hash MD5
$$ $$ 9D 1F E9 6A 84 3F 54 B3 BD EF E5 CF 58 47 80 29
##$RELAX= 
##$RELAX= 
##$RELAX= 
##$RELAX= 
##$RELAX= 
##$RELAX= 
##$RELAX= 
##$RELAX= 
##$RELAX= 
$$ Bruker specific parameters
$$ --------------------------
##$DU= <F:/spectra>
##$EXPNO= 4
##$NAME= <1H>
##$PROCNO= 1
##$TYPE= <nmr>
##$USER= <iren>
##$AMP= (0..31)
100 100 100 100 100 100 100 100 100 100 100 100 100 100 100 100 100 100 
100 100 100 100 100 100 100 100 100 100 100 100 100 100 
##$ANAVPT= -1
##$AQSEQ= 0
##$AQ_mod= 1
##$AUNM= <au_zg>
##$AUTOPOS= <>
##$BF1= 200.13
##$BF2= 200.13
##$BF3= 200.13
##$BF4= 200.13
##$BF5= 200.13
##$BF6= 200.13
##$BF7= 200.13
##$BF8= 200.13
##$BYTORDA= 1
##$CFDGTYP= 0
##$CFRGTYP= 5
##$CHEMSTR= <none>
##$CNST= (0..63)
1 1 145 1 1 1 1 1 1 1 1 1 1 1 1 1 1 1 1 1 1 1 1 1 1 1 1 1 1 1 1 1 1 1 
1 1 1 1 1 1 1 1 1 1 1 1 1 1 1 1 1 1 1 1 1 1 1 1 1 1 1 1 1 1 
##$CPDPRG= <>
##$CPDPRG1= <>
##$CPDPRG2= <>
##$CPDPRG3= <>
##$CPDPRG4= <mlev>
##$CPDPRG5= <mlev>
##$CPDPRG6= <mlev>
##$CPDPRG7= <mlev>
##$CPDPRG8= <mlev>
##$CPDPRGB= <>
##$CPDPRGT= <>
##$D= (0..63)
0 2 0 0 0 0 0 0 0 0.06 0 0.03 0 0 0 0 0.0002 0 0 0 0 0 0 0 0 0 0 0 0 0 
$$ [...]
##$SW_h= 4401.40845070422
##$TD= 16384
##$TD0= 1
##$TE= 300
##$TE2= 300
##$TE3= 300
##$TEG= 300
##$TL= (0..7)
0 120 120 120 120 120 120 120 
##$TP= (0..7)
150 150 150 150 150 150 150 150 
##$TP07= 0
##$TPNAME0= <>
##$TPNAME1= <>
##$TPNAME2= <>
##$TPNAME3= <>
##$TPNAME4= <>
##$TPNAME5= <>
##$TPNAME6= <>
##$TPNAME7= <>
##$TPOAL= (0..7)
0.5 0.5 0.5 0.5 0.5 0.5 0.5 0.5 
##$TPOFFS= (0..7)
0 0 0 0 0 0 0 0 
##$TUNHIN= 0
##$TUNHOUT= 0
##$TUNXOUT= 0
##$USERA1= <user>
##$USERA2= <user>
##$USERA3= <user>
##$USERA4= <user>
##$USERA5= <user>
##$V9= 5
##$VALIST= <valist>
##$VCLIST= <CCCCCCCCCCCCCCC>
##$VD= 0
##$VDLIST= <DDDDDDDDDDDDDDD>
##$VPLIST= <PPPPPPPPPPPPPPP>
##$VTLIST= <TTTTTTTTTTTTTTT>
##$WBST= 1024
##$WBSW= 25
##$XGAIN= (0..3)
0 0 0 0 
##$XL= 0
##$YL= 0
##$YMAX_a= 1066164
##$YMIN_a= -1463832
##$ZGOPTNS= <>
##$ZL1= 120
##$ZL2= 120
##$ZL3= 120
##$ZL4= 120
##$ABSF1= 17.95386
##$ABSF2= -4.038887
##$ABSG= 5
##$ABSL= 3
##$ALPHA= 0
##$AQORDER= 0
##$ASSFAC= 0
##$ASSFACI= 0
##$ASSFACX= 0
##$ASSWID= 0
##$AUNMP= <proc_1d>
##$AXLEFT= 0
##$AXRIGHT= 0
##$AXTYPE= 0
##$AXUNIT= <>
##$AZFE= 0.1
##$AZFW= 0.1
##$BCFW= 0
##$BC_mod= 2
##$BYTORDP= 0
##$COROFFS= 0
##$CY= 7568.61572265625
##$DATMOD= 1
##$DC= 0
##$DFILT= <>
##$DTYPP= 0
##$F1P= 17.9538593292236
##$F2P= -4.03888763876832
##$FCOR= 0.5
##$FTSIZE= 32768
##$FT_mod= 6
##$GAMMA= 0
##$GB= 0
##$INTBC= 0
##$INTSCL= 1.483618e-010
##$ISEN= 128
##$LB= 0.02
##$LEV0= 0
##$LPBIN= 0
##$MAXI= 945.577
##$MC2= 0
##$MEAN= 0
##$ME_mod= 0
##$MI= -402.1523
##$NCOEF= 0
##$NC_proc= -5
##$NLEV= 6
##$NOISF1= 8.587773
##$NOISF2= 6.764455
##$NSP= 0
##$NTH_PI= 0
##$NZP= 0
##$OFFSET= 17.95386
##$PC= 1
##$PHC0= 307.1758
##$PHC1= 3.520618
##$PH_mod= 1
##$PKNL= yes
##$PPARMOD= 0
##$PPDIAG= 0
##$PPIPTYP= 0
##$PPMPNUM= 100
##$PPRESOL= 1
##$PSCAL= 0
##$PSIGN= 0
##$REVERSE= no
##$SF= 200.13
##$SI= 32768
##$SIGF1= 16.12182
##$SIGF2= -4.496377
##$SINO= 3.521527
##$SIOLD= 32768
##$SREGLST= <1H.CDCl3>
##$SSB= 0
##$STSI= 32768
##$STSR= 0
##$SW_p= 4401.40845070423
##$SYMM= 0
##$S_DEV= 0
##$TDeff= 16384
##$TDoff= 0
##$TI= <>
##$TILT= no
##$TM1= 0
##$TM2= 0
##$TOPLEV= 0
##$USERP1= <user>
##$USERP2= <user>
##$USERP3= <user>
##$USERP4= <user>
##$USERP5= <user>
##$WDW= 1
##$XDIM= 32768
##$YMAX_p= 363232485
##$YMIN_p= -579801
$$ End of Bruker specific parameters
$$ ---------------------------------
##NTUPLES= NMR SPECTRUM
##VAR_NAME=  FREQUENCY,     SPECTRUM/REAL,   SPECTRUM/IMAG
##SYMBOL=    X,             R,               I
##VAR_TYPE=  INDEPENDENT,   DEPENDENT,       DEPENDENT
##VAR_FORM=  AFFN,          ASDF,            ASDF
##VAR_DIM=   32768,         32768,           32768
##UNITS=     HZ,            ARBITRARY UNITS, ARBITRARY UNITS
##FACTOR=    0.134324425510551, 1,           1
##FIRST=     4401.40845070423, 14630,        -1674393
##LAST=      0,             -7845,           -1885626
##MIN=       0,             -579801,         0
##MAX=       4401.40845070423, 363232485,    0
$$ Real data points
##PAGE= N=1
##DATA TABLE= (X++(R..R)), XYDATA
$$ [...]
12133 77077447 76628667 76100622 75491570 74741510 73849754 72883814 71884591 70850543 69810743
12124 69810743 68823105 67891320 66964656 66031433 65139547 64320230 63569722 62909414 62377900
12115 62377900 61956514 61596460 61333118 61271240 61431286 61718057 62083604 62612240 63377777
12106 63377777 64307531 65264036 66192375 67117754 68056161 68984058 69833856 70467258 70723662
12097 70723662 70552751 70033042 69216146 68048249 66509996 64724672 62827359 60820454
12089 60820454 58675077 56492754 54429705 52517178 50693980 48974528 47442535 46101654
12081 46101654 44872918 43736119 42746225 41908174 41156161 40464198 39866172 39362842 38918865
12072 38918865 38552929 38318392 38195537 38120217 38113687 38250745 38500534 38754047 39028765 39477498
12062 39477498 40144923 40881224 41569184 42273660 43066048 43850220 44486296 44960952 45300124
12053 45300124 45419881 45212560 44707818 44012600 43150487 42083784 40836792 39476626 38027466
12044 38027466 36519643 35059135 33721102 32438645 31134073 29891173 28834454 27898842
12036 27898842 26915935 25900522 25037451 24373689 23742801 23046345 22395683 21880281 21392006
12027 21392006 20815527 20233221 19779649 19410118 18985007 18506730 18101979 17806267 17523572
12018 17523572 17193253 16860666 16568600 16292433 16009852 15746655 15524019 15324769 15131379
12009 15131379 14944925 14758956 14565885 14389850 14259253 14148432 14004449 13830530 13679724
12000 13679724 13562911 13433411 13277972 13150718 13083633 13025396 12914989 12770443 12654724 12584040
11990 12584040 12520225 12438753 12357114 12294229 12237892 12166801 12087147 12030769 12017346 12028190 12026068
11979 12026068 11996153 11951635 11901708 11843992 11797153 11798827 11841595 11853355 11790072 11711465 11699580
11968 11699580 11732635 11725729 11681594 11692667 11777189 11830335 11792730 11759540 11834252 11960944 12014076
11957 12014076 11995373 12013778 12099009 12170598 12196411 12248345 12362342 12461624 12483389 12485477 12547281
11946 12547281 12639403 12683355 12690517 12743793 12860907 12965189 12998293 12996559 13042043 13178670 13378573
11935 13378573 13558890 13644297 13650024 13683641 13821376 14009690 14146987 14233047 14355121 14539467
11925 14539467 14716579 14849027 14993270 15192813 15400872 15571813 15753159 16007359 16297500
11916 16297500 16539123 16733844 16964665 17271227 17610276 17941820 18281157 18648631 19026616
11907 19026616 19391050 19745094 20099839 20449594 20780904 21085948 21361193 21608691 21834445
11898 21834445 22031260 22182265 22304253 22457939 22676060 22910495 23101690 23272085 23485456
11889 23485456 23737810 23971928 24191580 24466478 24811063 25154045 25459236 25784314 26173472
11880 26173472 26580027 26958480 27354494 27826390 28342036 28838356 29331018 29874769 30455633
11871 30455633 31018811 31577793 32198274 32885771 33583584 34278164 35010054 35772768 36498969
11862 36498969 37172275 37862864 38614880 39377423 40090011 40765435 41442213 42123445 42815931
11853 42815931 43564384 44381536 45200192 45969621 46756677 47670749 48718744 49819615 50942420
11844 50942420 52132036 53392150 54642878 55834235 57020970 58263769 59511209 60650514
11836 60650514 61647193 62565233 63457158 64300081 65051811 65711566 66295149 66793282 67194828
11827 67194828 67524215 67813253 68053099 68220977 68347286 68503560 68715807 68941913 69156487
11818 69156487 69407972 69755396 70191132 70674026 71206499 71823871 72530323 73307598 74177976
11809 74177976 75196937 76383326 77715564 79199158 80872512 82733813 84732076 86859398
11801 86859398 89188287 91777605 94594834 97573477 100696340 103971813 107369802 110831907
11793 110831907 114305787 117713586 120918350 123778509 126211923 128161934 129543534 130290387
11785 130290387 130422654 129997775 129029681 127546173 125699621 123707563 121675581 119583037
11777 119583037 117460058 115461286 113715056 112207087 110889721 109818026 109081674 108663710
11769 108663710 108472047 108478407 108725460 109209371 109851928 110596839 111448509 112392873 113351708
11760 113351708 114250928 115085154 115885454 116666672 117438680 118236613 119108402 120093542 121235750
11751 121235750 122593836 124213059 126085980 128131542 130180332 131987224 133325713 134116714
11743 134116714 134436749 134365308 133855532 132798490 131186223 129150541 126848453 124373317
11735 124373317 121792564 119210578 116747383 114478638 112431358 110626135 109098013 107886530
11727 107886530 107025736 106529780 106364737 106448592 106705888 107106934 107615536 108108128 108396992
11718 108396992 108349008 107943488 107201369 106110733 104661349 102910786 100956542 98856291
11710 98856291 96629114 94330808 92069991 89933468 87939750 86085678 84396690 82897888
11702 82897888 81561956 80320685 79119166 77939413 76785248 75664132 74569818 73461468
11694 73461468 72271859 70959945 69552478 68120717 66723524 65380954 64083867 62810263
11686 62810263 61549017 60331967 59231303 58300554 57524033 56842855 56218970 55650336 55134976
11677 55134976 54651480 54174271 53681683 53144161 52522528 51783963 50915523 49930181 48863451
11668 48863451 47744005 46559422 45282035 43943261 42634640 41397886 40165309 38872791
11660 38872791 37587878 36435343 35417102 34412953 33368550 32372433 31508681 30736171
11652 30736171 29977361 29239057 28563350 27927337 27285189 26663525 26119625 25633320 25132406
11643 25132406 24607371 24108827 23639429 23144902 22622283 22145188 21754513 21401895 21033879
11634 21033879 20662298 20313842 19973658 19624476 19290742 18997905 18728021 18456150 18193425
11625 18193425 17956118 17729126 17498828 17285094 17098847 16904392 16672818 16442006 16267935
11616 16267935 16134948 15970386 15743249 15499658 15296259 15136113 14979962 14798140 14603601
11607 14603601 14439277 14326283 14227914 14091470 13924243 13781804 13672284 13537393 13358929
11598 13358929 13209337 13137392 13074034 12936568 12769477 12676452 12649805 12586822 12461545 12353298
11588 12353298 12293983 12216132 12090463 11993018 11972729 11957404 11870039 11752673 11688339 11668601 11627929
11577 11627929 11556542 11491994 11440908 11391419 11364322 11369511 11349420 11253758 11137711 11091349 11097110
11566 11097110 11060018 10965555 10896977 10890262 10881066 10821292 10749812 10708921 10675112 10616858 10550721
11555 10550721 10499162 10456401 10430621 10451112 10495390 10483218 10393402 10315953 10327568 10380088 10383658
11544 10383658 10344792 10339969 10391807 10456798 10513306 10579098 10648743 10688293 10697397 10716481 10764236
11533 10764236 10816074 10849450 10868715 10883019 10897026 10923052 10970233 11028119 11089638 11172636 11284023
11522 11284023 11387968 11456581 11528706 11662578 11847478 12021313 12160815 12290705 12416200 12517886
11512 12517886 12608630 12721139 12838380 12914273 12968623 13075470 13240875 13383663 13469842 13575345
11502 13575345 13764855 13988320 14158017 14260901 14333555 14390216 14443217 14536195 14682441 14818249
11492 14818249 14889934 14939637 15027928 15120397 15143641 15116599 15124199 15181854 15232301 15272415 15376294
11481 15376294 15575506 15809307 16018072 16205062 16382871 16540522 16694457 16895949 17151473
11472 17151473 17402643 17617168 17831046 18068843 18298825 18509068 18748167 19034719 19305202
11463 19305202 19523978 19772832 20139241 20567874 20923230 21169476 21391383 21656310 21954983
11454 21954983 22273425 22617605 22943523 23154793 23215224 23203893 23221253 23288885 23369317 23430023
11444 23430023 23448298 23397855 23278388 23133593 23000819 22856720 22638600 22305908 21864722 21352400
11434 21352400 20816660 20291827 19780534 19273702 18791029 18373277 18030214 17734426 17478308
11425 17478308 17294066 17198010 17160611 17157476 17199244 17272689 17305134 17245752 17143080 17076838 17044749
11414 17044749 16992223 16932292 16946000 17061397 17222386 17401072 17653586 18014881 18406726 18714958
11404 18714958 18916030 19067331 19203375 19299666 19316183 19218961 18976488 18597453 18166889 17783101
11394 17783101 17451907 17098620 16695190 16316945 16049160 15891884 15796276 15751393 15781128 15874313
11384 15874313 15968330 16004692 15972637 15901195 15832680 15799144 15801120 15810389 15805354 15787508 15746195 15638124
11372 15638124 15443434 15220760 15050996 14931528 14784162 14570713 14333888 14104885 13844338
11363 13844338 13520315 13181051 12885624 12610842 12303529 11991813 11756095 11601062 11446946
11354 11446946 11255611 11076916 10945450 10816569 10648667 10475286 10340097 10221997 10086807
11345 10086807 9960016 9878693 9815260 9724331 9628518 9574324 9531185 9429413 9285966 9189377
11335 9189377 9152411 9086755 8954843 8842043 8820002 8827777 8766628 8643861 8532179 8433171 8280790
11324 8280790 8062672 7843356 7660045 7476072 7260515 7047941 6882586 6747454 6589559
11315 6589559 6395709 6211402 6086897 6020112 5958338 5857443 5732299 5631129 5563942 5492348
11305 5492348 5398866 5316117 5258157 5178972 5052582 4942537 4914830 4919316 4852065 4717802 4625237
11294 4625237 4616537 4611169 4547747 4474657 4447933 4435352 4391604 4346942 4340086 4331402 4273524 4214583
11282 4214583 4231952 4297920 4311444 4246556 4174457 4144023 4131181 4110820 4092018 4068120 4011866
11271 4011866 3939886 3908189 3920945 3915427 3864754 3823868 3835748 3858279 3833206 3774656 3736800
11260 3736800 3733919 3743332 3756798 3780172 3801762 3801939 3781861 3755208 3727341 3702886 3691884 3689799
11248 3689799 3676772 3652308 3639244 3638765 3621969 3585343 3567367 3582791 3590830 3563377 3531770 3522468
11236 3522468 3502502 3446415 3404203 3429507 3481576 3480430 3431708 3411814 3444573 3477152 3473249 3449411
11224 3449411 3419232 3381180 3364595 3405174 3465684 3465894 3407497 3382104 3430596 3485154 3487745 3474117
11212 3474117 3487005 3493491 3458734 3425979 3441369 3460644 3419149 3346852 3321431 3342099 3344673 3318693
11200 3318693 3311926 3326530 3307157 3241301 3186092 3178503 3193141 3204389 3217662 3222926 3192535 3146129
11188 3146129 3140660 3170956 3164147 3107420 3086907 3142020 3176825 3103700 2993576 2971060 3019267
11177 3019267 3019732 2954403 2922600 2953496 2951131 2869692 2805902 2839354 2896853 2876939 2816646 2814492
11165 2814492 2856007 2851182 2804203 2798648 2824257 2774294 2643560 2576976 2652517 2748661 2727046
11154 2727046 2639001 2626571 2695063 2725127 2673428 2619783 2617177 2624338 2609839 2609093 2637580 2643561
11142 2643561 2597639 2551018 2551832 2569686 2557097 2528900 2525390 2543436 2556677 2563785 2568763 2552470
11130 2552470 2510334 2479282 2479989 2471662 2414413 2339308 2304528 2317002 2348001 2387025 2424106 2421136
11118 2421136 2367867 2328680 2359844 2414436 2410876 2365240 2360853 2404447 2416758 2368633 2324858 2333619
11106 2333619 2364161 2381272 2398229 2424456 2436438 2432404 2446164 2480961 2502983 2521833 2588145
11095 2588145 2678907 2687596 2586369 2499164 2531830 2614544 2612308 2526089 2470813 2490533 2510165
11084 2510165 2466958 2395201 2364301 2395045 2449375 2466740 2419517 2359825 2377043 2473814 2539797
11073 2539797 2504494 2449780 2485466 2575357 2601477 2557632 2542742 2576381 2567990 2490074 2441353
11062 2441353 2487222 2558785 2575609 2563818 2578087 2599225 2594156 2600313 2658042 2718454 2713039 2672206
11050 2672206 2681533 2747975 2799201 2802066 2797696 2819161 2849386 2872654 2906445 2961334 3011574 3026195
11038 3026195 3007377 2989596 3011001 3077067 3144035 3162623 3151485 3188834 3305091 3429043 3482071
11027 3482071 3482220 3502114 3564516 3643508 3733151 3839092 3927641 3966527 4001876 4107093 4260043
11016 4260043 4365046 4406157 4479943 4647357 4848531 5012108 5163435 5362189 5606326 5871658
11006 5871658 6185713 6574795 6975915 7291911 7519616 7741024 7987264 8186760 8263061 8221320
10996 8221320 8115074 7978169 7817342 7633482 7421627 7177437 6927375 6726502 6599765
10987 6599765 6505585 6386056 6240156 6118725 6055374 6034970 6032018 6044797 6073948 6097201 6098092
10976 6098092 6102860 6148161 6218027 6263338 6293448 6387264 6575481 6769643 6875219 6935449 7076646
10965 7076646 7328749 7599960 7836213 8096413 8430843 8792766 9141931 9542173 10059882
10956 10059882 10640672 11204130 11809418 12594385 13573517 14630533 15699608 16793520 17821812
10947 17821812 18552842 18853872 18843798 18698331 18411682 17882404 17144611 16347005 15544624
10938 15544624 14684542 13796575 13023943 12419726 11867738 11282277 10753011 10388916 10130189
10929 10130189 9846306 9544313 9332003 9211429 9063430 8844959 8659899 8591017 8581236 8546646
10919 8546646 8508059 8525311 8574152 8586888 8574729 8614754 8732264 8881431 9037933 9229559
10909 9229559 9466773 9719056 9980693 10292892 10674671 11096519 11557164 12122992 12842042
10900 12842042 13674032 14565897 15546325 16658989 17817270 18808515 19458369 19741084 19730992
10891 19730992 19511949 19146070 18659373 18019707 17179778 16181362 15173913 14287390 13522268
10882 13522268 12807268 12126336 11528292 11033580 10599929 10184460 9787904 9428258 9113083
10873 9113083 8847533 8632126 8442127 8242668 8033330 7846044 7693315 7554806 7421970
10864 7421970 7313878 7235061 7161330 7087921 7047418 7051651 7059111 7037513 7020053 7054983 7132218
10853 7132218 7210608 7291269 7407051 7557861 7718816 7905674 8167469 8505582 8855988 9166009
10843 9166009 9440010 9694467 9914750 10073766 10150276 10115358 9952049 9709777 9484433 9309547
10833 9309547 9115189 8835340 8511781 8243677 8071819 7965656 7892012 7834052 7761412 7647255
10823 7647255 7514157 7409761 7334999 7243061 7110036 6959152 6811017 6657883 6498936 6358558
10813 6358558 6251650 6160458 6057209 5926389 5766251 5599728 5478343 5433066 5421559 5370395
10803 5370395 5271879 5186552 5143130 5099872 5028732 4973103 4977913 5012765 5016990 4987166 4969699 4990670
10791 4990670 5038617 5097499 5154566 5191355 5204370 5219393 5253788 5288599 5314680 5376386 5516845
10780 5516845 5699636 5844143 5932553 6024724 6164576 6327199 6471704 6597832 6727907 6866689
10770 6866689 6998987 7103664 7159526 7160701 7132549 7108303 7086454 7036727 6949197 6847939 6753280
10759 6753280 6661872 6569454 6482117 6397142 6300801 6192177 6084046 5979386 5876218 5792664
10749 5792664 5748419 5720044 5659720 5568383 5505154 5506955 5539928 5550165 5524117 5478756 5430625
10738 5430625 5397365 5393607 5403329 5392079 5364776 5368593 5418090 5469017 5496085 5540022 5633596 5735813
10726 5735813 5797697 5847557 5943715 6077528 6195095 6290879 6405797 6546157 6677330 6794133
10716 6794133 6930518 7098670 7277671 7457137 7628954 7744893 7759314 7715366 7706767 7742753
10706 7742753 7736889 7650694 7554464 7505077 7457495 7362263 7268825 7246898 7264552 7237350 7162039
10695 7162039 7110682 7112240 7125948 7124038 7119945 7113619 7086028 7058036 7082512 7159056 7221443 7233946
10683 7233946 7240698 7289710 7362024 7413894 7446433 7493865 7573339 7679248 7800547 7917235 8008875
10672 8008875 8090227 8203317 8348832 8470715 8547301 8648700 8844380 9092573 9295292 9438686
10662 9438686 9593565 9784655 9958021 10100609 10292411 10579604 10872866 11055106 11144676 11262146
10652 11262146 11454747 11645336 11764464 11849943 11979114 12161782 12348335 12509810 12662799
10643 12662799 12827495 12997280 13152054 13286407 13425174 13610093 13853916 14108405 14308803
10634 14308803 14459742 14640259 14901030 15193130 15435649 15626500 15839580 16124767 16457641
10625 16457641 16788727 17101982 17416235 17759765 18152137 18587345 19030941 19456653 19885262
10616 19885262 20359922 20883972 21418074 21946233 22507574 23142211 23832870 24526501 25201942
10607 25201942 25896240 26665416 27525077 28428248 29308632 30153629 31016923 31938229 32875668
10598 32875668 33760258 34599933 35468002 36385489 37280115 38082157 38798008 39455333 40035571
10589 40035571 40509876 40892588 41200849 41398720 41445396 41375988 41272633 41167796 41030995 40840540
10579 40840540 40614706 40379167 40154756 39970849 39841887 39741277 39651142 39622235 39717794 39908235
10569 39908235 40102811 40292246 40573224 41005782 41530865 42072609 42646544 43310114 44070504
10560 44070504 44906539 45829222 46850989 47937236 49058816 50254171 51561268 52918524
10552 52918524 54219952 55449344 56663309 57841845 58857559 59618451 60147856 60478515
10544 60478515 60551789 60290523 59716419 58925285 57981309 56898064 55693820 54399199 53027012
10535 53027012 51596533 50176271 48840392 47587311 46363223 45164592 44047931 43029877
10527 43029877 42058069 41114803 40273184 39590781 39005740 38414056 37815700 37305220 36932905
10518 36932905 36654330 36418410 36228130 36096449 36013397 35988886 36065627 36244314 36442086 36571728
10508 36571728 36627658 36652845 36658340 36623692 36541658 36402689 36158538 35766058 35258068 34709431
10498 34709431 34134281 33476629 32707958 31874330 31030508 30180469 29306099 28410909 27511210
10489 27511210 26619546 25755713 24939673 24159055 23382482 22619216 21920089 21299647 20708260
10480 20708260 20111221 19542626 19036343 18551786 18031020 17501445 17052040 16707837 16384867
10471 16384867 15988498 15524218 15089414 14763694 14520064 14256331 13919890 13574778 13309291
10462 13309291 13103564 12859379 12556217 12283915 12093947 11920728 11709430 11519550 11407836
10453 11407836 11297968 11092528 10850971 10710132 10661655 10565828 10382222 10223270 10151677 10087252
10443 10087252 9973743 9882919 9862394 9819916 9678895 9533617 9507306 9541128 9482538 9332998
10433 9332998 9242467 9268692 9300589 9245780 9154459 9105125 9082421 9038800 8991956 8983833 8998502
10422 8998502 8991267 8964157 8953744 8968752 8989004 9006419 9023578 9028062 9009695 8992942 9014777 9075749
10410 9075749 9144846 9207358 9274351 9345241 9397342 9424911 9458570 9523945 9601946 9658840 9703941
10399 9703941 9780576 9897351 10010284 10094108 10191037 10348968 10543076 10714022 10864469 11052333
10389 11052333 11296852 11566159 11859196 12211261 12601501 12958108 13296065 13737810 14328863
10380 14328863 14950662 15519081 16153544 17007614 18036591 19115705 20302822 21756588 23456089
10371 23456089 25294566 27438044 30183916 33273832 35708632 36624651 36203180 35364562
10363 35364562 34649621 33779434 32317373 30335976 28233689 26211047 24232987 22351029
10355 22351029 20747008 19468656 18361043 17311287 16392100 15692732 15137081 14567824 13941091
10346 13941091 13345446 12857543 12459117 12096480 11754901 11445537 11160150 10879900 10611922
10337 10611922 10376416 10162802 9943024 9731811 9578839 9481042 9366197 9207339 9086883
10328 9086883 9072893 9089265 9014382 8874630 8811403 8858186 8891860 8839404 8787793 8813788 8840241
10317 8840241 8777903 8700895 8731364 8817688 8794375 8643051 8532206 8576414 8698436 8777139 8808158
10306 8808158 8848486 8903683 8959057 9052437 9220354 9409096 9526560 9569315 9625844 9755299
10296 9755299 9926766 10088699 10240349 10404594 10569201 10697883 10787709 10876358 10986219 11095233
10286 11095233 11182653 11271618 11389060 11510180 11601850 11708693 11917630 12228015 12550782 12871823
10276 12871823 13306889 13913422 14546901 15024909 15366586 15736189 16200474 16692595 17184261
10267 17184261 17724824 18313027 18901890 19546991 20379570 21415083 22575178 23913317 25585015
10258 25585015 27570161 29750230 32359399 35903575 40257413 44179570 46289365 46461524
10250 46461524 45771162 45070009 44150034 42437270 39941953 37140673 34299616 31396283
10242 31396283 28546983 26058380 24048469 22341699 20782117 19403583 18249674 17245868
10234 17245868 16318777 15476546 14713628 13973726 13253142 12618352 12084445 11588755 11108795
10225 11108795 10688099 10321084 9934924 9516961 9139574 8824123 8502146 8150764 7840464
10216 7840464 7600089 7364376 7115700 6941103 6865137 6761016 6540151 6310977 6213657 6193179
10206 6193179 6092369 5905384 5770758 5737147 5699641 5582689 5442219 5344405 5260651 5142058
10196 5142058 5010744 4912725 4838967 4752948 4659169 4592339 4557366 4520095 4455130 4382047 4348130
10185 4348130 4371347 4400931 4358441 4233382 4105481 4040842 4003736 3923873 3818042 3767961 3785843
10174 3785843 3785308 3704460 3586464 3506329 3476743 3463954 3446439 3414231 3350961 3264495 3205356
10163 3205356 3205303 3218810 3178225 3097148 3060961 3102444 3138791 3069528 2909182 2775029 2743829
10152 2743829 2766609 2748626 2675332 2610595 2587858 2568573 2521982 2481442 2480306 2482914 2438338 2370183
10140 2370183 2345822 2369715 2373829 2316196 2229416 2161582 2122583 2102812 2095260 2081759 2042875 1999227
10128 1999227 1997767 2037160 2053770 2008938 1946218 1927808 1951055 1965757 1945661 1904632 1861730
10117 1861730 1824740 1796020 1769239 1731720 1686512 1654969 1644292 1635824 1618951 1608007 1609903 1607314
10105 1607314 1592414 1582092 1579557 1561319 1526379 1510937 1521567 1507163 1444009 1394353 1416439
10094 1416439 1464640 1458982 1416382 1417165 1460998 1464536 1409193 1381288 1429343 1480327 1456333 1393194
10082 1393194 1369138 1377189 1354386 1300969 1280942 1313069 1340410 1318265 1269346 1234211 1219031
10071 1219031 1215420 1228602 1256121 1268603 1242110 1192964 1158337 1155398 1174619 1195279 1190853 1141308
10059 1141308 1065921 1025377 1057898 1123566 1147596 1113761 1075183 1071434 1082147 1077782 1067531 1065392
10047 1065392 1051990 1015328 995449 1032026 1088569 1092060 1040542 1004898 1018529 1034769 1014992
10036 1014992 990668 998442 1012039 991922 959307 961530 991759 1002288 982367 967477 977225 993184
10024 993184 997810 992410 975648 943976 916452 923002 962815 1003975 1024877 1026698 1008916 968870
10012 968870 927123 916346 937526 958937 964588 970727 985077 983604 946446 893441 863937 872298
10000 872298 895303 898386 871884 844258 850923 884536 895986 859596 812619 805212 836323 870593
9988 870593 891922 900021 881412 836199 811625 847558 902676 901962 849982 822231 841762 848009
9976 848009 809518 784739 827587 900015 932359 921840 917006 937641 959528 959610 939561 916269
9964 916269 907666 912226 899083 847977 795600 795582 832814 837728 792730 753799 749468 738049 697317
9951 697317 675180 703606 736791 728858 703603 692989 679681 659257 678084 737679 747869 665610
9939 665610 594907 635860 711384 680462 565936 514811 562112 597064 564176 536927 561901
9928 561901 577809 542030 510553 529484 555544 548886 547451 581381 601874 567724 526309 534371
9916 534371 563262 556287 524978 516048 527350 525118 510104 506550 514106 520300 532070 553306 562631
9903 562631 548987 532902 521808 490847 441673 425389 463707 502433 493832 471805 488108 523745
9891 523745 527410 500367 478499 464629 441546 423344 435110 465611 488003 498089 492331 452965
9879 452965 399745 398551 460402 496159 445826 386352 415606 488767 486975 408436 362866 393488
9867 393488 434523 446867 466929 500066 488448 424412 388443 427216 486624 511644 523465 548182
9855 548182 556198 531114 520332 553750 581686 558729 525734 540459 583486 602277 596625 589239
9843 589239 562018 501202 462423 501447 569221 569639 508261 487143 545469 599429 572153 505407
9831 505407 490959 541539 586361 572571 523837 500198 530085 588432 626888 617908 572941 525104
9819 525104 502449 516779 561474 608906 624325 600784 572701 576043 599914 599089 556726 513424
9807 513424 520449 574734 619072 611519 578863 581310 628763 664476 647506 616791 633432 682065
9795 682065 688447 635641 597971 633068 697272 715064 690540 689135 730444 766729 769930 774816
9783 774816 809594 836737 810151 760980 768190 846317 918990 925129 901722 917636 962339 966843
9771 966843 924001 910117 966689 1033738 1044922 1026740 1042106 1085732 1111000 1124737 1168902 1227670
9759 1227670 1246031 1238888 1284719 1392731 1470182 1458642 1418496 1427858 1471007 1489058 1482200 1490440
9747 1490440 1509778 1494981 1429008 1340618 1266898 1233065 1248476 1290112 1311311 1293379 1263625
9736 1263625 1243376 1217011 1177610 1157305 1175467 1196955 1179630 1127428 1065941 1009358 981593
9725 981593 1014007 1081289 1098436 1030747 948365 920264 921377 907209 904381 942573 967978 927067
9713 927067 875150 887504 918109 878843 814966 847399 958241 999642 928993 868429 889341
9702 889341 902900 839554 784708 826759 893659 871285 795953 789722 857795 889611 842871 798578
9690 798578 822127 877428 910230 930621 966091 993515 973556 920750 886729 884114 875455 846154
9678 846154 841709 896998 961784 957619 901009 893601 968637 1031757 1008684 967954 1005259 1073376
9666 1073376 1052218 953766 915631 985883 1052725 1023937 951884 924893 942628 965599 994796
9655 994796 1028948 1021383 954300 891872 892230 926203 943847 957121 991496 1018902 1009260 992522
9643 992522 1001855 1010468 990753 977843 1005585 1039216 1043176 1051883 1094306 1115746 1067118 1008581
9631 1008581 1019708 1062073 1046768 994362 1001844 1076169 1128064 1123345 1117333 1132647 1120548 1066940
9619 1066940 1034080 1063034 1114250 1132797 1108245 1056567 1005985 1004535 1073941 1154951 1167946 1125022
9607 1125022 1107909 1140389 1167350 1163047 1171464 1222441 1284064 1315515 1304339 1249714 1175089 1147437
9595 1147437 1205546 1281371 1280379 1224253 1211265 1250396 1259931 1230196 1244851 1314632 1337174 1276151
9583 1276151 1241327 1313016 1409052 1418997 1369661 1358224 1399868 1438327 1448849 1446606 1439992 1441463
9571 1441463 1476962 1534062 1557856 1538805 1531494 1548416 1531095 1477460 1484193 1585981 1668862 1643621
9559 1643621 1593152 1624736 1681218 1650226 1577513 1597843 1702193 1752632 1713107 1691773 1741110
9548 1741110 1779066 1749001 1715680 1743635 1795343 1813486 1810635 1815466 1809229 1777425 1760113 1791407
9536 1791407 1839288 1858264 1860004 1882817 1924103 1948771 1943323 1925172 1913462 1919253 1953464 2019323
9524 2019323 2096979 2149353 2152756 2128206 2134893 2207996 2300894 2326010 2268126 2214072 2241958 2326175
9512 2326175 2392796 2424312 2453276 2485831 2496477 2484675 2481983 2508548 2558538 2612691 2637613 2606689
9500 2606689 2555390 2568889 2667366 2754766 2742788 2676903 2667408 2739055 2828229 2890699 2926750 2930758
9488 2930758 2904269 2896214 2946715 3015105 3045041 3067542 3146059 3253320 3311240 3328900 3383010
9477 3383010 3472763 3516493 3495568 3480893 3501222 3500904 3454344 3416396 3427028 3456665 3470344 3461449
9465 3461449 3411245 3309295 3222319 3237401 3321615 3347355 3278056 3216218 3238476 3297023 3323657
9454 3323657 3323981 3324683 3326418 3349007 3427479 3529093 3572658 3559111 3577394 3654241 3715592 3729002
9442 3729002 3757380 3829580 3888289 3916127 3979607 4090848 4163191 4170319 4210178 4337220 4473471
9431 4473471 4567196 4689175 4872063 5004834 5007383 4973037 5009888 5069171 5063537 5030127 5034952
9420 5034952 5034875 4982197 4951171 5006561 5059889 5020471 4977823 5054286 5180503 5214957 5197181 5267880
9408 5267880 5403986 5458834 5430348 5466208 5609184 5747237 5829031 5932506 6089803 6224849
9398 6224849 6311377 6436893 6652722 6881812 7023440 7058082 7027091 6992514 7020786 7128207
9388 7128207 7254336 7353269 7461401 7600241 7699044 7725321 7794528 8003137 8243204 8352713
9378 8352713 8368313 8442686 8588782 8713753 8837894 9047461 9277139 9386609 9431295 9605873
9368 9605873 9920669 10185961 10330987 10482732 10695985 10864689 10962372 11125168 11414075 11712971
9358 11712971 11942862 12174928 12458331 12731720 12972395 13243244 13536888 13765948 13950935
9349 13950935 14213339 14544742 14801450 14965609 15179459 15481849 15758444 15996301 16322416
9340 16322416 16734727 17071108 17310470 17621010 18041673 18415773 18716246 19117126 19650719
9331 19650719 20126294 20492436 20933426 21493808 21977952 22352349 22852925 23537385 24144121
9322 24144121 24575830 25091053 25809746 26484234 26999717 27624474 28485521 29291371 29893130
9313 29893130 30608318 31628619 32637927 33423125 34311311 35544877 36799271 37836538 39033997
9304 39033997 40674022 42331113 43633354 44994783 46846678 48815955 50512991 52413025
9296 52413025 54967921 57605250 59772897 62183921 65658326 69589516 73237851 77618449
9288 77618449 83926567 91000462 97343750 105144474 118117678 134286085 145221021 145378162
9280 145378162 139076902 134659716 134020165 132106890 125476183 116462498 108436915 101379746
9272 101379746 94046386 87266693 82560635 79402583 76186352 72770513 70137608 68335440
9264 68335440 66497109 64422342 62647114 61224003 59688488 58053565 56761377 55770450
9256 55770450 54617558 53277150 52130150 51179825 50067413 48789863 47690499 46793389
9248 46793389 45808609 44755716 43953086 43402937 42772310 41987769 41303821 40769083 40144499
9239 40144499 39385022 38717510 38190315 37589870 36857264 36174727 35584997 34910725 34106032
9230 34106032 33330949 32631554 31882803 31081465 30368509 29736733 29036726 28286297 27650267
9221 27650267 27106911 26472691 25772365 25231708 24864247 24417524 23793641 23183948 22707344
9212 22707344 22243113 21716647 21235548 20833240 20373098 19821290 19336146 18974636 18582066
9203 18582066 18087162 17636326 17310555 16973157 16535788 16124158 15833458 15557189 15210040
9194 15210040 14892994 14678173 14445052 14097734 13747459 13510564 13307283 13027879 12727161
9185 12727161 12487775 12252772 11962009 11702659 11553216 11416384 11177017 10900605 10708057
9176 10708057 10569100 10386952 10185938 10048889 9950040 9803782 9614333 9446475 9310375 9184536
9166 9184536 9081360 8993112 8855807 8657773 8490226 8402699 8316457 8171802 8037138 7966871
9156 7966871 7882774 7720768 7567636 7512441 7480106 7361258 7201109 7107702 7069082 7011117 6942386
9145 6942386 6890612 6791505 6602422 6436671 6414596 6460085 6417120 6294048 6212042 6177762 6099596
9134 6099596 5982973 5916663 5893547 5830139 5743432 5724903 5750698 5702557 5580011 5509820 5526274
9123 5526274 5517587 5425281 5333819 5312973 5314986 5283948 5243489 5220360 5186557 5127442 5077683 5050688
9111 5050688 5013081 4956276 4915828 4901041 4879545 4840788 4801705 4751173 4666443 4576813 4530122
9100 4530122 4509479 4465761 4409234 4378386 4350446 4287051 4232061 4243108 4261264 4188368 4068590
9089 4068590 4038060 4102379 4126820 4057034 3985208 3971057 3959226 3915837 3891841 3897721 3861035 3768303
9077 3768303 3712468 3736531 3759241 3719121 3666789 3650175 3631613 3585863 3561306 3577371 3577520 3545777
9065 3545777 3547671 3593635 3594777 3526259 3494883 3557384 3611806 3572225 3514228 3526983 3550081 3496145
9053 3496145 3424613 3442687 3519165 3546116 3520593 3523725 3568451 3596482 3588340 3568046 3539876 3511990
9041 3511990 3525924 3575996 3575968 3500232 3463486 3544050 3630611 3590196 3492777 3493975 3568950 3560589
9029 3560589 3452351 3389444 3431529 3475340 3445501 3390826 3356090 3313103 3261851 3260559 3308916
9018 3308916 3325454 3283046 3250428 3261956 3262598 3222057 3190228 3196857 3203874 3197730 3221887 3277864
9006 3277864 3303276 3289662 3308473 3372687 3391404 3322946 3257517 3275333 3331017 3357352 3376778
8995 3376778 3418222 3424338 3350844 3276233 3296381 3372112 3396859 3367226 3368462 3420555 3454595 3434901
8983 3434901 3404658 3404805 3427781 3457561 3489431 3508887 3508005 3514543 3547792 3563287 3511189 3435633
8971 3435633 3433523 3512643 3575946 3565188 3536207 3554363 3593030 3596438 3584457 3615946 3676238 3684750
8959 3684750 3619504 3561117 3582756 3651144 3682824 3662447 3647852 3672726 3706627 3719872 3730928
8948 3730928 3763106 3799551 3816148 3824844 3847085 3870956 3872034 3856812 3853647 3880568 3946021 4049213
8936 4049213 4151083 4187242 4149808 4112319 4128503 4160540 4165868 4188201 4273190 4353806 4338096
8925 4338096 4273649 4291305 4398897 4471399 4454166 4431528 4462801 4494716 4492291 4519923 4614302
8914 4614302 4696695 4702396 4693742 4747572 4822620 4843245 4835758 4870477 4931147 4955288 4959432 5014945
8902 5014945 5126279 5227558 5280380 5298551 5303214 5323518 5404998 5543925 5653134 5668825 5649410
8891 5649410 5690566 5789449 5879387 5950463 6036395 6121634 6165611 6189439 6239627 6297993 6327376
8880 6327376 6366221 6464256 6567219 6600299 6631441 6791674 7041562 7191130 7180394 7171527 7303158
8869 7303158 7506318 7647136 7719940 7798117 7897509 7995391 8109610 8257903 8390144 8446130
8859 8446130 8442553 8438440 8455476 8486575 8536161 8598480 8641739 8660773 8695872 8757624 8794262 8782049
8847 8782049 8781201 8843096 8927640 8980159 9026870 9116394 9222575 9291679 9342766 9433554 9558871
8836 9558871 9667706 9755254 9856044 9968265 10067611 10177125 10335486 10505524 10606139 10642364
8826 10642364 10717405 10892484 11107903 11275248 11389209 11509595 11673507 11865542 12056983 12244911
8816 12244911 12451060 12688420 12935733 13162700 13380704 13632003 13914043 14164199 14355676
8807 14355676 14557022 14838594 15162514 15438086 15656222 15886104 16155024 16423231 16680897
8798 16680897 16976094 17320007 17647647 17915315 18169290 18467903 18791463 19088043 19367716
8789 19367716 19685314 20047085 20396289 20696011 20979316 21299351 21658618 22011725 22328210
8780 22328210 22629448 22954809 23305769 23646354 23960361 24280370 24641113 25025640 25387700
8771 25387700 25717551 26053962 26431684 26846118 27275569 27712104 28155648 28594326 29012906
8762 29012906 29424424 29877202 30405840 30970639 31482063 31920020 32394705 33021199 33748560
8753 33748560 34409128 34957748 35553427 36339579 37244780 38106771 38916700 39802448 40807905
8744 40807905 41842564 42858724 43932966 45125841 46384775 47653334 48972591 50389523
8736 50389523 51844901 53247823 54610873 56018963 57491762 58958562 60354988 61672280
8728 61672280 62915676 64077664 65157276 66156773 67055316 67825665 68475145 69030950 69490762
8719 69490762 69834450 70084054 70297667 70487201 70592454 70569633 70467526 70371531 70294495 70175585
8709 70175585 69983613 69761916 69545709 69287423 68917415 68448549 67951843 67434111 66815244
8700 66815244 66045756 65172241 64246682 63242959 62125634 60938244 59738455 58489436 57113229
8691 57113229 55630189 54145475 52702368 51248876 49757875 48279714 46851206 45446824
8683 45446824 44055652 42720925 41462809 40241136 39035290 37882584 36796963 35734321
8675 35734321 34685328 33711129 32827851 31952700 31042936 30192256 29488020 28857492 28176987
8666 28176987 27467598 26847219 26330769 25819644 25272262 24746644 24270814 23802891 23339072
8657 23339072 22937262 22600090 22248208 21852514 21486107 21191683 20899045 20546408 20198538
8648 20198538 19955848 19800587 19620516 19358786 19068117 18826730 18656235 18522800 18383042
8639 18383042 18223837 18068160 17935556 17804341 17643632 17475720 17354107 17272249 17156438 16975613
8629 16975613 16798319 16699127 16658153 16602413 16509060 16416134 16356108 16325716 16305788 16274234 16214994
8618 16214994 16143435 16102626 16106800 16113114 16079377 16023075 15988976 15982966 15974136 15940185 15875290 15777187
8606 15777187 15666977 15600168 15612084 15664586 15687817 15662293 15619727 15580026 15539948 15516848 15544160
8595 15544160 15611586 15660743 15662802 15660250 15703243 15775508 15819286 15818756 15821913 15875770 15966630 16040345
8583 16040345 16068637 16075281 16098481 16150009 16221580 16309670 16411616 16511675 16597482 16680018 16770577
8572 16770577 16853464 16918242 17000364 17133984 17274674 17343857 17360077 17439824 17629121 17818249
8562 17818249 17891306 17892550 17956919 18120922 18300385 18434426 18550571 18682231 18814568 18938842
8552 18938842 19085732 19268855 19452379 19610435 19771853 19970542 20191213 20401378 20606069
8543 20606069 20832675 21081827 21329397 21568758 21822587 22112045 22431643 22761386 23100742
8534 23100742 23481579 23929776 24411438 24849946 25220900 25597496 26060690 26593681 27122770
8525 27122770 27640286 28210004 28852068 29507284 30138143 30785145 31482451 32189771 32863488
8516 32863488 33535955 34258733 35010364 35725915 36383615 36997532 37556549 38043426 38491558
8507 38491558 38944340 39368703 39688043 39899006 40073186 40235480 40331642 40344861 40352481 40410922
8497 40410922 40461655 40428183 40351094 40336985 40400867 40450320 40425812 40377048 40382582 40458129 40570827
8486 40570827 40694465 40821246 40954703 41114736 41320660 41555438 41780948 41999069 42252507
8477 42252507 42548442 42836088 43091800 43370017 43720615 44105837 44462828 44809398 45212794
8468 45212794 45677798 46146240 46598999 47079104 47610369 48168056 48738964 49337964 49956016
8459 49956016 50571315 51225634 51997038 52865264 53702116 54450152 55218787 56130034 57153768
8450 57153768 58188962 59237016 60380397 61631506 62920609 64220595 65579944 67033263
8442 67033263 68569386 70186080 71888330 73634726 75379107 77170408 79113488 81213572
8434 81213572 83354859 85458634 87565684 89723094 91884967 93985784 96035463 98072241
8426 98072241 100073514 101972729 103722176 105290268 106640380 107761783 108686261 109435500
8418 109435500 109990031 110340656 110520628 110551592 110413577 110112013 109718134 109292374 108821035
8409 108821035 108281672 107715735 107176119 106656772 106141845 105672959 105291319 104959092 104622398
8400 104622398 104314940 104108861 103988984 103867425 103707200 103542248 103386135 103212744 103024455
8391 103024455 102845256 102636180 102307961 101839767 101305036 100752499 100133837 99378467 98472901
8382 98472901 97433049 96259084 94956383 93553696 92066678 90481396 88795894 87037308
8374 87037308 85221140 83339816 81409259 79477256 77564121 75643035 73701305 71773261
8366 71773261 69889993 68045479 66236718 64487632 62806883 61172421 59585289 58084778
8358 58084778 56677336 55306896 53937488 52610355 51368626 50178046 48986721 47822008
8350 47822008 46752653 45776100 44819925 43854914 42937831 42122240 41377780 40629979 39854178
8341 39854178 39098764 38418974 37810253 37222933 36637041 36093165 35629441 35216188 34795639
8332 34795639 34370794 33999656 33702374 33434146 33161251 32902596 32674900 32458270 32246616
8323 32246616 32073235 31949381 31834007 31705847 31608649 31577228 31575768 31565005 31572790 31629943 31689845
8312 31689845 31695611 31689047 31763039 31926615 32102362 32243674 32369041 32486603 32573282 32637154 32718667
8301 32718667 32811405 32852557 32812331 32728615 32633697 32510074 32341377 32144880 31925417 31654889
8291 31654889 31329081 30990323 30657880 30287037 29841299 29363068 28922048 28520099 28097070
8282 28097070 27621416 27135063 26704358 26347330 26014500 25637918 25201805 24758955 24367895
8273 24367895 24029909 23710310 23399501 23110916 22832752 22535281 22225024 21938472 21679564
8264 21679564 21420157 21167568 20964828 20807382 20631642 20417406 20229076 20108179 19993621
8255 19993621 19813343 19599158 19433738 19323674 19209236 19076785 18971664 18899834 18802776 18653054
8245 18653054 18504522 18411664 18352794 18276500 18185610 18124501 18100388 18066350 17987305 17886593 17809796
8234 17809796 17764807 17722576 17668336 17622059 17599814 17582529 17546285 17504725 17489898 17501335 17509810
8223 17509810 17506906 17509295 17511506 17483698 17432264 17411844 17446345 17484320 17475680 17452078 17473999 17526567
8211 17526567 17538835 17501260 17490516 17556040 17643529 17672704 17649319 17647337 17698550 17755347 17769012
8200 17769012 17757497 17769920 17816228 17868305 17912145 17954550 17981919 17963700 17913289 17897322 17951081
8189 17951081 18023564 18048150 18033758 18035540 18065418 18095064 18127233 18190794 18271724 18326415 18367903
8178 18367903 18458068 18599520 18721075 18799198 18904923 19084045 19278053 19430083 19591428 19839336
8168 19839336 20149643 20441771 20702963 20969582 21217104 21375032 21445078 21507463 21599353 21670568
8158 21670568 21678270 21653018 21646241 21671112 21720205 21794239 21892001 22008797 22156200 22348541 22567420
8147 22567420 22777433 22974389 23176191 23374117 23545635 23711588 23921080 24173978 24416323
8138 24416323 24623008 24828783 25063725 25314084 25567046 25842730 26156127 26487880 26815644
8129 26815644 27143211 27485785 27854809 28258049 28682103 29085233 29450620 29829467 30273293
8120 30273293 30742193 31155491 31519166 31908577 32324790 32679451 32949168 33231399 33592963
8111 33592963 33964475 34256593 34494921 34757919 35050969 35328618 35588564 35859711 36137258
8102 36137258 36405492 36690211 37020458 37372493 37711964 38049043 38390788 38692848 38933551
8093 38933551 39180400 39491136 39797033 39992402 40107928 40276400 40534901 40779550 40931727
8084 40931727 41041261 41190215 41382802 41575128 41750188 41923131 42114930 42343243 42603383
8075 42603383 42856476 43081358 43328264 43660253 44051929 44422563 44766202 45159597 45631468
8066 45631468 46123086 46608139 47149178 47778676 48415644 48981258 49532619 50192440 50982734
8057 50982734 51812461 52614385 53418210 54283558 55220197 56196114 57194087 58239923 59376664
8048 59376664 60610436 61890251 63164577 64454927 65837413 67346056 68937742 70566612
8040 70566612 72243579 73995019 75811257 77677490 79617749 81660814 83788129 85959805
8032 85959805 88170698 90435530 92735071 95025574 97295919 99569482 101844027 104068029
8024 104068029 106191046 108212783 110166805 112069754 113902225 115638162 117281807 118864525
8016 118864525 120405144 121891847 123317523 124714040 126122646 127541398 128936818 130302806
8008 130302806 131668957 133049457 134425897 135788173 137147512 138490065 139755626 140888269
8000 140888269 141886124 142785937 143615623 144363047 144969549 145366729 145555532 145628516 145657603 145581256
7990 145581256 145286489 144796595 144270965 143794032 143276171 142618627 141870112 141136396 140424122
7981 140424122 139678961 138914977 138192384 137501948 136778004 136009213 135241825 134482871 133687460
7972 133687460 132838805 131962933 131066904 130134517 129177901 128222411 127247334 126214563 125150625
7963 125150625 124125978 123156417 122199900 121247171 120334232 119462928 118595107 117739240 116961054
7954 116961054 116287481 115674551 115090060 114551876 114058819 113557330 113008606 112422948 111796132
7945 111796132 111072998 110204153 109182152 107999240 106633718 105106078 103487059 101823801
7937 101823801 100118569 98397766 96724738 95116600 93531418 91975534 90536522 89258930
7929 89258930 88073506 86913387 85819345 84855190 83993336 83168448 82378773 81643144 80916619
7920 80916619 80151885 79402191 78758467 78213039 77689849 77190918 76805443 76575955 76459922
7911 76459922 76439928 76579034 76936056 77495564 78206106 79022107 79876576 80662210 81270502 81624985
7901 81624985 81678550 81423744 80910155 80209907 79365862 78410050 77409869 76429370 75452518
7892 75452518 74418397 73338054 72305732 71384214 70550041 69764371 69020404 68300188 67569244
7883 67569244 66853176 66241279 65763060 65329714 64854265 64366583 63947799 63612419 63329561
7874 63329561 63107064 62965438 62861980 62731026 62582401 62477927 62427231 62395060 62399087 62497179
7864 62497179 62671921 62839995 63008535 63313915 63851960 64570574 65399424 66387180 67624260
7855 67624260 69131614 70933260 73107062 75560072 77828021 79368284 80093349 80378616
7847 80378616 80472834 80168651 79215927 77795855 76299194 74801739 73101472 71212904 69467607
7838 69467607 68079370 66923840 65849819 64931350 64273822 63816248 63489365 63352883 63403422
7829 63403422 63459864 63440596 63553557 63987486 64616206 65271225 66102550 67342888 68907892
7820 68907892 70643949 72803586 75688834 78784284 80865487 81266906 80605673 79911686 79409155
7811 79409155 78571377 77095178 75294459 73596956 72126641 70874979 69936776 69412549 69272943
7802 69272943 69443180 69897997 70596772 71420296 72222472 72886233 73337637 73582833 73705430
7793 73705430 73745843 73633179 73331194 72975751 72736796 72618225 72546985 72581128 72839209 73285246
7783 73285246 73799267 74420070 75288062 76383768 77590274 78998357 80835324 83071452 85475710
7774 85475710 88155327 91565764 95663098 99429061 101742327 102588836 102960835 103604224 104318401
7765 104318401 104557409 104262857 103842097 103622515 103660456 103968245 104622105 105616679 106802995
7756 106802995 108035679 109285741 110573088 111867396 113099792 114219382 115188489 115947569
7748 115947569 116434935 116642403 116608833 116337708 115757045 114801618 113509275 111976295 110227873
7739 110227873 108209285 105917082 103452490 100905378 98269080 95530637 92763926 90045092
7731 90045092 87340145 84584909 81837229 79231656 76793071 74410004 72008965 69655103
7723 69655103 67446829 65392160 63432947 61533723 59703553 57962645 56314139 54732362
7715 54732362 53181729 51671347 50266799 49002891 47814208 46617513 45437595 44367661
7707 44367661 43416627 42491060 41537103 40606364 39756515 38972399 38219189 37497497 36808366
7698 36808366 36129718 35461660 34834842 34248108 33662370 33078231 32545477 32068916 31585131
7689 31585131 31066980 30568140 30122892 29687516 29230798 28795206 28408060 28017501 27586327
7680 27586327 27167836 26812341 26477282 26113109 25760749 25471886 25206976 24912599 24627414
7671 24627414 24400083 24172220 23870126 23552182 23324596 23159919 22952079 22713456 22545336
7662 22545336 22427761 22226137 21927489 21685264 21576464 21486158 21308558 21103468 20956211 20825205
7652 20825205 20644881 20460699 20336315 20223111 20047640 19846430 19688398 19540063 19343481
7643 19343481 19161137 19089916 19072891 18958342 18733873 18542321 18450330 18356291 18175356 17977574
7633 17977574 17864265 17810459 17719635 17567808 17410476 17289030 17201587 17139212 17089960 17021802
7623 17021802 16910268 16776153 16661395 16575519 16494014 16401796 16311321 16237271 16171640 16091734 15990478
7612 15990478 15891580 15820094 15757320 15655275 15513042 15399125 15358333 15335059 15251144 15130734
7602 15130734 15064066 15055378 15004136 14860214 14705576 14634772 14630744 14617454 14571836 14517337 14458623
7591 14458623 14395024 14359746 14371813 14378019 14317566 14223968 14185451 14214042 14232574 14193850 14135302
7580 14135302 14100216 14077952 14051256 14039312 14054584 14066389 14048950 14026754 14030790 14042856 14028777
7569 14028777 14003115 14012379 14063671 14113600 14127900 14116526 14106810 14114144 14145876 14203642 14268461 14309135
7557 14309135 14323254 14348706 14412911 14489820 14537361 14563410 14611900 14684206 14728405 14730078 14758406
7546 14758406 14868934 15001111 15048627 15015585 15014689 15100356 15197769 15236550 15262092 15343074 15447192
7535 15447192 15508242 15563173 15703689 15912186 16069354 16135024 16202738 16340230 16488828 16582413
7525 16582413 16667561 16820228 17016925 17186788 17344577 17569334 17869349 18161766 18386564 18560148
7515 18560148 18707328 18816325 18885072 18949460 19031667 19103282 19129872 19120265 19107323 19107836 19124494
7504 19124494 19164617 19235116 19333612 19456985 19602038 19750809 19879691 19995166 20134399 20310559
7494 20310559 20478249 20577122 20597728 20582497 20571024 20569550 20573804 20594420 20641476 20696026 20723355
7483 20723355 20723299 20747124 20842995 20996888 21156623 21307176 21480506 21686146 21885369 22061463
7473 22061463 22264339 22538236 22846014 23124741 23387065 23699793 24080955 24493080 24929358
7464 24929358 25419391 25936166 26383570 26711040 26968271 27207198 27402440 27522901 27615152 27742181
7454 27742181 27885029 27982645 28041763 28133091 28295232 28514249 28789885 29147330 29574376 30013088
7444 30013088 30436191 30881711 31387330 31927786 32440300 32885556 33268169 33620056 33975225
7435 33975225 34342382 34698250 35024117 35338836 35665921 35980489 36235507 36441469 36668500
7426 36668500 36953716 37252654 37507025 37722161 37949221 38222579 38544391 38904543 39284585
7417 39284585 39660681 40029711 40418082 40846247 41305594 41788285 42309172 42869610 43431841
7408 43431841 43970824 44524790 45141869 45794187 46409198 46984967 47602256 48299778 49009077
7399 49009077 49664817 50323501 51095563 51984770 52881461 53723365 54580855 55543629 56588438
7390 56588438 57620547 58604884 59583723 60580261 61557555 62480894 63359138 64204431 65000992
7381 65000992 65736484 66421197 67055566 67624470 68147966 68687997 69272653 69865340 70450661
7372 70450661 71095776 71866464 72728622 73606638 74506788 75502640 76618825 77814796 79076946
7363 79076946 80439816 81908406 83441533 85028422 86705431 88478768 90309198 92198478
7355 92198478 94211029 96374827 98637842 100965256 103405384 106009677 108759736 111631220
7347 111631220 114661090 117885867 121278079 124817494 128564863 132581453 136827760 141234482
7339 141234482 145834177 150727803 155951910 161475688 167302605 173468127 179950537 186699395
7331 186699395 193762763 201280369 209329390 217876604 226913341 236539665 246864467 257896491
7323 257896491 269574562 281821054 294493543 307323693 319943419 331918951 342720320
7316 342720320 351729076 358370295 362259091 363232485 361310765 356676091 349640505 340571941
7308 340571941 329853745 317915411 305234329 292249800 279294057 266619432 254432091
7301 254432091 242855664 231911068 221581799 211867639 202751541 194178485 186115353 178572665
7293 178572665 171516731 164832332 158447852 152433284 146879202 141724325 136804873 132044471
7285 132044471 127490407 123180058 119081721 115169055 111448572 107896172 104459534 101144825
7277 101144825 98014725 95077549 92262302 89528150 86911171 84430294 82037651 79710072
7269 79710072 77504419 75458813 73509435 71573889 69659705 67821916 66064241 64354640
7261 64354640 62696530 61109411 59570762 58051707 56585235 55222644 53939223 52662766
7253 52662766 51390353 50194386 49100446 48038233 46947399 45867864 44875083 43966974
7245 43966974 43073008 42162290 41288410 40511330 39809708 39104753 38363061 37636430 36980871
7236 36980871 36371053 35740672 35090264 34490756 33969863 33461936 32906209 32336210 31817329
7227 31817329 31340849 30847719 30330711 29840346 29397091 28965960 28524293 28094702 27696535
7218 27696535 27315203 26936496 26568013 26209770 25842601 25462648 25092587 24743894 24401548
7209 24401548 24058595 23729585 23415418 23093866 22765185 22468382 22222759 21983881 21692678
7200 21692678 21352509 21028065 20772170 20569662 20352816 20072456 19759483 19498685 19319423
7191 19319423 19140836 18875180 18561042 18315380 18157328 17978819 17717577 17452520 17263304
7182 17263304 17094166 16856067 16587597 16390888 16253293 16067977 15817343 15598174 15449615
7173 15449615 15290029 15067039 14847103 14691224 14550962 14371186 14201235 14101865 14016000 13848501
7163 13848501 13626127 13456547 13353482 13226765 13045784 12890670 12813511 12755632 12647959 12505158
7153 12505158 12368436 12231978 12084884 11960083 11877258 11792151 11667980 11545874 11470586 11392424
7143 11392424 11233789 11027527 10890479 10857690 10833646 10729493 10570656 10433677 10339225 10251127
7133 10251127 10138520 9999375 9850899 9723657 9638041 9568995 9467733 9333338 9219339 9149004
7123 9149004 9075494 8958906 8830926 8737336 8663507 8572672 8477748 8410841 8353560 8268555 8176474
7112 8176474 8123722 8087609 7998946 7860019 7751751 7706431 7660486 7566387 7467504 7411700 7366010
7101 7366010 7283680 7195917 7159284 7152627 7106675 7013308 6928404 6876542 6826639 6763539 6714966 6694051
7089 6694051 6672473 6628157 6573007 6519538 6464892 6420467 6409677 6418405 6394389 6319161 6237237 6188126
7077 6188126 6153570 6104900 6058336 6037213 6014494 5949951 5865695 5823889 5829330 5811429 5722717 5611794
7065 5611794 5565259 5598836 5640018 5616281 5533903 5457619 5427742 5421044 5396944 5356479 5330013 5318677
7053 5318677 5284534 5206885 5117717 5063353 5051403 5052490 5037720 4999986 4954664 4930503 4939802 4948571
7041 4948571 4905634 4815441 4743928 4727171 4718535 4668686 4614036 4620143 4664662 4656782 4571300 4485364
7029 4485364 4464437 4481456 4479103 4451498 4423915 4399580 4370179 4343055 4318746 4274924 4210992 4174571
7017 4174571 4200014 4250128 4264876 4240951 4213026 4181923 4123151 4054015 4025687 4043627 4055159
7006 4055159 4030159 4001160 4002694 4018926 4020842 4016028 4024583 4031875 4005423 3949527 3908646 3911339 3932352
6993 3932352 3922720 3870508 3817231 3804996 3818189 3803763 3751494 3714533 3725242 3731734 3670013 3574397
6981 3574397 3547693 3620014 3703195 3705906 3638409 3573795 3552603 3562610 3577596 3577899 3555109 3525331
6969 3525331 3517616 3530104 3526314 3493801 3468384 3473192 3476558 3450005 3427310 3453297 3504464 3519653
6957 3519653 3490795 3463133 3456131 3446678 3430487 3436475 3465848 3474208 3440939 3409787 3424376 3455823
6945 3455823 3438377 3367238 3319647 3362121 3457585 3496124 3425687 3321544 3293441 3346021 3386845
6934 3386845 3366781 3335743 3335721 3322744 3253514 3177823 3164610 3190536 3191403 3178099 3198338 3219465
6922 3219465 3170643 3085756 3072311 3130893 3143056 3070671 3028854 3099640 3199954 3218235 3173662
6911 3173662 3144168 3130719 3100481 3087053 3130677 3174485 3136529 3047422 3007453 3035767 3066882
6900 3066882 3074278 3092466 3127605 3145000 3142712 3151314 3166271 3160460 3150483 3169644 3195963 3194374 3201212
6887 3201212 3263102 3322298 3289410 3212232 3226112 3332247 3382761 3317030 3252313 3280963 3333525
6876 3333525 3328932 3317357 3364191 3413838 3392162 3345782 3353846 3384723 3367446 3332266 3348658 3386556
6864 3386556 3376101 3352553 3397518 3475514 3481007 3427175 3433538 3527712 3611804 3640265 3679911 3759764
6852 3759764 3807575 3790070 3783706 3838372 3889526 3880922 3864030 3888931 3897866 3829382 3744564 3736294
6840 3736294 3773322 3750187 3652909 3561478 3507804 3441386 3338101 3245147 3197681 3167637 3121256
6829 3121256 3069105 3034387 3015391 2998189 2972806 2927910 2861538 2798999 2766051 2746981 2708101
6818 2708101 2657847 2635209 2637570 2615214 2550269 2485589 2451037 2414527 2344374 2275399 2261754 2291303
6806 2291303 2300572 2262673 2209329 2167425 2125125 2074113 2040224 2044394 2063351 2059757 2031931 2004254
6794 2004254 1983910 1960599 1940470 1943971 1969197 1989885 1991748 1977070 1933706 1847702 1759158 1746977
6782 1746977 1820572 1878520 1831624 1729527 1696178 1760375 1825985 1809289 1732651 1667151 1647136
6771 1647136 1665832 1700206 1712093 1671660 1606551 1584955 1626559 1674710 1678363 1650287 1617468 1572405
6759 1572405 1514031 1480995 1492032 1500057 1462140 1414481 1417057 1457644 1474749 1450909 1421570 1411420
6747 1411420 1419042 1442908 1465656 1439565 1352928 1283940 1312128 1396028 1423533 1373015 1331550 1349158
6735 1349158 1371936 1344725 1292962 1265106 1265854 1283655 1319291 1350888 1333603 1271900 1231533 1242055
6723 1242055 1250661 1216063 1182031 1200226 1236965 1223844 1161231 1108052 1097246 1115714 1141977 1155530
6711 1155530 1134742 1087959 1058849 1066535 1079753 1083283 1111965 1170414 1187354 1122656 1056498 1079155
6699 1079155 1143197 1133397 1048506 994427 1011767 1033516 1019249 1010050 1027045 1028990 1004526 1000019
6687 1000019 1018080 997097 937317 930790 1001116 1033571 957188 881819 928306 1016579 981107 842175
6675 842175 786496 883216 989845 979350 909414 891553 915113 903808 864471 866283 911557 930193
6663 930193 894029 853030 850472 869306 879375 883853 894210 899460 889827 884651 905804 935924 932020
6650 932020 881759 825596 813398 847870 880606 863573 799856 742639 744429 804076 863047 862610
6638 862610 810726 778430 812696 868560 864043 797494 756440 790034 831998 800210 723961 697457
6626 697457 735130 763857 754564 760258 798432 799461 730579 679416 727275 810202 813015 753369
6614 753369 746919 806167 811374 708334 607633 622066 704784 734628 693030 662104 686156 725558
6602 725558 735328 716284 690125 678418 700130 743282 754055 703140 642121 637173 670894 679951
6590 679951 667342 687038 725556 706438 630849 601382 659065 704124 652610 575648 582786 642969
6578 642969 645054 590906 590215 669003 719161 671830 604393 613732 671507 681633 624123 564782
6566 564782 552784 576061 604454 621199 614864 583625 550395 544297 566436 593714 609864 614063
6554 614063 608993 599622 593659 587329 566413 538453 540655 587941 633692 619086 551429 497868 505667
6541 505667 561031 622513 659959 659499 625440 585777 568731 568577 560069 545369 551176 575167 578178
6528 578178 546687 521775 537558 566168 562017 535408 537103 580077 620269 618828 589677 575878
6516 575878 601601 654243 696495 693971 648239 601560 590758 602643 600691 587108 597067 627946
6504 627946 625276 564334 500754 498746 541322 561213 540167 521573 531360 545787 547545 557280 583445
6491 583445 588538 544800 492101 495154 555131 602735 580591 506008 445700 442287 472504 479036
6479 479036 445336 423687 464525 532276 541320 479495 431929 454522 493455 485794 473005 525262
6467 525262 597879 577309 462028 380312 404649 459481 461575 447998 486751 542983 533701 466290
6455 466290 422202 427759 435387 423326 422545 438681 433005 401976 399547 447910 490774 476064 432731
6442 432731 420251 442644 460513 459062 455035 452903 440252 421321 416098 424443 422425 399436 374172
6429 374172 367099 376597 389482 399009 404427 406024 410063 428074 458872 477202 456076 404363 369640
6416 369640 391238 453014 494595 474046 413146 375337 400293 461846 491585 449404 372420 341188
6404 341188 387567 453389 462696 417295 382082 384422 382863 348418 319145 337265 377132 384697
6392 384697 358934 343038 353930 371352 385996 408706 433915 437531 413839 381553 356506 347454
6380 347454 365567 402803 418362 388949 352889 354666 368893 343449 298168 299155 340852 346333
6368 346333 298729 276966 326612 385146 386251 358210 356499 368282 355230 334283 339265 346647
6356 346647 318325 285667 311128 384707 433564 427606 409032 416266 435293 433755 403234 364442
6344 364442 354035 391257 436311 416885 329397 267254 297427 358660 354024 300831 295998 357776
6332 357776 406442 402010 396616 425490 439249 390034 315431 285580 311972 350823 365381 353644
6320 353644 337081 339730 359738 362043 326897 294115 315796 375344 406447 386604 354109 336776
6308 336776 327860 331241 360309 388530 374273 338596 337651 354017 314317 233096 225658 331295
6296 331295 433862 428173 367263 358001 395079 400510 365166 343821 348592 346798 339485 352507 368418
6283 368418 349640 314637 315019 349882 373749 375848 382119 391877 382103 364941 374720 405743 423809
6270 423809 428399 444075 463836 459865 434998 409116 380154 355053 378538 458544 509920 464835
6258 464835 394761 411015 482189 484501 411975 383027 433225 463894 429819 414931 461424 482407
6246 482407 430510 403965 474371 544349 509693 445168 473469 543217 514067 404788 371173
6235 371173 453543 522262 490421 422655 395669 392170 387131 414296 477533 500416 443614 390886
6223 390886 435623 541870 598127 567680 512640 496331 525723 574161 609731 611551 592819 590892
6211 590892 610287 608306 566862 534605 553194 586335 581713 564040 591451 646435 658134 624723
6199 624723 619207 662410 688458 670507 681424 765133 835805 799895 715704 715823 801786 843441
6187 843441 787771 738290 780533 845428 830135 766937 762564 819368 836665 781562 745520 801899
6175 801899 895366 923389 870458 808288 796409 831501 879678 917434 939181 949221 954864 962183
6163 962183 975969 998616 1023882 1041007 1053249 1076162 1104316 1105976 1077465 1072761 1134983 1222366
6151 1222366 1259247 1246595 1255878 1314663 1370216 1381887 1380767 1407661 1448808 1468183 1459951 1440526
6139 1440526 1427961 1447908 1513938 1585472 1599133 1560185 1541891 1574033 1605454 1607540 1629948 1702645
6127 1702645 1767534 1778337 1790902 1866712 1952807 1961235 1921689 1944050 2051577 2157588 2202583
6116 2202583 2216841 2240088 2268028 2297642 2351310 2430493 2501281 2547892 2598547 2683323 2798401
6105 2798401 2919582 3029631 3135792 3271073 3454343 3640593 3758435 3816221 3907452 4079193
6095 4079193 4269907 4420754 4561944 4732421 4910985 5096868 5351101 5676927 5984357 6268757
6085 6268757 6670688 7235726 7806517 8326859 9021763 10019522 11064251 12005662 13314045
6076 13314045 15470995 17896221 19222657 18885155 17803770 17110726 16772127 16009674 14617988
6067 14617988 13138122 11933412 10829682 9696829 8755269 8138641 7637942 7083021 6599176
6058 6599176 6292283 6010771 5624110 5256683 5041317 4881387 4655605 4444386 4352080 4288044
6048 4288044 4121588 3901212 3737929 3608117 3441742 3277066 3164844 3040503 2846666 2662915
6038 2662915 2564596 2479422 2338606 2235239 2257649 2294601 2201371 2047341 1991571 2008580 1956554
6027 1956554 1841817 1788551 1798908 1770010 1711787 1717206 1738826 1636819 1452857 1389003 1477926
6016 1477926 1517674 1403437 1289530 1315113 1381219 1341797 1243100 1213054 1240306 1222092 1144696
6005 1144696 1075933 1041361 1025061 1036467 1073670 1077228 1017177 968076 1000540 1055430 1029586 937441
5993 937441 878047 877190 873784 843817 829036 842613 842016 807767 771583 753565 737285 717579 713735
5980 713735 725720 730745 729836 745487 767164 753861 703571 668955 684183 719169 728781 711819
5968 711819 696526 694191 691882 675750 643845 606328 583755 593524 626935 647772 625143 568027
5956 568027 521816 524953 566073 591343 564914 514658 498843 532164 571873 578699 559341 539425
5944 539425 527755 523358 526138 521233 484644 426970 398462 422435 455838 449228 415525 400913
5932 400913 414987 432059 436720 422150 368805 281899 231862 288831 416341 496777 476327 423049
5920 423049 417726 447894 451812 420523 400576 416866 443547 447613 423151 381348 338072 315646
5908 315646 329213 361854 375566 359084 345440 364841 396060 390927 342760 300773 306781 343390
5896 343390 364752 358028 344815 333073 304949 257022 219740 221113 252181 282894 296334 296183
5884 296183 295204 305376 325432 333797 311950 277045 266360 284080 293279 270773 237695 220848
5872 220848 217417 217773 228794 249526 257423 247299 249420 275144 280660 228561 155051 126081 149255
5859 149255 179365 190733 190467 178395 154353 152651 202067 254903 229385 135079 83296 142677
5847 142677 246898 287093 245909 191377 174203 185024 196723 200114 196890 190814 192065 209473
5835 209473 232622 234894 201597 150935 120455 127722 148253 145494 121462 113149 131684 140490 116468
5822 116468 93692 106739 127623 115398 98843 137108 211608 237926 190188 133819 117772 114608
5810 114608 98230 101544 147025 186405 169766 125595 113032 133764 147826 143185 133908 118085
5798 118085 92624 85833 122126 173659 194734 183006 161546 129804 87341 76205 130352 200814
5786 200814 206381 153633 128834 161747 178175 120570 46853 53103 135996 191901 147606 47913
5774 47913 -2772 35193 97808 108625 79769 82960 131417 155159 115831 76299 100596 143884
5762 143884 124072 63802 60586 126261 162241 113328 48179 45827 85924 107434 108052 119022
5750 119022 130927 115081 88869 93880 124344 134453 109597 80825 70979 70343 68028 69337 74751
5737 74751 71336 54039 35458 29619 41201 70039 109251 138128 132925 90185 33508 -2985
5725 -2985 2298 42025 82184 91859 74853 58957 54744 49530 45627 67707 112011 125976 76698
5712 76698 13335 12588 72886 114029 85791 27460 2467 19161 47508 77177 112404 129114
5700 129114 93830 29959 11479 65403 125756 125375 95484 112455 166789 166652 82057 639
5688 639 -1384 33041 28311 3727 22639 59346 31182 -46805 -58744 35461 127723 114738 33679
5675 33679 -15501 -6950 22034 55280 92029 103105 71537 43551 65120 98877 82258 41468
5663 41468 58566 135041 178630 135388 54872 5745 -2300 10563 35965 60141 59729 43301
5651 43301 48787 75863 74414 30143 6355 57115 144319 191313 185123 172896 179660 183375 163155
5638 163155 125614 83315 45034 29595 54324 101100 123083 100169 68379 76546 123152 154164
5626 154164 126159 58679 11874 16201 41322 40273 6388 -28333 -36491 -16901 15558 39599
5614 39599 36449 12457 3525 32387 73163 87034 78182 76334 78122 56254 21269 15343 37509
5601 37509 35642 -8125 -42230 -23701 22240 52884 66025 69677 47275 2180 -11268 39441
5589 39441 98778 92747 35581 2008 16083 36909 40553 43313 46118 27733 1911 13932 63109
5576 63109 90189 65452 34031 44606 81160 98329 84875 58752 31154 7288 -1535 7439
5564 7439 21556 34980 50887 52779 15522 -37570 -39408 25939 82716 65487 18035 28164
5552 28164 94256 130019 92964 35576 18425 35296 47193 40501 23996 6459 2723 28564
5540 28564 65851 66786 20733 -15832 8784 66861 89867 62624 31861 28492 32147 22011 16421
5527 16421 36256 61027 54353 17328 -14185 -18952 -8378 5164 27681 57535 65666 30754
5515 30754 -15637 -14021 44871 99072 93938 53407 37550 51453 49560 24315 23093 58048 70127
5502 70127 28795 1345 49180 107051 66141 -47163 -92173 -22235 47566 21577 -43009 -55316
5490 -55316 -39488 -62356 -92876 -58179 8864 11153 -42925 -44594 33641 89494 54504 -9983
5478 -9983 -27040 -11723 -8675 -13906 -19911 -53687 -103795 -93364 -2273 65021 24771 -47867 -34553
5465 -34553 35028 37149 -37594 -72392 -20125 26726 -4322 -54591 -40474 18287 43629 13641
5453 13641 -29259 -47449 -36196 -5905 28128 50815 57276 45650 8102 -42072 -53125 4491
5441 4491 74527 77213 27323 12189 50492 65026 16940 -29775 -19882 8292 6248 -668 18618
5428 18618 25274 -16824 -58449 -42136 -5345 -13102 -37502 -9417 46650 45206 -10009 -27507
5416 -27507 16650 41635 3432 -35711 -21340 6815 -955 -15367 8946 43511 31370 -17962
5404 -17962 -44947 -25970 12055 41935 52402 33385 -8143 -32487 -10704 28835 36882 11844
5392 11844 -9465 -14442 -19857 -24152 -9402 7890 -14129 -67228 -82037 -23401 48800 55415 1091
5379 1091 -44976 -47560 -31301 -18810 -1290 20368 17260 -22404 -68850 -93305 -98544 -85750 -35449
5366 -35449 43762 91155 67827 19772 11153 27108 11431 -26128 -26607 5093 2324 -37756 -35224
5353 -35224 31973 72295 24179 -39860 -32070 10088 -494 -49777 -57698 -19524 4356 13283
5341 13283 58753 117862 99817 647 -63871 -23360 46304 42393 -24256 -70516 -61691 -27345
5329 -27345 1162 10953 -7552 -49323 -84658 -89888 -71113 -43312 -14245 666 -13934 -37754
5317 -37754 -30322 3147 9733 -28429 -62125 -52317 -27368 -29597 -51541 -61299 -50556 -25125 12168
5304 12168 40414 25966 -22451 -49480 -31017 -6040 -4410 -3470 10108 3373 -32419 -43269 -1184
5291 -1184 33606 2966 -57722 -85169 -82810 -77765 -50809 4280 18561 -50637 -114712 -69800
5279 -69800 28612 41381 -33044 -61205 2843 49465 284 -73988 -78934 -27711 16120 34103
5267 34103 27931 -19687 -92270 -114291 -46028 45393 67991 18987 -31007 -33789 -2468 20271
5255 20271 6049 -27759 -29357 13219 30225 -35831 -118940 -106874 -19821 7774 -61179 -107984
5243 -107984 -57754 1529 -19295 -58834 -27266 26666 4368 -64771 -77013 -36555 -40863 -105595
5231 -105595 -139575 -96783 -35413 -10440 -7528 -3654 -7380 -16564 -7525 14310 12258 -21690 -56023
5218 -56023 -69614 -63783 -35885 5699 19641 -14631 -46650 -27178 2429 -20934 -58637 -26221
5206 -26221 47498 46863 -39576 -88860 -35368 36311 40437 10811 5781 3689 -23975 -30218 23312
5193 23312 75207 51411 -16127 -46169 -30272 -12813 -831 16935 8868 -46260 -85617 -43067
5181 -43067 28664 23990 -49388 -85493 -54453 -39176 -80311 -106061 -62318 -5841 -561 -7278
5169 -7278 40625 112115 119324 52710 -8577 -13619 5679 5691 -4080 7009 33498 40351 10702
5156 10702 -35898 -67637 -68683 -45440 -16045 2243 754 -17068 -36332 -40459 -28099 -18536 -31171
5143 -31171 -58896 -72444 -56264 -30055 -23885 -37666 -41149 -17649 8409 2395 -31513 -54471
5131 -54471 -46092 -26766 -16709 -3509 22522 27425 -26057 -105253 -126890 -63238 14837 25394
5119 25394 -28560 -80198 -87743 -64890 -38675 -17530 -3060 -3506 -23257 -50758 -64119 -48095
5107 -48095 -9372 24205 28048 5256 -22952 -46085 -65314 -71822 -53471 -23341 -8451 -7136
5095 -7136 3611 14030 -13760 -71189 -93101 -55714 -25175 -58289 -109931 -105923 -62839 -53857
5083 -53857 -84280 -91068 -56543 -31715 -39294 -41231 -23711 -30137 -73718 -94167 -51877 -1779 -14124
5070 -14124 -70010 -97862 -77964 -46897 -22300 10745 46857 55165 32186 9678 -344 -23553
5058 -23553 -69434 -99334 -77088 -26761 -7638 -40349 -85932 -100107 -84201 -69731 -69648 -67689 -52362
5045 -52362 -36624 -35682 -46111 -60129 -80078 -99661 -91559 -42805 11579 23945 -4358 -30792
5033 -30792 -35320 -36790 -46039 -47636 -39085 -44359 -68998 -81864 -66762 -54470 -70588 -85004 -56180
5020 -56180 -4039 8820 -37478 -96041 -117835 -103103 -77273 -49060 -16515 5006 -7877 -48964
5008 -48964 -78650 -69737 -40414 -23365 -16175 6219 33977 21647 -37854 -82750 -62017 -10042
4996 -10042 5890 -14495 -15687 17291 39016 21224 -12100 -38276 -66330 -96144 -100503 -70954
4984 -70954 -36972 -20370 -12910 -11699 -27962 -48127 -41126 -18281 -24811 -56746 -58676 -25357 -20065
4971 -20065 -56326 -57979 4605 38081 -27872 -107456 -82481 9511 37453 -16767 -48090 -8870
4959 -8870 30540 12249 -31201 -53158 -54125 -42687 -14558 10295 -91 -31491 -46467 -59827
4947 -59827 -108128 -153289 -120405 -34663 -4583 -49962 -70289 -21964 3225 -57961 -120377 -87025
4935 -87025 -5758 15788 -24564 -52333 -53110 -69442 -96368 -85326 -37797 -6641 -10388 -19276 -20258
4922 -20258 -31076 -53499 -66576 -62136 -46897 -23376 -1651 -3243 -21736 -19890 -97 -20327
4910 -20327 -92103 -132394 -87415 -33130 -58832 -115288 -96230 -23634 -15228 -86809 -128291 -84935
4898 -84935 -28341 -20020 -28824 -23694 -32193 -57200 -45197 4226 4204 -72905 -118008 -45819 56308
4885 56308 51185 -41773 -86643 -42710 -8260 -50503 -107679 -98400 -43266 -21301 -53061 -83224
4873 -83224 -64720 -18123 981 -26311 -61444 -60811 -30201 -7509 -4962 -2821 3317 -6772 -30185
4860 -30185 -30795 438 19425 -4923 -38733 -37186 -15723 -19685 -48761 -64878 -61857 -72957 -107982
4847 -107982 -130846 -113100 -75168 -56406 -64708 -72326 -53991 -19532 -6198 -35458 -81872 -99954
4835 -99954 -81561 -63181 -69704 -79685 -63990 -33408 -22318 -40191 -62263 -60546 -30547 3644
4823 3644 5873 -33900 -77103 -78866 -53315 -57306 -101324 -125919 -88673 -24377 14283 27560 37998
4810 37998 34961 3694 -26035 -19105 2462 -6336 -37005 -43321 -19705 -6891 -25867 -56116 -74157
4797 -74157 -71118 -43722 -9028 -8048 -49129 -75843 -46914 -13321 -41212 -90525 -69156 6457
4785 6457 20941 -55144 -108961 -60199 15473 10110 -55815 -85934 -60901 -40679 -44346 -24115
4773 -24115 38730 90038 78360 24212 -13968 -15193 -10280 -28828 -54811 -50150 -15790 1110
4761 1110 -23233 -47417 -30396 -6167 -32997 -89199 -96142 -41892 1058 -7660 -29134 -37295 -64445
4748 -64445 -113195 -116378 -45911 22387 23366 1983 17567 29207 -20757 -77459 -50247 26597
4736 26597 39786 -20449 -55784 -31422 -17124 -41301 -38527 16292 45392 2690 -35920 4239
4724 4239 69794 65618 4255 -26310 -5067 6306 -23037 -48331 -28860 9981 17377 -17116
4712 -17116 -60330 -79917 -75505 -68023 -65817 -52794 -19151 10958 6830 -23002 -43156 -42961 -39980
4699 -39980 -38542 -28943 -24959 -49208 -77063 -55424 7876 36761 -4436 -57125 -60757 -41166 -57983
4686 -57983 -110705 -150691 -153904 -134161 -110373 -98694 -108531 -115316 -75791 -2590 26120 -25827
4674 -25827 -89467 -90073 -55950 -59409 -97228 -111539 -94813 -87191 -91232 -74339 -41923 -27107 -21521
4661 -21521 974 8153 -48106 -121722 -110664 -14123 55104 37922 3360 19626 52910 46706
4649 46706 11674 -22068 -61341 -98417 -81562 -4030 49732 18061 -44898 -62672 -52356 -62222
4637 -62222 -63083 -8076 50506 21594 -74626 -130100 -108691 -73874 -63744 -51446 -37490 -66080
4625 -66080 -121737 -117907 -33528 34224 9158 -54768 -68169 -40485 -44404 -93105 -128080 -106978
4613 -106978 -45593 13414 31278 -10713 -89469 -149221 -157696 -133494 -103158 -68902 -39756 -44392
4601 -44392 -76405 -77808 -26036 11497 -27876 -95190 -94078 -24315 23094 4411 -29262 -31666
4589 -31666 -27123 -48677 -77041 -79226 -60762 -45235 -38926 -43291 -66577 -97428 -103299 -81011 -69863
4576 -69863 -83868 -73994 -3578 73910 73145 -1511 -55263 -30291 22341 23931 -21630 -42638 -7643
4563 -7643 30283 11605 -43788 -66461 -40224 -25053 -60990 -98303 -69985 -1809 17145 -31818
4551 -31818 -66262 -26448 38636 51729 16946 -9716 -17680 -38589 -67536 -63370 -28835 -20908
4539 -20908 -62962 -103833 -91247 -41022 -4125 -1959 -24374 -59492 -91737 -95316 -64569 -33835
4527 -33835 -35744 -54427 -50697 -19669 10087 23335 25650 9327 -43459 -113351 -140973 -96817
4515 -96817 -27449 -3685 -38404 -83194 -96127 -81620 -62607 -45184 -26751 -17406 -28429 -46755
4503 -46755 -45162 -21323 -6542 -24971 -59627 -75154 -64873 -54794 -62143 -71264 -59289 -29634
4491 -29634 -5322 3391 8859 22307 32475 17346 -24112 -61425 -63954 -41457 -36920 -68070 -92779
4478 -92779 -59132 15701 52234 7404 -65063 -80875 -31856 8935 -16456 -84263 -126528 -108029
4466 -108029 -51284 -3491 4810 -21701 -51936 -59864 -52457 -56910 -77165 -83060 -56893 -29432 -40601
4453 -40601 -76069 -81942 -46090 -21287 -44262 -72031 -44826 11929 12447 -58779 -108979 -65286
4441 -65286 14895 22785 -45552 -89179 -55840 -14967 -45985 -119077 -142884 -93016 -32138 -17044
4429 -17044 -41779 -73210 -93625 -95655 -73252 -36507 -11135 -9104 -17658 -23998 -30125 -38286 -46204
4416 -46204 -63277 -102979 -147175 -148418 -89410 -16253 12418 -8367 -38441 -50001 -48317 -45997
4404 -45997 -46216 -49038 -51303 -42642 -21127 -6622 -15955 -31483 -22330 5493 12281 -16557 -46833
4391 -46833 -45127 -24803 -21407 -41354 -59503 -58639 -49806 -54612 -80609 -113032 -123777 -95172 -43495
4378 -43495 -10745 -21729 -55822 -72734 -59672 -39103 -33841 -39964 -36882 -14817 10444 8095 -36094
4365 -36094 -93152 -107352 -53270 30719 80626 71546 28564 -15317 -45006 -52653 -37463 -25184
4353 -25184 -53725 -119607 -165988 -148316 -90024 -47076 -38745 -46212 -61064 -91118 -122898 -124079
4341 -124079 -92591 -65343 -64595 -70231 -62191 -55971 -70899 -92038 -94048 -81654 -75434 -74758 -67478 -62349
4327 -62349 -75533 -92870 -83913 -53333 -40563 -60729 -80433 -66951 -33654 -18066 -34479 -65367
4315 -65367 -85326 -79713 -52091 -25037 -22737 -44087 -64146 -67160 -62462 -62004 -62323 -59124 -58793 -60921
4301 -60921 -50014 -23387 -7642 -22958 -47317 -46610 -30264 -40373 -82703 -105562 -67593 -2055
4289 -2055 16980 -32795 -92083 -93985 -47093 -19807 -47726 -89146 -86723 -45170 -17821 -32307
4277 -32307 -65557 -86075 -82833 -52525 -104 40594 30834 -13220 -28973 3637 29381 3686
4265 3686 -39544 -49722 -40055 -47196 -52496 -18164 25355 12823 -44403 -68023 -40297 -32716 -82545
4252 -82545 -127200 -106820 -57701 -44410 -58506 -52754 -31413 -32135 -44778 -23581 27196 47170
4240 47170 6022 -58028 -96851 -104404 -96064 -74719 -38898 -1427 18696 14601 -2970 -12555 -1478
4227 -1478 12741 -2949 -46313 -68864 -42391 -7471 -13185 -34714 -12225 40282 40750 -33186 -98271
4214 -98271 -85620 -41202 -48030 -96410 -106780 -60406 -27545 -56737 -105140 -110333 -81236 -73353
4202 -73353 -101598 -124582 -108199 -64796 -23908 3585 18178 12792 -17893 -60266 -91414 -100684
4190 -100684 -89921 -61503 -22451 6454 5791 -18881 -45182 -63921 -82886 -103192 -114846 -117182
4178 -117182 -119096 -115596 -91906 -57423 -43680 -55914 -60582 -40253 -25714 -45575 -76865 -81152
4166 -81152 -61647 -45251 -33988 -19267 -20201 -53521 -82349 -56629 1787 20246 -13821 -31819
4154 -31819 6170 46542 24297 -42930 -88969 -89773 -73226 -63021 -57267 -51280 -46434 -40903 -33556
4141 -33556 -30055 -32510 -36906 -47813 -71823 -89663 -70465 -27601 -16550 -52349 -77430 -50471
4129 -50471 -18356 -41831 -88831 -77631 -9407 23850 -26420 -94736 -94832 -31870 15474 -5243
4117 -5243 -70748 -117884 -108712 -66330 -49557 -81961 -115919 -92185 -24763 12794 -14628 -64304
4105 -64304 -85059 -79809 -75062 -70089 -54041 -45067 -68480 -106698 -110098 -60673 1743 23494 -7561
4092 -7561 -53381 -62614 -17323 49040 83255 66771 30524 10882 7499 -865 -16758 -27807 -41488
4079 -41488 -80243 -133814 -150612 -101097 -26713 7091 -6432 -19199 -11931 -22902 -72786 -111100
4067 -111100 -83791 -20515 4555 -18370 -31356 -11284 -2299 -29776 -55887 -54880 -61974 -97202
4055 -97202 -106210 -45043 28859 29832 -29764 -69800 -69201 -70925 -78401 -48215 12139 38469 16758
4042 16758 309 -425 -41634 -121464 -138939 -44768 58364 51686 -33677 -78850 -52310 -24579
4030 -24579 -39179 -64763 -66350 -44602 -7556 31021 34462 -11376 -49468 -19196 40034 34241
4018 34241 -38016 -74617 -25090 31774 8349 -66226 -98594 -59788 -542 32985 41292 39631
4006 39631 32088 22395 19109 20336 11198 -13833 -35254 -27175 6108 24243 -2538 -47881 -58260
3993 -58260 -28539 -9704 -28039 -44413 -24261 2681 214 -6195 15253 23806 -31222 -100094
3981 -100094 -89143 -17934 -4865 -79760 -129473 -75274 7126 15982 -23550 -27149 -920 -18819
3969 -18819 -90060 -146955 -147640 -109935 -56807 -2478 19643 -11115 -50285 -37986 6286 11877
3957 11877 -25190 -35563 3426 27431 -7464 -56248 -66138 -57555 -71199 -91356 -83587 -65271
3945 -65271 -71305 -80156 -47248 3205 -1767 -65565 -100060 -51770 15523 13539 -44955 -77929 -60606
3932 -60606 -42808 -46638 -32473 8916 13270 -52194 -107398 -63442 34538 63418 3927 -36229
3920 -36229 8075 68341 59446 -1353 -48978 -70063 -80569 -64562 -11712 28335 6706 -40760
3908 -40760 -43545 -3785 19463 8909 -5160 -18131 -47404 -67051 -32802 28739 42284 2118
3896 2118 -17983 13231 40703 25396 4009 11391 23151 15887 9576 7946 -26548 -89547 -105570
3883 -105570 -42762 19078 6887 -32138 -21406 8574 -17275 -68260 -46515 38703 63070 -24959
3871 -24959 -118965 -105239 -15944 29125 -17623 -90045 -105583 -59206 -17869 -36991 -90374 -100364
3859 -100364 -45874 -1638 -31823 -85708 -68274 10315 45358 -1481 -48375 -28845 10621 1019
3847 1019 -39498 -56760 -60464 -89829 -119975 -93333 -28017 -5403 -44610 -72348 -40851 -699
3835 -699 -13705 -53908 -55555 -22538 -20703 -69622 -107576 -82256 -26612 -10533 -46989 -85666 -87101
3822 -87101 -63059 -40856 -24148 -6197 3871 -6908 -28185 -32873 -8954 27371 46375 25199
3810 25199 -35377 -101584 -124695 -86456 -22989 9508 -11656 -64956 -114229 -132609 -109992 -60801
3798 -60801 -20468 -14031 -29799 -37855 -25934 -912 30568 57948 56273 11804 -47704 -79060
3786 -79060 -75501 -62558 -50419 -28697 -4079 1675 -5110 4730 25493 13224 -41506 -85435 -75124
3773 -75124 -35472 -13313 -10821 -3484 7754 5606 -4876 -8981 -17589 -49205 -87560 -96346 -72716
3760 -72716 -53252 -66065 -100293 -120802 -97287 -30332 35078 41475 -13028 -60607 -45704 2946
3748 2946 18142 -11706 -41116 -44668 -41795 -46617 -45065 -31464 -24652 -35012 -50651 -65413 -85913
3735 -85913 -102867 -92560 -58284 -34475 -36328 -40622 -31354 -27258 -43168 -58769 -51743 -32992 -22526
3722 -22526 -17762 -14872 -34627 -88167 -134125 -115114 -38928 14648 -15219 -95172 -135531 -97013
3710 -97013 -36076 -30919 -78767 -99988 -49105 20251 32374 -4774 -24725 -12862 -21577 -71471
3698 -71471 -110229 -96818 -62065 -44924 -26274 19617 55208 29273 -31670 -52417 -20013 1174
3686 1174 -28853 -68045 -57545 -4313 27232 -10570 -94357 -144122 -101873 -6852 33229 -29320
3674 -29320 -115537 -122912 -60068 -16148 -23071 -32089 -21566 -32550 -74524 -87568 -43573 -4349
3662 -4349 -19527 -39239 -4217 38669 6352 -72802 -87648 -13836 46994 16618 -59072 -94472
3650 -94472 -76904 -48081 -28916 -16186 -16613 -32769 -38786 -15023 10966 -913 -42821 -73630
3638 -73630 -81341 -86363 -88190 -58528 2183 46390 41931 20148 29821 63524 67227 18581 -42058
3625 -42058 -70853 -78072 -96679 -113518 -79768 2137 51732 8621 -75532 -97781 -43059 1515
3613 1515 -21631 -64009 -58328 -18559 1776 1930 15351 31613 14875 -16149 -9647 19412 -1241
3600 -1241 -75853 -114684 -69246 -7176 2101 -5492 28048 63144 26154 -53048 -78299 -42465
3588 -42465 -31397 -69529 -78391 -20798 23778 -11787 -69002 -59494 -6934 -1596 -53712 -86973
3576 -86973 -64722 -34421 -37473 -49192 -33542 -2312 11013 -612 -22677 -45420 -62686 -64961
3564 -64961 -53409 -46887 -59822 -82666 -93196 -78959 -45961 -15736 -12106 -35930 -55934 -43772
3552 -43772 -14698 -8194 -28714 -37518 -11879 20442 23495 644 -24711 -50436 -84236 -107309
3540 -107309 -90162 -44967 -24120 -51669 -84557 -66847 -7551 24449 -15731 -93670 -135891 -111051
3528 -111051 -54869 -21058 -26372 -46489 -49360 -23486 16091 40168 30212 -2528 -28957 -35539
3516 -35539 -33471 -31440 -20248 1916 10405 -15428 -56428 -75475 -66577 -53635 -46206 -30333 -5985
3503 -5985 1786 -16902 -34385 -24473 -4435 -14173 -61298 -106676 -106529 -60394 -14652 -17139 -65725
3490 -65725 -107917 -99456 -54782 -25434 -37298 -70059 -93076 -94918 -75247 -34339 17463 55879
3478 55879 58797 22666 -31107 -59145 -26742 41968 69991 21449 -36399 -21158 36564 32991
3466 32991 -43426 -85376 -36176 15103 -25221 -104331 -107331 -34985 11162 -6879 -25379 -5489
3454 -5489 7171 -22450 -50621 -27177 23575 40742 7251 -44739 -81003 -89206 -76799 -64538
3442 -64538 -66392 -71234 -65534 -66029 -92223 -114704 -85417 -22657 -2408 -46256 -82770 -54860 -5627
3429 -5627 -8292 -58311 -92425 -83321 -58522 -43451 -36406 -30827 -22466 -3132 21299 22052 -11968
3416 -11968 -44542 -38573 -12045 -8359 -30206 -46925 -51525 -61910 -75177 -70127 -51442 -43975 -44350
3403 -44350 -25690 7696 18128 -6697 -37715 -53526 -59268 -50074 -9177 41275 42362 -19569
3391 -19569 -79988 -79421 -38732 -14174 -15857 -16422 -11186 -18590 -36776 -47084 -52231 -68146 -83111
3378 -83111 -67394 -24225 8084 9787 94 -2270 -3974 -11876 -16062 -13460 -19301 -36953 -42742 -22584
3364 -22584 -666 -5576 -25287 -24770 2266 28990 38580 42158 49793 50029 30626 3139 -7029
3351 -7029 10345 36917 39095 -639 -57644 -80349 -48895 -8013 -13603 -53946 -65259 -30259
3339 -30259 -9140 -44788 -86506 -59348 21429 66698 34574 -23128 -39795 -8159 35213 54593
3327 54593 31222 -23634 -58558 -26557 45938 77982 38052 -17995 -32572 -16763 -5825 -183
3315 -183 7062 -4481 -38572 -50838 -18400 4029 -35637 -91565 -83719 -25902 -2165 -32805 -56259
3302 -56259 -40551 -19254 -8487 18356 53279 42859 -13140 -38020 6327 58774 58108 26345
3290 26345 3404 -24599 -71107 -95158 -72844 -59865 -105377 -157859 -139707 -70448 -29617 -33090
3278 -33090 -33697 -16524 -6248 -2075 9138 -2572 -62633 -111344 -72800 9753 20686 -46189
3266 -46189 -75524 -20444 23295 -19154 -84635 -90000 -62082 -61130 -63085 -22604 13746 -26374 -100844
3253 -100844 -96584 -2704 67983 42370 -21371 -33846 8902 47645 45971 14868 -15449 -18051
3241 -18051 13669 51906 57641 28871 1364 -7420 -23210 -65472 -103673 -93583 -40638 4948
3229 4948 11875 -2455 -9753 -10013 -14747 -11967 19296 62426 68482 23852 -20873 -19183 2982 -9481
3215 -9481 -49638 -57948 -18554 17399 17407 13311 33816 50360 30921 -2226 -15262 -19758 -36300
3202 -36300 -41648 -10405 23986 12892 -29004 -53009 -59996 -82973 -104750 -75530 -10156 15748
3190 15748 -21104 -60180 -57196 -38783 -30375 -7958 35929 49661 2119 -53206 -55565 -30793
3178 -30793 -40557 -75403 -74528 -32278 -4972 -9046 11840 89499 158092 126867 3354 -101929
3166 -101929 -99592 -20619 28648 -3911 -64577 -77599 -41592 -9749 -3736 74 9303 120 -28934
3153 -28934 -42317 -24069 -1924 1594 -4488 -15059 -36179 -43590 -2088 51854 30248 -62274
3141 -62274 -96881 -2373 110356 102231 8705 -30906 9147 32978 4875 -8495 17564 21203
3129 21203 -16989 -30332 5185 19573 -19373 -39017 5521 41545 4673 -45173 -30634 7066
3117 7066 -11997 -61370 -60131 -16295 1752 -2927 23219 57689 25933 -54859 -84022 -40131
3105 -40131 -12369 -45558 -74822 -54923 -37744 -61058 -66586 -7501 51127 30886 -27723 -27918
3093 -27918 33920 76068 60519 24112 -4930 -35812 -60965 -51026 -15650 -3826 -27537 -42142
3081 -42142 -21466 277 -12831 -41408 -43194 -12605 19498 24867 -3574 -53216 -94520 -99858
3069 -99858 -74874 -54012 -51730 -39572 8023 64022 74197 26992 -29527 -46431 -28310 -14497
3057 -14497 -19008 -13066 27183 76141 83463 37631 -18615 -40272 -25412 6 19186 29683
3045 29683 31126 28182 30665 32437 10080 -33931 -51074 -7282 54185 58537 2900 -38250 -19234
3032 -19234 17994 15020 -18757 -31348 -8747 11993 -354 -35511 -62121 -60189 -31492 6068
3020 6068 31157 33868 20112 2997 -5072 1528 9934 -7572 -54563 -83990 -47621 28294 62206
3007 62206 23607 -29185 -40863 -35135 -56907 -86482 -73002 -24880 156 -14680 -27433 -10877
2995 -10877 13313 23079 28189 39367 47132 45619 41754 31843 6305 -16525 -5187 26982 27557
2982 27557 -14387 -43451 -18923 26755 41884 23775 -2192 -29069 -52100 -45057 -885 36448
2970 36448 30791 14948 38511 81156 81004 32604 -10079 -21729 -29000 -43739 -41754 -22535 -24791
2957 -24791 -57203 -70598 -30321 31581 66964 69379 50954 9216 -44145 -65517 -37334 -7840
2945 -7840 -23596 -54701 -43408 -1902 2969 -46662 -93535 -86560 -35544 22275 61496 64255 23802
2932 23802 -31031 -54416 -42528 -38041 -62981 -87280 -81101 -56459 -33565 -7124 23952 32642
2920 32642 7063 -15868 -2109 21728 7358 -40452 -75360 -78488 -67246 -49361 -20880 -740
2908 -740 -10219 -21525 10793 63528 60180 -8512 -52083 -6348 73322 96874 62413 31027 23156
2895 23156 14211 5806 22299 45967 31681 -10593 -19546 18828 44552 17421 -26142 -40169
2883 -40169 -34088 -31069 -13691 38161 92021 97539 55125 7814 -16511 -18363 -3824 13431 7164
2870 7164 -26952 -51739 -39495 -17008 -17173 -15817 25388 76456 71478 17059 -7351 31379 72621
2857 72621 59206 18035 6269 27746 44791 36516 8057 -28331 -50016 -31403 16701 45744
2845 45744 34391 19943 34790 51019 28384 -18047 -43895 -38948 -18460 17506 62538 71286
2833 71286 13456 -57928 -60767 1819 49697 44461 25609 21572 5636 -32747 -47790 -11793
2821 -11793 31108 34619 22702 38618 64478 52544 8150 -19956 -16029 -7138 -5245 5798 24765
2808 24765 23727 -7433 -45691 -70732 -81785 -74691 -39649 8136 30314 13539 -11216 -12737
2796 -12737 -547 -6668 -42012 -81691 -84277 -28025 56081 97836 63268 5763 -564 29768
2784 29768 14354 -56939 -82816 946 105812 103353 7636 -51845 -20509 24337 18342 4189
2772 4189 33162 64374 37610 -17280 -29881 -7536 -14322 -53393 -63465 -31335 -16104 -43640
2760 -43640 -63509 -44501 -31783 -58553 -73111 -21910 50438 62500 19954 -3563 13406 24872
2748 24872 15539 26601 69428 93218 68064 33294 27632 30647 15287 5187 28679 57661
2736 57661 48103 12666 -2057 8513 7174 -19334 -44405 -48084 -36375 -15645 12025 28868
2724 28868 17550 -76 18465 70127 97777 63730 -793 -39250 -36705 -20976 -15474 -16004 -10344
2711 -10344 -2727 -9600 -30059 -30399 18640 83764 84890 -215 -81241 -59985 29728 58596 -18220
2698 -18220 -97524 -76464 9797 56493 36753 3765 -17432 -49275 -80570 -59403 9375 41191
2686 41191 -7038 -57683 -19115 72685 98267 24011 -55450 -56523 -11698 3399 -14365 -14597
2674 -14597 9510 14987 -10013 -27515 -19857 -16353 -30369 -28901 2733 20575 -7820 -39222 -17576
2661 -17576 34886 54621 39234 38865 57216 42828 -12513 -45942 -19575 24908 40817 41112 47960
2648 47960 39142 -2347 -37056 -27707 -7924 -29454 -74891 -89633 -73001 -65284 -63955 -32261 15568
2635 15568 20988 -17290 -28962 15938 54655 29170 -27206 -47874 -26910 -4081 3650 1893
2623 1893 -18294 -59980 -83139 -46551 20469 43720 4500 -36798 -29863 -85 259 -29249 -42404
2610 -42404 -13654 32024 53404 33760 -13238 -57653 -67491 -27841 39144 83006 70583 20521
2598 20521 -21227 -35211 -36890 -34200 -11309 29789 46252 7235 -52135 -70074 -39456 -7026
2586 -7026 1528 5937 17659 16750 343 2003 32587 48508 18553 -18348 -10583 23647 28391
2573 28391 2849 -2128 25292 36948 6852 -25661 -22503 -7202 -19699 -46228 -41922 -6587
2561 -6587 11414 -9464 -27279 2630 57530 71961 25741 -29001 -40567 -23207 -19068 -22129
2549 -22129 6336 52694 48376 -23240 -79059 -43285 44932 90469 72542 45843 36673 20771
2537 20771 -1856 2361 23487 8216 -38373 -39742 23221 61134 16193 -34262 -2422 57593
2525 57593 37985 -33507 -31443 54214 90381 14843 -61300 -32059 40951 41515 -14283 -21980 32183
2512 32183 60676 28997 3251 26435 48363 20010 -20908 -13756 28725 46056 21850 -3203
2500 -3203 1765 21081 24476 8068 -4799 4939 23548 16154 -21007 -37266 7988 68311 55223
2487 55223 -29825 -76933 -18559 67195 68390 1575 -25595 14378 38689 1643 -30965 3092
2475 3092 57165 51084 -4523 -33865 -15983 -4487 -31419 -56699 -32849 22142 45698 9887
2463 9887 -41375 -40226 23145 81425 71552 20741 9535 50539 66088 12865 -39123 -10888
2451 -10888 57472 66787 14109 -11232 18898 28496 -26052 -77591 -62018 -26199 -44451 -88395
2439 -88395 -72552 2565 47988 21882 -19138 -18860 3775 7770 -4268 -11621 -17405 -22675 773
2426 773 62615 108793 79696 -602 -48161 -29670 4807 7955 -590 18126 56006 77307 73391
2413 73391 57468 28002 -17547 -47654 -25454 30864 65163 62990 62019 73366 52966 -17970
2401 -17970 -78515 -62753 7867 58292 59520 41888 28999 17223 14487 40948 82206 89521
2389 89521 42802 -18942 -41222 -5862 59094 98122 69283 -3148 -36992 6946 59399 35748
2377 35748 -32716 -41279 28300 87907 89483 84145 105147 101780 46536 7309 36893 78006 64818
2364 64818 39420 67367 107436 81208 19366 12601 50812 42902 -17945 -42654 -4946 19614
2352 19614 -3176 -9435 34768 63954 29036 -16107 -8440 26021 31235 6697 -24972 -66359
2340 -66359 -102239 -78812 8023 69894 42657 -15528 -18075 18766 26215 12894 42902 112721
2328 112721 149738 124461 77591 39654 4756 -16183 3512 42746 43269 -1341 -33053 -22523
2316 -22523 -11044 -34122 -60072 -41086 13340 50424 41751 11344 3436 32263 62325 47146
2304 47146 -6660 -37921 -9909 41110 63253 56517 43408 15108 -35024 -61519 -22932 37327
2292 37327 43858 4350 -11970 2886 -8271 -47351 -42403 25101 74709 51775 8468 6548
2280 6548 19565 -2911 -39605 -37880 -1933 27002 41832 58539 63897 34458 -11274 -30388
2268 -30388 -12670 16084 31540 24894 2849 -6373 19664 48610 21363 -48977 -71060 -6759
2256 -6759 61067 48791 -7203 -22305 3809 12954 -303 1867 11658 -6972 -31253 -5152 57536
2243 57536 87112 69631 53262 46171 7668 -48989 -48602 21724 74844 51546 2831 -3623 16750
2230 16750 16701 4655 15399 37624 35189 15410 21064 63696 102247 86076 6046 -86050 -111577
2217 -111577 -47686 28923 23807 -52026 -95178 -49645 30330 70450 60840 26939 -14698 -39145
2205 -39145 -17807 24152 20976 -28047 -41193 13970 56879 25346 -15336 18474 84851 86751
2193 86751 31929 9024 38874 64406 68907 88296 109147 69536 -22773 -76682 -48509 4069
2181 4069 25393 31063 40985 28904 -15674 -47637 -37283 -21217 -37181 -63251 -65549 -53296 -41634
2168 -41634 -11684 42214 72234 40032 -14697 -22434 24158 72832 84426 60906 20529 -15333
2156 -15333 -24699 -5653 17737 27791 28534 17182 -19428 -60842 -56447 -5078 23488 -8822 -40512
2143 -40512 -6114 51775 44465 -24384 -69056 -52743 -21369 -10926 -6577 -2839 -22545 -54978
2131 -54978 -49912 -2698 22119 -12250 -55077 -47273 -7663 7508 -10935 -30580 -35218 -29315 -9652
2118 -9652 21774 36173 13444 -15785 -5867 37918 70309 72789 65368 56753 31005 -8619 -27014
2105 -27014 -7137 21148 24036 9747 8101 23498 34048 27606 15187 10913 16449 26093 34822
2092 34822 40065 43460 49259 55179 51782 39820 36270 45488 37525 -12472 -67564 -57619 19394 73942
2078 73942 41488 -21235 -18406 36610 40506 -34219 -90323 -57061 2729 3856 -21722 6784
2066 6784 64718 55343 -19582 -48793 8696 52341 1576 -74338 -67462 5683 46942 31586
2054 31586 18960 32673 31848 4017 -5010 23708 42941 17329 -19844 -23295 1431 28140 56547
2041 56547 85966 82490 24414 -44333 -57741 -12071 38407 58681 57713 42452 4049 -39036
2029 -39036 -38783 13360 57978 44129 292 -14068 -894 -12198 -56708 -80136 -51287 -10600
2017 -10600 -1894 -3424 26177 66267 58014 -347 -41586 -23412 15877 19232 -10557 -26654 -8565
2004 -8565 17460 19763 -3205 -27724 -29930 -7932 13755 9241 -14421 -21691 5521 43821 60803
1991 60803 52406 33974 15081 2422 7517 27035 32789 9113 -14171 2499 49427 77460
1979 77460 62610 28568 5325 -2110 571 11364 21705 17301 1707 122 28299 71427 101404
1966 101404 103462 82003 51985 27755 12534 715 -5407 4807 24341 25216 1970 -8579
1954 -8579 16270 37408 10835 -30767 -17468 45526 77735 45227 9344 26946 68475 74876
1942 74876 41304 892 -28277 -36881 -8938 41725 60294 23976 -12053 8679 59708 79095
1930 79095 63808 52440 44536 10407 -35837 -47365 -24941 -18416 -44724 -64702 -47407 -3791
1918 -3791 47354 94733 113530 82538 28047 2271 15383 34179 41606 45165 37144 9375 -2341
1905 -2341 38988 91583 79837 16855 -10649 16605 31460 17259 39660 102615 106226 19146
1893 19146 -37039 24166 100687 63272 -31710 -43766 13793 11817 -58976 -74317 466 50363
1881 50363 10225 -33696 -2453 51549 54950 33229 36541 42308 19907 10713 50758 81390 35111
1868 35111 -40751 -46854 14596 48312 14237 -25141 -11012 36133 64482 55753 22863 -13980
1856 -13980 -33538 -28301 -20422 -33433 -47555 -19234 47980 88640 51821 -29324 -67891 -19510
1844 -19510 67217 104761 65251 6287 -9336 9015 13520 1726 10186 34642 27761 -12054
1832 -12054 -24130 13997 44571 31170 25602 70272 106007 62990 -12808 -25195 16209 14904
1820 14904 -50407 -92293 -53868 16871 56955 67218 68906 55282 24103 82 -6529 -13388
1808 -13388 -18647 2602 36956 34324 -4729 -14538 29131 61667 34736 -2501 12600 52605
1796 52605 50667 7447 -25462 -33627 -38828 -35503 -485 46562 58397 32610 13843 25135 43841
1783 43841 44199 24160 -5542 -25581 -13012 26176 49323 35792 24540 50398 77901 56661
1771 56661 11043 3103 28449 30118 5086 7831 42971 47006 1171 -25246 14383 66104 60290
1758 60290 11860 -22165 -33469 -46895 -52304 -20884 28117 39516 581 -39118 -31091 20548
1746 20548 73689 92044 74763 55974 67359 93308 83512 22920 -39084 -52381 -30712 -20463
1734 -20463 -29112 -26134 -2096 16847 13921 4423 5791 12910 14083 12357 19566 37964 54112 49750
1720 49750 22226 -5199 -4489 22760 47679 54777 57220 62546 53552 24890 9322 33699 68533
1707 68533 59879 2261 -56009 -75644 -59613 -25052 19714 59088 62972 18376 -43916 -71023
1695 -71023 -37006 31576 78252 69586 28285 4997 17210 35420 34638 29448 38892 46984 30449
1682 30449 3074 -5259 2736 4857 8646 40143 85946 96542 58764 21505 29623 66920 88352
1669 88352 81777 69649 64308 50102 12444 -31224 -42238 -6771 38388 45655 20802 16192 50100
1656 50100 73746 46032 -863 -13871 957 6063 6007 24975 38333 9236 -23345 10561 80766
1643 80766 78919 -7565 -57573 405 77388 69209 13449 4821 34095 26413 -12839 -12422 29792
1630 29792 42526 6885 -18966 -6686 7763 8738 26799 60305 60596 22810 6037 29773 35377
1617 35377 -6505 -34686 -1191 41903 31499 1591 15646 44558 15931 -42973 -26157 78666
1605 78666 146247 86599 -22263 -42061 38704 105614 85991 32231 20096 35658 16925 -32668
1593 -32668 -44051 7720 62122 65031 42507 40545 42362 8697 -34262 -25500 24526 40641 2873
1580 2873 -23800 -4658 3153 -47469 -102356 -84457 -11866 36514 38669 37087 49850 52188 42371
1567 42371 51194 74901 65879 13826 -20183 15240 87139 121449 96030 56119 48934 72325
1555 72325 90093 80589 59242 52322 57524 48051 18266 13 16982 46514 51538 30009 3935
1542 3935 -20126 -44508 -52987 -31619 -4066 -2953 -17119 -12936 4901 8683 12922 55662 112229
1529 112229 105151 23379 -41705 -19018 45577 62907 19161 -30686 -46388 -27708 9606 34905
1517 34905 12029 -47004 -73630 -35401 6301 -9641 -39362 -4513 68258 79195 15802 -25857
1505 -25857 4514 39643 16745 -21276 -7346 39933 59796 50275 50352 56505 34106 -5115 -10528
1492 -10528 24094 49822 42337 32233 38981 32094 -8644 -39279 -5629 70630 108371 69545
1480 69545 6117 -9471 27345 58445 42664 1796 -15302 9277 52455 81541 79528 50480
1468 50480 17137 5383 14488 12670 -17772 -43945 -22050 33340 59361 29356 -12826 -17754
1456 -17754 8153 28398 29104 16718 -8022 -39876 -54395 -37552 -13503 -11374 -21927 -20231 -11737
1443 -11737 -15682 -19851 -127 24876 12955 -26414 -31437 23007 85204 97231 62780 18958
1431 18958 -18981 -50121 -56362 -20056 39391 78723 77139 51581 32965 38302 55541 51507 13390
$$ [...]
##END NTUPLES=NMR SPECTRUM
##END=
