##TITLE=1H ikalashn
CG-1212-x3
18.9.2024
##JCAMPDX= 6.0         $$ Bruker NMR JCAMP-DX V2.0
##DATA TYPE= NMR SPECTRUM
##DATA CLASS= NTUPLES
##ORIGIN= UXNMR, Bruker Analytische Messtechnik GmbH
##OWNER= root
$$ TOPSPIN		Version 1.3
$$ 2024-09-18 11:21:26.750 +0400  Irina@DPX200
$$ Compression mode = diff/dup
##.OBSERVE FREQUENCY= 200.131392401
##.OBSERVE NUCLEUS= ^1H
##.ACQUISITION MODE= SIMULTANEOUS
##.ACQUISITION SCHEME= undefined
##.AVERAGES= 64
##.DIGITISER RES= 18
##SPECTROMETER/DATA SYSTEM= spect
##.PULSE SEQUENCE= zg
##.SOLVENT NAME= CDCl3
##.SHIFT REFERENCE= INTERNAL, CDCl3, 1, 17.95386
##AUDIT TRAIL= $$ (NUMBER, WHEN, WHO, WHERE, WHAT)
$$ ##TITLE= Audit trail, TOPSPIN		Version 1.3
$$ ##JCAMPDX= 5.01
$$ ##ORIGIN= Bruker BioSpin GmbH
$$ ##OWNER= Irina
$$ $$ F:/spectra/data/iren/nmr/1H/4/pdata/1/auditp.txt
$$ ##AUDIT TRAIL=  $$ (NUMBER, WHEN, WHO, WHERE, VERSION, WHAT)
(   1,<2024-09-18 11:19:57.875 +0400>,<Irina>,<DPX200>,<TOPSPIN 1.3>,
      <created by zg
	started at 2024-09-18 11:15:44.765 +0400,
	POWCHK disabled, PULCHK disabled
       configuration hash MD5:
       BE 6D 3F 07 2A EA 11 49 91 17 2B D3 AF B3 58 0D
       data hash MD5: 16K
       56 77 EF 0D A9 89 17 8E 3F 1E 93 B3 4B 3B 10 E7>)
(   2,<2024-09-18 11:21:00.093 +0400>,<Irina>,<DPX200>,<TOPSPIN 1.3>,
      <Start of raw data processing
       efp BC_mod = 2 LB = 0.05 FT_mod = 6 PKNL = 1 PHC0 = 102.1341 PHC1 = 7.128729 SI = 32K 
       data hash MD5: 32K
       46 DC CC 0B 60 AB AE D1 52 D8 28 4E C2 97 D3 8A>)
(   3,<2024-09-18 11:21:02.312 +0400>,<Irina>,<DPX200>,<TOPSPIN 1.3>,
      <apk 
       data hash MD5: 32K
       70 93 C5 58 B6 13 0D 89 B8 44 16 B6 7B 34 14 33>)
(   4,<2024-09-18 11:21:11.812 +0400>,<Irina>,<DPX200>,<TOPSPIN 1.3>,
      <pk fgphup PHC0 = -8.098303 PHC1 = 7.6 
       data hash MD5: 32K
       A2 C9 B2 FA BF A5 13 FF C8 66 27 BC EE 47 55 43>)
(   5,<2024-09-18 11:21:16.375 +0400>,<Irina>,<DPX200>,<TOPSPIN 1.3>,
      <abs n ABSG = 5 
       data hash MD5: 32K
       6F 6C D9 9A 01 C1 A1 50 21 52 3A E9 3B 57 03 E9>)
$$ ##END=
$$ 
$$ $$ hash MD5
$$ $$ C7 B7 77 43 78 3D 91 AC 32 02 D1 E2 2A F1 B7 46
##$RELAX= 
##$RELAX= 
##$RELAX= 
##$RELAX= 
##$RELAX= 
##$RELAX= 
##$RELAX= 
##$RELAX= 
##$RELAX= 
$$ Bruker specific parameters
$$ --------------------------
##$DU= <F:/spectra>
##$EXPNO= 4
##$NAME= <1H>
##$PROCNO= 1
##$TYPE= <nmr>
##$USER= <iren>
##$AMP= (0..31)
100 100 100 100 100 100 100 100 100 100 100 100 100 100 100 100 100 100 
100 100 100 100 100 100 100 100 100 100 100 100 100 100 
##$ANAVPT= -1
##$AQSEQ= 0
##$AQ_mod= 1
##$AUNM= <au_zg>
##$AUTOPOS= <>
##$BF1= 200.13
##$BF2= 200.13
##$BF3= 200.13
##$BF4= 200.13
##$BF5= 200.13
##$BF6= 200.13
##$BF7= 200.13
##$BF8= 200.13
##$BYTORDA= 1
##$CFDGTYP= 0
##$CFRGTYP= 5
##$CHEMSTR= <none>
##$CNST= (0..63)
1 1 145 1 1 1 1 1 1 1 1 1 1 1 1 1 1 1 1 1 1 1 1 1 1 1 1 1 1 1 1 1 1 1 
1 1 1 1 1 1 1 1 1 1 1 1 1 1 1 1 1 1 1 1 1 1 1 1 1 1 1 1 1 1 
##$CPDPRG= <>
##$CPDPRG1= <>
##$CPDPRG2= <>
##$CPDPRG3= <>
$$ [...]
##$SW_h= 4401.40845070422
##$TD= 16384
##$TD0= 1
##$TE= 300
##$TE2= 300
##$TE3= 300
##$TEG= 300
##$TL= (0..7)
0 120 120 120 120 120 120 120 
##$TP= (0..7)
150 150 150 150 150 150 150 150 
##$TP07= 0
##$TPNAME0= <>
##$TPNAME1= <>
##$TPNAME2= <>
##$TPNAME3= <>
##$TPNAME4= <>
##$TPNAME5= <>
##$TPNAME6= <>
##$TPNAME7= <>
##$TPOAL= (0..7)
0.5 0.5 0.5 0.5 0.5 0.5 0.5 0.5 
##$TPOFFS= (0..7)
0 0 0 0 0 0 0 0 
##$TUNHIN= 0
##$TUNHOUT= 0
##$TUNXOUT= 0
##$USERA1= <user>
##$USERA2= <user>
##$USERA3= <user>
##$USERA4= <user>
##$USERA5= <user>
##$V9= 5
##$VALIST= <valist>
##$VCLIST= <CCCCCCCCCCCCCCC>
##$VD= 0
##$VDLIST= <DDDDDDDDDDDDDDD>
##$VPLIST= <PPPPPPPPPPPPPPP>
##$VTLIST= <TTTTTTTTTTTTTTT>
##$WBST= 1024
##$WBSW= 25
##$XGAIN= (0..3)
0 0 0 0 
##$XL= 0
##$YL= 0
##$YMAX_a= 565505
##$YMIN_a= -405743
##$ZGOPTNS= <>
##$ZL1= 120
##$ZL2= 120
##$ZL3= 120
##$ZL4= 120
##$ABSF1= 17.95386
##$ABSF2= -4.038887
##$ABSG= 5
##$ABSL= 3
##$ALPHA= 0
##$AQORDER= 0
##$ASSFAC= 0
##$ASSFACI= 0
##$ASSFACX= 0
##$ASSWID= 0
##$AUNMP= <proc_1d>
##$AXLEFT= 0
##$AXRIGHT= 0
##$AXTYPE= 0
##$AXUNIT= <>
##$AZFE= 0.1
##$AZFW= 0.1
##$BCFW= 0
##$BC_mod= 2
##$BYTORDP= 0
##$COROFFS= 0
##$CY= 7568.61572265625
##$DATMOD= 1
##$DC= 0
##$DFILT= <>
##$DTYPP= 0
##$F1P= 17.9538593292236
##$F2P= -4.03888763876832
##$FCOR= 0.5
##$FTSIZE= 32768
##$FT_mod= 6
##$GAMMA= 0
##$GB= 0
##$INTBC= 0
##$INTSCL= 1.483618e-010
##$ISEN= 128
##$LB= 0.05
##$LEV0= 0
##$LPBIN= 0
##$MAXI= 945.577
##$MC2= 0
##$MEAN= 0
##$ME_mod= 0
##$MI= -402.1523
##$NCOEF= 0
##$NC_proc= -6
##$NLEV= 6
##$NOISF1= 8.587773
##$NOISF2= 6.764455
##$NSP= 0
##$NTH_PI= 0
##$NZP= 0
##$OFFSET= 17.95386
##$PC= 1
##$PHC0= 104.937
##$PHC1= 2.094543
##$PH_mod= 1
##$PKNL= yes
##$PPARMOD= 0
##$PPDIAG= 0
##$PPIPTYP= 0
##$PPMPNUM= 100
##$PPRESOL= 1
##$PSCAL= 0
##$PSIGN= 0
##$REVERSE= no
##$SF= 200.13
##$SI= 32768
##$SIGF1= 16.12182
##$SIGF2= -4.496377
##$SINO= 3.521527
##$SIOLD= 32768
##$SREGLST= <1H.CDCl3>
##$SSB= 0
##$STSI= 32768
##$STSR= 0
##$SW_p= 4401.40845070423
##$SYMM= 0
##$S_DEV= 0
##$TDeff= 16384
##$TDoff= 0
##$TI= <>
##$TILT= no
##$TM1= 0
##$TM2= 0
##$TOPLEV= 0
##$USERP1= <user>
##$USERP2= <user>
##$USERP3= <user>
##$USERP4= <user>
##$USERP5= <user>
##$WDW= 1
##$XDIM= 32768
##$YMAX_p= 377562720
##$YMIN_p= -1217613
$$ End of Bruker specific parameters
$$ ---------------------------------
##NTUPLES= NMR SPECTRUM
##VAR_NAME=  FREQUENCY,     SPECTRUM/REAL,   SPECTRUM/IMAG
##SYMBOL=    X,             R,               I
##VAR_TYPE=  INDEPENDENT,   DEPENDENT,       DEPENDENT
##VAR_FORM=  AFFN,          ASDF,            ASDF
##VAR_DIM=   32768,         32768,           32768
##UNITS=     HZ,            ARBITRARY UNITS, ARBITRARY UNITS
##FACTOR=    0.134324425510551, 1,           1
##FIRST=     4401.40845070423, -278231,      -2076111
##LAST=      0,             85058,           -2081306
##MIN=       0,             -1217613,        0
##MAX=       4401.40845070423, 377562720,    0
$$ Real data points
##PAGE= N=1
##DATA TABLE= (X++(R..R)), XYDATA
$$ [...]
10092B740572k8853j41682r4105K0508J0483p0935k4549J10295R2742q3870j34873
10081B395733L7426J46844n246j79122j06678J8067j41389m22231l28305J70635
10071A585734N03561L08708o4897j24353P5606J59145N8990l407P863o1072j50852
10060B295026k8813K39661K83893J127k50682k04576o9781j20292k16711q1012
10050A847840J68050J61676j03572j98108J05262M45546L27157k11830o18903
10041A923118m87485n276L27591K90062R5410P889J9399j1510q6679j08891p8284
10030A885344n2603P198J42846K19537P9764j68405k70101j87022n9419J25520
10020A722659M37690O05056K31530m63419o87223j47557M47264L80850o8175j76304
$$ plain form
10092 2740572 2711719 2570037 2475932 2496440 2506923 2435988 2411439 2521734 2614476 2530606 2395733
10081 2395733 2433159 2580003 2574757 2395635 2288957 2307024 2165635 1743404 1415099 1585734
10071 1585734 2089295 2398003 2333106 2208753 2284359 2443504 2502494 2499087 2506950 2445878 2295026
10060 2295026 2266213 2505874 2789767 2790894 2540212 2335636 2265855 2145563 1928852 1847840
10050 1847840 2015890 2177566 2073994 1875886 1981148 2426694 2753851 2542021 1923118
10041 1923118 1435633 1430357 1757948 2048010 2143420 2151309 2170708 2159198 2072519 1963628 1885344
10030 1885344 1832741 1839939 1982785 2202322 2282086 2113681 1843580 1656558 1597139 1722659
10020 1722659 2160349 2765405 2996935 2533516 1846293 1698736 2146000 2526850 2458675 2282371
10010B282371Q1265J48621q9155j87919o494Q0380n7406n1890K21242L12978l0888
9999B703105l50885j80963J87933J77055j74524l29072j00041J40977P1991j84924
9989A960652l12232j50786K05071M58005L13519j62171m99559l67828j6666R8371
9979A526376k9447m3383J46211K51650J28948j5901k3581R11r745O9979K40808
9968B242826K42429m1405l23015l01993q4645L4569K284m4790p4078j12964n9813
9957A479405J55049L26039K03833r3781k10968n9124J08242J02479k7313k05015
9947A778846l61838k72038K13073P06816N73549j32692n55339k05646K94731J71319
9937B210781k95778k84403J71589K50460k28753m65365l4401L79297J38094k92138
$$ plain form
10010 2282371 2363636 2512257 2423102 2235183 2228689 2309069 2251663 2199773 2421015 2733993 2703105
9999 2703105 2352220 2171257 2359190 2536245 2361721 2032649 1932608 2073585 2145576 1960652
9989 1960652 1648420 1497634 1702705 2160710 2474229 2312058 1812499 1444671 1428005 1526376
9979 1526376 1496929 1453546 1599757 1851407 1980355 1964454 1940873 1941784 1932039 2002018 2242826
9968 2242826 2485255 2443850 2120835 1818842 1734197 1768766 1771050 1726260 1652182 1539218 1479405
9957 1479405 1634454 1960493 2164326 2070545 1859577 1800453 1908695 2011174 1983861 1778846
9947 1778846 1417008 1144970 1358043 2064859 2638408 2505716 1950377 1744731 2039462 2210781
9937 2210781 1915003 1630600 1802189 2052649 1823896 1358531 1324130 1703427 1841521 1549383
9927A549383j82924K26396K34055o8034n1995K12837P9572l77465l25050L61011
9917A657786O98806J31583n41518m31089R7448J77619j31372j40901J84420K61104
9907A963886j573j06209N0018J8812k79781l46740j6593K21512J02709K5215K29810
9896A861066K74184j44557m84054j50642M66377N08176o8182m70880k66137J09949
9886A635300J31311j12690k22424q3422J18270K31649K49990J98805Q2515p6768
9876B152536k01340j72669M2177K48846J71398j47276k88497n593L65995L40566
9866B506143k7889k55677j51092q540n5580j28147l8912R1490Q4396R798J2204
9855B038194L5160m8907j77098j79625l9425J01283J35593P5494N83l242O9349
$$ plain form
9927 1549383 1366459 1592855 1826910 1758876 1706881 1919718 1999290 1621825 1296775 1657786
9917 1657786 2356592 2488175 1946657 1515568 1613016 1790635 1659263 1518362 1702782 1963886
9907 1963886 1962313 1856104 1906122 1924934 1645153 1298413 1281820 1503332 1606041 1631256 1861066
9896 1861066 2135250 1990693 1506639 1355997 1822374 2330550 2262368 1791488 1525351 1635300
9886 1635300 1766611 1653921 1431497 1348075 1466345 1697994 1947984 2146789 2229304 2152536
9876 2152536 1951196 1778527 1820704 2069550 2240948 2093672 1805175 1799582 2165577 2506143
9866 2506143 2478254 2222577 2071485 2062945 2007365 1879218 1840306 1931796 2016192 2025990 2038194
9855 2038194 2073354 2024447 1847349 1667724 1628299 1729582 1865175 1940669 1941252 1938010 2007359
9844B007359Q8976m6453j87659q3343J99734K81334J7274k52784k12725k6923
9834A784790M281l3682J05215K87579J78620j26109j76180Q9352K04316o1924
9824B256258l15546j91718N9611L7225j29754n8698J72227J50630j18623j70528
9814A691084J38498L52207J35834j93335j91991K2027M0636j20814r1846J44203
9804A926503J45971k45563n23849j92117M67284P02666K79356k37530k61668Q3577
9794B144630K34658j3972k97557k51183J0869J36387N0337k0027M1333Q2377n386
9783B112466p2711K9508J63970J02794r4462j50961Q47J15135J3871j46532j14479
9772A959446R9012K44979J47184j17963l14818k69306m3662R7889j4342j97757
$$ plain form
9844 2007359 2096335 2049882 1862223 1778880 1978614 2259948 2277222 2024438 1811713 1784790
9834 1784790 1789071 1755389 1860604 2148183 2326803 2200694 2024514 2113866 2318182 2256258
9824 2256258 1940712 1748994 1808605 1845830 1716076 1657378 1829605 1980235 1861612 1691084
9814 1691084 1829582 2181789 2317623 2124288 1932297 1954324 1994960 1874146 1782300 1926503
9804 1926503 2072474 1826911 1303062 1110945 1578229 2280895 2560251 2322721 2061053 2144630
9794 2144630 2379288 2365316 2067759 1816576 1827445 1963832 2014169 1994142 2035475 2117852 2112466
9783 2112466 2039755 2069263 2233233 2336027 2241565 2090604 2091451 2206586 2220457 2073925 1959446
9772 1959446 2058458 2303437 2450621 2332658 2017840 1748534 1704872 1802761 1788419 1590662
9762A590662j11954K49091M57454J79001l49646n56468j90130L98183O15884K20326
9752B502403m02062n63141k1480O28815N85592j25088o36154m11355O5526J35177
9742A758233j6656J71867N13300K95562m27373p07766j19727N38231M24331j62118
9732B267884l94107j67658J55k8656P7731L27961K94967j09031l84748j87073
9722A697425J75250K37333J0791j51804q2188O6459R5059N837r780J74524L56286
9711B575192J62469l72387o33204j76686N38364O60909J07675l51013k16329J30185
9701B425175J54537n9137j29244k4561L7928L5700P2758R5259L3546J9947J32299
9690B794207J43956j15818l74274k84263Q806R2904p1050j81491j48523j34346
$$ plain form
9762 1590662 1478708 1727799 2185253 2364254 2014608 1458140 1268010 1666193 2282077 2502403
9752 2502403 2100341 1537200 1515720 2144535 2730127 2605039 1968885 1557530 1623056 1758233
9742 1758233 1741577 1913444 2426744 2722306 2294933 1587167 1467440 2005671 2430002 2267884
9732 2267884 1873777 1706119 1706274 1677618 1755349 2083310 2378277 2269246 1884498 1697425
9722 1697425 1872675 2110008 2120799 1968995 1886807 1953266 2048325 2054162 2044382 2218906 2575192
9711 2575192 2737661 2365274 1732070 1555384 2093748 2754657 2862332 2511319 2294990 2425175
9701 2425175 2579712 2520575 2391331 2366770 2404698 2440398 2513156 2608415 2641961 2661908 2794207
9690 2794207 2938163 2822345 2448071 2163808 2172614 2265518 2194468 2012977 1864454 1730108
9680A730108j08846J21540M23083L87159j6048l07688j95125L2968L1464o8962
9670B029653M2781L13723M08081J85423j62095l65315k93839k503K94945L67185
9660B818039J78009r2145k51736k34730p6050Q7385N3891j77864k58636P9060
9650B125223N00729M15324j32349m26600r9877L38964K93858q3982k62629j33922
9640B534739K5619J00419J53268J22093k9801o2214J73128L24812K7088m08173
9630B960978l98496m7632J5433k71335k64573K62284O45186L60822j39275j62647
9620B960745J60564J80541k03438m29553j65587K33952K74625l1892k45932p4618
9610B659407K72198L40145L9003j71842Q2983M49428K78876l37622n87689j58199
$$ plain form
9680 1730108 1621262 1742802 2165885 2553044 2536996 2229308 2034183 2067151 2098615 2029653
9670 2029653 2072434 2386157 2794238 2979661 2817566 2452251 2158412 2155909 2450854 2818039
9660 2818039 2996048 2903903 2652167 2417437 2341387 2428772 2482663 2304799 2046163 2125223
9650 2125223 2625952 3041276 2908927 2482327 2382450 2721414 3015272 2931290 2668661 2534739
9640 2534739 2560358 2660777 2814045 2936138 2906337 2844123 3017251 3342063 3369151 2960978
9630 2960978 2562482 2514850 2530283 2258948 1994375 2256659 2901845 3262667 3123392 2960745
9620 2960745 3121309 3301850 3098412 2668859 2503272 2737224 3011849 2979957 2734025 2659407
9610 2659407 2931605 3271750 3310753 3138911 3221894 3671322 3950198 3612576 3024887 2866688
9600B866688K55009P2753k14836Q5427N97428M16203l42567n98424J4519N55679
9590C707879K47432l53204k96707K83462M52505o2122n05245k40598L79462N66915
9580D179779J45276l11669k85673N3548J62664q0228k00363J45461N73854M66261
9570D848910j04014m22667j38906K89166L35746J09365r202j5250j20120k27535
9560D545493p1074K56208L71889J68098q3315j73749j50506p0640Q9678K47527
9550E129609K45742J14202K9943J3331n3105j21323k2621J79949K34546J19296
9540E869569N1135N6603l7007j34202Q1932M83803M61304j42666o23024l91823
9530E675624J37096K23256n9898p4298K59386L86886J04769j59866j44719j05938
$$ plain form
9600 2866688 3121697 3194450 2979614 3065041 3662469 4078672 3736105 3137681 3152200 3707879
9590 3707879 3955311 3602107 3305400 3588862 4041367 3979245 3474000 3233402 3612864 4179779
9580 4179779 4325055 4013386 3727713 3781261 3943925 3863697 3663334 3808795 4382649 4848910
9570 4848910 4744896 4322229 4183323 4472489 4808235 4917600 4908398 4893148 4773028 4545493
9560 4545493 4474419 4730627 5102516 5270614 5187299 5013550 4863044 4792404 4882082 5129609
9550 5129609 5375351 5489553 5519496 5532827 5479722 5358399 5335778 5515727 5750273 5869569
9540 5869569 5920704 5977307 5940300 5806098 5888030 6371833 6833137 6690471 6067447 5675624
9530 5675624 5812720 6035976 5976078 5901780 6161166 6548052 6652821 6492955 6348236 6242298
9520F242298j86430j13400J79635K61292p2152l36838j00997K92063K79606l6276
9510F408801j59876n7779q8893k56731k08615O2373J65417J9732K73K31230L13860
9499F429792O566l27457k74310K9100J90830J43894Q0016M3222o3681k11548k64822
9488E781602j75755J3292K21372K70520J5880l24555k84655J85737N12037K57225
9478F472700k38874l72033j24861O2844L2642j6224k9419j13549j31731J41882
9468E683377M76791L77275j24211m35719k75036n23P7977J19432K39185J77013
9458F315561j54663l22105k0489L67492L50383R3590P7594K80411K69204n2256
9448G204722l20190k80897n3700J44166J92324M9928j61302j69090Q0873K51667
$$ plain form
9520 6242298 6055868 5942468 6122103 6383395 6311243 5974405 5873408 6165471 6445077 6408801
9510 6408801 6248925 6191146 6102253 5845522 5636907 5699280 5864697 5884429 5884702 6115932 6429792
9499 6429792 6436358 6108901 5834591 5863691 6054521 6198415 6278431 6321653 6257972 6046424 5781602
9488 5781602 5605847 5619139 5840511 6111031 6126911 5802356 5517701 5703438 6215475 6472700
9478 6472700 6233826 5861793 5736932 5799776 5832418 5816194 5786775 5673226 5541495 5683377
9468 5683377 6160168 6537443 6413232 5977513 5702477 5701954 5779931 5899363 6138548 6315561
9458 6315561 6160898 5838793 5818304 6185796 6536179 6629769 6707363 6987774 7256978 7204722
9448 7204722 6884532 6603635 6549935 6694101 6886425 6936353 6775051 6605961 6686834 6938501
9438F938501J06013q8900k2240J00467m3284k25524l0324L32085L05824k5861
9428G346757m5482K92399L33271j06996l29427Q9469N30022L00549k71080m02495
9418G736987m4442K21066J73168J25511K34562K83175J68645Q6870J52169K20461
9408I358172J67132N6082j0052L633R6083K02754K11851J51026K02238L70689
9398A0809608L76385J09519q0368J20441M58406M76984K06061M2092R7745J54420
9388A2771293J66058L01333N00690M87127K69073J79058L29944M53086L77323
9379A5834985K70378K83474L26471L26492L64262M24133L44524J53269J26528
9370A8454516L64742O12556O46635N55048M95106M59712M19422M17762M05554
$$ plain form
9438 6938501 7044514 6955614 6933374 7033841 6990557 6765033 6734709 7066794 7372618 7346757
9428 7346757 7301275 7593674 7926945 7819949 7490522 7579991 8110013 8410562 8139482 7736987
9418 7736987 7692545 7913611 8086779 8212290 8446852 8730027 8898672 8985542 9137711 9358172
9408 9358172 9525304 9581386 9571334 9574967 9671050 9873804 10085655 10236681 10438919 10809608
9398 10809608 11185993 11295512 11215144 11335585 11793991 12270975 12477036 12519128 12616873 12771293
9388 12771293 12937351 13238684 13739374 14226501 14495574 14674632 15004576 15457662 15834985
9379 15834985 16105363 16388837 16715308 17041800 17406062 17830195 18174719 18327988 18454516
9370 18454516 18819258 19431814 20078449 20633497 21128603 21588315 22007737 22425499 22831053
9361B2831053K69553J28264K64884O35321Q08441N85175L21694L96035O71583
9352B6912003P67069O04759M16940L90814N19340O58605O27699M36546M10436
9343C1744211P66362J104173Q28337J22575j47676L01858P44090O31221M22303
9334C6517454O42337Q92002O22732K51702M91698J038663J055277O62540P19182
9325D2893587J236248J358195J044248J313849K323751K626098J275092m86231
9317E3584837q78555j33399P277j055184k076785j993483j333149j137012j447832
9308D3536715j555435j170651o82481n00917o45197q76800r20411o54007k92116
9299C6238700k25281m95691o64206m45381k06288m44212r60452j072937o37322
$$ plain form
9361 22831053 23100606 23228870 23493754 24129075 24937516 25522691 25844385 26240420 26912003
9352 26912003 27679072 28283831 28700771 29091585 29610925 30269530 30897229 31333775 31744211
9343 31744211 32510573 33614746 34443083 34565658 34417982 34719840 35463930 36095151 36517454
9334 36517454 37159791 38051793 38674525 38926227 39417925 40456588 41511865 42174405 42893587
9325 42893587 44129835 45488030 46532278 47846127 50169878 52795976 54071068 53584837
9317 53584837 52706282 52572883 52580160 51524976 49448191 47454708 46121559 44984547 43536715
9308 43536715 41981280 40810629 40128148 39627231 38982034 38105234 37184823 36530816 36238700
9299 36238700 36013419 35517728 34853522 34408141 34201853 33757641 32797189 31724252 31086930
9290C1086930k96999n19290q87634p51973k32374m3897m51757r36310r55770n85496
9280B5425430k36119j11874j75186l54368n30997n35319l83362l29287m82222
9271B2286696n93313m53202k60759l07613n14244o07384n63746n21057m32736
9262A8032642k13952p0781k32806m80025m25602j79878j86080m30677m34055j03470
9252A5275316M5948k68506o28373n87932k98419j11098k1288R7237J01250j49285
9242A3454850m28744m50808k89582j67796r5628l5750j19542l46264l80261m3583
9232A1096892K83838J82000j64992k95083j84762j46757k20341j86376n6452m5612
9222A0262355j42889j61234j25314j78924k17951o0714J29237N2311j95698k63181
$$ plain form
9290 31086930 30789931 30270641 29383007 28631034 28398660 28354763 27903006 26966696 26010926 25425430
9280 25425430 25189311 25077437 24902251 24547883 24016886 23481567 23098205 22768918 22286696
9271 22286696 21693383 21240181 20979422 20671809 20157565 19550181 18986435 18465378 18032642
9262 18032642 17818690 17747909 17515103 17035078 16609476 16429598 16243518 15812841 15378786 15275316
9252 15275316 15321264 15052758 14424385 13836453 13538034 13426936 13405648 13502885 13604135 13454850
9242 13454850 13026106 12575298 12285716 12117920 12022292 11986542 11867000 11520736 11140475 11096892
9232 11096892 11380730 11562730 11397738 11102655 10917893 10771136 10550795 10364419 10307967 10262355
9222 10262355 10119466 9958232 9832918 9653994 9436043 9375329 9504566 9556877 9361179 9097998
9212I097998j15588j0066j0872K002k3175j69873k30170m3364P9044j22719k15566
9201H237651K44709O84504K08889q01961j011592j61881M99004J92857k85592
9192G806588q5261L11874J34309k82183k25592P0922k4906l07410j85006J46437
9182G359772J34134J7307L27615O31121J25702p39000p19679J44807M60825k47917
9172G494687p48939j70363N90494M29775k16873l13559L4720K9026k84913k17196
9162F626859J86756K14273j89066l17803J9820J99922m4915j53248J94767M29548
9152G166913O0597m30549l40874J24303K18671j37123k84502P2767M01790J80968
9142G032961l18709m49776q7372K79576K63187L1057l0692J39046K56535J15901
$$ plain form
9212 9097998 8982410 8972344 8961472 8963474 8940299 8770426 8540256 8496892 8575936 8453217 8237651
9201 8237651 8482360 9166864 9375753 8573792 7562200 7400319 7899323 8092180 7806588
9192 7806588 7721327 8033201 8167510 7885327 7659735 7730657 7705751 7398341 7213335 7359772
9182 7359772 7493906 7511213 7838828 8469949 8595651 7856651 7136972 7281779 7742604 7494687
9172 7494687 6745748 6575385 7165879 7595654 7378781 7065222 7099942 7128968 6844055 6626859
9162 6626859 6813615 7027888 6838822 6521019 6540839 6740761 6695846 6542598 6737365 7166913
9152 7166913 7227510 6796961 6456087 6580390 6799061 6661938 6377436 6450203 6851993 7032961
9142 7032961 6714252 6264476 6177104 6456680 6719867 6750924 6720232 6859278 7115813 7231714
9132G231714j69897l62261l57931j78687J39186M76657N56335J86898l90454o39870
9122F491690l39816J28956K65656N2953j48465j70747j73328k28173j47688J41996
9112E873034L81140L47788J82400Q4866m9251l37145m81102j20234M75792O07876
9102F965164J20126l43670k51153J22283K07847m5134k56101k26447o6248J03763
9092F330430K12621J45610q2754k00083k5728K07150J88454K682q6741j13650
9082F577991k36099k76374L5280M56348M48730Q441k88568j53475N6701R36j59789
9071F470122j72531j13723j14989o3268J32792L00532K83430J73620O7304r1720
9061F871569k47096j80717P1099J59082Q184N606L01528M21004J1937m68269l68168
$$ plain form
9132 7231714 7061817 6699556 6341625 6162938 6302124 6778781 7335116 7522014 7131560 6491690
9122 6491690 6151874 6280830 6546486 6599439 6450974 6280227 6106899 5878726 5731038 5873034
9112 5873034 6254174 6601962 6784362 6869228 6819977 6482832 6001730 5881496 6357288 6965164
9102 6965164 7085290 6741620 6490467 6612750 6820597 6775463 6519362 6292915 6226667 6330430
9092 6330430 6543051 6688661 6605907 6405824 6380096 6587246 6775700 6778382 6691641 6577991
9082 6577991 6341892 6065518 6100798 6557146 7005876 7014317 6725749 6572274 6628975 6629911 6470122
9071 6470122 6297591 6183868 6068879 6005611 6138403 6438935 6722365 6895985 6963289 6871569
9061 6871569 6624473 6443756 6514855 6673937 6682121 6687727 6989255 7410259 7422196 6953927 6585759
9050F585759J79126M77084K59786r2321k05174p0538J72281L70123L35865O8970
9040H080961j18118l9243J0341k46085m74896j94898L68740N35821J83069j51390
9030G954302j54408o1918n0884J5876J12590j7449k68045j67336K85385M50683
9020H098796N9271k74352k5741L61025J99778k98216l56227J37400M82345K42262
9010H626341j79591k11400J10602L07058J47454r1596l6068K61206L37501o4922
9000I206585n47749n03256L1455L81864K04219m0663J18118L72230J66809l07399
8990I082213l39269J68279M94544J95015k22459r0617L97817M91569O037m14094
8980I769035k29901K60535M00502Q3732k04171j35003J00661K26745K53163K35765
$$ plain form
9050 6585759 6764885 7241969 7501755 7409434 7204260 7133722 7306003 7676126 8011991 8080961
9040 8080961 7962843 7923600 7933941 7687856 7212960 7018062 7386802 7922623 8105692 7954302
9030 7954302 7799894 7737976 7687092 7702968 7815558 7798109 7530064 7362728 7648113 8098796
9020 8098796 8158067 7883715 7857974 8218999 8418777 8120561 7764334 7901734 8384079 8626341
9010 8626341 8446750 8235350 8345952 8653010 8800464 8708868 8672800 8934006 9271507 9206585
9000 9206585 8658836 8155580 8187035 8568899 8773118 8732455 8850573 9222803 9389612 9082213
8990 9082213 8742944 8911223 9405767 9600782 9378323 9287706 9685523 10177092 10183129 9769035
8980 9769035 9539134 9799669 10200171 10283903 10079732 9944729 10045390 10272135 10525298 10761063
8970A0761063O8021j91497j64021K57309N06425R9413m80374l68255L42662O84163
8960A1514909K91107j08284M0638K74237O3681k05522L6915M59849L55793j46287
8950A2577036k99068M0475K82978J45411q13J09807K54288K43174K01890J74822
8940A3730000J2317j93985j07569K49876M18731K20731M4143J77999L58753K67546
8930A5178542L0623r3227j24569j34964J7846L60567N38378K85309q6293q0890
8920A5891322K60605M38148K09872j30635k01097K0376K44577K08913o1602k58596
8910A6621883j05488K76939M42756J63492k32012k26380K39485O58822N34935
8901A8374432k7749m11168k05510K58281L02050j85599n65254l34999J78025L56214
$$ plain form
8970 10761063 10829084 10637587 10473566 10730875 11237300 11336713 10856339 10488084 10830746 11514909
8960 11514909 11806016 11697732 11738370 12012607 12076288 11870766 11907681 12367530 12723323 12577036
8950 12577036 12277968 12318443 12601421 12746832 12746019 12855826 13110114 13353288 13555178 13730000
8940 13730000 13742317 13548332 13440763 13690639 14109370 14330101 14374244 14552243 14910996 15178542
8930 15178542 15209165 15115938 14991369 14856405 14874251 15234818 15773196 16058505 15972212 15891322
8920 15891322 16151927 16590075 16799947 16669312 16468215 16488591 16733168 16942081 16880479 16621883
8910 16621883 16516395 16793334 17236090 17399582 17167570 16941190 17180675 17839497 18374432
8901 18374432 18346683 17935515 17730005 17988286 18290336 18104737 17539483 17204484 17382509 17738723
8891A7738723J74379M6146N4656l8402j59100P728L28297L11075l8049j78409
8881A8247044P668L648l38640m14028Q2937N04104K43013k83435l33522K4373
8871A7743162J97967N7780q1588j17498j19935L4914L44984L65312j05800m37826
8861A7881472n3401N18499M12738j18270j37052L23601L22129k61422m27048J90096
8851A8651342N99663J18123m37758j08770O05109N79751j27097m49967o475M62789
8841A9886710L53331q495n9754J63646K32279P735j95787m4300L73758N93623
8831B1302746L23791j21271j79868J72562L74013J26379j49796J1395M06282N27189
8821B2793422L30408J72084J76828J46245J1240n3228L6446J59606K33054L07749
$$ plain form
8891 17738723 17913102 17959248 18013904 17975502 17816402 17824130 18152427 18463502 18425453 18247044
8881 18247044 18254712 18258360 17919720 17505692 17588629 18092733 18335746 18052311 17718789 17743162
8871 17743162 17941129 17998909 17917321 17799823 17679888 17714802 18059786 18425098 18319298 17881472
8861 17881472 17828071 18346570 18759308 18641038 18503986 18827587 19149716 18888294 18461246 18651342
8851 18651342 19251005 19369128 18931370 18822600 19427709 20007460 19880363 19430396 19423921 19886710
8841 19886710 20240041 20231546 20171792 20335438 20567717 20575452 20379665 20335365 20709123 21302746
8831 21302746 21626537 21505266 21325398 21497960 21871973 21998352 21848556 21859951 22266233 22793422
8821 22793422 23123830 23295914 23472742 23618987 23630227 23576999 23613445 23773051 24006105 24313854
8811B4313854M13390M97984N07880M04926J90263J1275P6919L38422M69625L24051
8801B7548589J58548K06993L22103K95514K31506K87189L33043K32587J79273
8792B9795345L53545N16824L94399J96970K50061L51811J01907l07611l05773
8783C1347478J18457L83714K59072J47822K94649L92088K33970J35822L38676
8774C3651748N15813L06826n1990p9363K39320N03249M78749K75137O0722r0717
8764C5809494j30098l3184J54318L71824N61342N99626L95616J09000M3912K37084
8754C8118934L88704L05750J62309J85969L28717M08561L73738K83752K06653
8745D0763087K32770M04248N82349O08541O00329P81992J025470R67257O32957
$$ plain form
8811 24313854 24727244 25225228 25733108 26138034 26328297 26339572 26416491 26754913 27224538 27548589
8801 27548589 27707137 27914130 28236233 28531747 28763253 29050442 29383485 29616072 29795345
8792 29795345 30148890 30665714 31060113 31257083 31507144 31858955 31960862 31653251 31347478
8783 31347478 31465935 31849649 32108721 32256543 32551192 32943280 33177250 33313072 33651748
8774 33651748 34167561 34474387 34422397 34343034 34582354 35085603 35564352 35839489 35900211 35809494
8764 35809494 35679396 35646212 35800530 36172354 36733696 37333322 37728938 37837938 37881850 38118934
8754 38118934 38507638 38813388 38975697 39161666 39490383 39898944 40272682 40556434 40763087
8745 40763087 40995857 41400105 41982454 42590995 43191324 43973316 44998786 45966043 46599000
8736D6599000M69888O35573P73852O94057P05781R77969J147934R87944R04262
8727E3896260J246671J627503J544639J242250J260337J495102J467283J245903
8719F5025948J290206J545932J535681J268964J217164J386543J287190R14523
8711G5472151Q64534J253123J402126R48958M43452L96806N06603L58352J81026
8702H1827131K77559L43308O2802j64719J20774N12096L11813k87502m87817j54492
8692H2360953R7246p81j02791j17944m08689r11453r64938m06989l6808m54565
8682G9053241j127042j248264r67242r99405j395598j537086j223364r60375j081706
8673F8513159j271708j192193j031685j109119j332424j408283j327387j294612
$$ plain form
8736 46599000 47068888 47704461 48478313 49172370 49878151 50856120 52004054 52991998 53896260
8727 53896260 55142931 56770434 58315073 59557323 60817660 62312762 63780045 65025948
8719 65025948 66316154 67862086 69397767 70666731 71883895 73270438 74557628 75472151
8711 75472151 76336685 77589808 78991934 79940892 80384344 80781150 81287753 81646105 81827131
8702 81827131 82104690 82447998 82510800 82346081 82466855 82978951 83290764 83003262 82515445 82360953
8692 82360953 82458199 82457418 82354627 82236683 81827994 80916541 79951603 79544614 79507806 79053241
8682 79053241 77926199 76677935 75710693 74711288 73315690 71778604 70555240 69594865 68513159
8673 68513159 67241451 66049258 65017573 63908454 62576030 61167747 59840360 58545748
8665E8545748j330969j260181j027874p81257o48071o24787o70002p50093q03854
8656E0648660p96081p83215q01504p44796n20262k78206k65894m47956n20829
8647D5489917l69746k41553l13715l63702j39460J41959L9434m27724p26905n17827
8637D2570678p7192J31824L2698j28343j91975j73835q8275M9862J16230J897
8627D2243569j87482k50751j67995p3635j1102P4601J47664J21368O3559J15662
8617D2075458K17202J78365L0915M242J15817J25780j2888k9834J79308L24476
8607D3208841K04981M7061O7493Q5882m6453k1871L99595P75087N45514L640o0630
8596D5209140L84901N44702R8374k77307k1207M56247N30169L13804K46849K74907
$$ plain form
8665 58545748 57214779 55954598 54926724 54145467 53497396 52872609 52202607 51452514 50648660
8656 50648660 49852579 49069364 48267860 47523064 47002802 46724596 46458702 46010746 45489917
8647 45489917 45120171 44878618 44564903 44201201 44061741 44203700 44243134 43815410 43088505 42570678
8637 42570678 42493486 42625310 42658008 42529665 42337690 42163855 42075580 42125442 42241672 42243569
8627 42243569 42056087 41805336 41637341 41563706 41552604 41627205 41774869 41896237 41959796 42075458
8617 42075458 42292660 42471025 42501940 42506182 42621999 42747779 42734891 42705057 42884365 43208841
8607 43208841 43413822 43460883 43528376 43614258 43567805 43545934 43945529 44720616 45266130 45269770 45209140
8596 45209140 45594041 46138743 46237117 45959810 45938603 46394850 46925019 47238823 47485672 47760579
8586D7760579J25621j4670J74073M52673L86341J54823K33041M54430K42730k96468
8576D9673173m25076P777L10430J32502j1376K17440L09777j32758n39089k34301
8566D9308499L96308M44405j61883o44106n43782j66862Q1619J46234P5221j19379
8556D8816274k86068k49709j22719j27800j77583m6500J34337M3532k22856k37936
8546D7522972M7148K04836J2490k61721l48739k83890j28363J32108K99466Q2381
8536D7278688l39111l86442O3725M13107K13531j85979k26647N3119K22065J46360
8526D7252416M7862P9222J94884K96831K67959M7160j60030k6328L69244N21502
8516D8890722K29624p2618p701J91151K07467K35257N15023P17522M50569M9435
$$ plain form
8586 47760579 47886200 47871530 48045603 48498276 48884617 49039440 49272481 49726911 49969641 49673173
8576 49673173 49248097 49255874 49566304 49698806 49687430 49904870 50214647 50081889 49542800 49308499
8566 49308499 49704807 50149212 49987329 49343223 48799441 48632579 48714198 48860432 48935653 48816274
8556 48816274 48530206 48280497 48157778 48029978 47852395 47805895 47940232 47983764 47760908 47522972
8546 47522972 47570120 47774956 47787446 47525725 47176986 46893096 46764733 46896841 47196307 47278688
8536 47278688 46939577 46553135 46616860 47029967 47243498 47057519 46830872 46883991 47106056 47252416
8526 47252416 47300278 47379500 47574384 47871215 48139174 48186334 48026304 47999976 48369220 48890722
8516 48890722 49120346 49047728 49040027 49231178 49438645 49673902 50188925 50906447 51357016 51406451
8506E1406451J28880N61645O73263L48857J48807L07905M24709K97322K92677
8497E4590516N98966Q10406O41987M48061N73504P21228N07805K23911M12586
8488E9528970R40829J135182P75168L65470L38568M90278M31612K38553L18090
8479F4562720P67640J177182J115289O23338J10171j40021j85104j75460j10263
8470F7745492M3505J64268J03474q2910k09016k13948j89604k10396k77250l65647
8460F6507968m09072l41937k67551l90833o31103n86547j53290J47143j20893
8451F3753885n70205n30073r5632N7796j95681k91088l0481O7972k45858m38010
8441F1482625j24669J94753m1671m70258l54557K44995N86100L42702p2654k19611
$$ plain form
8506 51406451 51535331 52096976 52770239 53119096 53267903 53575808 54000517 54297839 54590516
8497 54590516 55189482 55999888 56641875 57089936 57663440 58384668 58892473 59116384 59528970
8488 59528970 60469799 61604981 62380149 62745619 63084187 63574465 64006077 64244630 64562720
8479 64562720 65330360 66507542 67622831 68246169 68356340 68216319 68031215 67855755 67745492
8470 67745492 67788997 67953265 68056739 67973829 67764813 67550865 67361261 67150865 66873615 66507968
8460 66507968 66098896 65756959 65489408 65098575 64467472 63880925 63727635 63874778 63753885
8451 63753885 63183680 62653607 62557975 62615771 62420090 62129002 62098521 62166493 61920635 61482625
8441 61482625 61357956 61552709 61511038 61040780 60686223 60931218 61517318 61860020 61787366 61567755
8431F1567755r7956J07843K98768M23256M74802N22063N44355L89042J09521P9326
8421F4418775M53547Q12465P47001N05165N64818Q36220Q81276P26279P90006
8412G0735552J091294J214732J080064J071980J307103J427685J299072J281436
8404H0508918J552894J751912J626353J509910J744787K064962K010132J639494
8396I4409362J384816J404865J497318J515826J503697J474378J357103J147537
8388A05694902R15529O94361M94644L54934K61724J07886j62145m47780o10247
8379A07303808o18115n49709n46110p27870j010896j088549q28469n77160p18467
8370A00638463j013706q69458k87192L4534k62235o42484n20394j24439j7950
$$ plain form
8431 61567755 61469799 61577642 61876410 62299666 62774468 63296531 63840886 64229928 64339449 64418775
8421 64418775 64872322 65684787 66431788 66936953 67501771 68337991 69219267 69945546 70735552
8412 70735552 71826846 73041578 74121642 75193622 76500725 77928410 79227482 80508918
8404 80508918 82061812 83813724 85440077 86949987 88694774 90759736 92769868 94409362
8396 94409362 95794178 97199043 98696361 100212187 101715884 103190262 104547365 105694902
8388 105694902 106610431 107304792 107799436 108154370 108416094 108523980 108361835 107914055 107303808
8379 107303808 106685693 106135984 105589874 104862004 103851108 102762559 101934090 101356930 100638463
8370 100638463 99624757 98755299 98468107 98502641 98240406 97597922 97077528 96953089 96935139
8361I6935139j71817j33117J23088J66646j06100k54689K6434M61640O09249M16579
8351I8073052J76120J10895J52467O7287k37787n27826m68539j14040L8642l24254
8341I6946017q60328j025933q43811q18539j139184j421415j354538j186194j296567
8332H6999508j589944j677352j527868j527650j835270k058376j823350j403150
8324G3556548j375268j745666j908376j589957j304092j519777j854164j663424
8316F0595824j108589r11748j189796j326035j051176q34165r65619j042865p63460
8307E1402371n17325o75445r13410q29739o81366q43452j025538p71686l58082
8298D4786328l87578p46996p91520m32971k28326l93697n04582k95391q4000j90833
$$ plain form
8361 96935139 96763322 96630205 96753293 96919939 96813839 96559150 96585584 97047224 97656473 98073052
8351 98073052 98249172 98360067 98512534 98579821 98342034 97814208 97345669 97231629 97270271 96946017
8341 96946017 96085689 95059756 94215945 93397406 92258222 90836807 89482269 88296075 86999508
8332 86999508 85409564 83732212 82204344 80676694 78841424 76783048 74959698 73556548
8324 73556548 72181280 70435614 68527238 66937281 65633189 64113412 62259248 60595824
8316 60595824 59487235 58575487 57385691 56059656 55008480 54174315 53208696 52165831 51402371
8307 51402371 50885046 50209601 49296191 48466452 47785086 46941634 45916096 45144410 44786328
8298 44786328 44398750 43651754 42860234 42427263 42198937 41805240 41300658 41005267 40921267 40730434
8288D0730434m48531n04777k71062M7726J45849j14031m36249l41130Q3822J38198
8278C9030249l79434o37409m3050O12575L05878m76960m66485K59266M21333k12623
8268C8413340m17246L04406Q06335K90018l31286o5833M89578L26729k19347k29064
8258C9367630J31895R0784k08928o8689L05884J07902n35220o85616k06674L3352
8248C8332320l20385n83547k95306M7934q0967m37160n67162n10358n21471n86188
8238C4477710n54726m10263k10252m9947j16977m52560p21549o06273l09336k29885
8228C0815942l19274k75497j75359l02080n12744m31240j32781J2533K089L0124
8218B8711713q3954m99313o90261j56567M73491K14279n83000o62463L4061K45749
$$ plain form
8288 40730434 40281903 39777126 39506064 39553790 39699639 39585608 39149359 38808229 38892051 39030249
8278 39030249 38650815 38013406 37970356 38582931 38888809 38411849 37945364 38204630 38625963 38413340
8268 38413340 37996094 38300500 39106835 39396853 39065567 38999734 39489312 39816041 39596694 39367630
8258 39367630 39499525 39590309 39381381 39312692 39618576 39726478 39191258 38505642 38298968 38332320
8248 38332320 38011935 37428388 37133082 37181016 37100049 36662889 36095727 35585369 35063898 34477710
8238 34477710 33922984 33512721 33302469 33252522 33135545 32682985 31961436 31355163 31045827 30815942
8228 30815942 30496668 30221171 30045812 29743732 29230988 28799748 28666967 28679500 28681589 28711713
8218 28711713 28627759 28128446 27438185 27281618 27755109 27969388 27386388 26723925 26757986 27003735
8208B7003735l83239o33746J22975P32559K06130n93210m47467K37564L36172
8199B6581473p2036j46719O8354n8127l18175k8139N08067L70922k97402m26961
8189B6181257J64849M93647J23181j76867J36387M90530K87594j10464j16136
8180B7473978J30899J76228M9858P7983K84843M35701M02762K03529n7049j25723
8170B9053009J90004O44169P54051M65878K21637K91872M73467N33111N10468
8161C3137666M81314M29717M27694N58047O62663N75453N10688P20749R23857
8152C8427848P17814M08178O07682J084943R89287L14851O6192O52219J189503
8143D4458517R28810L76348K99814M97923L88598J09857J43258L71724L73007
$$ plain form
8208 27003735 26620496 25986750 26109725 26842284 27048414 26455204 26007737 26245301 26581473
8199 26581473 26509437 26362718 26431072 26372945 26054770 26026631 26534698 26905620 26608218 26181257
8189 26181257 26346106 26839753 26962934 26786067 26922454 27412984 27700578 27590114 27473978
8180 27473978 27604877 27781105 27830963 27908946 28193789 28629490 29032252 29235781 29178732 29053009
8170 29053009 29243013 29887182 30641233 31107111 31328748 31620620 32094087 32627198 33137666
8161 33137666 33618980 34048697 34476391 35034438 35697101 36272554 36783242 37503991 38427848
8152 38427848 39145662 39553840 40161522 41246465 42235752 42550603 42616795 43269014 44458517
8143 44458517 45387327 45763675 46063489 46561412 46950010 47059867 47203125 47574849 47947856
8134D7947856K39572L05232M13256K23251o8891m7242J86358K80009L06524M65647
8124E0251572M79799P1621l06163q5064L78583L19380j26742j70072K10396K30954
8114E1254264k58490m65734n7671K28684j55839o60143n80141j43787J3083j34111
8104D9040115j64120J7798J59546J37197P279j66208k21663N1603N05892O57050
8094E0024489L88070J91239L97150O59875O12443N18667P38655R99386Q40509
8085E5370483M60463M38001Q06803J069480J033099R96647J121658J212483J192732
8076F3701849J274304J525374J707273J678592J598912J617120J684915J769900
8068G6558239J931696K102407K118290K061391K228264K633969K895572K790625
$$ plain form
8134 47947856 48187428 48492660 48905916 49129167 49060276 49013034 49199392 49479401 49785925 50251572
8124 50251572 50731371 50802992 50496829 50411765 50790348 51109728 50982986 50812914 51023310 51254264
8114 51254264 50995774 50530040 50472369 50701053 50545214 49885071 49304930 49161143 49174226 49040115
8104 49040115 48875995 48893793 49053339 49190536 49197815 49031607 48809944 48861547 49367439 50024489
8094 50024489 50412559 50603798 51000948 51660823 52273266 52791933 53530588 54529974 55370483
8085 55370483 55830946 56268947 57075750 58145230 59178329 60174976 61296634 62509117 63701849
8076 63701849 64976153 66501527 68208800 69887392 71486304 73103424 74788339 76558239
8068 76558239 78489935 80592342 82710632 84772023 87000287 89634256 92529828 95320453
8060I5320453K600440K653299K820689K788772K616963K641076K898503L032519
8052A17372714K829621K533063K456759K516453K391065K045155J806219J877998
8044A35829047K024406J903011J555198J334474J398202J506826J373221J024735
8036A47949120P22737O33363O64554N88965L09739J0931n7778K16k43033q82916
8026A49695898j345692j144859p41517r90965j792391k123485j629630j269841
8018A38657518j831474k629566k554206j820109j598826k193570k724405k647503
8010A20657859k468756k644119k773928k440888k065704k245126k769178k980293
8002A00269867k759371k511127k402672k245517k034820k021132k203778k227297
$$ plain form
8060 95320453 97920893 100574192 103394881 106183653 108800616 111441692 114340195 117372714
8052 117372714 120202335 122735398 125192157 127708610 130099675 132144830 133951049 135829047
8044 135829047 137853453 139756464 141311662 142646136 144044338 145551164 146924385 147949120
8036 147949120 148671857 149305220 149969774 150558739 150868478 150879409 150821631 150821847 150578814 149695898
8026 149695898 148350206 147205347 146463830 145472865 143680474 141556989 139927359 138657518
8018 138657518 136826044 134196478 131642272 129822163 128223337 126029767 123305362 120657859
8010 120657859 118189103 115544984 112771056 110330168 108264464 106019338 103250160 100269867
8002 100269867 97510496 94999369 92596697 90351180 88316360 86295228 84091450 81864153
7994H1864153j909397j526147j411282j502565j466034j176298r14930j025278
7986G0932222j409362j542245j135751o12227n89427r91388j143876p92937m60386
7977F2254623n62904p68126o54969m88161p18939j087702r60657l94146j06020
7968E6512999l60780o00877l87631q0339k12992o44524p82235m36804m3828m6628
7958E2916361l36824m35726j52937J17675p3066n08873n05930O3670M46686P3147
7948E1604183n37915n45419q0596L9161l08774m26791j06561l4041n40969r16438
7938D8145840n63245l9083j76282p59206r27262n09216j12147r8342k62762m25247
7928D4273048o18291p12653n13822k42957l21541o60751p46044m54924k10435
$$ plain form
7994 81864153 79954756 78428609 77017327 75514762 74048728 72872430 71957500 70932222
7986 70932222 69522860 67980615 66844864 66232637 65643210 64651822 63507946 62715009 62254623
7977 62254623 61691719 60923593 60268624 59780463 59061524 57973822 57013165 56619019 56512999
7968 56512999 56152219 55551342 55163711 55083372 54870380 54225856 53443621 53006817 52962989 52916361
7958 52916361 52579537 52143811 51990874 52108549 52035483 51526610 51020680 51084350 51531036 51604183
7948 51604183 51066268 50520849 50440253 50479414 50170640 49743849 49637288 49603247 49062278 48145840
7938 48145840 47582595 47543512 47367230 46608024 45680762 45171546 45059399 44961057 44698295 44273048
7928 44273048 43654757 42942104 42428282 42185325 41863784 41203033 40456989 40002065 39791630
7919C9791630k70779m38836n41920o24624n96882k99707q864k05266o97792p05418
7909C5401542o7661L89015Q7374m41611m70057j58750n8793j08268P7899L29666
7899C4980356J80628k27969l13116q456J99446J50745J92569M33244N11804K57444
7889C6356695j3916l2535R3104K03395K75750K05033j04456l60715j53248L08118
7879C6777225L43214j50745m74267k15561J27326J6822k93279l33801k45266l81083
7869C5170585n55071m04844j62333l00310o30949n45485o8724J14227k50176o03576
7859C1763344m83805j60771o4268j22365n4740P7195K7107j76634k90043k26634
7849C0288386q7942O9231K51090L77966L23521R7675j28120j80255k9684J86924
$$ plain form
7919 39791630 39520851 39082015 38540095 37915471 37318589 37018882 37010018 36804752 36106960 35401542
7909 35401542 35333881 35722896 35810270 35368659 34898602 34739852 34681059 34572791 34650690 34980356
7899 34980356 35160984 34933015 34619899 34611443 34810889 34961634 35154203 35587447 36099251 36356695
7889 36356695 36342779 36310244 36403348 36606743 36882493 37087526 36983070 36622355 36469107 36777225
7879 36777225 37120439 36969694 36495427 36279866 36407192 36424014 36130735 35796934 35551668 35170585
7869 35170585 34615514 34210670 34048337 33748027 33117078 32571593 32502869 32617096 32366920 31763344
7859 31763344 31279539 31118768 31054500 30932135 30877395 30954590 30981697 30805063 30515020 30288386
7849 30288386 30200444 30269675 30520765 30898731 31222252 31319927 31191807 31011552 30981868 31168792
7839C1168792K89952K51742K32630L49846M92615M87064L41934J75146L1587k1219
7829C3800089K01872O90251J001442P63480L02190K58230O20090P43310M11728
7820C8792682J96893M89552Q42437P45900M95400O71608J154152J336760J105769
7811D5831153R30950J055033J214760J206473J185301J291047J424582J522187
7803E5661486J672669J847024J862782J734670J729132J938293K109714K054821
7795G0610591J950228K047863K292654K411887K270214K023911J979114K282666
7787H7869128K669042K645300K114882J623270J654465J881909J612779Q55051
7779A02925826K97855J94945P045n93132j106774j088579j000116j499698k323807
$$ plain form
7839 31168792 31458744 31710486 31943116 32292962 32785577 33272641 33614575 33789721 33821308 33800089
7829 33800089 34001961 34692212 35693654 36457134 36759324 37017554 37637644 38380954 38792682
7820 38792682 38989575 39479127 40321564 41067464 41562864 42234472 43388624 44725384 45831153
7811 45831153 46762103 47817136 49031896 50238369 51423670 52714717 54139299 55661486
7803 55661486 57334155 59181179 61043961 62778631 64507763 66446056 68555770 70610591
7795 70610591 72560819 74608682 76901336 79313223 81583437 83607348 85586462 87869128
7787 87869128 90538170 93183470 95298352 96921622 98576087 100457996 102070775 102925826
7779 102925826 103223681 103418626 103425671 102832539 101725765 100637186 99637070 98137372 95813565
7770I5813565k661504k417562k300655k669384l038455k909745k490070k296253
7762G5029937k465549k735356k822901k618533k227356j949268j997750k174685
7754E6038539k090423j739625j509437j549401j557568j347689j170937j207055
7746D3866404j185414q95660o71812q71225j188053j074839o47451n13652p62280
7737C6056018q26188m70965k33922n59457j060414j085642o31030k26069j86454
7728C0775877m08787o85595q07839n63436p2855Q1189m31179j019164q34883k6300
7718B6007028L80071p3146o87502p26895l99756k80797l77960l65734k78106l27729
7708B2869474l76185k20542j23856m01987p24320n38540j5134J87547k2041j65590
$$ plain form
7770 95813565 93152061 90734499 88433844 85764460 82726005 79816260 77326190 75029937
7762 75029937 72564388 69829032 67006131 64387598 62160242 60210974 58213224 56038539
7754 56038539 53948116 52208491 50699054 49149653 47592085 46244396 45073459 43866404
7746 43866404 42680990 41785330 41113518 40242293 39054240 37979401 37331950 36818298 36056018
7737 36056018 35229830 34758865 34524943 33965486 32905072 31819430 31188400 30962331 30775877
7728 30775877 30367090 29681495 28873656 28310220 28237365 28318554 27887375 26868211 26033328 26007028
7718 26007028 26387099 26313953 25626451 24899556 24499800 24219003 23841043 23475309 23197203 22869474
7708 22869474 22493289 22272747 22148891 21746904 21022584 20484044 20468910 20656457 20634416 20468826
7698B0468826j75260m39842q03234n58718K53914N79826r5105q58258p24533m5352
7688A7602264K43932N9059p7853j25870l50512m95486j77719J97818k3147n21190
7678A6331296m32067J36537K15794l68017o89501k99818J12068K7449j04817P2921
7668A5001845Q6796l41888n53919q6007L62807O1884m57142l24702J25191k7466
7658A3847399o01272n83549J07075M61799N3207l74438k58375m0835j86748l34410
7648A2089853l4073L80092L12364j57244m34007k35818J67564L60263J54722k70042
7638A2333674m76592k34355J15116R2869j73821j51662J65896J94392k34580n32308
7628A1098629l20223j7745l1145n4982K36582M36710P9004m27907l62929J32335
$$ plain form
7698 20468826 20293566 19853724 19050490 18491772 18745686 19325512 19230407 18372149 17647616 17602264
7688 17602264 17846196 17905255 17827402 17701532 17351020 16855534 16677815 16875633 16852486 16331296
7678 16331296 15899229 16035766 16251560 15883543 15194042 14894224 15006292 15033741 14928924 15001845
7668 15001845 15088641 14746753 14192834 14106827 14469634 14531518 14074376 13749674 13874865 13847399
7658 13847399 13246127 12662578 12769653 13231452 13284659 12910221 12651846 12611011 12424263 12089853
7648 12089853 12055780 12435872 12748236 12590992 12156985 11921167 12088731 12448994 12603716 12333674
7638 12333674 11857082 11622727 11737843 11830712 11656891 11505229 11671125 11865517 11630937 11098629
7628 11098629 10778406 10760661 10729516 10674534 10911116 11347826 11426830 10998923 10635994 10768329
7618A0768329K87887n6679k90866q8613J73370J67727P3535O6331l5282l19837
7608A0745902m64962j96170K68197M99377L46152k9961l68235m30358j54074K03035
7598A0418903K96848J27516j4104k8858q7443j93599j02729J85524K92430N0285
7588A0944773j76122n8838J65800J11212j17104j34224O4056J28166k6300q7514
7578A0813905J05416K82550J75945o2749j09536M1625J00732m3498j27991Q6686
7568A1263085L95134L66792l6616l51399k48326R87l0274k37367j65010K13272
7558A1170278L98747J39183j84754j70435L0764P3463O064Q3860K30736J53919
7548A1931825r8491j45384J31101L78607K78334l4260k06395j22986M6647J42855
$$ plain form
7618 10768329 11056216 10999537 10708671 10620058 10793428 10961155 11034690 11101021 11065739 10745902
7608 10745902 10280940 10084770 10352967 10852344 11198496 11168535 10800300 10369942 10215868 10418903
7598 10418903 10715751 10843267 10829163 10800305 10712862 10519263 10416534 10602058 10894488 10944773
7588 10944773 10768651 10709813 10875613 10986825 10869721 10735497 10799553 10927719 10901419 10813905
7578 10813905 10919321 11201871 11377816 11315067 11205531 11247156 11347888 11304390 11176399 11263085
7568 11263085 11658219 12025011 11988395 11636996 11388670 11389657 11359383 11122016 10957006 11170278
7558 11170278 11569025 11708208 11523454 11353019 11383783 11457246 11463310 11547170 11777906 11931825
7548 11931825 11833334 11687950 11819051 12197658 12475992 12441732 12235337 12112351 12158998 12301853
7538A2301853J84353K49092L06479K51530Q6974l9745m9086n9709j59711j77957
7528A2894073N4944L13380K26165q3770q0493L36818N88132K99612q1002n501
7518A4462358K92714K37334r9839j49465J75130L71042K09401K5145N8257J37657
7508A5719734J59763K72057L98188J98051k44097l12770K02261O53366M80029
7499A7526582P0529J01992M53691M70768O7173j50477J67579O46940P73178N01763
7489B0629718J65053P7642L03453N90634N59669J70496j11383J07625N61925O93363
7479B3748195M71655L72735N80931P46295O32003M95921O17406Q65816R95127
7470B9526084J018940J025803R32384P15142O24863Q52687J186490J314437J297015
$$ plain form
7538 12301853 12486206 12735298 13041777 13293307 13380281 13340536 13291450 13231741 13072030 12894073
7528 12894073 12949017 13262397 13488562 13404792 13324299 13661117 14249249 14548861 14467859 14462358
7518 14462358 14755072 14992406 14892567 14743102 14918232 15289274 15498675 15523820 15582077 15719734
7508 15719734 15879497 16151554 16549742 16747793 16503696 16190926 16393187 17046553 17526582
7499 17526582 17597111 17699103 18152794 18623562 18690735 18540258 18707837 19354777 20127955 20629718
7489 20629718 20794771 20872413 21175866 21766500 22326169 22496665 22385282 22492907 23054832 23748195
7479 23748195 24219850 24592585 25173516 25919811 26551814 27047735 27665141 28530957 29526084
7470 29526084 30545024 31570827 32503211 33218353 33843216 34695903 35882393 37196830 38493845
7461C8493845J406110J636826J754154J758707J908505K238890K436914K334250
7453E3968201K205259K338726K531857K307856J561015P09893J76771p0523l66801
7444F5362254q96690j522223j972798k079523j871902j561918j399516j429078
7436E2628606j421278j166489p82463n58814n40230n05340l67414k96221l43332
7427D6647025k71164L1949K59518J19611j62020j43137J68541L56098K53521J50375
7417D7410317K82480M95622N54367M84072M32841M22144M17832M89499P15432
7408E1704606R92834J072964Q14878M07293K88048O78011J179625J150393O26937
7399E8915589M41670J036115J632260J282647M08511L19828J244371J937115J562198
$$ plain form
7461 38493845 39899955 41536781 43290935 45049642 46958147 49197037 51633951 53968201
7453 53968201 56173460 58512186 61044043 63351899 64912914 65622807 65799578 65729055 65362254
7444 65362254 64465564 62943341 60970543 58891020 57019118 55457200 54057684 52628606
7436 52628606 51207328 50040839 49258376 48699562 48159332 47653992 47286578 46990357 46647025
7427 46647025 46375861 46407810 46667328 46786939 46624919 46481782 46650323 47006421 47259942 47410317
7417 47410317 47692797 48188419 48742786 49226858 49659699 50081843 50499675 50989174 51704606
7408 51704606 52697440 53770404 54585282 54992575 55280623 55958634 57138259 58288652 58915589
7399 58915589 59357259 60393374 62025634 63308281 63716792 64036620 65280991 67218106 68780304
7390F8780304Q81427R26510J432130J518847J240832J335578J801052J885320
7382G9802000J448199J260288J742752K315226K352236K066198K009035K242289
7374I5238223K457155K549919K669352K910922L244069L576908L753968L714683
7366A20115199L731451M172541M924444N423291N432070N408089N855037O651888
7358A61714010P323867P707787Q029462Q506365R160007R902878J0601363J1163371
7350B34109110J1695092J2406700J3261524J3952918J4341668J4598685J4709160
7343C29074857J4173908J2540287R997470P092588M032104O51506l001348o446601
7335C68114771r214454j1263331j2851147j4105725j4820643j4714087j3897559
$$ plain form
7390 68780304 69661731 70588241 72020371 73539218 74780050 76115628 77916680 79802000
7382 79802000 81250199 82510487 84253239 86568465 88920701 90986899 92995934 95238223
7374 95238223 97695378 100245297 102914649 105825571 109069640 112646548 116400516 120115199
7366 120115199 123846650 128019191 132943635 138366926 143798996 149207085 155062122 161714010
7358 161714010 169037877 176745664 184775126 193281491 202441498 212344376 222945739 234109110
7350 234109110 245804202 258210902 271472426 285425344 299767012 314365697 329074857
7343 329074857 343248765 355789052 365786522 372879110 376911214 377562720 374561372 368114771
7335 368114771 358900317 347636986 334785839 320680114 305859471 291145384 277247825
7328B77247825j2947863j2329111j1870852j1139708j0227752r677503r585190
7321A99469846r373816q689782p942115p577527p369282o927092o421999o187467
7313A38980766o001204n469405m835088m643631m778138m610023m039787l600434
7305A01003056l505505l391127l118981l026413l140445k936557k261408j780893
7297G7841727k012948k508439k543024k132499j782910j642191j520554j449436
7289F2249726j581839j720610j547205j212704j138977j302441j286194j037456
7281E1422300r75404j226704j332786r96088o38755q00024j277026j356011q24938
7272D1994564k94086l66884q33598r98411o55113l36601n08515q93185r08365
$$ plain form
7328 277247825 264299962 251970851 240099999 228960291 218732539 209055036 199469846
7321 199469846 190096030 181406248 173464133 165886606 158517324 151590232 145168233 138980766
7313 138980766 132979562 127510157 122675069 118031438 113253300 108643277 104603490 101003056
7305 101003056 97497551 94106424 90987443 87961030 84820585 81884028 79622620 77841727
7297 77841727 75828779 73320340 70777316 68644817 66861907 65219716 63699162 62249726
7289 62249726 60667887 58947277 57400072 56187368 55048391 53745950 52459756 51422300
7281 51422300 50446896 49220192 47887406 46891318 46252563 45452539 44175513 42819502 41994564
7272 41994564 41700478 41333594 40499996 39501585 38846472 38509871 38001356 37108171 36199806
7263C6199806n41233l36797n59521q39305p84917n37326m59457n82571o65656
7254C0893023o12700n43514n52109o06000o14402m90960k80068k54126o15026
7245B6324118j036364r12921k57785J31952k31573p53248o30776r6569k9571n37222
7235B1970041p98554l90478P3268n0954m87493n84155l06188j28962k27920l26590
7225A8742015k52416j77795k71335m38917m96371l94992k08964l5364M4010q317
7215A6501554j51412k92244l51162l02586j94044j30689j78038k64032k43359
7206A4393988q2737P2084M0031k03159m67158m87551j99031J23910J30418j67305
7196A3153490m02751l69684k63073k56227j71741J23957L17101Q1644l17685l77448
$$ plain form
7263 36199806 35658573 35321776 34762255 33922950 33138033 32600707 32141250 31558679 30893023
7254 30893023 30280323 29736809 29184700 28578700 27964298 27473338 27193270 26939144 26324118
7245 26324118 25287754 24374833 24117048 24249000 24017427 23264179 22633403 22536834 22507263 21970041
7235 21970041 21171487 20781009 20854277 20803323 20315830 19731675 19425487 19296525 19068605 18742015
7225 18742015 18489599 18311804 18040469 17601552 17105181 16710189 16501225 16465861 16509871 16501554
7215 16501554 16350142 16057898 15706736 15404150 15210106 15079417 14901379 14637347 14393988
7206 14393988 14311251 14383335 14423366 14220207 13753049 13265498 13066467 13190377 13320795 13153490
7196 13153490 12750739 12381055 12117982 11861755 11690014 11813971 12131072 12212716 11895031 11517583
7186A1517583j43427o2789j65267q1537J31547k4729n15032o01985k0117M60341
7176A0494588J79885l93612m71913j74427j27773k87153j09146L23106L37403
7167I770958j54294m49357k06115M4690j34034l67448j89676J36583J05661j64623
7157H392345j83603N0075O6767k60850m84968k58702J76832L52696J40214k13434
7147G777372m30090m15003k37303m3794M6038M3207N2988R0876K0977k21206m24645
7136F259417l04040Q6828L43681K06911j16145k73977k28026j53052n7041J44626
7126E909182K71119M0545l74152m31995k1054L05167J46012j55985j16742J19270
7116E691367J02065j53718k76312j98976j52730j46335k0490Q6500q0916l15140
$$ plain form
7186 11517583 11374156 11311367 11146100 11064563 11196110 11171381 10656349 10054364 10034247 10494588
7176 10494588 10674473 10280861 9808948 9634521 9506748 9219595 9110449 9433555 9770958
7167 9770958 9616664 9167307 8961192 9005882 8871848 8504400 8314724 8451307 8556968 8392345
7157 8392345 8208742 8258817 8325584 8064734 7579766 7321064 7497896 7850592 7990806 7777372
7147 7777372 7347282 6932279 6694976 6651182 6697220 6740427 6793415 6884291 6905268 6684062 6259417
7136 6259417 5955377 6042205 6385886 6592797 6476652 6202675 5974649 5821597 5764556 5909182
7126 5909182 6180301 6220846 5846694 5414699 5393645 5698812 5844824 5688839 5572097 5691367
7116 5691367 5793432 5639714 5363402 5164426 5011696 4865361 4844871 4931371 4850455 4535315
7106D535315j77091J99261K16945j83637l55461M029L42858J62312j98962j75319
7096D370250J33688K24626m595k26429k31883q3297R5045J57945n319k05238o9888
7085D154905L08212K97929l09379p75376m20672L07055M93930J26504n9318J17844
7075D241634J05153k38747l08614J52406M97408J86452l50438m28434j37464k0885
7065C698471j17774k3786K73642L03050j06487m98315m24833k9352K32390K01417
7055C508423R6850J09670J65770J17064j6509j15976j74942k70804l47771k37918
7045B833857M0984K25843J71933N9304O3737O4922o4170j32377L8269J70936j02910
7034C370328n61145o04540j34970L18717L97677K79988J56732n0714k59758j50082
$$ plain form
7106 4535315 4358224 4557485 4774430 4590793 4235332 4239361 4582219 4744531 4545569 4370250
7096 4370250 4503938 4728564 4723969 4497540 4265657 4182360 4277405 4435350 4430031 4224793 4154905
7085 4154905 4463117 4761046 4451667 3676291 3255619 3562674 4056604 4183108 4123790 4241634
7075 4241634 4346787 4108040 3799426 3951832 4449240 4635692 4285254 3856820 3719356 3698471
7065 3698471 3580697 3556911 3830553 4133603 4027116 3528801 3103968 3074616 3307006 3508423
7055 3508423 3605273 3714943 3880713 3997777 3981268 3865292 3690350 3419546 3071775 2833857
7045 2833857 2874841 3100684 3272617 3331921 3395658 3460580 3396410 3264033 3302302 3473238 3370328
7034 3370328 2809183 2204643 2069673 2388390 2786067 3066055 3222787 3172073 2912315 2762233
7024B762233J80700J32785m02100o23369k356P24030N50630k47607n28770l1526
7014B514650L37438K5452l87632k81087L1974l450j96254k6474L70856L88946
7004B774419m9546l59031j87393J26869J58794P770K5892K22334K74984M2789
6994C037881k30347k71292j20986P036N7702J11188J02783j29731m48863m06288
6984A709083J25260N94455M35396r6397k52745R7245K84211q4115m78971k86807
6974B046615K05583K63491j32185k72232J33936M71035J43684n11234o76248j69909
6964A502536L54216L13367r3328k59473j3904K19534Q4550j98929j86770J28714
6954A850513L41174K61350J29477J01077m1297l79163m75789K260N61972M31855
$$ plain form
7024 2762233 2942933 3075718 2673618 2050249 2047893 2771923 3322553 3074946 2546176 2514650
7014 2514650 2852088 2877540 2489908 2208821 2240795 2237345 2041091 2014617 2385473 2774419
7004 2774419 2724873 2365842 2178449 2305318 2464112 2471882 2497774 2720108 2995092 3037881
6994 3037881 2807534 2536242 2415256 2422292 2479994 2591182 2693965 2564234 2115371 1709083
6984 1709083 1834343 2428798 2864194 2767797 2515052 2612297 2896508 2812393 2333422 2046615
6974 2046615 2252198 2515689 2383504 2111272 2245208 2716243 2859927 2348693 1672445 1502536
6964 1502536 1856752 2170119 2076791 1817318 1803414 2022948 2107498 1908569 1721799 1850513
6954 1850513 2191687 2453037 2582514 2683591 2642294 2263131 1787342 1789602 2351574 2783429
6944B783429k51498n33233m7760M19310J58307l75345l48370R3738J20088l60739
6934A657927n14255O6419O74375N38204r2386m19239k05800J28401K34425J21534
6924B189605j14668l52452l23699R3000M99800L76230j32198l16281Q9959N00636
6914B509932L29594j80553l65977q7243J85019J13000j16036j83042p8636o941
6904B119117n7767j33634j08593M5735K37268K99062J29347j47767k37831k072
6894B142865L10920L06354n5609l63236k70992M3052J55051J7768k9667J30533
6884B387039K01435M3841q108K56775M26957P9237m22334l93856P5287K52189
6874B898462l8081j80715R2004K23337j06360l04854J03981N33108K56182l18111
$$ plain form
6944 2783429 2531931 1998698 1950938 2370248 2528555 2153210 1804840 1898578 2018666 1657927
6934 1657927 1143672 1210091 1884466 2422670 2330284 1911045 1705245 1833646 2068071 2189605
6924 2189605 2074937 1722485 1398786 1491786 1991586 2367816 2235618 1919337 2009296 2509932
6914 2509932 2839526 2658973 2292996 2205753 2390772 2503772 2387736 2204694 2126058 2119117
6904 2119117 2061350 1927716 1819123 1864858 2102126 2401188 2530535 2382768 2144937 2142865
6894 2142865 2453785 2760139 2704530 2341294 2070302 2113354 2268405 2286173 2256506 2387039
6884 2387039 2588474 2632315 2624207 2880982 3307939 3387176 2964842 2570986 2646273 2898462
6874 2898462 2860381 2679666 2771670 2995007 2888647 2583793 2687774 3220882 3477064 3158953
6864C158953k99003J61451J30556m69292o81462j12205M29914K79322j09929r8761
6854B389544R0276k5667k31334p1879K18010R3449k91809k94498J32515L58266
6844B366873R0401k50210l00289k48844l17125k96089L3971M01541L66987l8490
6834A808726l45417k64136k423P7246o3961j44573l924J46303N5062j23467k7266
6823A112170K84381L15867q4752l73699r4904L68899L43191j05438l06030m3230
6813A416455J89513N4885j61386j51571o7495r7090p1488J29083K20678L869j72826
6802A292627N7514L88788K60453k16833l88210p3484J87141L8315j54158J3069
6792A405222K70672J27071k92526m10391q6926J94821R9466r7296l9261J17418
$$ plain form
6864 3158953 2859950 3021401 3151957 2682665 2001203 1888998 2318912 2598234 2488305 2389544
6854 2389544 2479820 2454153 2222819 2150940 2368950 2462399 2170590 1876092 2008607 2366873
6844 2366873 2457274 2207064 1906775 1657931 1340806 1044717 1078688 1480229 1847216 1808726
6834 1808726 1463309 1199173 1196750 1273996 1210035 1065462 1061538 1207841 1262903 1139436 1112170
6823 1112170 1396551 1712418 1627666 1253967 1159063 1527962 1871153 1765715 1459685 1416455
6813 1416455 1605968 1660853 1499467 1347896 1280401 1183311 1111823 1240906 1461584 1465453 1292627
6802 1292627 1350141 1738929 1999382 1782549 1394339 1320855 1507996 1546311 1392153 1405222
6792 1405222 1675894 1802965 1510439 1100048 1013122 1207943 1307409 1210113 1170852 1288270
6782A288270J2240k61228k53893J30456M47753L34138k3788k08271r6956J24603
6772A493324K54812J64338k01611o43884p02841j58363N46400P12037K08560l93227
6762A279545n26788j89599K27472L85175J99494j45469l02940r8122J94486J50240
6752A173494j96426l53800p8409K64161K36801o9526k30015o6403K16671L27698
6742A224246J31122k54256m61795j94972L19706M81164J06606k69282j74903J04449
6732A012085N6127j83714r9528K54268K89616j17122l71961j09664K32339J31205
6722A093651k26647k99212Q40K87041K89798Q6171j37173k40384j45963N3395
6712G61517J10013m8043j58432j6796J78282J58130M2705Q7800J60171m9323l75874
$$ plain form
6782 1288270 1300510 1039282 785389 915845 1363598 1697736 1673948 1465677 1368721 1493324
6772 1493324 1748136 1912474 1710863 1066979 364138 205775 752175 1464212 1672772 1279545
6762 1279545 752757 563158 790630 1175805 1375299 1229830 926890 828768 1023254 1173494
6752 1173494 977068 623268 544859 809020 1045821 976295 746280 679877 896548 1224246
6742 1224246 1355368 1101112 639317 444345 764051 1245215 1351821 1082539 907636 1012085
6732 1012085 1068212 884498 784970 1039238 1328854 1211732 839771 730107 962446 1093651
6722 1093651 867004 567792 568632 855673 1145471 1231642 1094469 854085 708122 761517
6712 761517 871530 823487 665055 648259 826541 984671 1027376 1115176 1275347 1226024 850150
6701H50150l07281J73027M39721J46603k28010j26414K26685K11339k02273m27966
6691G55581j68288J85132J73849j13340k59534r4080J69384K42872O4995j51692
6681H04879j33196J30104L20955J96461m9725p7379M4020m1803l03152k70183
6671F20981J67899M32567Q3748m54925m83578k1628L31746L14228J82189R3403
6661A266630o2471k14700j07395J66356K06053lk0374K06642J67052l18187o43947
6650F45656l46646J18009J10545j79630j41960K15871L85547K67193J93126J83142
6640A450853m0166l27270j96244K52986L11655k14488o00411k95780K35416K75195
6630H51746o7624j40509K05151M58738K44688k14204m55096k83781J09697L60922
$$ plain form
6701 850150 542869 715896 1155617 1302220 1074210 947796 1174481 1385820 1183547 755581
6691 755581 587293 772425 946274 832934 573400 479320 648704 891576 956571 804879
6681 804879 671683 801787 1122742 1319203 1269478 1192099 1236119 1194316 891164 620981
6671 620981 788880 1221447 1305195 850270 366692 345064 676810 991038 1173227 1266630
6661 1266630 1204159 989459 882064 1048420 1254473 1254470 1234096 1440738 1607790 1289603 645656
6650 645656 299010 417019 527564 347934 205974 421845 807392 1074585 1267711 1450853
6640 1450853 1410687 1083417 887173 1140159 1451814 1237326 636915 341135 576551 851746
6630 851746 784122 643613 848764 1307502 1552190 1337986 882890 599109 708806 1069728
6620A069728K64096j4434j37613m3257J2902q6578j27569J6977J06694n9958k43513
6609G57475j10705K15326L20077J08538r3019k5435J83355K14766p1672m55988
6599A042718n08386o6341M24781L54631j74560l56153J69036O73707L64637l87660
6589A536410n66723k3395L81163J60636j50025k1967J94549k6909m05920k89710
6579G88109K40549M41973M3824l63840k42986J42481K29135K2642o716K57287
6569A552458L74660O2909l22695l09330k836J39983N8243R8628K95534K21029
6559B168583k40005n19863j84861L20257K97438j37827k67038Q7530L33194R1443
6549A948851k50796k24474K7703R3743o4120j85349j64352p9853M4257K01773
$$ plain form
6620 1069728 1333824 1319390 1181777 1138520 1151422 1064844 937275 954252 1060946 1000988 757475
6609 757475 646770 862096 1182173 1290711 1197692 1172257 1355612 1570378 1498706 1042718
6599 1042718 534332 467991 892772 1247403 1072843 716690 885726 1559433 1924070 1536410
6589 1536410 969687 946292 1327455 1488091 1338066 1316099 1510648 1483739 1077819 788109
6579 788109 1028658 1470631 1514455 1150615 907629 1050110 1279245 1301887 1295171 1552458
6569 1552458 1927118 1990027 1667332 1358002 1355166 1495149 1553392 1652020 1947554 2168583
6559 2168583 1928578 1408715 1223854 1544111 1841549 1703722 1436684 1524214 1857408 1948851
6549 1948851 1698055 1473581 1501284 1595027 1530907 1345558 1181206 1101353 1145610 1347383
6539A347383K64105J41305k6799o4304k9146p1043j34518m9389J45808K14953
6529A738355O7382r9823n7748J63343L03347J77063q3128j60720K4178J59291
6519B231540k7104l04702k11906K49753N63173M19468J18532N7423J56880Q4288
6509C337345j89341l72266k76508j4499J62689P9949k05134l78857j89064J46185
6499B100499J35451k58845m64698j13846L79737M23966Q8864j21289o8241k2098
6489B079500p6173p4938m1438j27544j73707J11161N06373M27445j45329m95776
6479A989574j96911K52180K07198j70097k51705O8794K94330J35260j15434j05962
6469B107227O0420M3700j98465l32035j06706K61538L16632l7557l65464k67132
$$ plain form
6539 1347383 1611488 1752793 1725994 1661690 1632544 1561501 1426983 1377594 1523402 1738355
6529 1738355 1805737 1705914 1648166 1811509 2114856 2291919 2208791 2048071 2072249 2231540
6519 2231540 2204436 1899734 1687828 1937581 2500754 2920222 3038754 3096177 3253057 3337345
6509 3337345 3148004 2775738 2499230 2484731 2647420 2727369 2522235 2143378 1954314 2100499
6499 2100499 2235950 1977105 1512407 1398561 1778298 2202264 2291128 2169839 2101598 2079500
6489 2079500 2003327 1928389 1886951 1759407 1585700 1696861 2203234 2630679 2485350 1989574
6479 1989574 1792663 2044843 2252041 2081944 1830239 1899033 2193363 2328623 2213189 2107227
6469 2107227 2167647 2211347 2012882 1680847 1574141 1835679 2152311 2114754 1749290 1482158
6459A482158P6926K01511N5709P232J72038K15005l7058k42340r2380J63483J21993
6448B124277j23326j71332J5410R1032o7807j82749p4000M6471m2796j81118n8823
6437A375239K96132M98575K76738j81421m29617k71770L2645J31882M3794O5023
6427A837220K53082K94749J2886k87670k37947M9781J85818J07486Q7630J90195
6417B493230J53861r9710k58737j19651O3959J0755j04135L9444L10493K84683
6407B774192n6820k49689o8416J07422r2672l96177k71503K32327M98724K12195
6397B689583k22557k93321m3355J50623J73770J76459J58096k1026k48072k10110
6387B310090P6800J89136p3082l31167j77602J99879K98191L7475j66041l4548
$$ plain form
6459 1482158 1559084 1760595 1816304 1823536 1995574 2210579 2173521 1931181 1838801 2002284 2124277
6448 2124277 2000951 1829619 1845029 1936061 1868254 1685505 1611505 1657976 1615180 1434062 1375239
6437 1375239 1671371 2169946 2446684 2265263 1835646 1563876 1596521 1728403 1772197 1837220
6427 1837220 2090302 2385051 2397937 2110267 1872320 1922101 2107919 2215405 2303035 2493230
6417 2493230 2647091 2547381 2288644 2168993 2232952 2243707 2139572 2179016 2489509 2774192
6407 2774192 2717372 2467683 2399267 2506689 2414017 2017840 1746337 1978664 2477388 2689583
6397 2689583 2467026 2173705 2130350 2280973 2454743 2631202 2789298 2768272 2520200 2310090
6387 2310090 2386890 2576026 2502944 2171777 1994175 2194054 2492245 2529720 2363679 2329131
6377B329131K14801K32151M65j98906j55188N0136J55906K4919j69754j38475
6367B345186J18500K60881P5652k04154k53423j26280o6551k6148J94445M13346
6357B731454K15093k95881m56715k560M64195L39092j06681k10202P8240K60344
6347C016379J30890o5342j89451k88613j90531K88008P10397L82174m75231p39464
6337B579216L5328Q49984O58111j72751n66425l32524j24563j74505r3054J91377
6327B850194K80234J28005J17505K34107O5494k63152j37781L46043L12139l71894
6317C560894o40349N1732O78881K49531n37923m43093K82798M07370k00521m73048
6307B936272J315M35685K94586K4672L6534N2591j40936k22746j3441J68518J47509
$$ plain form
6377 2329131 2543932 2776083 2776548 2577642 2422454 2472590 2628496 2653415 2483661 2345186
6367 2345186 2463686 2724567 2800219 2596065 2342642 2216362 2149811 2123663 2318108 2731454
6357 2731454 2946547 2650666 2193951 2191391 2655586 2994678 2887997 2677795 2756035 3016379
6347 3016379 3147269 3081927 2892476 2603863 2413332 2701340 3411737 3793911 3318680 2579216
6337 2579216 2614544 3464528 4122639 3949888 3383463 3050939 2926376 2751871 2658817 2850194
6327 2850194 3130428 3258433 3375938 3610045 3675539 3412387 3274606 3620649 3932788 3560894
6317 3560894 2920545 2972277 3651158 3900689 3362766 2919673 3202471 3609841 3409320 2936272
6307 2936272 2937587 3373272 3667858 3692530 3729064 3781655 3640719 3417973 3404532 3573050 3720559
6296C720559J42413J55779q3231l81591k01039K74797K24293l63238m77028K15395
6286C227109O90497K69244k44092l1984L15921K160m17253m3086O30846M95340
6276D894702k44822m56708j8004J67194j06517j32580K13083K45848j19783j45537
6266D296876K89815L74180j42999m29147l3069L36755J04044k07748j1134L02548
6256D880121J39727k54601l08185n8076J16318J65852J77601K8179k16913r4866
6246D575157M96878Q59028M12302l91508o81646l11909J72689L81794L50988K12599
6236F076372N5172m7335j31332k53305k17802J90517O47560N64861M4161j71934
6226F756935R9781J86307k12980m51285j05853K27591R342k60487L5672N11530
$$ plain form
6296 3720559 3862972 4018751 3935520 3553929 3352890 3627687 3851980 3488742 3011714 3227109
6286 3227109 3917606 4186850 3942758 3910774 4226695 4228855 3811602 3768516 4399362 4894702
6276 4894702 4649880 4193172 4175168 4342362 4235845 4103265 4316348 4562196 4442413 4296876
6266 4296876 4586691 4960871 4817872 4388725 4355656 4692411 4796455 4588707 4577573 4880121
6256 4880121 5019848 4765247 4457062 4398986 4515304 4681156 4858757 4886936 4670023 4575157
6246 4575157 5072035 5931063 6343365 5951857 5270211 4958302 5130991 5512785 5863773 6076372
6236 6076372 6131544 6084209 5952877 5699572 5481770 5672287 6319847 6884708 6928869 6756935
6226 6756935 6856716 7043023 6830043 6378758 6272905 6500496 6509838 6249351 6285023 6796553
6216F796553M92423J73111J13711J85081o228j86173Q4078M50033L23958k7291
6206H399256K5496L08052K28739n4522L0859L03384J63955j64071M2710O11691
6196I895549O57273J09310j85733O4675K49249J00083R2693L79964M65215K29736
6186A2058014K25819O20587Q32952N50332J89262N6861m7705j59870j3647K09156
6176A4521761k987m00018j04904Q38934J237317N53764k16749j35786L08631K32467
6166A6832430j82614j85738K72154O45145O87221N21466K33174k4414O3202M74307
6156A9336333O97574M76359K15046K84250M70732M82084M31626M60062M31654
6147B3285720L30967M09675O82150Q41421Q27199Q37278P40609K86995j09543
$$ plain form
6216 6796553 7288976 7462087 7575798 7760879 7754651 7568478 7652556 8102589 8426547 8399256
6206 8399256 8424752 8732804 8961543 8907021 8937880 9241264 9405219 9241148 9283858 9895549
6196 9895549 10552822 10662132 10476399 10541074 10790323 10890406 10983099 11363063 11828278 12058014
6186 12058014 12283833 12904420 13737372 14287704 14476966 14533827 14486122 14326252 14312605 14521761
6176 14521761 14518774 14118756 14013852 14852786 16090103 16643867 16427118 16291332 16599963 16832430
6166 16832430 16649816 16464078 16736232 17381377 18068598 18590064 18823238 18798824 18862026 19336333
6156 19336333 20033907 20510266 20725312 21009562 21480294 21962378 22394004 22854066 23285720
6147 23285720 23616687 24026362 24708512 25549933 26377132 27214410 27955019 28242014 28132471
6138B8132471J98736Q57886Q79715L19676K33034P75807Q91441K65964n2554M32094
6128C2934270Q09923N65171N25553J114386J376990Q11713M61764R88334J363982
6119D0952086Q07820L09573P67444J310721J049955P83618J277848J608045J041008
6110D9908118P42958J600850K237701J451124O86049J533351K708509K386846
6102F3255506J651241K409417L666085L393859K466646K921746L856881L201637
6094H6823018K126352L134114N040756M834444L450228M239029O554427O890734
6086A23093102N830363P176296J0405577J1485870J1340465J4741963J9909023
6079B03982659J9846009J6767914K2428885L7331774M2694860K5029917j520371
$$ plain form
6138 28132471 28331207 29189093 30068808 30388484 30621518 31397325 32288766 32554730 32502176 32934270
6128 32934270 33744193 34309364 34834917 35949303 37326293 38138006 38599770 39588104 40952086
6119 40952086 41759906 42069479 42836923 44147644 45197599 45981217 47259065 48867110 49908118
6110 49908118 50651076 52251926 54489627 55940751 56626800 58160151 60868660 63255506
6102 63255506 64906747 67316164 70982249 74376108 76842754 79764500 83621381 86823018
6094 86823018 88949370 92083484 97124240 101958684 105408912 109647941 116202368 123093102
6086 123093102 128923465 136099761 146505338 157991208 169331673 184073636 203982659
6079 203982659 223828668 240596582 263025467 300357241 343052101 368082018 366561647
6072C66561647j2626167p094948n574549j8184232l1772456l2770079k5971425
6065B32567791k2511141k2208663j8515100j2296172r594431j0522560j0107874
6058A26811850p512559o225223o735411o167081m289695l674127m355130l831095
6050H4021529k126749j868666l334446l970660l017174k466010l109462l445828
6042F0682534k928118k787158l157195k663278j369762j032563j874817k089386
6034D2780257j143511o70235j352039j735025j039109n00171q88217j146471o13554
6025C3691925l19698q91179j275333p75551l92230q75805j284717q04301k95727
6016B6777384o43646j110092p77575k53534m58662r13686p21047k40536l17470
$$ plain form
6072 366561647 353935480 346840532 341265983 323081751 291309295 258539216 232567791
6065 232567791 210056650 187847987 169332887 157036715 147442284 136919724 126811850
6058 126811850 119299291 113074068 106338657 100171576 95881881 92207754 87852624 84021529
6050 84021529 81894780 80026114 76691668 72721008 69703834 67237824 64128362 60682534
6042 60682534 57754416 54967258 51810063 49146785 47777023 46744460 44869643 42780257
6034 42780257 41636746 40966511 39614472 37879447 36840338 36340167 35451950 34305479 33691925
6025 33691925 33372227 32481048 31205715 30430164 30037934 29162129 27877412 27073111 26777384
6016 26777384 26133738 25023646 24246071 23992537 23533875 22620189 21899142 21658606 21341136
6007B1341136o77996n24368o5908r2125n18873o19000l30297j96509k94956k54616
5997A7766488j18487k51105n43664n37560k29038m5809j29366k52793l36435m87332
5987A4834899o16318n03630k01148r455r8340l58250n15327l09983K02292N10508
5977A2935248J82039m56530o66500l44601j03944k29782k92791k2261J95226L7493
5967A1233597k25627l06787l52065m42940l08503O6844K10233n0401k33986o7843
5957I522522J3108k84913n01750k39297J03799N1879j32922k2615J81391J06381
5947H797583q3851j08795j66588m43730n70010k54261P2198l4243k16771J4336
5937G005868L29459J45018l08978l71635n0870J13382l780r9286j03709j19223
$$ plain form
6007 21341136 20663140 20138772 20072864 19980739 19461866 18842866 18512569 18316060 18021104 17766488
5997 17766488 17648001 17396896 16853232 16315672 16086634 16040825 15911459 15658666 15322231 14834899
5987 14834899 14218581 13714951 13513803 13504348 13406008 13047758 12532431 12222448 12424740 12935248
5977 12935248 13117287 12660757 11994257 11649656 11545712 11315930 11023139 11000878 11196104 11233597
5967 11233597 11007970 10701183 10349118 9906178 9597675 9664519 9874752 9824351 9590365 9522522
5957 9522522 9535630 9250717 8748967 8509670 8613469 8665348 8532426 8509811 8691202 8797583
5947 8797583 8713732 8604937 8438349 7994619 7424609 7170348 7242546 7208303 6991532 7005868
5937 7005868 7335327 7480345 7171367 6799732 6748862 6862244 6858464 6759178 6655469 6536246
5927F536246l932K77757K75058k41984o51650l76553R1677N278l17882j03173
5917E490842L87427K57955l79333n24078K623L14165L1056k04891l3190M7686
5907E390262k25854l48182n2655J66744O564j22414J2787j6841l81166m88906
5897C940339l045M60088K95901j37968j99766K5478N7738j44686l04441l58315
5887C631323l42341j43510J81578K64918J4766j26570Q1631K20503m0804k97502
5877C443992q7196K78288K11366j99176l92358k21181j6485M4647O8400O3221
5867C193518p8600k80078l33370j92657L2071K32005K69509L3321k94871l32365
5857B248483l5471K09381K00190J67004K05641L9932l29000l66637J24251M78484
$$ plain form
5927 6536246 6532314 6810071 7085129 6843145 6191495 5814942 5906619 5911897 5594015 5490842
5917 5490842 5878269 6136224 5756891 5232813 5235436 5549601 5580657 5375766 5342576 5390262
5907 5390262 5164408 4816226 4763571 4930315 4936879 4814465 4827252 4810411 4429245 3940339
5897 3940339 3937294 4397382 4693283 4555315 4355549 4381027 4438765 4294079 3989638 3631323
5887 3631323 3288982 3145472 3327050 3591968 3606734 3480164 3561795 3782298 3741494 3443992
5877 3443992 3356796 3635084 3846450 3647274 3254916 3033735 3017250 3061897 3130297 3193518
5867 3193518 3114918 2834840 2501470 2308813 2340884 2572889 2842398 2875719 2580848 2248483
5857 2248483 2213012 2422393 2622583 2789587 2995228 3035160 2706160 2339523 2463774 2942258
5847B942258J23183m65954m68724L5577K94199O6701j88918j67918l9069L9770
5837B171105J08791J19035k4820j64500q1470Q8218O1579r1606r7364J6428J9685
5826B125081n7048k1878N9584L722q8748k9173M5555o2159j50269L9081K38543
5815B102291L3342l60964l66341K5855K69633J47981l3932j04659j88307k10666
5805A314233N3966L93103L10709j44014l89810k44457j16885j47153M1659M81274
5795A552625N61298J1140n30212m28412N1623K85760K04843J08929R799k22986
5785A604407l62928r5111L62472M52910O1305l39477l51778j14304j1579j50403
5775A055514k63125q6362K53951L56382R2634j59565m2705K28117J94169j16723
$$ plain form
5847 2942258 3065441 2599487 2130763 2166340 2460539 2527240 2338322 2170404 2131335 2171105
5837 2171105 2279896 2398931 2374111 2209611 2128141 2216359 2277938 2186332 2088968 2105396 2125081
5826 2125081 2068033 2046155 2105739 2109461 2020713 1991540 2037095 1974936 1824667 1863748 2102291
5815 2102291 2135633 1774669 1408328 1434183 1703816 1851797 1817865 1713206 1524899 1314233
5805 1314233 1368199 1761302 2072011 1927997 1538187 1293730 1176845 1029692 1071351 1552625
5795 1552625 2113923 2125063 1594851 1166439 1218062 1503822 1708665 1817594 1827393 1604407
5785 1604407 1241479 1146368 1508840 1961750 2023055 1683578 1331800 1217496 1205917 1055514
5775 1055514 792389 706027 959978 1316360 1408994 1249429 1206724 1434841 1629010 1512287
5765A512287k45996l4043J94283J91351N7272r0687k42255k55820o041K10346
5755A290697K31l63838k08828L96493N73209j3291n65640l80620J24204K19847
5745A072464N110J768J69937J30241l3803J1797J32582k0205k72527j96538O7854
5734A068680K5756k53648k15593J93984L94972J34408j36507n6469J11317L4506
5724A301406j28416q4818O6907M8249j11540j48443l053J02075J0683j43196j29926
5713G79928M8812J52544N2711n8833K2610J37442p31k65698k41878Q2383K38475
5702I47765L4398j42543k5225Q1970q5989k21766J0403L59845M21527K63968J24407
5691A768760p7378l73840l81170O1938L67372M5958l89368k18261K41702J91212
$$ plain form
5765 1512287 1266291 1232248 1426531 1617882 1675154 1584467 1342212 1086392 1080351 1290697
5755 1290697 1290928 927090 718262 1114755 1687964 1674673 1109033 728413 852617 1072464
5745 1072464 1077574 1079342 1249279 1379520 1345717 1357514 1490096 1469891 1197364 1000826 1068680
5734 1068680 1094436 840788 625195 819179 1214151 1348559 1212052 1155583 1266900 1301406
5724 1301406 1172990 1088172 1155079 1203328 1091788 943345 940292 1042367 1053050 909854 779928
5713 779928 828740 981284 1033995 975162 997772 1135214 1134483 868785 626907 709290 947765
5702 947765 982163 839620 814395 896365 810376 588610 599013 958858 1380385 1644353 1768760
5691 1768760 1691382 1317542 936372 998310 1365682 1411640 1022272 804011 1045713 1236925
5681A236925k15059j54272L39889M01076j10584l55026k0035J74426j46931l43098
5671H07311l444K58860m6001l46211l3876M20972K83567j90207k43374J25205
5661A032802K93514Q1585j25840j14751k3231M7917O8290p1964k98614k40282
5651F49426J88148M78597K77588k1923J2814P9933k24699n08451j88928L83545
5641A126050L89428j00501k54505J06356K80142k2327j93996J45373M77887L14433
5631B268340P014N0956K05603j4563m13172m01629M486J84052r7439l26327p9946
5620A387375K72764J26773l71458m50556J21638N69603J89585n40970n96705N5651
5610G63700M05502q753l93112m1888M87322L27758k42494l13152R9618J45300
$$ plain form
5681 1236925 1021866 867594 1207483 1608559 1497975 1142949 1122914 1297340 1150409 807311
5671 807311 803867 1062727 1016726 670515 636639 1057611 1341178 1150971 907597 1032802
5661 1032802 1326316 1407901 1282061 1167310 1144079 1191996 1260286 1188322 889708 649426
5651 649426 837574 1316171 1593759 1571836 1584650 1664583 1439884 931433 742505 1126050
5641 1126050 1515478 1414977 1160472 1266828 1546970 1524643 1330647 1476020 1953907 2268340
5631 2268340 2275354 2326310 2531913 2517350 2104178 1702549 1707035 1891087 1793648 1467321 1387375
5620 1387375 1660139 1786912 1415454 964898 1086536 1656139 1845724 1304754 708049 763700
5610 763700 1169202 1160449 767337 725449 1212771 1540529 1298035 984883 1084501 1229801
5600A229801l20132m54069J02844N46729J86879m53436m68007R5358M40802K25232
5590A132001j30052k11680j09513o4224m8397Q5695K47568J55495k29865n08955
5580C18073k89426K28742M21822P2368l23348k71903O9098K61072K25129J19056
5570H30683n3033k38957j35267K57521L08433l05914p87251k78751O27289O30013
5560H54766k01189m74013K60874P72219J97700n75007m44253J77533K67269r9341
5550G36558j57065Q2690K3038k62747j69476K49027L37878J5069j35759M5012
5540G64225P6366j93391l04357n9671J34113M3554j4289J42895J77110j19675
5530F46880l70701k06855J40405K29500N1950o8239K1990J85300K16228J5757
$$ plain form
5600 1229801 909669 455600 558444 1105173 1292052 838616 370609 465967 906769 1132001
5590 1132001 1001949 790269 680756 616532 568135 653830 901398 1056893 827028 318073
5580 318073 28647 257389 679211 751579 428231 156328 225426 486498 711627 830683
5570 830683 777650 538693 403426 660947 969380 663466 -123785 -402536 224753 854766
5560 854766 653577 179564 440438 1212657 1410357 835350 391097 568630 835899 736558
5550 736558 579493 662183 685221 422474 252998 502025 839903 854972 719213 764225
5540 764225 840591 647200 342843 283172 417285 460839 446550 589445 766555 646880
5530 646880 276179 69324 209729 439229 491179 422940 444930 630230 846458 862215
5520H62215k98617l96393p6213L63618L94876l6750m01895k91911P9307K33555
5510D31792L2856k40091k37383J12964M90727M28986j30016o06308m11796K47261
5500A18992N76388K16390l44829m78575j47817K30036L33168J57573q5782j55207
5490D20337k0517N6505j15865k90027j00862L06359M13446J12275j48942j06290
5480E26419l1526j30396j33431J53494L57481P4811m19782n08510j07166K64919
5470D6313K37534L635o5656Q4829K01726P8866j85422k81114n7999K40161K51117
5459E53990k1502k18771j45692q539l3359j24222q5122L5547M3978q3580j72794
5448b60066p9259J60309L52456K97127K278k69086k82989j03326O7703J83543
$$ plain form
5520 862215 563598 167205 90992 454610 849486 812736 410841 118930 198237 431792
5510 431792 464648 224557 -12826 100138 590865 1019851 889835 283527 -128269 118992
5500 118992 695380 911770 566941 88366 -59451 170585 503753 661326 575544 420337
5490 420337 399820 456325 340460 50433 -50429 255930 669376 781651 632709 526419
5480 526419 494893 364497 231066 384560 742041 816852 397070 -111440 -218606 46313
5470 46313 283847 287482 221826 306655 508381 587247 401825 120711 62712 302873 553990
5459 553990 532488 313717 168025 159486 126127 1905 -83217 -47670 -3692 -87272 -260066
5448 -260066 -339325 -179016 173440 470567 472845 203759 -79230 -182556 -114853 68690
5438F8690K63190J85781r1315k79701j39291N9149m8684k26044p968L72763K56954
5427D13524k50512l18715J96588M10152j11382n56339k03903L87769L67880k7490
5417C07572m9236K36288K22470q8442k26499j96327k97101l15258R7950N19819
5407B11236K87178k82633l18516J14091J64537k10298j44485M72808O16085j36506
5397G73497p69497m24980K76809L45958n8840j47243J51993K97026J35804l6329
5387E44198j10869j62966r2616J39801K20512l4148k46560p5894J40435m0806
5377B81087l30898j59929L10470L94684k1527l32665j72285J28645J55512l0623
5367B22471j13653K7971K15492J62863j83473m31750j39642M55882N64618j9141
$$ plain form
5438 68690 331880 517661 426346 146645 7354 66503 17819 -208225 -216193 156570 413524
5427 413524 163012 -155703 40885 451037 339655 -216684 -420587 -32818 335062 307572
5417 307572 258336 494624 717094 628652 402153 205826 -91275 -406533 -308583 211236
5407 211236 498414 215781 -102735 11356 175893 -34405 -178890 293918 910003 773497
5397 773497 4000 -420980 -144171 201787 142947 -4296 147697 444723 580527 544198
5387 544198 433329 270363 177747 317548 538060 503912 257352 181458 321893 281087
5377 281087 -49811 -209740 100730 495414 473887 141222 -31063 97582 253094 222471
5367 222471 108818 136789 352281 515144 331671 -100079 -239721 216161 780779 761638
5357G61638m80310j78831L28164K03835k70755k15009K81054K90721k94610m91875
5347f5978J13579O09286K31160l98129l08563K79027L95647j24438m95014k60038
5337b3461J30284J47299q4754j59927l4997L4444m3385j08783m3720P6980J33993
5326B3973J11005N3740p119k8988M3775J53540J13105j14319k33118M620L08772
5315D28986J57114l58124n05936J8021N26349K88097l86695o03518j49838L43546
5305b41998L85375J37452n0335n8953R2036K81489K18559k12348n83331l97310
5295d29364J33885L52631J42397m47J21432J58124k1147p9102O1269l893l53008
5284H2777m48692l4553L71108L12013O7597K2749J4999j53579j78575J52061L74485
$$ plain form
5357 761638 281328 102497 430661 634496 363741 148732 429786 720507 425897 -65978
5347 -65978 47601 656887 888047 489918 181355 460382 856029 731591 236577 -23461
5337 -23461 106823 254122 169368 9441 -25556 8888 -34497 -143280 -187000 -110020 23973
5326 23973 134978 188718 181599 152611 196386 349926 463031 348712 115594 120214 428986
5315 428986 586100 227976 -277960 -259939 266410 554507 167812 -435706 -585544 -241998
5305 -241998 143377 280829 230494 171541 263577 545066 763625 551277 -32054 -429364
5295 -429364 -295479 57152 199549 199102 320534 478658 457511 378409 439678 435785 82777
5284 82777 -365915 -400468 -29360 282653 350250 372999 387998 234419 55844 207905 582390
5273E82390K8311n26553o17907k04733K66181N43400N54911J68720m33794o23148
5263b62222j81690K22061P0222j27833J98705N37378J70377m18065k82370K88492
5253B15055K36603l66479m26864J96017M23611r9944l90319O4215L86517o2492
5243A75920n05270j23323N31815N23702J0599k65294k07730j37916j7780K04663
5233A89386J36954l08789m19315J59584N46611k0899p26995l68995O14881P90923
5223E93346K0794m59484j32333J98567L3918r3581J20786J36689k59749l83511
5213b24558J12523M94293J49081l92927l88983l4955Q8498K8275J16888J95639
5203A43774j1459k07166J0443L56202K85120r0445k35158r2268l5520j08930k6808
$$ plain form
5273 582390 610701 84148 -533759 -738492 -472311 71089 626000 794720 360926 -262222
5263 -262222 -443912 -221851 -151629 -279462 -80757 456621 626998 208933 -73437 215055
5253 215055 451658 85179 -341685 -145668 277943 177999 -212320 -148105 238412 175920
5243 175920 -329350 -452673 79142 602844 613443 348149 140419 2503 -15277 189386
5233 189386 326340 17551 -401764 -242180 304431 283532 -443463 -812458 -197577 593346
5223 593346 614140 154656 22323 220890 254808 161227 282013 418702 158953 -224558
5213 -224558 -112035 382258 531339 138412 -250571 -285526 -197028 -168753 -51865 143774
5203 143774 132315 -74851 -64408 291794 576914 486469 251311 159043 123523 14593 -12215
5192a2215J68959J28400j49377k78721j22938O0423J19368J57995J81401P2286
5182C25581o4070n134J23471j9045l47546l71621J6405K99418J17112j75341p0013
5171a70783L14856M20794M9234l92889m43647j26338J56293J56044N9713J60829
5161A84106L56054K30336k85730o62982m38292J20049L75515J82297l9826L81
5151B1908J53850K19383J99860R4607j57901m20485m12646j39661Q8238J53762
5141a99085K45737L67814K19735k11558m34856j67280J74392J10947j56265j37756
5131a88175J14993J49861q9792k03956l4426J23884O7508l9483l7368L071M3234
5120i0649J67270K78143J08182k83709m26897j07508K47790J85571j01104j28212
$$ plain form
5192 -12215 156744 285144 135767 -142954 -265892 -205469 -86101 71894 253295 325581
5182 325581 261511 256377 379848 360803 13257 -358364 -341959 -42541 74571 -100770 -170783
5171 -170783 144073 564867 614101 221212 -222435 -348773 -192480 -36436 23277 184106
5161 184106 540160 770496 484766 -178216 -616508 -496459 -120944 61353 21527 21908
5151 21908 175758 395141 595001 689608 531707 111222 -301424 -441085 -352847 -199085
5141 -199085 46652 414466 634201 422643 -12213 -179493 -5101 105846 -50419 -188175
5131 -188175 -73182 76679 -13113 -217069 -251495 -127611 -60103 -99586 -136954 -133883 -90649
5120 -90649 76621 354764 462946 179237 -247660 -355168 -107378 78193 -22911 -151123
5110a51123R1472J17427j50398k92846n0708K59599K27731o2255j94545k809K58759
5099E0304K64752k7149l46853l60778j5646L31409K67149j35317l38177m1356
5089c51662L75163L65184k9264k96438k15224o5921o8985o7833P1909J52697J576
5078a28798j75085j07373R3409J33116J7644K638J49623K47973J56197l3944j65972
5067A89428j58918k0129J20163P8585j15897j74909M1433K73573K63124J47843
5057F44296J24000J3561l53292o00604k91474K22725J96781k96966l95173J72185
5047e63961O02246K84636k69546l02345P1488K55501J37336k927j15957k59024
5037a62553k21812Q3572K22420j08785m00031m9581N63329N79951P666l47674
$$ plain form
5110 -151123 -59651 57776 -92622 -385468 -436176 -176577 51154 -11101 -205646 -208455 50304
5099 50304 315056 287907 -58946 -419724 -435370 -103961 163188 27871 -310306 -351662
5089 -351662 23501 388685 359421 62983 -152241 -218162 -287147 -354980 -283071 -130374 -128798
5078 -128798 -303883 -411256 -317847 -184731 -167087 -164449 -14826 233147 389344 355400 189428
5067 189428 30510 10381 130544 209129 93232 -81677 -40244 233329 496453 644296
5057 644296 768296 781857 428565 -172039 -463513 -240788 -44007 -340973 -736146 -563961
5047 -563961 38285 322921 53375 -248970 -177482 78019 215355 212428 96471 -162553
5037 -162553 -384365 -300793 -78373 -187158 -587189 -636770 -73441 506510 514176 166502
5027A66502j80415K7044J4095P7030K63240J69989k03103k85082O3603K31680
5017C44583p3537k84341L090K76542J6845l54208j90855K62276K80419j77377
5007A03437m80463k96959R7108L40889L01525J7609k48675j34868K66098L30525
4997B96226j72758n43521j43404N22250N01791j52140n18718k28254J70999K48193
4987a9336J92990J64561k0008l15635l14070L9712K57947J20420L2977K53090
4977C92648L86800P8253l38618l55558m9142J29122J1595k25116l90143l43623
4967g03782j861M32088N23256J62058k25680k74304j38361q1404o035K25319L69104
4956B80398J66606j44348j64856K2659K8177j75224k40424m7707J31714R6267
$$ plain form
5027 166502 -13913 13131 27226 104256 367496 537485 334382 49300 112903 344583
5017 344583 271046 -13295 -10205 266337 283182 -71026 -261881 395 280814 103437
5007 103437 -377026 -673985 -576877 -235988 65537 83146 -165529 -300397 -34299 296226
4997 296226 123468 -420053 -563457 -41207 460584 308444 -210274 -438528 -267529 -19336
4987 -19336 173654 338215 318207 2572 -311498 -271786 -13839 106581 139558 392648
4977 392648 779448 857701 519083 163525 114383 243505 255100 29984 -360159 -703782
4967 -703782 -705643 -273555 249701 411759 186079 -88225 -226586 -307990 -314025 -88706 280398
4956 280398 447004 302656 137800 160459 188636 13412 -227012 -274719 -143005 -46738
4946d6738k5444l1991R6072K36775K44027N0847k07478k76222j20895o328p3999
4935a61374r3369J16558K92838J11646k48552l30932n4168K38328K82063R9663
4925B52701j75600l45528j70638K81768M96793J49962l13164k60792J42216J90842
4915B48560j99812l54285L3583M00126K42864j26254j88237j9614J5608n8940
4905f401m402R9821L0949q8323L617J59422N060l81165m77897p7357L90072M31724
4893H5120P8869k63690l20522j26543J42470L43653M06700L06937M9023k86567
4883D15450m96585l85837k8112K33758J88822L9955R4816K81442K48497o9758
4873E22448l08900k06404Q565j7598k15104k26334K782J39449K9781k9460J93473
$$ plain form
4946 -46738 -72182 -104173 -8101 228674 472701 523548 316070 39848 -81047 -87375 -161374
4935 -161374 -254743 -138185 154653 266299 17747 -313185 -367353 -129025 153038 252701
4925 252701 77101 -268427 -439065 -157297 339496 489458 176294 -84498 57718 248560
4915 248560 48748 -305537 -271954 128172 371036 244782 56545 36931 52539 -6401
4905 -6401 -10803 89018 119967 31644 35261 194683 199743 -181422 -659319 -736676 -346604 85120
4893 85120 163989 -99701 -420223 -546766 -404296 -60643 346057 652994 702017 415450
4883 415450 -81135 -466972 -495084 -261326 -72504 -32549 62267 343709 592206 522448
4873 522448 213548 7144 15709 -1889 -216993 -443327 -440545 -301096 -271315 -300775 -107302
4862a07302L98783J82362k64105l61558k0627K10917P116k50665j42920J00982
4852b47017L9118k02538j38965K59754N12750L40789m2142l31868l91470j45409
4842c46998L11359N24706J28856m92399n58630O088M29366K17638k05056k71976
4832b57046p4367K0290K1108J08736J97469J61773J34716J70642J5329l61422
4822A37228m70255n6871L28151J42170k30650j29805K26149J46718k54066k30290
4812c91521K34828L39535j32723m01486k0228L86160K26523j09990o5419R6550
4802A62229j12179m17480k46487K31295L75555J25983l3734J3842l3457j29809
4792f4242Q0076M12184K22667m43324o64428l8211N51991K32873m63105l95511
$$ plain form
4862 -107302 291481 473843 209738 -151820 -172447 38470 45586 -205079 -347999 -247017
4852 -247017 -207899 -410437 -549402 -289648 223102 563891 521749 189881 -201589 -346998
4842 -346998 -35639 489067 617923 125524 -433106 -427018 2348 219986 14930 -257046
4832 -257046 -331413 -311123 -290015 -181279 16190 177963 312679 483321 498650 137228
4822 137228 -333027 -389898 -61747 80423 -150227 -280032 -53883 92835 -161231 -391521
4812 -391521 -156693 182842 50119 -351367 -371595 14565 241088 131098 65679 162229
4802 162229 50050 -367430 -613917 -382622 -7067 118916 85182 99024 65567 -64242
4792 -64242 15834 428018 650685 207361 -457067 -495278 56713 289586 -173519 -569030
4782e69030L95008P48618J85198m23548k80787J84680J86970j42989j56464J28733
4772B56389J54778j04132j34237R3081L8221l25467l09910K67084N99043J75641
4762G10491l25346j70204K00011K1072l65534j02591N67373N71204k08014o98097
4752B00365l48484J33352R9183j06122l1528O5737q3659j26354J69985L20610
4742B93085n194k52447P7613M38352J15631m81467m50331R1798K37564j67919
4732a03315l34973R2392M93650L20162j60137m41723m21163k02417J48717M26641
4722a82166L75665J27077O2283J52706l850l92093m70091n5808L12850K04840
4712A31413r3609j50672n1445p7234j52028m9935J49453K04908R8925j0528l0999
$$ plain form
4782 -569030 -174022 574596 759794 336246 55459 240139 427109 284120 127656 256389
4772 256389 411167 307035 172798 265879 304100 -21367 -331277 -64193 534850 710491
4762 710491 385145 214941 414952 436024 70490 -32101 535272 1106476 898462 200365
4752 200365 -148119 -14767 84416 -21706 -53234 12503 -71156 -197510 -27525 293085
4742 293085 287891 35444 113057 551409 667040 185573 -264758 -172960 64604 -103315
4732 -103315 -438288 -345896 147754 467916 307779 -133944 -555107 -757524 -608807 -182166
4722 -182166 193499 320576 382859 535565 531715 139622 -330469 -386277 -73427 131413
4712 131413 37804 -112868 -164313 -241547 -393575 -443510 -294057 -89149 9776 -752 -31751
4701c1751N9045K17787K46454m392k74048j58566J93376K02018j87203l37841
4691g5121J1729K60115k0018l07717n6431K99400J12333k71280r2935M17699L72367
4680F50141k07913l75803R5077K81933k78002p09995k26072N30256M86596j80039
4670F6179m09100N8001M17494J75478j94004j68852M9706O2637l9593K2164J51006
4659A91116R3737m7213P595J83156J47430j25108l05875k32587r1792l2920K7385
4648a85076J22148J20602L2896O4461J98221J19808k05254l20634o6K71794M2066
4637B60966l06999j67797K17947J44821k75368k24230L68817N66355l2308n44364
4627G840k30127K85632J01136m24509l18623L21058N05960K7010k73203J4541
$$ plain form
4701 -31751 27294 245081 491535 487143 213095 54529 247905 449923 262720 -75121
4691 -75121 -63392 196723 176705 -131012 -187443 111957 224290 -46990 -139925 277774 650141
4680 650141 442228 66425 161502 443435 165433 -544562 -770634 -240378 246218 66179
4670 66179 -342921 -284920 132574 308052 114048 -54804 -5098 57539 17946 40110 191116
4659 191116 284853 237640 245235 428391 575821 450713 144838 -87749 -179541 -212461 -185076
4648 -185076 -62928 57674 90570 155031 353252 473060 267806 -52828 -52894 218900 260966
4637 260966 -46033 -213830 4117 148938 -126430 -350660 18157 584512 552204 7840
4627 7840 -222287 63345 164481 -260028 -578651 -257593 248367 275377 2174 16715
4617A6715K55071k3391l20823j02788K64247J78488j82686k22161P4242J85105
4607A22019p0900l16675k54749l9361O6221O0451J05688K45951L30582J84854
4597D34081j45119l52399j99151J31757K23808j0156k14098j19835R7894J50385
4587b833M3255n1568r4361j16021n8600Q4394J42742K1817q3259K3736J85974
4576I5276J09219j65557k93938j10518J63477K25234M0163j54202j24440Q2882
4566a32404J64503m3460k65937j36945J88171J75359k34589m18941j6327M28468
4556b92102K70084j96747j85392L25596N66670J95808k45626k81771j66323k30255
4546b40058k18196J73590N73243M05846j69153m51063k33218p531q9672j63820
$$ plain form
4617 16715 271786 248395 -72428 -175216 89031 267519 84833 -137328 -63086 122019
4607 122019 51119 -265556 -520305 -559666 -493445 -432994 -327306 -81355 249227 434081
4597 434081 288962 -63437 -262588 -130831 92977 82821 -131277 -251112 -153218 -2833
4587 -2833 40422 -11146 -105507 -221528 -280128 -195734 -52992 -31175 -114434 -90698 95276
4576 95276 204495 38938 -255000 -365518 -202041 23193 63356 -90846 -215286 -132404
4566 -132404 32099 -11361 -277298 -414243 -226072 -50713 -285302 -704243 -720570 -292102
4556 -292102 -22018 -218765 -404157 -78561 488109 683917 438291 156520 -9803 -240058
4546 -240058 -458254 -284664 288579 694425 525272 74209 -159009 -166540 -256212 -420032
4536d20032P1557L37373K40634o0631j17593R2616J85867L0815q7628j8104K028
4525B56902j74702k76523o4726J98056J20524j77761k33870L9976K52174J62112
4515A02162j8088n6882l3055m9965J4390K18636L23098J40438j16268j48826m2942
4504C32698q0785k26937j83266Q2357K30752M4108k60457l30770j08319J59820
4494c40799K30932R5563o4745r8703l8863k644M731N4689R6254J1707j12425n3535
4482b17838J32894J13110j52158k33148Q7982L68910J64274k29133k38029M6828
4472a56308O3533k16127k16441K37399N57835K90030k22042m03410k17805n538
4462b88874Q2444J14576J04322M3133K6396Q9957R2956l6086j34808p6010J1072
$$ plain form
4536 -420032 -348475 -11102 229532 168901 51308 143924 329791 360606 272978 254874 256902
4525 256902 82200 -194323 -259049 -60993 59531 -118230 -352100 -312124 -59950 102162
4515 102162 84074 27192 -5863 -55828 -41438 177198 500296 640734 524466 375640 332698
4504 332698 251913 24976 -158290 -75933 154819 198927 -61530 -392300 -500619 -340799
4494 -340799 -109867 -14304 -79049 -177752 -216615 -219259 -214528 -159839 -63585 -51878 -164303 -217838
4482 -217838 -84944 28166 -123992 -357140 -269158 99752 264026 34893 -203136 -156308
4472 -156308 -92775 -308902 -525343 -287944 269891 559921 337879 -65531 -283336 -288874
4462 -288874 -206430 -91854 12468 55601 81997 171954 264910 228824 94016 18006 29078
$$ [...]
##END NTUPLES=NMR SPECTRUM
##END=
