##TITLE=1H ikalashn
CG-1212-x2
18.9.2024
##JCAMPDX= 6.0         $$ Bruker NMR JCAMP-DX V2.0
##DATA TYPE= NMR SPECTRUM
##DATA CLASS= NTUPLES
##ORIGIN= UXNMR, Bruker Analytische Messtechnik GmbH
##OWNER= root
$$ TOPSPIN		Version 1.3
$$ 2024-09-18 11:00:01.171 +0400  Irina@DPX200
$$ Compression mode = diff/dup
##.OBSERVE FREQUENCY= 200.131392401
##.OBSERVE NUCLEUS= ^1H
##.ACQUISITION MODE= SIMULTANEOUS
##.ACQUISITION SCHEME= undefined
##.AVERAGES= 16
##.DIGITISER RES= 18
##SPECTROMETER/DATA SYSTEM= spect
##.PULSE SEQUENCE= zg
##.SOLVENT NAME= CDCl3
##.SHIFT REFERENCE= INTERNAL, CDCl3, 1, 17.95386
##AUDIT TRAIL= $$ (NUMBER, WHEN, WHO, WHERE, WHAT)
$$ ##TITLE= Audit trail, TOPSPIN		Version 1.3
$$ ##JCAMPDX= 5.01
$$ ##ORIGIN= Bruker BioSpin GmbH
$$ ##OWNER= Irina
$$ $$ F:/spectra/data/iren/nmr/1H/4/pdata/1/auditp.txt
$$ ##AUDIT TRAIL=  $$ (NUMBER, WHEN, WHO, WHERE, VERSION, WHAT)
(   1,<2024-09-18 10:58:27.640 +0400>,<Irina>,<DPX200>,<TOPSPIN 1.3>,
      <acquisition in progress>)
(   2,<2024-09-18 10:59:34.531 +0400>,<Irina>,<DPX200>,<TOPSPIN 1.3>,
      <Start of raw data processing
       efp BC_mod = 2 LB = 0.5 FT_mod = 6 PKNL = 1 PHC0 = 108.0458 PHC1 = -3.167623 SI = 32K 
       data hash MD5: 32K
       C5 1E 10 E2 6B 56 C5 FB E2 E9 AD BF D4 66 8F 91>)
(   3,<2024-09-18 10:59:38.046 +0400>,<Irina>,<DPX200>,<TOPSPIN 1.3>,
      <apk 
       data hash MD5: 32K
       30 2C C9 35 D5 FE CA 82 1C CF 1C B3 36 67 BD 2E>)
(   4,<2024-09-18 10:59:48.953 +0400>,<Irina>,<DPX200>,<TOPSPIN 1.3>,
      <pk fgphup PHC0 = 16.31455 PHC1 = -23.2 
       data hash MD5: 32K
       E4 5D 5D 06 B5 E4 5D CE CB EE 97 EA 3F B7 C6 4F>)
(   5,<2024-09-18 10:59:50.984 +0400>,<Irina>,<DPX200>,<TOPSPIN 1.3>,
      <abs n ABSG = 5 
       data hash MD5: 32K
       8A 4A 9C 33 43 AB 84 28 FF C7 AC EC B0 E4 3C 37>)
$$ ##END=
$$ 
$$ $$ hash MD5
$$ $$ 90 7B 14 58 64 06 4A 21 A7 96 5D 52 9B 40 3B 74
##$RELAX= 
##$RELAX= 
##$RELAX= 
##$RELAX= 
##$RELAX= 
##$RELAX= 
##$RELAX= 
##$RELAX= 
##$RELAX= 
$$ Bruker specific parameters
$$ --------------------------
##$DU= <F:/spectra>
##$EXPNO= 4
##$NAME= <1H>
##$PROCNO= 1
##$TYPE= <nmr>
##$USER= <iren>
##$AMP= (0..31)
100 100 100 100 100 100 100 100 100 100 100 100 100 100 100 100 100 100 
100 100 100 100 100 100 100 100 100 100 100 100 100 100 
##$ANAVPT= -1
##$AQSEQ= 0
##$AQ_mod= 1
##$AUNM= <au_zg>
##$AUTOPOS= <>
##$BF1= 200.13
##$BF2= 200.13
##$BF3= 200.13
##$BF4= 200.13
##$BF5= 200.13
##$BF6= 200.13
##$BF7= 200.13
##$BF8= 200.13
##$BYTORDA= 1
##$CFDGTYP= 0
##$CFRGTYP= 5
##$CHEMSTR= <none>
##$CNST= (0..63)
1 1 145 1 1 1 1 1 1 1 1 1 1 1 1 1 1 1 1 1 1 1 1 1 1 1 1 1 1 1 1 1 1 1 
1 1 1 1 1 1 1 1 1 1 1 1 1 1 1 1 1 1 1 1 1 1 1 1 1 1 1 1 1 1 
##$CPDPRG= <>
##$CPDPRG1= <>
##$CPDPRG2= <>
##$CPDPRG3= <>
##$CPDPRG4= <mlev>
##$CPDPRG5= <mlev>
##$CPDPRG6= <mlev>
##$CPDPRG7= <mlev>
##$CPDPRG8= <mlev>
##$CPDPRGB= <>
##$CPDPRGT= <>
##$D= (0..63)
0 2 0 0 0 0 0 0 0 0.06 0 0.03 0 0 0 0 0.0002 0 0 0 0 0 0 0 0 0 0 0 0 0 
$$ [...]
##$SW_h= 4401.40845070422
##$TD= 16384
##$TD0= 1
##$TE= 300
##$TE2= 300
##$TE3= 300
##$TEG= 300
##$TL= (0..7)
0 120 120 120 120 120 120 120 
##$TP= (0..7)
150 150 150 150 150 150 150 150 
##$TP07= 0
##$TPNAME0= <>
##$TPNAME1= <>
##$TPNAME2= <>
##$TPNAME3= <>
##$TPNAME4= <>
##$TPNAME5= <>
##$TPNAME6= <>
##$TPNAME7= <>
##$TPOAL= (0..7)
0.5 0.5 0.5 0.5 0.5 0.5 0.5 0.5 
##$TPOFFS= (0..7)
0 0 0 0 0 0 0 0 
##$TUNHIN= 0
##$TUNHOUT= 0
##$TUNXOUT= 0
##$USERA1= <user>
##$USERA2= <user>
##$USERA3= <user>
##$USERA4= <user>
##$USERA5= <user>
##$V9= 5
##$VALIST= <valist>
##$VCLIST= <CCCCCCCCCCCCCCC>
##$VD= 0
##$VDLIST= <DDDDDDDDDDDDDDD>
##$VPLIST= <PPPPPPPPPPPPPPP>
##$VTLIST= <TTTTTTTTTTTTTTT>
##$WBST= 1024
##$WBSW= 25
##$XGAIN= (0..3)
0 0 0 0 
##$XL= 0
##$YL= 0
##$YMAX_a= 902006
##$YMIN_a= -540367
##$ZGOPTNS= <>
##$ZL1= 120
##$ZL2= 120
##$ZL3= 120
##$ZL4= 120
##$ABSF1= 17.95386
##$ABSF2= -4.038887
##$ABSG= 5
##$ABSL= 3
##$ALPHA= 0
##$AQORDER= 0
##$ASSFAC= 0
##$ASSFACI= 0
##$ASSFACX= 0
##$ASSWID= 0
##$AUNMP= <proc_1d>
##$AXLEFT= 0
##$AXRIGHT= 0
##$AXTYPE= 0
##$AXUNIT= <>
##$AZFE= 0.1
##$AZFW= 0.1
##$BCFW= 0
##$BC_mod= 2
##$BYTORDP= 0
##$COROFFS= 0
##$CY= 7568.61572265625
##$DATMOD= 1
##$DC= 0
##$DFILT= <>
##$DTYPP= 0
##$F1P= 17.9538593292236
##$F2P= -4.03888763876832
##$FCOR= 0.5
##$FTSIZE= 32768
##$FT_mod= 6
##$GAMMA= 0
##$GB= 0
##$INTBC= 0
##$INTSCL= 1.483618e-010
##$ISEN= 128
##$LB= 0.5
##$LEV0= 0
##$LPBIN= 0
##$MAXI= 945.577
##$MC2= 0
##$MEAN= 0
##$ME_mod= 0
##$MI= -402.1523
##$NCOEF= 0
##$NC_proc= -6
##$NLEV= 6
##$NOISF1= 8.587773
##$NOISF2= 6.764455
##$NSP= 0
##$NTH_PI= 0
##$NZP= 0
##$OFFSET= 17.95386
##$PC= 1
##$PHC0= 95.94743
##$PHC1= 17.53316
##$PH_mod= 1
##$PKNL= yes
##$PPARMOD= 0
##$PPDIAG= 0
##$PPIPTYP= 0
##$PPMPNUM= 100
##$PPRESOL= 1
##$PSCAL= 0
##$PSIGN= 0
##$REVERSE= no
##$SF= 200.13
##$SI= 32768
##$SIGF1= 16.12182
##$SIGF2= -4.496377
##$SINO= 3.521527
##$SIOLD= 32768
##$SREGLST= <1H.CDCl3>
##$SSB= 0
##$STSI= 32768
##$STSR= 0
##$SW_p= 4401.40845070423
##$SYMM= 0
##$S_DEV= 0
##$TDeff= 16384
##$TDoff= 0
##$TI= <>
##$TILT= no
##$TM1= 0
##$TM2= 0
##$TOPLEV= 0
##$USERP1= <user>
##$USERP2= <user>
##$USERP3= <user>
##$USERP4= <user>
##$USERP5= <user>
##$WDW= 1
##$XDIM= 32768
##$YMAX_p= 475134535
##$YMIN_p= -300974
$$ End of Bruker specific parameters
$$ ---------------------------------
##NTUPLES= NMR SPECTRUM
##VAR_NAME=  FREQUENCY,     SPECTRUM/REAL,   SPECTRUM/IMAG
##SYMBOL=    X,             R,               I
##VAR_TYPE=  INDEPENDENT,   DEPENDENT,       DEPENDENT
##VAR_FORM=  AFFN,          ASDF,            ASDF
##VAR_DIM=   32768,         32768,           32768
##UNITS=     HZ,            ARBITRARY UNITS, ARBITRARY UNITS
##FACTOR=    0.134324425510551, 1,           1
##FIRST=     4401.40845070423, -154333,      -1918840
##LAST=      0,             -7976,           -2503332
##MIN=       0,             -300974,         0
##MAX=       4401.40845070423, 475134535,    0
$$ Real data points
##PAGE= N=1
##DATA TABLE= (X++(R..R)), XYDATA
$$ [...]
10063B332022l2814n6746m9137j0812K5575L2987J0614k4912n2141n4288l4083
$$ 2332022 2299208 2242462 2193325 2182513 2208088 2241075 2251689 2226777 2174636 2120348 2086265
10052B086265j6480j9663k8015j4826J2043J5882j3237l9074k9685n15J3342O295
$$ 2086265 2069785 2050122 2022107 2007281 2019324 2035206 2021969 1982895 1953210 1952695 1966037 1972332
10040A972332j218l86j459j0669k3256l5692m5223m1357j6988J4992L3636L4621
$$ 1972332 1971114 1970728 1969269 1958600 1935344 1899652 1854429 1813072 1796084 1811076 1844712 1879333
10028A879333K6527J0532j3929k9919j7525J2097K4857R931q979j4422j7615k7927
$$ 1879333 1905860 1916392 1902463 1872544 1855019 1867116 1891973 1901904 1892925 1878503 1860888 1832961
10016A832961k9380q747J5405J6945J841k43K3014N2892O2731M1676K219k4834
$$ 1832961 1803581 1794834 1810239 1827184 1829025 1828782 1851796 1904688 1967419 2009095 2011314 1986480
10004A986480j3290K8085N9771N8633M5056M5783M9458K8076j0724k9575j7817
$$ 1986480 1973190 2001275 2061046 2119679 2164735 2210518 2259976 2288052 2277328 2247753 2229936
9993B229936n812j5979l3129l7443l6521m3283m6502l0745j0703j6489m9187p5961
$$ 2229936 2224124 2208145 2175016 2137573 2101052 2057769 2011267 1980522 1969819 1953330 1904143 1828182
9981A828182p0625l9263l207K3813L4478K1857j0590m1278m8011l2996j9955k3789
$$ 1828182 1757557 1718294 1715087 1738900 1773378 1795235 1784645 1743367 1695356 1662360 1642405 1618616
9969A618616l1448j8799J7839N4230O2177L5750o918m1504n3697m3611k2566o116
$$ 1618616 1587168 1568369 1586208 1640438 1702615 1738365 1731447 1689943 1636246 1592635 1570069 1563953
9957A563953m778j7731l4916m4472l8975j8857P230K7862L6731L3063J5539j5481
$$ 1563953 1559175 1541444 1506528 1462056 1423081 1404224 1411454 1439316 1476047 1509110 1524649 1509168
9945A509168m6962n5904l3704q31J4432P769k459m349n301j4658k7142k9010j3318
$$ 1509168 1462206 1406302 1372598 1371767 1386199 1393968 1391509 1387160 1381859 1367201 1340059 1311049 1297731
9932A297731J3510L4937L6249K0508P553O881O34k8344o0143n8003k4672m641
$$ 1297731 1311241 1346178 1382427 1402935 1410488 1417369 1418003 1389659 1329516 1271513 1246841 1242200
9920A242200j9339l5119j8089J1203J2613o964n992K0468K8314p385n0300n0695
$$ 1242200 1222861 1187742 1169653 1180856 1193469 1186505 1180513 1200981 1229295 1221910 1171610 1120915
9908A120915j1270J8860N275l5734n9620m0586N022L8951M2367K9880J9639O909
$$ 1120915 1109645 1128505 1133780 1098046 1038426 997840 1002862 1041813 1084180 1114060 1133699 1140608
9896A140608j5168k6563n545K4982J8819k0699l5639n49L1848P648m4593n6477
$$ 1140608 1125440 1098877 1093332 1118314 1137133 1116434 1080795 1080246 1112094 1119742 1075149 1018672
9884A018672j9929J2100J3425J2115K5671K8095K934k0373j3363P022J4005J7898
$$ 1018672 998743 1010843 1024268 1036383 1062054 1090149 1093083 1072710 1059347 1066369 1080374 1098272
9872A098272L9248O0494M7737P059k2127k4262k0149k3723k3257j0935J381N086
$$ 1098272 1137520 1198014 1245751 1252810 1230683 1206421 1186272 1162549 1139292 1128357 1129738 1134824
9860A134824O322N690p229k8360l3387j1829J4044J8868M617j1669k1999k5094
$$ 1134824 1141146 1146836 1139607 1111247 1077860 1066031 1080075 1098943 1103560 1091891 1069892 1044798
9848A044798j8510q820j1579k3843j6148K5880O9206P0162L2114k096p911M64
$$ 1044798 1026288 1017468 1005889 982046 965898 991778 1060984 1131146 1163260 1161164 1153253 1153717
9836A153717M218L091K22p752j6094j0749Q233K2505K4264K8112M1798M6314K3279
$$ 1153717 1157935 1161026 1161248 1153496 1137402 1126653 1134886 1157391 1181655 1209767 1251565 1297879 1321158
9823A321158j4118l7910m1843m0768m1619l6797k3479q326Q400L3329N9153O2585
$$ 1321158 1307040 1269130 1227287 1186519 1144900 1108103 1084624 1076298 1084698 1118027 1177180 1239765
9811A239765L5617M717J910K3706L7086K5765J1278K0306M7534O6003O3874N2018
$$ 1239765 1275382 1280099 1282009 1305715 1342801 1368566 1379844 1400150 1447684 1513687 1577561 1629579
9799A629579L9636K4038P065P93R075K1789L5854O0981R1504R6342O0509J8353
$$ 1629579 1669215 1693253 1700318 1701111 1710186 1731975 1767829 1828810 1920314 2016656 2077165 2095518
9787B095518J6459N3849Q7289Q7868O2643K7239q372k8173k0431m245j1382l5808
$$ 2095518 2111977 2165826 2253115 2340983 2403626 2430865 2422493 2394320 2373889 2369644 2358262 2322454
9775B322454l7912q278J2853l559l4682m8856n1038n6144n3538l4664k4990m6212
$$ 2322454 2284542 2276264 2289117 2285558 2250876 2202020 2150982 2094838 2041300 2006636 1981646 1935434
9763A935434p0828n8561j9531M124M624Q507J9938J5278o424j6324m789O506P775
$$ 1935434 1864606 1806045 1786514 1790638 1795262 1803769 1823707 1838985 1832561 1816237 1811448 1817954 1825729
9750A825729J2876J9758M787k9470m5194k6850o108p955j4243p685r568l6651
$$ 1825729 1838605 1858363 1863150 1833680 1788486 1761636 1755528 1747573 1733330 1725645 1716077 1679426
9738A679426n6993l4209R295K0755n661k5789j3758R586J8711J5682J1553N722
$$ 1679426 1622433 1588224 1597519 1618274 1612613 1586824 1573066 1582652 1601363 1617045 1628598 1634320
9726A634320l400q348m740O81J584K28j83j252m664j0029j7298k3420j9241K94
$$ 1634320 1630920 1622572 1617832 1618513 1620097 1620325 1620142 1618890 1614226 1604197 1586899 1563479 1544238 1544532
9712A544532K4780L6316K7383M613j9895l3656k8043p660J1117K0280K9878M6816
$$ 1544532 1569312 1605628 1633011 1637624 1617729 1584073 1556030 1548370 1559487 1579767 1609645 1656461
9700A656461N5602L6994j744l2864m0062k8772r619J0661K3655K1703Q523k858
$$ 1656461 1712063 1749057 1747313 1714449 1674387 1645615 1635996 1646657 1670312 1692015 1700538 1697680
9688A697680k619J1082L1656M0006J5249l3707o0710l0839L0414O1758L8205n316
$$ 1697680 1695061 1706143 1737799 1777805 1793054 1759347 1698637 1667798 1698212 1759970 1798175 1792859
9676A792859k2980o385K1114L6181L1482J4565j61n285p039j1269j0044L563J5823
$$ 1792859 1769879 1763494 1784608 1820789 1852271 1866836 1866675 1861390 1854351 1843082 1833038 1836601 1852424
9663A852424Q316j0745j3842P918L5303M8674M4291K5703L052j519K3595N0973
$$ 1852424 1860740 1849995 1836153 1844071 1879374 1928048 1972339 1998042 2001094 1999575 2023170 2074143
9651B074143L9722o142l8234l1314j4585k0260l6042l2703r955J2644K8331L9331
$$ 2074143 2113865 2107723 2069489 2038175 2023590 2003330 1967288 1934585 1924630 1937274 1965605 2004936
9639B004936L8844K4075J2884K1451L6631L4495J6117J915R2L539R815K1548L2731
$$ 2004936 2043780 2067855 2080739 2102190 2138821 2173316 2189433 2191348 2191440 2194979 2204794 2226342 2259073
9626B259073L4789L0438K4736J2434o592j2663P500L0158K0550j4976l4309j8423
$$ 2259073 2293862 2324300 2349036 2361470 2354878 2342215 2349715 2379873 2400423 2385447 2351138 2332715
9614B332715O219J1995P407J4387L0533L4991K0892L137l234J274Q062J4484K4396
$$ 2332715 2338934 2350929 2358336 2372723 2403256 2438247 2459139 2462276 2459042 2460316 2468378 2482862 2507258
9601B507258L6992M2381L3739J9321J3206J6790K1582K8028M3260N8646N3159
$$ 2507258 2544250 2586631 2620370 2639691 2652897 2669687 2691269 2719297 2762557 2821203 2874362
9590B874362K7691J1495K0117L1774K5284J6058K6876M5607M6220L4099L1228
$$ 2874362 2902053 2913548 2933665 2965439 2990723 3006781 3033657 3079264 3125484 3159583 3190811
9579C190811K9012J485l7831m1310N68L6814K4749j5419l8578l6078k9576k5270
$$ 3190811 3219823 3221308 3183477 3142167 3142735 3179549 3204298 3188879 3150301 3114223 3084647 3059377
9567C059377p657K7651O1070P1551N8207L7748K6883K7626K9485K7761L1779M4617
$$ 3059377 3051720 3079371 3140441 3211992 3270199 3307947 3334830 3362456 3391941 3419702 3451481 3496098
9555C496098M5838J6693k3169l2982p258J5644R734n092j220J5170K3841K6566
$$ 3496098 3541936 3558629 3535460 3502478 3495220 3510864 3520598 3515506 3514286 3529456 3553297 3579863
9543C579863L5064M1406L1464J6396J9568L7509M4026L3243K9263M6009O2829
$$ 3579863 3614927 3656333 3687797 3704193 3723761 3761270 3805296 3838539 3867802 3913811 3976640
9532C976640N3731K3134k682q562J79J4258K9609M0161L7004K2009J1535J5995
$$ 3976640 4030371 4053505 4050823 4042261 4042440 4056698 4086307 4126468 4163472 4185481 4197016 4213011
9520D213011K3022J5230L07L227K5549L6108J6131p646J973L8283N8882M2651
$$ 4213011 4236033 4251263 4251570 4254797 4280346 4316454 4332585 4324939 4326912 4365195 4424077 4466728
9508D466728J1477n173j914J1195K6683M0528M9965N6361N9746N2578L3201J9917
$$ 4466728 4478205 4473032 4471118 4482313 4508996 4549524 4599489 4655850 4715596 4768174 4801375 4821292
9496D821292L0685N2387N4113L0758R018R342K6282M7123O3906O6556N2016M0955
$$ 4821292 4851977 4904364 4958477 4989235 4998253 5007595 5033877 5081000 5144906 5211462 5263478 5304433
9484E304433N5448Q0590Q2604O4057N9131P1187O5482L6414K7136N6789Q0502
$$ 5304433 5359881 5440471 5523075 5587132 5646263 5717450 5782932 5819346 5846482 5903271 5983773
9473E983773N8710K1910K2969N9667Q9309R3780Q7284Q0169P4286P7271Q8656
$$ 5983773 6042483 6064393 6087362 6147029 6236338 6330118 6417402 6497571 6571857 6649128 6737784
9462F737784Q9882P6381P5720J05285J39854J51521J50101J51250J42788J22870
$$ 6737784 6827666 6904047 6979767 7085052 7224906 7376427 7526528 7677778 7820566 7943436
9452G943436J29726J81612K26318K10514J64156J48107J49938J11543M0180M580
$$ 7943436 8073162 8254774 8481092 8691606 8855762 9003869 9153807 9265350 9305530 9310110
9442I310110K3657M3398L3473K8012N2567Q2430R8073J18995J55802J83125J85615
$$ 9310110 9333767 9377165 9410638 9438650 9491217 9573647 9671720 9790715 9946517 10129642 10315257
9431A0315257J82457J84816J75584J50649J34384J35349J30174J07700Q7376Q1902
$$ 10315257 10497714 10682530 10858114 11008763 11143147 11278496 11408670 11516370 11603746 11685648
9421A1685648Q4353R9239J38793J83169J96426J85918J89173K01601J86020J57627
$$ 11685648 11770001 11869240 12008033 12191202 12387628 12573546 12762719 12964320 13150340 13307967
9411A3307967J77390K43184K73131K28534J71707J63696J84425J97986K16755
$$ 13307967 13485357 13728541 14001672 14230206 14401913 14565609 14750034 14948020 15164775
9402A5164775K48124K54467K25962K21818K75485L27429L20346K95480L19034
$$ 15164775 15412899 15667366 15893328 16115146 16390631 16718060 17038406 17333886 17652920
9393A7652920L72198L94561L86363L86608L92050L76340L53090L47264L40959
$$ 17652920 18025118 18419679 18806042 19192650 19584700 19961040 20314130 20661394 21002353
9384B1002353L16579L12299L62003M21486M29917M05678M06198M32421M48853
$$ 21002353 21318932 21631231 21993234 22414720 22844637 23250315 23656513 24088934 24537787
9375B4537787M57022M71245M65170M23272L99547M40300M97742N09991N11957
$$ 24537787 24994809 25466054 25931224 26354496 26754043 27194343 27692085 28202076 28714033
9366B8714033N64921O31888O39548O14635O32177O71255O58413O19731O45132
$$ 28714033 29278954 29910842 30550390 31165025 31797202 32468457 33126870 33746601 34391733
9357C4391733P25079P70457P77753Q21669Q93942R10335Q79649R02529R90189
$$ 34391733 35116812 35887269 36665022 37486691 38380633 39290968 40170617 41073146 42063335
9348D2063335J047303J052943J092518J185533J251738J280911J363632J513427
$$ 42063335 43110638 44163581 45256099 46441632 47693370 48974281 50337913 51851340
9340E1851340J632949J701197J815574K000944K164790K293640K491281K758051
$$ 51851340 53484289 55185486 57001060 59002004 61166794 63460434 65951715 68709766
9332F8709766K947175L020240L125129L331867L525727L660716L863865M175640
$$ 68709766 71656941 74677181 77802310 81134177 84659904 88320620 92184485 96360125
9324I6360125M471613M779039N351535O252240P209906Q098085R150638J0432899
$$ 96360125 100831738 105610777 110962312 117214552 124424458 132522543 141673181 152106080
9316A52106080J1604238J2608340J3943003J5435417J5257414J1406056M294565
$$ 152106080 163710318 176318658 190261661 205697078 220954492 232360548 236655113
9309B36655113l154209q340989j1082337j2561888j3269177j2877632j1502840
$$ 236655113 233500904 225159915 214077578 201515690 188246513 175368881 163866041
9302A63866041r938505q698117p643470o631171n858410n412203n017187m454898
$$ 163866041 153927536 145229419 137585949 130954778 125096368 119684165 114666978 110212080
9294A10212080l852484l373039k945801k484865k102194j916823j856589j802120
$$ 110212080 106359596 102986557 100040756 97555891 95453697 93536874 91680285 89878165
9286H9878165j755276j739144j693144j588347j508021j508085j520225j478927
$$ 89878165 88122889 86383745 84690601 83102254 81594233 80086148 78565923 77086996
9278G7086996j422363j390123j343165j261397j203696j197880j181548j116526
$$ 77086996 75664633 74274510 72931345 71669948 70466252 69268372 68086824 66970298
9270F6970298j050595j007950r39312q41953q00552q36501q47208p79770p35311
$$ 66970298 65919703 64911753 63972441 63130488 62329936 61493435 60646227 59866457 59131146
9261E9131146p99319q89817q91952q39414q35804q81437r08282r19922r67071
$$ 59131146 58331827 57442010 56550058 55710644 54874840 53993403 53085121 52165199 51198128
9252E1198128j030092j045690j018701j002715r97954r63670r04789q57610q16964
$$ 51198128 50168036 49122346 48103645 47100930 46102976 45139306 44234517 43376907 42559943
9243D2559943p61710p22829p40684p81477p80075p41211p16709p09055o83101
$$ 42559943 41798233 41075404 40334720 39553243 38773168 38031957 37315248 36606193 35923092
9234C5923092o50016o50635o71822o66985o47090o63233p06941p17065o84904
$$ 35923092 35273076 34622441 33950619 33283634 32636544 31973311 31266370 30549305 29864401
9225B9864401o64515o72598o63937o19760n79032n61748n36888m92029m65821
$$ 29864401 29199886 28527288 27863351 27243591 26664559 26102811 25565923 25073894 24608073
9216B4608073m80575n01482m93968m71779m60056m54122m39769m17034l86170
$$ 24608073 24127498 23626016 23132048 22660269 22200213 21746091 21306322 20889288 20503118
9207B0503118l46127l16594l20253l35902l17775k71532k56878k96280l35801
$$ 20503118 20156991 19840397 19520144 19184242 18866467 18594935 18338057 18041777 17705976
9198A7705976l24523k83198k59400k57028k50803k39563k43179k62316k74289
$$ 17705976 17381453 17098255 16838855 16581827 16331024 16091461 15848282 15585966 15311677
9189A5311677k62687k32877k05247k00079k15773k21356j91427j47678j37436
$$ 15311677 15048990 14816113 14610866 14410787 14195014 13973658 13782231 13634553 13497117
9180A3497117j69615k04142k09179j94536j81327j73499j68897j65515j49228
$$ 13497117 13327502 13123360 12914181 12719645 12538318 12364819 12195922 12030407 11881179
9171A1881179j10277p6706r0071j40639j72906j66104j56917j65035j55665j08647
$$ 11881179 11770902 11694196 11604125 11463486 11290580 11124476 10967559 10802524 10646859 10538212
9161A0538212o8681q0699j19435j33132j21552j18855j27319j21770j01412q7946
$$ 10538212 10469531 10388832 10269397 10136265 10014713 9895858 9768539 9646769 9545357 9457411
9151I457411q4860q1778q5809j06445j22792j09204q1645p4599q2863p3530m8308
$$ 9457411 9372551 9290773 9204964 9098519 8975727 8866523 8784878 8710279 8627416 8553886 8505578
9140H505578m2728o3422p7679p2520p3727r1150r3043n9825k3829k4373n2019
$$ 8505578 8462850 8399428 8321749 8249229 8175502 8084352 7991309 7931484 7907655 7883282 7831263
9129G831263o9661o9063p3259r2200j06554r7845p4135n8642o2314p3711p3995
$$ 7831263 7761602 7692539 7619280 7527080 7420526 7322681 7248546 7189904 7127590 7053879 6979884
9118F979884n9355m5014m4290m9302m1635j9524k546o791k5327l8893m0136m0821
$$ 6979884 6920529 6875515 6831225 6781923 6740288 6720764 6718218 6711427 6686100 6647207 6607071 6566250
9106F566250n4504p5610q1836o1646l2479k0110k5193k8754k8149m0128o1965
$$ 6566250 6511746 6436136 6354300 6292654 6260175 6240065 6214872 6186118 6157969 6117841 6055876
9095F055876o2901l4164j6178m3395q5126q1926k9779J3571N253l7590p3440q1804
$$ 6055876 5992975 5958811 5942633 5899238 5814112 5732186 5702407 5715978 5721231 5683641 5610201 5528397
9083E528397o3527k7760O031J6248L628r318j0833j2538k3304l3260l4163l4771
$$ 5528397 5464870 5437110 5443141 5459389 5463017 5453699 5442866 5430328 5407024 5373764 5339601 5304830
9071E304830m3949n5695o0699n6374l9724j1346Q084o849m3357n4151k3685L86
$$ 5304830 5260881 5205186 5144487 5088113 5048389 5037043 5045127 5038278 4994921 4940770 4917085 4917471
9059D917471k8405q5019j04542o8738k0904K55J163K622M791j309j1928j7675
$$ 4917471 4889066 4804047 4699505 4630767 4609863 4610118 4611281 4613903 4618694 4617385 4605457 4587782
9047D587782j7872j5942j2568j2410k4767m8145o5861o6021n5050m3451l1827
$$ 4587782 4569910 4553968 4541400 4528990 4504223 4456078 4390217 4324196 4269146 4225695 4193868
9036D193868k1588k3945m0841m9686l0032J259P499j5628l2970k1464k13N842
$$ 4193868 4172280 4148335 4107494 4057808 4027776 4029035 4036534 4020906 3987936 3966472 3966259 3972101
9024C972101M584J4102K4080J4058l427J898K2678J7147k3853n6029m7371k4188
$$ 3972101 3976685 3990787 4014867 4028925 4025498 4027396 4050074 4067221 4043368 3987339 3939968 3915780
9012C915780k1070k1944M379L5858K0823l5852o6554l3945J6835K2805j6182n1838
$$ 3915780 3894710 3872766 3877145 3913003 3933826 3897974 3831420 3797475 3814310 3837115 3820933 3769095
9000C769095n6771m4325l1067j4495Q216K4046J8637l736k4107k9325k2253j1976
$$ 3769095 3712324 3667999 3636932 3622437 3630653 3654699 3673336 3669600 3645493 3616168 3593915 3581939
8988C581939r41J1463J7250O070j3960j8804j973J2447O387k108R692K5660J4396
$$ 3581939 3580998 3592461 3609711 3615781 3601821 3583017 3581044 3593491 3599878 3597770 3607462 3633122 3647518
8975C647518j4674k1927l020L429j7023k8924j0004O871j1019l7869k9762M048
$$ 3647518 3632844 3610917 3607897 3611326 3594303 3565379 3555375 3562246 3551227 3513358 3483596 3487644
8963C487644J7771J314j1231O05K0349L0267L2287K8511J4615n71P01J3772J3636
$$ 3487644 3505415 3506729 3495498 3496103 3516452 3546719 3579006 3607517 3622132 3621561 3622262 3636034 3649670
8950C649670l562j1195L209J4538J036j7594j0526J3129J5159j4416m0031k7504
$$ 3649670 3646108 3634913 3638122 3652660 3653696 3636102 3625576 3638705 3653864 3639448 3599417 3571913
8938C571913J2440M0368L5576J2078p980j8449k0511o722K7408O1504O2805K6419
$$ 3571913 3584353 3624721 3660297 3672375 3664395 3645946 3625435 3618713 3646121 3707625 3770430 3796849
8926C796849j4885k9664j9617k139J8119M0631M9103K8586l231r460J8151M6321
$$ 3796849 3781964 3752300 3732683 3730544 3748663 3789294 3838397 3866983 3863752 3854292 3872443 3918764
8914C918764M1713R574j5782q719K4051N1023M6516J7749l909k885K562p238k0356
$$ 3918764 3960477 3970051 3954269 3945550 3969601 4020624 4067140 4084889 4080980 4078095 4080657 4073419 4053063
8901D053063j3720O904J5011M776m380k798r94k422N303K4386L7605L4981K7728
$$ 4053063 4039343 4046247 4061258 4066034 4061654 4058856 4057862 4055440 4060743 4085129 4122734 4157715 4185443
8888D185443K5339J9498K562j5490k0396j0556P198K5348L3849K5595Q981Q14
$$ 4185443 4210782 4230280 4232842 4217352 4196956 4186400 4193598 4218946 4252795 4278390 4287371 4288185
8876D288185M104Q308J0953J8624K6715K2826J2707J6306L3648M2247L3492K1896
$$ 4288185 4292289 4300597 4311550 4330174 4356889 4379715 4392422 4408728 4442376 4484623 4518115 4540011
8864D540011J2995l276j9292r566K2271L9118L2698M3603Q9635J22080R6609M6697
$$ 4540011 4553006 4549730 4530438 4520872 4543143 4582261 4614959 4658562 4748197 4870277 4966886 5013583
8852E013583L3996N7360O8627N5621M7870N2947M9655M1283N5218Q5433R2907
$$ 5013583 5047579 5104939 5173566 5229187 5277057 5330004 5379659 5420942 5476160 5561593 5654500
8841E654500P2937O6676R0721J09331R8316Q4642R2040R3674N8021P020j3421
$$ 5654500 5727437 5794113 5884834 5994165 6092481 6177123 6269163 6362837 6420858 6427878 6414457
8830F414457J708J8857J6997K657j3557k3829j4691J9230N6172O5586M4925K0952
$$ 6414457 6416165 6435022 6452019 6454676 6441119 6417290 6402599 6421829 6478001 6543587 6588512 6609464
8818F609464J6785L1323M7203M7365K8830Q485O725J9456K1488N869k017J4622
$$ 6609464 6626249 6657572 6704775 6752140 6780970 6789455 6796180 6815636 6837124 6842993 6840976 6855598
8806F855598L3197K7603J4336K7738O0996P2291N0152L2242M6224O7135N7636
$$ 6855598 6888795 6916398 6930734 6958472 7019468 7091759 7141911 7174153 7220377 7287512 7345148
8795G345148K5773J1786K8502M6300L9621K1674J9814L4793M4891M2621M3383
$$ 7345148 7370921 7382707 7411209 7457509 7497130 7518804 7538618 7573411 7618302 7660923 7704306
8784G704306N3968N5551L3065N261L800L0025N5171O0766N5649N1573M6365L8331
$$ 7704306 7758274 7813825 7846890 7852151 7855951 7885976 7941147 8001913 8057562 8109135 8155500 8193831
8772H193831L4937L7213L5756L1798M0223N9478O3568M2250K5032M0562P3170
$$ 8193831 8228768 8265981 8301737 8333535 8373758 8433236 8496804 8539054 8564086 8604648 8677818
8761H677818Q8822Q6266Q8014R4014Q4804O6381O8609R2332R9072P0113M0666
$$ 8677818 8766640 8852906 8940920 9034934 9119738 9186119 9254728 9347060 9446132 9516245 9556911
8750I556911N1239R1999J23256J31430J33710J38445J33543J15028R9489R9229
$$ 9556911 9608150 9700149 9823405 9954835 10088545 10226990 10360533 10475561 10575050 10674279
8740A0674279J04225J00164R1338R2166J03050J09565J06618J10928J40615J87002
$$ 10674279 10778504 10878668 10970006 11062172 11165222 11274787 11381405 11492333 11632948 11819950
8730A1819950K17052K06251J62639J15392Q6982Q2819J00984J38556J85539K22406
$$ 11819950 12037002 12243253 12405892 12521284 12608266 12691085 12792069 12930625 13116164 13338570
8720A3338570K32269K15652J90310J75238J74606J77801J75496J72733J82125
$$ 13338570 13570839 13786491 13976801 14152039 14326645 14504446 14679942 14852675 15034800
8711A5034800K06535K35219K56179K64054K57131K39308K27099K38585K68001
$$ 15034800 15241335 15476554 15732733 15996787 16253918 16493226 16720325 16958910 17226911
8702A7226911K87227K83732K80250K99960L28083L32535L12782K99390L07108
$$ 17226911 17514138 17797870 18078120 18378080 18706163 19038698 19351480 19650870 19957978
8693A9957978L18183L18350L21748L45947L82676M09956M19646M18185M12208
$$ 19957978 20276161 20594511 20916259 21262206 21644882 22054838 22474484 22892669 23304877
8684B3304877M09510M24626M63848N07136N23248N07202M88928M96598N21352
$$ 23304877 23714387 24139013 24602861 25109997 25633245 26140447 26629375 27125973 27647325
8675B7647325N32112N22252N23953N66085O30712O70483O65480O41139O27303
$$ 27647325 28179437 28701689 29225642 29791727 30422439 31092922 31758402 32399541 33026844
8666C3026844O24503O21901O23077O33214O40855O37212O36725O51398O62390
$$ 33026844 33651347 34273248 34896325 35529539 36170394 36807606 37444331 38095729 38758119
8657C8758119O51286O43585O76969P34438P61043P50773P60751Q21031Q85042
$$ 38758119 39409405 40052990 40729959 41464397 42225440 42976213 43736964 44557995 45443037
8648D5443037R02608Q95291R15275R64921J007352J034021J070396J125626J184186
$$ 45443037 46345645 47240936 48156211 49121132 50128484 51162505 52232901 53358527 54542713
8639E4542713J243426J315015J388159J433629J451660J478434J533789J594723
$$ 54542713 55786139 57101154 58489313 59922942 61374602 62853036 64386825 65981548
8631F5981548J633432J653164J672263J697321J726051J754705J768344J743978
$$ 65981548 67614980 69268144 70940407 72637728 74363779 76118484 77886828 79630806
8623G9630806J678606J598007J524763J452919J365395J258933J138913J007541
$$ 79630806 81309412 82907419 84432182 85885101 87250496 88509429 89648342 90655883
8615I0655883Q73172P54016O51896N35946L77633J97998N7272o695j6424k9057
$$ 90655883 91529055 92283071 92934967 93470913 93848546 94046544 94103816 94097121 94080697 94051640
8605I4051640q2299j66269k39440k70346k68718k75341l18514l86182m48029m98683
$$ 94051640 93969341 93803072 93563632 93293286 93024568 92749227 92430713 92044531 91596502 91097819
8595I1097819n66168o76857q23486r73320j101414j208240j306600j400446j483654
$$ 91097819 90531651 89854794 89031308 88057988 86956574 85748334 84441734 83041288 81557634
8586H1557634j556512j631747j717298j800283j859103j888911j903573j911956
$$ 81557634 80001122 78369375 76652077 74851794 72992691 71103780 69200207 67288251
8578F7288251j904900j871088j816391j760138j717017j687080j658431j615196
$$ 67288251 65383351 63512263 61695872 59935734 58218717 56531637 54873206 53258010
8570E3258010j547505j459051j364107j275977j199701j133732j073739j016511
$$ 53258010 51710505 50251454 48887347 47611370 46411669 45277937 44204198 43187687
8562D3187687r64804r24455q90591q44921p79178p13477o72693o49566o15353
$$ 43187687 42222883 41298428 40407837 39562916 38783738 38070261 37397568 36748002 36132649
8553C6132649n66925n33245n25807n14080m71200m18115l93395l96380l92323
$$ 36132649 35565724 35032479 34506672 33992592 33521392 33103277 32709882 32313502 31921179
8544C1921179l65244l33561l15042l06268l00468k98378k93967k74547k46309
$$ 31921179 31555935 31222374 30907332 30601064 30300596 30002218 29708251 29433704 29187395
8535B9187395k37562k61343k91885k95518k73617k58373k72382l05625l28159
$$ 29187395 28949833 28688490 28396605 28101087 27827470 27569097 27296715 26991090 26662931
8526B6662931l16659k74996k37031k38758k75305k96061k60594j92310j53762
$$ 26662931 26346272 26071276 25834245 25595487 25320182 25024121 24763527 24571217 24417455
8517B4417455j69350j98372j93268j59309j36326j39200j45433j37129j25216
$$ 24417455 24248105 24049733 23856465 23697156 23560830 23421630 23276197 23139068 23013852
8508B3013852j23096j20416j01388p5141o5948p6591q1224o0066k7682j6872l9121
$$ 23013852 22890756 22770340 22668952 22593811 22527863 22451272 22370048 22309982 22282300 22265428 22226307
8497B2226307o9491p3055m3568j0982p071k8794m6453m5670m2145m7672m4854
$$ 22226307 22156816 22083761 22040193 22029211 22022140 21993346 21946893 21901223 21859078 21811406 21766552
8486B1766552j7144J3594J1390j8268l1904j0248J8187K6854K9078M3982N5767
$$ 21766552 21749408 21763002 21774392 21756124 21724220 21713972 21732159 21759013 21788091 21832073 21887840
8475B1887840M0262J2560J0969M0494O5767O0623L6446J7953J5575K7345M6826
$$ 21887840 21928102 21940662 21951631 21992125 22057892 22118515 22154961 22172914 22188489 22215834 22262660
8464B2262660O2718O8307P5195R8689J26491J25402Q8519N3701O0144J03510J49633
$$ 22262660 22325378 22393685 22468880 22567569 22694060 22819462 22907981 22961682 23021826 23125336 23274969
8453B3274969J77747J91490J97611J95083J83772J68824J56083J52683J68240
$$ 23274969 23452716 23644206 23841817 24036900 24220672 24389496 24545579 24698262 24866502
8444B4866502K02920K36489K43261K20813J93858J86949K02413K27552K51487
$$ 24866502 25069422 25305911 25549172 25769985 25963843 26150792 26353205 26580757 26832244
8435B6832244K65944K59003K24500J79818J60422J86060K36802K71825K70684
$$ 26832244 27098188 27357191 27581691 27761509 27921931 28107991 28344793 28616618 28887302
8426B8887302K49402K39251K59714L09085L65924L97154L82345L39527L13029
$$ 28887302 29136704 29375955 29635669 29944754 30310678 30707832 31090177 31429704 31742733
8417C1742733L26184L61016L94671M33240M87276N35172N47667N40743N63165
$$ 31742733 32068917 32429933 32824604 33257844 33745120 34280292 34827959 35368702 35931867
8408C5931867O25408O78581O80223O50287O39627O66771P11157P51667P83046
$$ 35931867 36557275 37235856 37916079 38566366 39205993 39872764 40583921 41335588 42118634
8399D2118634Q01218P98574P76432P46301P16519O86627O52506O08385N48369
$$ 42118634 42919852 43718426 44494858 45241159 45957678 46644305 47296811 47905196 48453565
8390D8453565M75859M07510L58114L24043K89166K44065J93478J48901J18926
$$ 48453565 48929424 49336934 49695048 50019091 50308257 50552322 50745800 50894701 51013627
8381E1013627J02539Q9862P6692P7658J10502J64744K05183K15437K18808K43603
$$ 51013627 51116166 51206028 51282720 51360378 51470880 51635624 51840807 52056244 52275052 52518655
8371E2518655K88209L37317L90466M48651M90195M93005M73658M73068N05016
$$ 52518655 52806864 53144181 53534647 53983298 54473493 54966498 55440156 55913224 56418240
8362E6418240N47390N83267O19303O57961O82268O82023O72441O72289O80090
$$ 56418240 56965630 57548897 58168200 58826161 59508429 60190452 60862893 61535182 62215272
8353F2215272O83825O79285O68616O55475O51743O74159P22355P72533Q03944
$$ 62215272 62899097 63578382 64246998 64902473 65554216 66228375 66950730 67723263 68527207
8344F8527207Q20285Q35702Q54168Q76308R13008R72996J042860J097520J130480
$$ 68527207 69347492 70183194 71037362 71913670 72826678 73799674 74842534 75940054 77070534
8335G7070534J160915J210442J283585J371513J463731J551673J628892J695717
$$ 77070534 78231449 79441891 80725476 82096989 83560720 85112393 86741285 88437002
8327H8437002J762425J841828J935672K031342K116748K196974K288212K393057
$$ 88437002 90199427 92041255 93976927 96008269 98125017 100321991 102610203 105003260
8319A05003260K490959K559437K597184K619536K639052K657095K662690K629865
$$ 105003260 107494219 110053656 112650840 115270376 117909428 120566523 123229213 125859078
8311A25859078K531880K376065K209669K066423J918479J712014J443995J167731
$$ 125859078 128390958 130767023 132976692 135043115 136961594 138673608 140117603 141285334
8303A41285334R21692O92765M60159K34859L3404j52850l32784m85726n88282
$$ 141285334 142207026 142899791 143359950 143594809 143628213 143475363 143142579 142656853 142068571
8294A42068571o52334p05439p47456p56831p29264o80524o19125n45649m72921
$$ 142068571 141416237 140710798 139963342 139206511 138477247 137796723 137177598 136631949 136159028
8285A36159028m15817l62602k86344j86825r3994k7485J8805M6753M0093n033
$$ 136159028 135743211 135380609 135094265 134907440 134813446 134785961 134804766 134851519 134891612 134886579
8275A34886579o1420j03565j43287k12820l21575m47278n66524o80589q10250
$$ 134886579 134825159 134721594 134578307 134365487 134043912 133596634 133030110 132349521 131539271
8266A31539271r71658j156997j337091j487050j610576j732709j867111j999361
$$ 131539271 130567613 129410616 128073525 126586475 124975899 123243190 121376079 119376718
8258A19376718k107300k188682k258386k321764k363670k371115k359869k363576
$$ 119376718 117269418 115080736 112822350 110500586 108136916 105765801 103405932 101042356
8250A01042356k390158k402435k359341k270087k183928k125491k070009j994310
$$ 101042356 98652198 96249763 93890422 91620335 89436407 87310916 85240907 83246597
8242H3246597j919112j872043j833839j761668j655466j558988j493905j433687
$$ 83246597 81327485 79455442 77621603 75859935 74204469 72645481 71151576 69717889
8234F9717889j354942j278703j238105j228588j213738j167363j091597j004106
$$ 69717889 68362947 67084244 65846139 64617551 63403813 62236450 61144853 60140747
8226F0140747r24818q69361q40719q26974q12445p88570p53798p11523o70095
$$ 60140747 59215929 58346568 57505849 56678875 55866430 55077860 54324062 53612539 52942444
8217E2942444o35596o02202n57682m99105m36029l81545l47736l39308l36989
$$ 52942444 52306848 51704646 51146964 50647859 50211830 49830285 49482549 49143241 48806252
8208D8806252l01522k19371j33455r6398j00544r2528n3531j7734m784J2929N5362
$$ 48806252 48504730 48285359 48151904 48055506 47954962 47862434 47808903 47791169 47786385 47799314 47854676
8197D7854676R8120J21555J49915K02009K44236K40582K16009K18198K42743K51502
$$ 47854676 47952796 48074351 48224266 48426275 48670511 48911093 49127102 49345300 49588043 49839545
8187D9839545K43324K45422K48210K15315J57535J30862J49292J59162J17703
$$ 49839545 50082869 50328291 50576501 50791816 50949351 51080213 51229505 51388667 51506370
8178E1506370M2285l9478j33324k41775l33900l89963m36082m94262n33533n16029
$$ 51506370 51548655 51509177 51375853 51134078 50800178 50410215 49974133 49479871 48946338 48430309
8168D8430309m64360m34631m39597m45355m33621m19992m11673l92270l57441
$$ 48430309 47965949 47531318 47091721 46646366 46212745 45792753 45381080 44988810 44631369
8159D4631369l28438l15647k98081k57774k13394j97841k11704k18188j85880
$$ 44631369 44302931 43987284 43689203 43431429 43218035 43020194 42808490 42590302 42404422
8150D2404422j25045p3750n1133l6843m882L5523N5440N7591Q0129J39574K01656
$$ 42404422 42279377 42205627 42154494 42117651 42112769 42148292 42203732 42261323 42341452 42481026 42682682
8139D2682682K28718K28590K30842K40606K49267K68816L13325L58444L64493
$$ 42682682 42911400 43139990 43370832 43611438 43860705 44129521 44442846 44801290 45165783
8130D5165783L37402L22856L36825L46465L30072L10856L10448L09230K82951
$$ 45165783 45503185 45826041 46162866 46509331 46839403 47150259 47460707 47769937 48052888
8121D8052888K48396K39458K58035K79260K89552K90519K79140K55477K41631
$$ 48052888 48301284 48540742 48798777 49078037 49367589 49658108 49937248 50192725 50434356
8112E0434356K61254L01660L24530L16979L07293L23652L57485L76942L63685
$$ 50434356 50695610 50997270 51321800 51638779 51946072 52269724 52627209 53004151 53367836
8103E3367836L28707K99539K95069L07843L12985K99071K81337K75241K71309
$$ 53367836 53696543 53996082 54291151 54598994 54911979 55211050 55492387 55767628 56038937
8094E6038937K55634K43662K64795L15225L55860L63589L58099L67545L92831
$$ 56038937 56294571 56538233 56803028 57118253 57474113 57837702 58195801 58563346 58956177
8085E8956177M21091M51834M88650N20892N36281N43541N63469O02690O50863
$$ 58956177 59377268 59829102 60317752 60838644 61374925 61918466 62481935 63084625 63735488
8076F3735488O97578P38024P69178P95297Q30294Q79523R26160R52384R66983
$$ 63735488 64433066 65171090 65940268 66735565 67565859 68445382 69371542 70323926 71290909
8067G1290909R92947J033243J071050J102202J144847J214558J309286J419976
$$ 71290909 72283856 73317099 74388149 75490351 76635198 77849756 79159042 80579018
8059H0579018J534753J631564J692862J734578J795064J885076J975644K049982
$$ 80579018 82113771 83745335 85438197 87172775 88967839 90852915 92828559 94878541
8051I4878541K137710K271524K432804K572947K676808K773151K887532L014701
$$ 94878541 97016251 99287775 101720579 104293526 106970334 109743485 112631017 115645718
8043A15645718L137711L247836L342262L423956L506580L599319L685448L736981
$$ 115645718 118783429 122031265 125373527 128797483 132304063 135903382 139588830 143325811
8035A43325811L751374L749951L737837L693928L609587L508880L414167L315631
$$ 143325811 147077185 150827136 154564973 158258901 161868488 165377368 168791535 172107166
8027A72107166L194942L059661K931946K818045K711004K610839K517813K414617
$$ 172107166 175302108 178361769 181293715 184111760 186822764 189433603 191951416 194366033
8019A94366033K281573K127439J981559J852838J715999J543238J334176J109259
$$ 194366033 196647606 198775045 200756604 202609442 204325441 205868679 207202855 208312114
8011B08312114Q85285O62261M26762J66758j11032l81515o26807q55600j085854
$$ 208312114 209197399 209859660 210286422 210453180 210342148 209960633 209333826 208478226 207392372
8002B07392372j315001j523137j701419j859225k005053k139343k265945k389319
$$ 207392372 206077371 204554234 202852815 200993590 198988537 196849194 194583249 192193930
7994A92193930k497108k568570k608785k653458k728294k822288k913404k999555
$$ 192193930 189696822 187128252 184519467 181866009 179137715 176315427 173402023 170402468
7986A70402468l085488l157621l197860l212680l222248l223672l189705l107327
$$ 170402468 167316980 164159359 160961499 157748819 154526571 151302899 148113194 145005867
7978A45005867k997904k892901k803490k718475k619762k496423k355106k218808
$$ 145005867 142007963 139115062 136311572 133593097 130973335 128476912 126121806 123902998
7970A23902998k103285j993570j858625j691895j520230j367509j229050j092948
$$ 123902998 121799713 119806143 117947518 116255623 114735393 113367884 112138834 111045886
7962A11045886r66477q62334p72756o79100n78675m80705l82817k76549j73994
$$ 111045886 110079409 109217075 108444319 107765219 107186544 106705839 106323022 106046473 105872479
7953A05872479j01670o3532l6192j0473j2668o9588j74360l04507m52690o16274
$$ 105872479 105770809 105707277 105671085 105660612 105647944 105578356 105403996 105099489 104646799 104030525
7943A04030525p74502r04921j010619j100461j150879j123898j025035r09809
$$ 104030525 103256023 102351102 101340483 100240022 99089143 97965245 96940210 96030401
7935I6030401q26424p83210p77395q14418q78524r23036r23952r17264r47233
$$ 96030401 95203977 94420767 93643372 92828954 91950430 91027394 90103442 89186178 88238945
7926H8238945r97477j013420r81455r43209r32555r38885r40161r36177r34394
$$ 88238945 87241468 86228048 85246593 84303384 83370829 82431944 81491783 80555606 79621212
7917G9621212r30570r19398r03442q79282q36345p82030p44632p33345p16207
$$ 79621212 78690642 77771244 76867802 75988520 75152175 74370145 73625513 72892168 72175961
7908G2175961o61241n85025n34488n26356n28443n02058m44202l82556l41863
$$ 72175961 71514720 70929695 70395207 69868851 69340408 68838350 68394148 68011592 67669729
7899F7669729l23629l14351l06226l04357l11758l15373k99675k71675k54306
$$ 67669729 67346100 67031749 66725523 66421166 66109408 65794035 65494360 65222685 64968379
7890F4968379k49317k24329j49502l5286P9158J66064K25386K69201L02889L15939
$$ 64968379 64719062 64494733 64345231 64309945 64389103 64555167 64780553 65049754 65352643 65668582
7880F5668582K80035J63129l9117k85429n11589o72608p62656q04336q27729q51940
$$ 65668582 65948617 66111746 66072629 65787200 65275611 64603003 63840347 63036011 62208282 61356342
7870F1356342q74628q80225q62023q29136p88256p31868o54310n67309m87506
$$ 61356342 60481714 59601489 58739466 57910330 57122074 56390206 55735896 55168587 54681081
7861E4681081m19566l63818l26915l06897k79234k20613j41885p5857l4112K690
$$ 54681081 54261515 53897697 53570782 53263885 52984651 52764038 52622153 52546296 52512184 52514874
7851E2514874M9813R5012J19212J27004J44880J91516K54754L01357L14508L19179
$$ 52514874 52564687 52659699 52778911 52905915 53050795 53242311 53497065 53798422 54112930 54432109
7841E4432109L57585M37991N26107N93961O55359P40050Q54989R85549J105042
$$ 54432109 54789694 55227685 55753792 56347753 57003112 57743162 58598151 59583700 60688742
7832F0688742J158133J069818Q17740M80171J69123p2122k65080m14167m94145
$$ 60688742 61846875 62916693 63734433 64214604 64383727 64311605 64046525 63632358 63138213
7823F3138213n15217n29262n52886n44806m83268m07576l51675k93207k09772
$$ 63138213 62622996 62093734 61540848 60996042 60512774 60105198 59753523 59460316 59250544
7814E9250544j33954r9457p2500M526J26474K37156L08853L58470M00305M36242
$$ 59250544 59116590 59017133 58944633 58949159 59075633 59312789 59621642 59980112 60380417 60816659
7804F0816659M84437N65583O61493P32270P73675Q15479Q66844R09937R47420
$$ 60816659 61301096 61866679 62528172 63260442 64034117 64849596 65716440 66626377 67573797
7795F7573797J007482J095262J185809J274544J388911J536469J683689J799099
$$ 67573797 68581279 69676541 70862350 72136894 73525805 75062274 76745963 78545062
7787G8545062J872392J876412J765195J544659J303973J136921J059949J039885
$$ 78545062 80417454 82293866 84059061 85603720 86907693 88044614 89104563 90144448
7779I0144448J069044J168890J339800J550945J771609J979721K151805K280303
$$ 90144448 91213492 92382382 93722182 95273127 97044736 99024457 101176262 103456565
7771A03456565K394456K530423K682748K812189K895447K937347K939176K889905
$$ 103456565 105851021 108381444 111064192 113876381 116771828 119709175 122648351 125538256
7763A25538256K792800K669750K528225K345573K095776J777185J410120J021277
$$ 125538256 128331056 131000806 133529031 135874604 137970380 139747565 141157685 142178962
7755A42178962O29974K34146j86998o38443j084587j484081j842538k195397k538376
$$ 142178962 142808936 143043082 142856084 142217641 141133054 139648973 137806435 135611038 133072662
7746A33072662k819765l017814l180252l351893l497520l545362l491456l409409
$$ 133072662 130252897 127235083 124054831 120702938 117205418 113660056 110168600 106759191
7738A06759191l354333l304378l214312l088096k967892k873091k782858k672566
$$ 106759191 103404858 100100480 96886168 93798072 90830180 87957089 85174231 82501665
7730H2501665k542348k410557k298489k221054k172434k117379k016464j870863
$$ 82501665 79959317 77548760 75250271 73029217 70856783 68739404 66722940 64852077
7722F4852077j729160j637979j593878j554199j488122j404530j332355j285572
$$ 64852077 63122917 61484938 59891060 58336861 56848739 55444209 54111854 52826282
7714E2826282j250728j203714j136329j065521j013184r78590r40476q88098q36121
$$ 52826282 51575554 50371840 49235511 48169990 47156806 46178216 45237740 44349642 43513521
7705D3513521q01482p80339p60479p41850p26775p02906o59993o15441n95704
$$ 43513521 42712039 41931700 41171221 40429371 39702596 38999690 38339697 37724256 37128552
7696C7128552n94771n80097n41600n04369m85768m71707m49487m33426m36025
$$ 37128552 36533781 35953684 35412084 34907715 34421947 33950240 33500753 33067327 32631302
7687C2631302m39205m20698l89717l68380l53257l26161k93466k81671k94642
$$ 32631302 32192097 31771399 31381682 31013302 30660045 30333884 30040418 29758747 29464105
7678B9464105l04552k90442k62495k41113k31125k24933k16722k05055j90397
$$ 29464105 29159553 28869111 28606616 28365503 28134378 27909445 27692723 27487668 27297271
7669B7297271j75645j64251j57865j59941j75382j98871k12702k07825j96875
$$ 27297271 27121626 26957375 26799510 26639569 26464187 26265316 26052614 25844789 25647914
7660B5647914j91308j78753j46661j18672j35134j94938k46426k46927k09171
$$ 25647914 25456606 25277853 25131192 25012520 24877386 24682448 24436022 24189095 23979924
7651B3979924j77876j79479k06105k31771k31726j99593j57523j38957j52505
$$ 23979924 23802048 23622569 23416464 23184693 22952967 22753374 22595851 22456894 22304389
7642B2304389j73125j74849j58886j42368j34314j33113j35192j35794j31433
$$ 22304389 22131264 21956415 21797529 21655161 21520847 21387734 21252542 21116748 20985315
7633B0985315j29367j42396j66243j76552j59541j32794j22896j33280j46705
$$ 20985315 20855948 20713552 20547309 20370757 20211216 20078422 19955526 19822246 19675541
7624A9675541j49497j40736j26375j16763j22029j38410j47249j38235j24137
$$ 19675541 19526044 19385308 19258933 19142170 19020141 18881731 18734482 18596247 18472110
7615A8472110j20807j23090j15204r6388p9985p2968p2324p7675r1577j08102
$$ 18472110 18351303 18228213 18113009 18016621 17936636 17863668 17791344 17713669 17622092 17513990
7605A7513990j14272j04039q2940o1582n1166n8306p4093p5937n3395k6070k1259
$$ 17513990 17399718 17295679 17212739 17151157 17099991 17041685 16967592 16891655 16838260 16812190 16790931
7594A6790931l8303n1533m7002l8800m4379n8045n9215m2052k7525m0523p5086
$$ 16790931 16752628 16701095 16654093 16615293 16570914 16512869 16453654 16411602 16384077 16343554 16268468
7583A6268468r1970o2450r090J7003P31j9741r607J5781K0676K552j1538p074
$$ 16268468 16176498 16114048 16104958 16121961 16122692 16102951 16093344 16109125 16129801 16132353 16120815 16113741
7571A6113741Q213K6902M6321N6922N2030M2989M0916L4379J3535J786K3985N2814
$$ 16113741 16121954 16148856 16195177 16252099 16304129 16347118 16388034 16422413 16435948 16437734 16461719 16514533
7559A6514533L6668j6907l8596O947P3271J03854J02591R7480P9271K7850k8310
$$ 16514533 16551201 16534294 16495698 16502645 16575916 16679770 16782361 16879841 16959112 16986962 16958652
7548A6958652l5807Q985N6747P5267P9808R0262R9565R7237R0285Q3737O7148
$$ 16958652 16922845 16931830 16988577 17063844 17143652 17233914 17333479 17430716 17521001 17604738 17671886
7537A7671886L9616K7410N4468J06240J41959J38841J10937Q6801P9548P9823
$$ 17671886 17711502 17738912 17793380 17899620 18041579 18180420 18291357 18378158 18457706 18537529
7527A8537529P1420N0486K9593K3110L1164M1254M3629M0151L9197M6854O3027
$$ 18537529 18608949 18659435 18689028 18712138 18743302 18784556 18828185 18868336 18907533 18954387 19017414
7516A9017414Q2405R9481J13936J27775J35852J26881R9702P1510O0925O7350
$$ 19017414 19099819 19199300 19313236 19441011 19576863 19703744 19803446 19874956 19935881 20003231
7506B0003231P5983P9202Q2567R1495J02493J09347J11069J11798J15833J22101
$$ 20003231 20079214 20158416 20240983 20332478 20434971 20544318 20655387 20767185 20883018 21005119
7496B1005119J22913J13725J05608J17940J53154J89762K08688K14589K20259
$$ 21005119 21128032 21241757 21347365 21465305 21618459 21808221 22016909 22231498 22451757
7487B2451757K24231K21162K21795K39417K63845K73981K72748K82284L03726
$$ 22451757 22675988 22897150 23118945 23358362 23622207 23896188 24168936 24451220 24754946
7478B4754946L11752K97338K86424K99181L14628K98614K52295K10611K00943
$$ 24754946 25066698 25364036 25650460 25949641 26264269 26562883 26815178 27025789 27226732
7469B7226732K22549K61001L03484L40076L65076L80779L92859M02792M09591
$$ 27226732 27449281 27710282 28013766 28353842 28718918 29099697 29492556 29895348 30304939
7460C0304939M13813M13357M02575L84467L76171L90449M16784M32905M30880
$$ 30304939 30718752 31132109 31534684 31919151 32295322 32685771 33102555 33535460 33966340
7451C3966340M19947M08582L99251L98363M13027M34227M39840M22970M05269
$$ 33966340 34386287 34794869 35194120 35592483 36005510 36439737 36879577 37302547 37707816
7442C7707816M12025M41460M68072M71777M56099M40380M40285M54611M68258
$$ 37707816 38119841 38561301 39029373 39501150 39957249 40397629 40837914 41292525 41760783
7433D1760783M70625M71370M90201N27805N57810N57843N40384N38363N63867
$$ 41760783 42231408 42702778 43192979 43720784 44278594 44836437 45376821 45915184 46479051
7424D6479051N97678O20198O34059O48917O62125O68949O78488P01160P29593
$$ 46479051 47076729 47696927 48330986 48979903 49642028 50310977 50989465 51690625 52420218
7415E2420218P52482P80141Q29587Q84900R05457Q86884Q83270R41998J035865
$$ 52420218 53172700 53952841 54782428 55667328 56572785 57459669 58342939 59284937 60320802
7406F0320802J092229J081667J045860J037170J061443J090214J103811J105400
$$ 60320802 61413031 62494698 63540558 64577728 65639171 66729385 67833196 68938596
7398F8938596J107780J121738J148751J175283J184075J179609J190385J234414
$$ 68938596 70046376 71168114 72316865 73492148 74676223 75855832 77046217 78280631
7390G8280631J292708J329501J330626J310500J291125J289672J318457J376704
$$ 78280631 79573339 80902840 82233466 83543966 84835091 86124763 87443220 88819924
7382H8819924J442921J493740J533627J590383J676529J771268J851229J926611
$$ 88819924 90262845 91756585 93290212 94880595 96557124 98328392 100179621 102106232
7374A02106232K030530K174900K330551K455004K531766K576993K613779K650331
$$ 102106232 104136762 106311662 108642213 111097217 113628983 116205976 118819755 121470086
7366A21470086K685504K727042K794923K906358L063548L258353L484307L739904
$$ 121470086 124155590 126882632 129677555 132583913 135647461 138905814 142390121 146130025
7358A46130025M021591M317815M614016M906310N208290N537055N889740O242734
$$ 146130025 150151616 154469431 159083447 163989757 169198047 174735102 180624842 186867576
7350A86867576O582027O925908P304307P720685Q150990Q579642R018225R485381
$$ 186867576 193449603 200375511 207679818 215400503 223551493 232131135 241149360 250634741
7342B50634741R988046J0532201J1134288J1806979J2545298J3339321J4184829
$$ 250634741 260622787 271154988 282289276 294096255 306641553 319980874 334165703
7335C34165703J5057261J5876106J6511440J6826585J6702881J6025928J4669224
$$ 334165703 349222964 365099070 381610510 398437095 415139976 431165904 445835128
7328D45835128J2514748R513743N758133J512783k835021o895267j0383449j3148757
$$ 445835128 458349876 467863619 473621752 475134535 472299514 465404247 455020798 441872041
7320D41872041j5139739j6372817j6926623j6934020j6554036j5937263j5199216
$$ 441872041 426732302 410359485 393432862 376498842 359944806 344007543 328808327
7313C28808327j4407922j3594807j2782822j1999159j1258844j0555831r888912
$$ 328808327 314400405 300805598 288022776 276023617 264764773 254208942 244320030
7306B44320030r282741q759994q302288p866287p434316p021362o634958o262422
$$ 244320030 235037289 226277295 217975007 210108720 202674404 195653042 189018084 182755662
7298A82755662n904456n586696n320607n079281m832090m583259m357379m164896
$$ 182755662 176851206 171264510 165943903 160864622 156032532 151449273 147091894 142926998
7290A42926998m000623l857887l721671l564020l373716l181763l030536k921252
$$ 142926998 138926375 135068488 131346817 127782797 124409081 121227318 118196782 115275530
7282A15275530k816609k694142k571266k472931k398618k332847k270056k213089
$$ 115275530 112458921 109764779 107193513 104720582 102321964 99989117 97719061 95505972
7274I5505972k157495k094788k030272j983460j963864j952361j915822j841841
$$ 95505972 93348477 91253689 89223417 87239957 85276093 83323732 81407910 79566069
7266G9566069j751777j674228j613256j553953j493996j450583j431522j417873
$$ 79566069 77814292 76140064 74526808 72972855 71478859 70028276 68596754 67178881
7258F7178881j387934j345364j308155j278760j243010j195181j146381j105557
$$ 67178881 65790947 64445583 63137428 61858668 60615658 59420477 58274096 57168539
7250E7168539j066926j022930r79803r50486r34224r11338q64256q03689p66616
$$ 57168539 56101613 55078683 54098880 53148394 52214170 51302832 50438576 49634887 48868271
7241D8868271p79273q23650q51104q31628p80010p30660o99269o77501o54548
$$ 48868271 48088998 47265348 46414244 45582616 44802606 44071946 43372677 42695176 42040628
7232D2040628o30620o11654n99586n88679n70132n43389n21102n14585n16143
$$ 42040628 41410008 40798354 40198768 39610089 39039957 38496568 37975466 37460881 36944738
7223C6944738n07798m86452m64499m45622m21022l93875l83478l95491m11129
$$ 36944738 36436940 35950488 35485989 35040367 34619345 34225470 33841992 33446501 33035372
7214C3035372m16621m17777m13545l88399l51808l47927l91413m27124m00104
$$ 33035372 32618751 32200974 31787429 31399030 31047222 30699295 30307882 29880758 29480654
7205B9480654l40217l22701l59991l92779l83988l57873l37477l07885k66402
$$ 29480654 29140437 28817736 28457745 28064966 27680978 27323105 26985628 26677743 26411341
7196B6411341k52255k88885l37925l48415l20657k88163k66282k52829k51775
$$ 26411341 26159086 25870201 25532276 25183861 24863204 24575041 24308759 24055930 23804155
7187B3804155k59608k52190k21655k03301k26371k61028k60561k37855k44511
$$ 23804155 23544547 23292357 23070702 22867401 22641030 22380002 22119441 21881586 21637075
7178B1637075k80831k87608k38593j84636j78816k02616k04312j80340j74112
$$ 21637075 21356244 21068636 20830043 20645407 20466591 20263975 20059663 19879323 19705211
7169A9705211k04492k36213k28559j86374j48892j42786j61105j82591j96121
$$ 19705211 19500719 19264506 19035947 18849573 18700681 18557895 18396790 18214199 18018078
7160A8018078k02006k00626j91112j77331j63771j46626j21202r7795r4273j09634
$$ 18018078 17816072 17615446 17424334 17247003 17083232 16936606 16815404 16717609 16623336 16513702
7150A6513702j22877j25288j33929j60295j85249j83692j58541j29682j03542
$$ 16513702 16390825 16265537 16131608 15971313 15786064 15602372 15443831 15314149 15210607
7141A5210607p7521o2743p3909j01224j19439j24098j33882j55484j70393j62230
$$ 15210607 15133086 15070343 14996434 14895210 14775771 14651673 14517791 14362307 14191914 14029684
7131A4029684j38284j18000j13773j24423j35080j26765j00056q1887r1131j08601
$$ 14029684 13891400 13773400 13659627 13535204 13400124 13273359 13173303 13091416 13000285 12891684
7121A2891684j06086r3212j00715j23468j22807r0907o9320q6946j17337j20650
$$ 12891684 12785598 12692386 12591671 12468203 12345396 12254489 12185169 12098223 11980886 11860236
7111A1860236r7445p5747o9384p4051q4562r3378q9259p6199p4854q8888r4110
$$ 11860236 11762791 11687044 11617660 11543609 11459047 11365669 11276410 11200211 11125357 11036469 10942359
7100A0942359q0006p2936r0774j03694p7439l2811j8474l8272n1091l8306k6158
$$ 10942359 10862353 10789417 10698643 10594949 10517510 10484699 10466225 10427953 10376862 10338556 10312398
7089A0312398l6652n6808o7904p1625p4039p1838o7694p4533r1210r6628q1934
$$ 10312398 10275746 10218938 10151034 10079409 10005370 9933532 9865838 9791305 9700095 9603467 9521533
7078I521533o7360p0979p9132o7537m0400k8753n2019r3740j16920r9448n5243
$$ 9521533 9454173 9383194 9304062 9236525 9196125 9167372 9115353 9021613 8904693 8805245 8750002
7067H750002k0646j8162l7685n6812o9260q2272r6352j03887j01133q6112n4284
$$ 8750002 8729356 8711194 8673509 8616697 8547437 8465165 8368813 8264926 8163793 8077681 8023397
7056H023397j4943J389k1152n1696m9878k6407k4833m6145m3462k846K5779O127
$$ 8023397 8008454 8009843 7988691 7936995 7887117 7860710 7835877 7789732 7746270 7743424 7769203 7775330
7044G775330k5887k1850J237o378m3544o2952m7427k8051k6342k6958j7593j5428
$$ 7775330 7749443 7727593 7728830 7722452 7678908 7615956 7568529 7540478 7514136 7487178 7469585 7454157
7032G454157l7057p0289r0771q7146o1927k6717j623j43j1757j8470k6040n2536
$$ 7454157 7417100 7346811 7256040 7168894 7106967 7080250 7078627 7078484 7066727 7048257 7022217 6969681
7020F969681q7466r6034p0517m3428l8312m1821m0356m7563p0010p9349n3085
$$ 6969681 6882215 6786181 6715664 6672236 6633924 6592103 6551747 6504184 6434174 6354825 6301740
7009F301740j7810j4101l6469m7564l9155l6870m9658n7578n2319m8915m9108
$$ 6301740 6283930 6269829 6233360 6185796 6146641 6109771 6060113 6002535 5950216 5901301 5852193
6998E852193l3333l525O087j5617k7281M769M5426L3526k8322p2793n7985j6047
$$ 5852193 5818860 5815335 5821422 5805805 5778524 5783293 5828719 5862245 5833923 5761130 5703145 5687098
6986E687098J658q795j7552j5761k1935m0793m8612k8476J699J1787j409j4293
$$ 5687098 5688756 5679961 5662409 5646648 5624713 5583920 5535308 5506832 5508531 5520318 5518909 5504616
6974E504616j2538r727k3566m5942n0057k4197J4156L9292M0798K2265r993m5387
$$ 5504616 5492078 5482351 5458785 5412843 5362786 5338589 5352745 5392037 5432835 5455100 5445107 5399720
6962E399720o5056n5760k7342l795L954M511N397K157o447r382j546K964p599
$$ 5399720 5334664 5278904 5251562 5247767 5251721 5256232 5261629 5263786 5257339 5247957 5246411 5249375 5241776
6949E241776j8924j0481O052m714m8899q3528o6188q799L7036L9389J1890j4815
$$ 5241776 5222852 5212371 5218423 5213709 5164810 5081282 5015094 5006295 5043331 5082720 5094610 5079795
6937E079795k6803k9061l0537l5008l7868k7689L86L0370L6069J1590j9679l3698
$$ 5079795 5052992 5023931 4993394 4958386 4920518 4892829 4893215 4923585 4959654 4971244 4951565 4917867
6925D917867l1986k9350k7618j7753r33J1336J6735K3159K8298J7623r453k9073
$$ 4917867 4885881 4856531 4828913 4811160 4810227 4821563 4838298 4861457 4889755 4907378 4897925 4868852
6913D868852k1672J244J3381P366l409r592j4249j7830j2455M364K2628L1110
$$ 4868852 4847180 4848424 4861805 4869171 4865762 4856170 4841921 4824091 4811636 4816000 4838628 4869738
6901D869738K6899J2410o691j9452j8339j2525j8034k9459j9175K2620O2218N7035
$$ 4869738 4896637 4909047 4902356 4882904 4864565 4852040 4834006 4804547 4785372 4807992 4870210 4927245
6889D927245J0292k8805k1545J9006M8743M3044J8005O157J9331L8350L7763J6263
$$ 4927245 4937537 4908732 4887187 4906193 4954936 4997980 5015985 5022142 5041473 5079823 5117586 5133849
6877E133849k563J813K6402N3395O9082O9882O0773N5429O6864Q8120R3331P0288
$$ 5133849 5131286 5133099 5159501 5212896 5281978 5351860 5412633 5468062 5534926 5623046 5716377 5786665
6865E786665L9345K4031J7114M01j3047Q115N6192P6639L4383l8718q3672q2270
$$ 5786665 5826010 5850041 5867155 5867556 5854509 5862624 5918816 5995455 6029838 5991120 5907448 5825178
6853E825178o3346n6324o4386p7870r0442r8356r8435r1655q2781p6784p8069
$$ 5825178 5761832 5705508 5641122 5563252 5472810 5374454 5276019 5184364 5101583 5024799 4946730
6842D946730q6680r1426p8123n2707m2813o2654q7761q2719m7241j5499j2161
$$ 4946730 4860050 4768624 4690501 4637794 4594981 4532327 4444566 4361847 4314606 4299107 4286946
6831D286946k7802l9059l6148k4866j3858p478n783p538j3945k6206l7344l4915
$$ 4286946 4259144 4220085 4183937 4159071 4145213 4137735 4131952 4124414 4110469 4084263 4046919 4012004
6819D012004j8632n933j0829k6653m0189n0345n8178n2710k8712p792j4478l6365
$$ 4012004 3993372 3987439 3976610 3949957 3909768 3859423 3801245 3748535 3719823 3712031 3697553 3661188
6807C661188l7164r439J5226J3669m88o092n453j1499k5716m3719o4183p8147
$$ 3661188 3624024 3614585 3629811 3643480 3642992 3636900 3631447 3619948 3594232 3550513 3486330 3408183
6795C408183o7937l2442K419J3294M519r216k6320m6685n4890l8827j3797n169
$$ 3408183 3340246 3307804 3310223 3323517 3328036 3318820 3292500 3245815 3190925 3152098 3138301 3133132
6783C133132j3639j7536m459J6761L0800K7768P070j6867k1979o385K962j3508
$$ 3133132 3119493 3101957 3097498 3114259 3145059 3172827 3179897 3163030 3141051 3134666 3137628 3124120
6771C124120l7475m0933l0267l1592m1712l1047L162K4066P808k1819k9097j3430
$$ 3124120 3086645 3045712 3015445 2983853 2942141 2911094 2914256 2938322 2946130 2924311 2895214 2881784
6759B881784r05n481j8620k8298l1385l1338l4387m4425n5091n2522l1504l027
$$ 2881784 2880879 2875398 2856778 2828480 2797095 2765757 2731370 2686945 2631854 2579332 2547828 2544801
6747B544801J7651K3763J6493J819r211p834P80L069k864m485M587J3980J1731
$$ 2544801 2562452 2586215 2602708 2604527 2595316 2587482 2588262 2591331 2588467 2583982 2588569 2602549 2614280
6734B614280k051k1134l9586m7594l6417j4158q61o39K848J3710J0065j8412m1182
$$ 2614280 2612229 2591095 2551509 2503915 2467498 2453340 2452479 2451840 2454688 2468398 2478463 2460051 2418869
6721B418869k4071J6895L1638L542l1174l7313k4286k0734k8837k6661n428J8317
$$ 2418869 2394798 2411693 2443331 2446873 2415699 2378386 2354100 2333366 2304529 2277868 2272440 2290757
6709B290757K7404K3859J8507J2403k064k5667m7321n6702n5840n2666m5902k4711
$$ 2290757 2318161 2342020 2360527 2372930 2370866 2345199 2297878 2241176 2185336 2132670 2086768 2062057
6697B062057J2837M6890N0534K0350j3535j5706J5559M5406M3103J6433n856j6564
$$ 2062057 2074894 2121784 2172318 2192668 2179133 2163427 2178986 2224392 2267495 2283928 2278072 2261508
6685B261508l1940n1122m5057k888L7544L4512k02k1953j8719j6649k5114k1021
$$ 2261508 2229568 2178446 2133389 2130501 2168045 2202557 2202355 2180402 2161683 2145034 2119920 2098899
6673B098899M608K7094L0288K8941K9604R624l6852o9817n6919k4739j5702k1332
$$ 2098899 2103507 2130601 2160889 2189830 2219434 2229058 2192206 2122389 2065470 2040731 2025029 2003697
6661B003697o286K2208K4924K113l632J8714K6455p360m8210m9988j7618P249
$$ 2003697 1997411 2019619 2044543 2046656 2043024 2061738 2088193 2080833 2032623 1982635 1965017 1972266
6649A972266J003k3740l9237k6587Q097L3561K6107M852R667M0441N1898K1244
$$ 1972266 1973269 1949529 1910292 1883705 1891802 1925363 1951470 1956322 1965989 2006430 2058328 2079572
6637B079572j5491j7527L151J0041K011N966K2783K0482j6171n8100o3978k7006
$$ 2079572 2064081 2046554 2049705 2059746 2061757 2067723 2090506 2110988 2094817 2036717 1972739 1945733
6625A945733J5465J6373l1844q2144q1335l4880J53o924k2278n603K8883M2149
$$ 1945733 1961198 1977571 1945727 1863583 1782248 1747368 1747521 1740597 1718319 1712716 1741599 1783748
6613A783748L2511K6264K5620J2579m826J418K6341L0806J605k8290l2035k3515
$$ 1783748 1816259 1842523 1868143 1880722 1875896 1877314 1903655 1934461 1936066 1907776 1875741 1852226
6601A852226k2732k1423o190J1241J2126R42l802L723J4398J6195j303l7529o7177
$$ 1852226 1829494 1808071 1801881 1813122 1825248 1826190 1822388 1826111 1840509 1856704 1855401 1817872 1750695
6588A750695n7988j5790J1918m217l4727l3479k35K7455L0072K1734J6020O969
$$ 1750695 1692707 1676917 1688835 1684618 1649891 1616412 1616177 1643632 1673704 1695438 1711458 1718427
6576A718427j2630l6272n1395m7704j9888K2132M9988M3559J9510J3337L2467
$$ 1718427 1705797 1669525 1618130 1570426 1550538 1572670 1622658 1666217 1685727 1699064 1731531
6565A731531M8067L6752R064j1833k0687k6194l0045k5599j2040K775J2919J9931
$$ 1731531 1779598 1816350 1825414 1813581 1792894 1766700 1736655 1711056 1699016 1701791 1714710 1734641
6553A734641K6268K7820J6989m658j9782j0506J5956K7506M033l3432m5134k1296
$$ 1734641 1760909 1788729 1805718 1801060 1781278 1770772 1786728 1814234 1818267 1784835 1739701 1718405
6541A718405P236Q477j4679l2683k2781J0920M3218N0329L2797J6485K3330M2844
$$ 1718405 1725641 1734118 1719439 1686756 1663975 1674895 1718113 1768442 1801239 1817724 1841054 1883898
6529A883898M3565J3211k4972l8871j9945J3771L6711L4859J5603J342N487J6813
$$ 1883898 1927463 1940674 1915702 1876831 1856886 1870657 1907368 1942227 1957830 1959172 1964659 1981472
6517A981472J8247J4479K0547K7148P610l4038n5061l2884k629q300l9808n3401
$$ 1981472 1999719 2014198 2034745 2061893 2069503 2035465 1980404 1947520 1944891 1936591 1896783 1843382
6505A843382l9724l1237m4427n4124l4652M693L8890N7547O1504M9628K5415K292
$$ 1843382 1803658 1772421 1727994 1673870 1639218 1643911 1682801 1740348 1801852 1851480 1876895 1879187
6493A879187j1916k4152l8966m5725l5426j7265m999J042M203k712k2925l7819
$$ 1879187 1867271 1843119 1804153 1758428 1723002 1705737 1700738 1701780 1705983 1703271 1680346 1642527
6481A642527k7034k007N010j3057k6797j2944J2869K0572P374l930j063M009m34
$$ 1642527 1615493 1613486 1618496 1605439 1578642 1565698 1578567 1599139 1606513 1602583 1601520 1605529 1605095
6468A605095n215N557K9223M5796M1157J7958j4769m8422o7497n2605n540L8964
$$ 1605095 1599880 1605437 1634660 1680456 1721613 1739571 1724802 1676380 1608883 1556278 1550738 1589702
6456A589702M5278J7660q398j3414j1574j8608k5972j8876j026J3641J9683J7187
$$ 1589702 1634980 1652640 1644242 1630828 1619254 1600646 1574674 1555798 1554772 1568413 1588096 1605283
6444A605283M765j0045r530P401J3998o489k8576j9161R344J6830k29m200J9660
$$ 1605283 1610048 1600003 1590473 1597874 1611872 1605383 1576807 1557646 1566990 1583820 1583591 1579391 1599051
6431A599051L7292K0212j1009k1962j3875r781j3081j0258j234J814j657k686
$$ 1599051 1636343 1656555 1645546 1623584 1609709 1599928 1586847 1576589 1575355 1577169 1575512 1572826
6419A572826l411j2729k4818k3243n559J4017K5101K7677K0280n83k8065m7044
$$ 1572826 1569415 1556686 1531868 1508625 1503066 1517083 1542184 1569861 1590141 1589558 1561493 1514449
6407A514449n0943m5725l7774k8211j7093l026J7692M0847M8831K9365l662k1164
$$ 1514449 1463506 1417781 1380007 1351796 1334703 1331677 1349369 1390216 1439047 1468412 1464750 1443586
6395A443586q946K2247N0285N5068K8764j2257l4891k4295j287J0606J8376L5672
$$ 1443586 1434640 1456887 1507172 1562240 1591004 1578747 1543856 1519561 1518274 1528880 1547256 1582928
6383A582928M4061J5308l5880o2173m7851k3994j4862r323L467J0192L772K289
$$ 1582928 1626989 1642297 1606417 1544244 1496393 1472399 1457537 1448214 1451681 1461873 1465645 1467934
6371A467934J5639K4238J3518r3j417m856k2482l2469j3146J4966J8028K259P07
$$ 1467934 1483573 1507811 1521329 1521236 1519819 1514963 1492481 1460012 1446866 1461832 1479860 1482119 1482826
6358A482826J8586K9389J9651K952q875j7815k2960j8586r268m551j189Q135J5072
$$ 1482826 1501412 1530801 1550452 1553404 1544529 1526714 1503754 1485168 1475900 1471349 1470160 1478295 1493367
6345A493367Q583K76R408K7690K7328J743k7612m1468l5110q428K7417M2380K0427
$$ 1493367 1501950 1502226 1511634 1539324 1566652 1568395 1540783 1499315 1464205 1455777 1483194 1525574 1546001
6332A546001p881l503J8904J3299j7719k2289J2679L3690N812k9914k1830J4567
$$ 1546001 1538120 1534617 1553521 1566820 1549101 1526812 1539491 1573181 1578993 1549079 1527249 1541816
6320A541816K8615J0956p190p915K434J8393L2817K5044j1062m1634l2686j495
$$ 1541816 1570431 1581387 1574197 1566282 1568716 1587109 1619926 1644970 1633908 1592274 1559588 1558093
6308A558093J0545K530O262K2157J4932k1643m5479k9075p5M821p399q659k10
$$ 1558093 1568638 1571168 1577430 1599587 1614519 1592876 1547397 1518322 1518247 1523068 1515669 1507010 1506800
6295A506800o205k8003l7023j5102K0969M2611M1912L0787J7673L05j8048k1421
$$ 1506800 1500595 1472592 1435569 1420467 1441436 1484047 1525959 1556746 1574419 1574724 1556676 1535255
6283A535255k396J9536J9388L260J569K3459M3272M1796L3619L4778K9342k513
$$ 1535255 1532859 1552395 1571783 1575043 1576612 1600071 1643343 1685139 1718758 1753536 1782878 1780365
6271A780365m0855m4525o690L8038N8812N3565L1885K365k0367k2627j1818q457
$$ 1780365 1739510 1694985 1688295 1726333 1785145 1838710 1870595 1872960 1852593 1829966 1818148 1809691
6259A809691j4931j3098M443K2813K8626K4264J4665R65q383j349J7355K8694
$$ 1809691 1794760 1781662 1786105 1808918 1837544 1861808 1876473 1877438 1869055 1867706 1885061 1913755
6247A913755K5070J4114k431k7491m4757k7570J8572N2071M7208K3479R824Q193
$$ 1913755 1938825 1952939 1950508 1923017 1878260 1850690 1869262 1921333 1968541 1992020 2001844 2010037
6235B010037J0440K2553M7472O6061O0892M1872K6115J0932r246j8572k092K2284
$$ 2010037 2020477 2043030 2090502 2156563 2217455 2259327 2285442 2296374 2287128 2268556 2266464 2288748
6223B288748K6161J6264K4865N6896P7554N8355J2200k4242k6685K013L8595N7285
$$ 2288748 2314909 2331173 2356038 2412934 2490488 2548843 2561043 2536801 2510116 2512129 2550724 2608009
6211B608009N1598L8685L4458L1821J6638l542o554J2493L6529N2954O4622P2656
$$ 2608009 2659607 2698292 2732750 2764571 2781209 2777667 2771113 2783606 2820135 2873089 2937711 3010367
6199C010367O8979N3484M2264M8810O6770P9121P7195O5257N2927M7879N1434
$$ 3010367 3079346 3132830 3175094 3223904 3290674 3369795 3446990 3512247 3565174 3613053 3664487
6188C664487N7282N6658M6032K9415J5740J4693K8803M6191M9005L4324J8343
$$ 3664487 3721769 3778427 3824459 3853874 3869614 3884307 3913110 3959301 4008306 4042630 4060973
6177D060973J3540J2567M710l081L226K0493L1659L0704K9307L8538N6445P4665
$$ 4060973 4074513 4087080 4091790 4088709 4091935 4112428 4144087 4174791 4204098 4242636 4299081 4373746
6165D373746Q6826Q9210Q1782P0277O2051N9855O2335O7154P0983P2303P6642
$$ 4373746 4460572 4549782 4631564 4701841 4763892 4823747 4886082 4953236 5024219 5096522 5173164
6154E173164R1266J12525J28541J36233J41528J40392J19257Q2176N7042O1983
$$ 5173164 5264430 5376955 5505496 5641729 5783257 5923649 6042906 6125082 6182124 6244107
6144F244107Q3011R6918R7884R0392P8541P6029J00107J37420J44728J07622O9154
$$ 6244107 6327118 6424036 6521920 6612312 6690853 6766882 6866989 7004409 7149137 7256759 7325913
6133G325913P1710J00740J20724J35148J65679J97874K00516J83018J81249J96592
$$ 7325913 7397623 7498363 7619087 7754235 7919914 8117788 8318304 8501322 8682571 8879163
6123H879163K00067J88749J86753J96372K00013K05422K34826K72901K82281K70001
$$ 8879163 9079230 9267979 9454732 9651104 9851117 10056539 10291365 10564266 10846547 11116548
6113A1116548K80201L20044L53415L70440L99034M42717M74483M99183N50404
$$ 11116548 11396749 11716793 12070208 12440648 12839682 13282399 13756882 14256065 14806469
6104A4806469O16568O47493O45765O66637P12246P23018O99630P25995Q29209
$$ 14806469 15423037 16070530 16716295 17382932 18095178 18818196 19517826 20243821 21073030
6095B1073030R28007R76222J041859J172584J304308J397583J545049J826632
$$ 21073030 22001037 22977259 24019118 25191702 26496010 27893593 29438642 31265274
6087C1265274K168891K477113K793371L176129L551507L873451M280472M788771
$$ 31265274 33434165 35911278 38704649 41880778 45432285 49305736 53586208 58374979
6079E8374979M903725L936081J828204o23352k523929l627848m196822m418367
$$ 58374979 63278704 67214785 69042989 68419637 65895708 62267860 58071038 53652671
6071E3652671m279227l860288l398434l028805k697689k364699k099921j934248
$$ 53652671 49373444 45513156 42114722 39085917 36388228 34023529 31923608 29989360
6063B9989360j779652j568370j350438j190636j068581r41412q23377p44743o95027
$$ 29989360 28209708 26641338 25290900 24100264 23031683 22090271 21266894 20522151 19827124
6054A9827124o56162o39505o49842o59483o51281o43560o45113o30044n84104
$$ 19827124 19170962 18531457 17881615 17222132 16570851 15927291 15282178 14652134 14068030
6045A4068030n34381n07280m93664m75202m47981m05817l42730k85404k74794
$$ 14068030 13533649 13026369 12532705 12057503 11609522 11203705 10860975 10575571 10300777
6036A0300777k97795k89653k28455j73474j76855k09012k13684j91906j81953
$$ 10300777 10002982 9713329 9484874 9311400 9134545 8925533 8711849 8519943 8337990
6027H337990j90493j95032j91229j89717j82888j59251j37543j44095j65491j64340
$$ 8337990 8147497 7952465 7761236 7571519 7388631 7229380 7091837 6947742 6782251 6617911
6017F617911j36901j16045j17382j19194j02056p7380o5343o7038p0977p3183
$$ 6617911 6481010 6364965 6247583 6128389 6026333 5948953 5883610 5816572 5745595 5672412
6007E672412p9490r3500j08457j12104j01174q8308q6144q7216p4726n2294m1784
$$ 5672412 5592922 5499422 5390965 5278861 5177687 5089379 5003235 4916019 4841293 4788999 4747215
5996D747215m8553n4784n5131o8336r6466j04457o8134j8196l519k7545n3701
$$ 4747215 4698662 4643878 4588747 4520411 4423945 4319488 4251354 4233158 4229639 4202094 4148393
5985D148393o0645n6933m8910l1597j3164j5422m0946o3468o0122l6924j6468
$$ 4148393 4087748 4030815 3981905 3950308 3937144 3921722 3880776 3817308 3757186 3720262 3703794
5974C703794j3181k3660l2089k6618j6982k6369n6592p7461o6675m0569k2591
$$ 3703794 3690613 3666953 3634864 3608246 3591264 3564895 3508303 3430842 3364167 3323598 3301007
5963C301007m476K5563L6911r129q3392j04103m2956L3243N0995J6970j5644k9811
$$ 3301007 3296531 3322094 3359005 3349876 3266484 3162381 3119425 3152668 3203663 3220633 3204989 3175178
5951C175178m8936p9610r7104q5932n9186l3280j0742N731M361j9970n3196p2893
$$ 3175178 3126242 3046632 2949528 2863596 2804410 2771130 2760388 2766119 2770480 2750510 2697314 2624421
5939B624421o7272m3941k4815k7290m2987m3104j5398J4305J4619n539p403K1044
$$ 2624421 2557149 2513208 2488393 2461103 2418116 2375012 2359614 2373919 2388538 2382999 2375596 2396640
5927B396640M4466K6633k2040n8981n9216l4594j0982l090j0231k1895k3933r059
$$ 2396640 2441106 2467739 2445699 2386718 2327502 2292908 2281926 2278836 2268605 2246710 2222777 2213718
5915B213718J4166K8107K3837P607r756k2827l0113l1043k7910k4921k2962k1410
$$ 2213718 2227884 2255991 2279828 2287435 2277679 2254852 2224739 2193696 2165786 2140865 2117903 2096493
5903B096493k4861l7131m7092l6346q047R410L98j4701j3646j0146k6975m5985
$$ 2096493 2071632 2034501 1987409 1951063 1943016 1952426 1952824 1938123 1924477 1914331 1887356 1841371
5891A841371k7833J9697M0429J0412k5772k4530o724j3538l4082k7858P08O001
$$ 1841371 1813538 1833235 1873664 1884076 1858304 1833774 1827050 1813512 1779430 1751572 1752280 1758281
5879A758281k3855m7625l4243p76K5371M0493M3249J8824k8947o1323n1381k4262
$$ 1758281 1734426 1686801 1652558 1651782 1677153 1717646 1760895 1779719 1750772 1689449 1638068 1613806
5867A613806j9864l3975l0733k818J7671R852o361k743J6833K4505P244j6641
$$ 1613806 1593942 1559967 1529234 1526416 1544087 1553939 1547578 1544835 1561668 1586173 1593417 1576776
5855A576776k0234J07K0617J7763n978k9619m0737m2369l5600j4000J8022L8212
$$ 1576776 1556542 1556649 1577266 1595029 1589051 1559432 1518695 1476326 1440726 1426726 1444748 1482960
5843A482960L0952Q561m252o97M078n393k8041m8586n2087l8774k3543j4380K003
$$ 1482960 1513912 1522473 1518221 1517524 1521602 1516209 1488168 1439582 1387495 1348721 1325178 1310798 1312801
5830A312801L6553O5449M9758o771n0389m3741j1575J613p606j3179r815j4106
$$ 1312801 1349354 1414803 1464561 1457790 1407401 1363660 1352085 1353698 1346092 1332913 1323098 1308992
5818A308992k7363l5040l8272m9501n7183l1932K4903P1081P3193M1273N428j6526
$$ 1308992 1281629 1246589 1208317 1158816 1101633 1069701 1094604 1165685 1238878 1280151 1285579 1269053
5806A269053j9290m701J1363J0288M37J0869M3456N9854L5175l047j4907l426
$$ 1269053 1249763 1245062 1256425 1266713 1267150 1278019 1321475 1381329 1416504 1413457 1398550 1395124
5794A395124P42r278j6029j7252k7228m0297l0952J693K3115J2288o642k373J5563
$$ 1395124 1395866 1386588 1370559 1353307 1326079 1285782 1254830 1256523 1279638 1291926 1285284 1282911 1298474
5781A298474J3959j0783k6925j6435k700j5608m6811o1038m6092k7740k7572k7539
$$ 1298474 1312433 1301650 1274725 1258290 1255590 1239982 1193171 1132133 1086041 1058301 1030729 1003190
5769A003190J945M8380O1833K1190k9834l4043P116L9698L0639M833N33J5290
$$ 1003190 1005135 1053515 1115348 1136538 1106704 1072661 1079777 1119475 1150114 1154947 1155480 1170770
5757A170770J8320N74j5798j5727j2325k1003l3170l1132j6198m212k21M024J0062
$$ 1170770 1189090 1189664 1173866 1158139 1145814 1124811 1091641 1060509 1044311 1040099 1039878 1043902 1053964
5744A053964R207J002k933J062J614p204j5142j4961j4275j5006j897K7086L8575
$$ 1053964 1063171 1064173 1061240 1062302 1063916 1056712 1041570 1026609 1012334 997328 995431 1022517 1061092
5731A061092M662m4719m9366j277L9189K3353k3796m4348k2886Q661K3669K4195
$$ 1061092 1065754 1021035 971669 970392 1009581 1032934 1009138 964790 941904 950565 974234 998429
5719I98429J7134q54k7484m5754m1623j9789M246J9609K4073K0729J4696Q302
$$ 998429 1015563 1014709 987225 941471 899848 880059 884305 903914 927987 948716 963412 971714
5707I71714j348j5144k3783j5264P967K7182K6856J1249k583n321l946r454k0534
$$ 971714 970366 955222 931439 916175 924142 951324 978180 989429 986846 981525 977579 968125 947591
5694I47591k5033j7718r134j1068j9180j9534q707M364J4488K3878K9106K1007
$$ 947591 922558 904840 895706 884638 865458 845924 837217 841581 856069 879947 909053 930060
5682I30060K437j0392j1828j5283k7450l1962j4874Q717J4315M090J009J2167
$$ 930060 932497 922105 910277 894994 867544 835582 820708 829425 843740 847830 848839 861006
5670H61006K0962J5921O360M041N656J171j0548k0491j8465k310J6840K1351O230
$$ 861006 881968 897889 904249 908290 913946 915117 904569 884078 865613 863303 880143 901494 907724
5657I07724j2590j6818o671O154J7629K9096L3206K0831L2r041J520K1840L9773
$$ 907724 895134 878316 871645 877799 895428 924524 957730 978561 978593 969552 971072 992912 1032685
5644A032685M6735L3828L281j9149p625K6465M4786L2644J2664J935j3092m2679
$$ 1032685 1079420 1113248 1116529 1097380 1089755 1116220 1161006 1193650 1206314 1208249 1195157 1152478
5632A152478o3807n0722j7309q14j2038k6960k4689j1447m347q232j4358j3129
$$ 1152478 1088671 1037949 1020640 1019826 1007788 980828 956139 944692 940345 932113 917755 904626
5620I04626l675O136Q887O341M353J318p192j2423J557K9267L9310J2101l1471
$$ 904626 900951 907087 915974 922315 926668 927986 920794 908371 909928 939195 978505 990606 959135
5607I59135n4245m5159k2163k459J1907K3093K8872K6332J4845l131j8518j9332
$$ 959135 904890 859731 837568 835109 847016 870109 898981 925313 940158 937027 918509 899177
5595H99177n181R161J1929P190K881j502o439o430m260j4532l7433m6583k4015
$$ 899177 893996 903157 915086 922276 925157 923655 917216 910786 906526 891994 854561 807978 783963
5582G83963Q710J8618N899p444j8656l8106n0797k7076K4216N3667L5427o73j6900
$$ 783963 792673 811291 817190 809746 791090 752984 702187 675111 699327 752994 788421 787748 770848
5569G70848j5703j9346k9037l0283k0172m727J6942M3034N5183L7430K841j8754
$$ 770848 755145 735799 706762 676479 656307 651580 668522 711556 766739 804169 807010 788256
5557G88256j5975l090L579J329m229p785r189j6377l5858n3675m0607Q481N3566
$$ 788256 772281 769191 772770 774099 769870 762085 752896 736519 700661 646986 606379 614860 668426
5544F68426M9643J804m1358m6308k3478L158K8917N7834P8572P1851L8011J774
$$ 668426 718069 719873 678515 632207 608729 611887 640804 698638 777210 849061 887072 888846
5532H88846j3410p966L14l75n922q979j2039k0055k6437k0036n400j53p459q012
$$ 888846 875436 867470 867784 867409 861487 852508 840469 820414 793977 773941 768541 768388 760929 752917
5518G52917J0134K9476K6709N977j0931j8426k8127m0046l8570k1210p808j1266
$$ 752917 763051 792527 819236 825213 814282 795856 767729 727683 689113 667903 660095 648829
5506F48829j8648j3979l110J25k07J0517L0619M1460L3194J5041k107j8054l2519
$$ 648829 630181 616202 613092 613217 613010 623527 654146 695606 728800 743841 741734 723680 691161
5493F91161l5647k0619J664J2338O578l998j0022j4898k3972l3089l4035k5367
$$ 691161 655514 634895 636559 648897 655475 651477 641455 626557 602585 569496 535461 510094
5481E10094j1782K096J1324J0423J926k29J3206L0834L3219J9439O838L907J71
$$ 510094 498312 500408 511732 522155 524081 523852 537058 567892 601111 620550 627388 631295 631466
5468F31466j2464k4947k6725k1005j3302J084K3570L8791L2447J3991K524k724
$$ 631466 619002 594055 567330 546325 533023 534107 557677 596468 628915 642906 645430 642706
5456F42706j5701l1036k5070M847K7302J7664o734j1435O611J7800M626j4374
$$ 642706 627005 595969 570899 575746 603048 620712 613978 602543 609154 626954 631580 617206
5444F17206j3000O564K0694J9052J3980J4025P319j6257m0300l9618j7140k12
$$ 617206 604206 610770 631464 650516 664496 678521 685840 669583 629283 589665 572525 572313
5432E72313R10N102K2266L0818J3180r467o881J1250J0007j3923k7505j6563p850
$$ 572313 573223 578325 600591 631409 644589 635122 628241 639491 649498 635575 608070 591507 583657
5419E83657k1442l4587j8139J4235K3538J037k2054j8666L673J9838J6852J95
$$ 583657 562215 527628 509489 523724 547262 548299 526245 507579 511252 531090 547942 548137
5407E48137j7028k3472j4901K723J6713J7263M777j0311j4712l369J3691J9543
$$ 548137 531109 507637 492736 495459 512172 529435 534212 523901 509189 505820 519511 539054
5395E39054R672L87J2521M6202P4962O7949K0870l4629n7700l9179j1160q895
$$ 539054 548726 549113 561634 607836 682798 750747 771617 736988 679288 640109 628949 620054
5383F20054k8867l6744j3651K1712L9577L1517Q975j6444l8834n1908m9422l1176
$$ 620054 591187 554443 540792 562504 602081 633598 642573 626129 587295 535387 485965 454789
5371D54789m009K1153L3163K8399J6125Q789P161M417K800J0634K2281K0677O059
$$ 454789 450780 471933 505096 533495 549620 558409 565570 569987 572787 583421 605702 626379 632438
5358F32438J676J9944M1519M1497J9291j1544m3461o6342n9959k2826O342j0843
$$ 632438 634114 654058 695577 737074 756365 744821 701360 635018 575059 552233 558575 547732
5346E47732n6146p1586l4294J5586K8820K502k9609l9457k1737J5090N5246P7370
$$ 547732 491586 420000 385706 401292 430112 432614 403005 363548 341811 356901 412147 489517
5334D89517O4649J9867k9856m7807j8226L2824N8767M3772J9004J5256J9454K632
$$ 489517 554166 574033 544177 496370 478144 510968 569735 613507 632511 647767 667221 669853
5322F69853k6733l4128j6353o641j9817l2820k9540k4732k6701j6370J1053K0829
$$ 669853 643120 608992 592639 585998 566181 533361 503821 479089 452388 436018 447071 467900
5310D67900j0061m5874l6890Q892M0694L7657K2356R004j2858l6798k8755K0729
$$ 467900 457839 411965 375075 383967 424661 462318 484674 493678 480820 444022 415267 435996
5298D35996O7712O5154K0592k0536l2972k8202k2863j6773m117J2177K4595L1070
$$ 435996 503708 568862 589454 568918 535946 507744 484881 468108 463991 476168 500763 531833
5286E31833L5338L9606L8872K3980o023l5510m4433l1993j9408k2966l3148l0785
$$ 531833 567171 606777 645649 669629 663606 628096 583663 551670 532262 509296 476148 445363
5274D45363j6436q029j0525o338J5961L8613L6223J2702k548M263J3906O006j0135
$$ 445363 428927 420898 410373 404035 419996 458609 494832 507534 504986 509249 523155 529161 519026
5261E19026j3436o926j2027l0265l5994j4132J6432L0020K7828K7302L0262K3304
$$ 519026 505590 498664 486637 456372 420378 406246 422678 452698 480526 507828 538090 561394
5249E61394O161k510O483J5698M143k1122l0461q979K2878L2670J3580j1855k3648
$$ 561394 567555 565045 571528 587226 591369 570247 539786 530807 553685 586355 599935 588080 564432
5236E64432k5112k5550j8693L913K7764K7528M223j2486m755J1177J1436o053
$$ 564432 539320 513770 495077 498990 526754 554282 558505 546019 541264 552441 563877 557824
5224E57824k8598m5885m7535k3484J5930L7614K3720k095o862P018J2667K390
$$ 557824 529226 483341 435806 412322 428252 465866 489586 487491 480629 487647 500314 502704
5212E02704o947n815k060j033m24m157j7894l1021k6776j0237j676j952P275K5180
$$ 502704 495757 489942 487882 486849 486425 482268 464374 433353 406577 396340 394664 392712 399987 425167
5198D25167K4835l434k9629k2958P427K8529K4639O308q550p604J0391K9436K5555
$$ 425167 450002 446568 416939 393981 401408 429937 454576 460884 452334 444730 455121 484557 510112
5185E10112n884m0851n3772m3407k3560j916J8870L0153K3463M250j0784r653
$$ 510112 504228 463377 409605 366198 342638 340722 359592 389745 413208 417458 406674 397021
5173C97021M178J3575L059j9268k2055J0726M8688M7590J0085j7320j0735M420
$$ 397021 401199 414774 417833 398565 376510 387236 435924 483514 493599 476279 465544 469964
5161D69964L980J880J4148K3789J3750L317J3668K1990p025n9647q5787o5552
$$ 469964 473944 475824 489972 513761 527511 530828 544496 566486 559461 499814 414027 348475
5149C48475k4785R397L0950L6884K5511J3321J8599K7237R655k6923m0190j2588
$$ 348475 323690 333087 364037 400921 426432 439753 458352 485589 495244 468321 428131 415543
5137D15543K5591M0640L0075O215j9592k7649k150L4082L4666l775k8366n714
$$ 415543 441134 481774 511849 518064 498472 470823 468673 502755 537421 533646 505280 499566
5125D99566K7124J8605k2644m6740l3814q426L309l536k3399m2309l6476J698
$$ 499566 526690 545295 522651 475911 442097 433671 436980 433444 410045 367736 331260 332958
5113C32958M0895M2210J0915r276N696L2005L2391Q83l2751l3487M146M5594M7727
$$ 332958 373853 416063 426978 417702 423398 455403 487794 488677 455926 422439 426585 472179 519906
5100E19906P638l2845m0615k9079k5480k4899p653J4987J2168j4598k9618j6319
$$ 519906 527544 494699 454084 425005 399525 374626 366973 381960 394128 379530 349912 333593
5088C33593K746O937O114J5492K9363L5122L2406K4919J1501l941j1378j2002
$$ 333593 336339 343276 349390 364882 394245 429367 461773 486692 498193 494252 482874 470872
5076D70872j7126k2500p908K6217M7791L5665R067n708j3739l0592m4875l5553
$$ 470872 453746 431246 423338 449555 497346 533011 542078 536370 522631 492039 447164 411611
5064D11611j3473r423k5331l2385j8632l705J291J3500M0682N4079K6539k0516
$$ 411611 398138 388715 363384 330999 312367 308662 309953 323453 364135 418214 444753 424237
5052D24237l9024j7116Q176L694j9196k7767j3595K270J999q809j4587r474K462
$$ 424237 385213 368097 376273 379967 360771 333004 319409 321679 323678 314869 300282 290808 293270
5039B93270J7243L2076M0989L8673K8309J8559J2377N443l812j0693j3807k0209
$$ 293270 310513 342589 383578 422251 450560 469119 481496 486939 483127 472434 458627 438418
5027D38418l4281m6165l9227q936K9984N4996N2405K6394l083j3752M04K1996
$$ 438418 404137 357972 318745 309809 339793 394789 447194 473588 470505 456753 457157 479153
5015D79153K6253O437j9529k9071j8267k838J157o674j4051j1610l353j799j3094
$$ 479153 505406 511843 492314 463243 444976 442138 443295 436621 422570 410960 407607 405808 392714
5002C92714k7097k4859O97L2389M3175K5951L501K383K0506K9779J1036k3592
$$ 392714 365617 340758 341455 373844 417019 442970 446471 448854 469360 499139 510175 486583
4990D86583m6934m7069l4639k5086k1441j4797J855K1134K4569K646l0202m8272
$$ 486583 439649 392580 357941 332855 311414 296617 298472 319606 344175 346821 316619 268347
4978B68347m1224j8388J1306M6138P4356P2265L4798q711k8052k7881k9386l0647
$$ 268347 227123 208735 220041 266179 340535 412800 447598 438887 410835 382954 353568 322921
4966C22921j4348J2001J7536n740k7476k0043Q261L1526L6804K5644N259r925
$$ 322921 308573 320574 338110 332370 304894 284851 293112 324638 361442 387086 392345 382420
4954C82420o496O415L137j8699k6414J890M0721M9540K5569p62j0550r648n615
$$ 382420 375924 382339 385476 366777 340363 342253 382974 432514 458083 457321 446771 437123 431508
4941D31508R8l48j4221k7045j4461J8174L1602J323m5927o0045k4856K5088M3817
$$ 431508 431606 431258 417037 389992 375531 393705 425307 426630 380703 320658 295802 320890 364707
4928C64707K1292j1906k2645r143P954J7620K4384K5997J0387j6850k6384l229
$$ 364707 385999 374093 351448 342305 350259 367879 392263 418260 428647 411797 385413 382184
4916C82184K9004M0880L5503L1817K8096J0403j5826l2346l6586l4988j9862J3582
$$ 382184 411188 452068 487571 519388 547484 557887 542061 509715 473129 438141 418279 431861
4904D31861L7866K1475j7806l0984j0574J57k1891m6760m5505l1417k3910j3649
$$ 431861 469727 491202 473396 442412 431838 431995 410104 363344 317839 286422 262512 248863
4892B48863O204J1799j2434l6353k2844J8447N0102N8046N0078K5743j3127l8855
$$ 248863 255067 266866 254432 218079 195235 213682 263784 321830 371908 397651 384524 345669
4880C45669k5730Q793K7249K5674K6941L2230K1965n79j0709q002j7980m3038
$$ 345669 319939 328732 355981 381655 408596 440826 462791 462212 451503 443501 425521 382483
4868C82483n2215k9535L287K2296K6441J9625K341j0341P29K0277J0177k7247
$$ 382483 330268 300733 304020 326316 352757 372382 374723 364382 365111 385388 395565 368318
4856C68318m1444j0477J9633M372l1768l8757j8091p488j1897l156K1406L2175
$$ 368318 326874 316397 336030 340402 308634 269877 251786 244298 232401 229245 250651 282826
4844B82826K0975J5779L1610M4968L2445N498r592m661J1440K8675L7228K7282
$$ 282826 303801 319580 351190 396158 428603 434101 424509 419848 431288 459963 497191 524473
4832E24473K38k7994m2230l9826k5927p413P184J3210J6683K4800L1204K3934
$$ 524473 524711 496717 454487 414661 388734 381321 388505 401715 418398 443198 474402 498336
4820D98336N811r719k1401l8894n7801n8933l8352j5425j878J3803L7525M8493
$$ 498336 504147 494428 473027 434133 376332 317399 279047 263622 261744 275547 313072 361565
4808C61565K8641l518j3584K543J6312O966j6084l0892k5196k9L2044M8867L4248
$$ 361565 390206 386688 373104 375647 391959 398925 382841 351949 326753 326724 358768 407635 441883
4795D41883r96k3925j3456J6026L1083J6091j1144k0573m143J4589Q343j9562
$$ 441883 440887 416962 403506 419532 450615 466706 455562 434989 430846 445435 453778 434216
4783D34216l8524k9346o489N398L211n69m507j8486m0682n4347m9915l3819j3119
$$ 434216 395692 366346 359857 365255 368466 367897 363390 344904 304222 249875 199960 166141 153022
4770A53022J1454L3327L9912L3025L1637M2972M7375K6856n994k5789k9033k9541
$$ 153022 164476 197803 237715 270740 302377 345349 392724 419580 413586 387797 358764 329223
4758C29223k7994j1884J5166L0151K3216J1232Q418K776k2782n9643q1075p3652
$$ 329223 301229 289345 304511 334662 357878 369110 377528 380304 357522 297879 216804 143152
4746A43152m7058j7955K601R890P475P847K0336L8780M9285M7250L7356K2335
$$ 143152 96094 78139 80740 90630 98105 105952 126288 165068 214353 261603 298959 321294
4734C21294N465k82J5201L6405L2790l47l0801l1175j3488n435q863o628l16r284
$$ 321294 326759 326477 341678 378083 410873 410526 379725 348550 335062 329627 320764 314136 313820 304536
4720C04536l0412l1314J043L0942J8055k3821m1169j0984L1267M0935J7913m355
$$ 304536 274124 242810 243853 274795 292850 269029 227860 216876 248143 289078 306991 302636
4708C02636o950r39o69l496j278L206R62r281j9425k0488q418J3330L2203L3224
$$ 302636 295686 294747 294078 290582 289304 292510 293472 284191 264766 244278 235860 249190 281393 314617
4694C14617J4262r155k0931k2381k5129l0101k5779q526P720R151J727L893K1664
$$ 314617 328879 319724 298793 276412 251283 221182 195403 186877 194597 203748 205475 209368 231032
4681B31032L9174L7296J8119M777J3768L2056L1460O547j5223r825J0265J6099
$$ 231032 270206 307502 325621 330398 344166 376222 407682 414229 399006 389181 399446 415545
4669D15545N845M226J9583K8474J2068j5742l0869k9750k1052o267R402M160l2769
$$ 415545 421390 425616 445199 473673 485741 469999 439130 409380 388328 382061 391463 395623 362854
4656C62854o9342n8734PN6868P0396M6647J4005j1793k4768j7872L766J6647P026
$$ 362854 293512 234778 234785 291653 362049 408696 422701 410908 386140 368268 372034 388681 395707
4643C95707q195q386l373j6030l9412m0635r451K3441K6428N077j3153j6585j4283
$$ 395707 387512 379126 375753 359723 320311 279676 270225 293666 320094 325171 312018 295433 281150
4630B81150j2279n520N351P152o431k0309j6607k125j13j3073j3078J8862N9012
$$ 281150 268871 263351 268702 275854 269423 249114 232507 230382 230269 217196 204118 222980 281992
4617B81992O6368L4665l057k0239k2692k3691j9110l023J1842J0413p7k592J059
$$ 281992 348360 383025 379968 359729 337037 313346 294236 291213 303055 313468 313391 310799 311858
4604C11858l554j3173p592J5765L0845J7621q310j5862K01J3902M215j7004k2204
$$ 311858 308304 295131 287539 303304 334149 351770 343460 327598 327799 341701 345916 328912 306708
4591C06708p261J686j3091k9391j1272L7667P1403N7593J3257k6580m9783n6991
$$ 306708 299447 301133 288042 258651 247379 285046 356449 414042 427299 400719 350936 293945
4579B93945l7793P928M1480K0816l7236p0125n0054j3059K451N532J9726L6648
$$ 293945 256152 264080 305560 326376 289140 219015 168961 155902 158353 163885 183611 220259
4567B20259L4774K0134J4632J9265J9822J6605J7848J4098p592l0540k5269J004
$$ 220259 255033 275167 289799 309064 328886 345491 363339 377437 369845 339305 314036 315040
4555C15040Q573j4389l2296j8408L111l574l0197l9291k0657l08L356K456J3287
$$ 315040 323613 309224 276928 258520 261631 258057 227860 188569 167912 167604 170960 173416 186703
4542A86703L0709L9321L3649J6108j1371m0179m9773k6973J2204L5801L2399J9938
$$ 186703 217412 256733 290382 306490 295119 254940 205167 178194 190398 226199 258598 278536
4530B78536J4664Q679r840k8879k6004m037R688L024m082P271K4245K2569M825
$$ 278536 293200 301879 292039 263160 237156 233119 242807 245831 241749 249020 273265 295834 300659
4517C00659l591P321J9175J3210n972k1410k5897k4537k3291k2963k0964j4663
$$ 300659 297068 304389 323564 336774 330802 309392 283495 258958 235667 212704 191740 177077
4505A77077n492n0j482p76J3367L4154L9174K0559J49J112J4061J1018r630j6766
$$ 177077 171585 171535 170053 169277 182644 216798 255972 276531 276680 277792 291853 302871 293241 276475
4491B76475N597K7779J4783j7133j7228K5553O0341M3135k516k3254j2608r419
$$ 276475 282072 309851 324634 307501 290273 315826 376167 419302 416786 393532 380924 371505
4479C71505k7631l3987n590L1430M1982K8234J1275m629k0582k1908l756K715
$$ 371505 343874 309887 304297 335727 377709 405943 417218 412589 392007 370099 366343 369058
4467C69058k9914p3005p2818k7552J1450J5876J0944K0578K8701J5816m548j1526
$$ 369058 339144 266139 193321 165769 177219 193095 204039 224617 253318 269134 264586 253060
4455B53060q486m354Q032K7998K7929j0104n7410o9805m3012r561P771J2627J4807
$$ 253060 244574 240220 248252 276250 304179 294075 236665 166860 123848 114287 122058 134685 149492
4442A49492J9158K8260L5262K3270q500l0909k0189O031J2988l465j9553k0783
$$ 149492 168650 196910 232172 255442 246942 216033 195844 201875 214863 211398 191845 171062
4430A71062p804K0403N5604O5454K8773k2552l8016j9589j3959l5569m7285k5153
$$ 171062 163258 183661 239265 304719 333492 310940 272924 253335 239376 203807 156522 131369
4418A31369P218K3565K7306K1416o133m2572m3419K102M1460L1910L389N038K5745
$$ 131369 138587 162152 189458 210874 204741 162169 118750 120852 162312 194222 197611 202649 228394
4405B28394K1464n056j1563Q672J7047m884l0238l3375j9135J200K3515L2633
$$ 228394 249858 244802 233239 241911 258958 254074 223836 190461 171326 172526 196041 228674
4393B28674R563l0510m3017j2424K4690L1004J4489M888R416J3731R670J768l323
$$ 228674 238237 207727 164710 152286 176976 207980 222469 227357 236773 250504 260174 261942 258619
4380B58619k70J2991K8349L2826K5435J6682J0348K511k247L310O233j4500m6983
$$ 258619 258349 271340 299689 332515 357950 374632 384980 387491 385244 388554 394787 380287 333304
4367C33304n0939j7032J3016P366q573K292K4537J4080k9025n6935m2213r975
$$ 333304 282365 265333 278349 285715 277142 279434 303971 318051 289026 232091 189878 179903
4355A79903O020O063Q602J6519J8007P549r166k3796k7957j3718J6885M4340M4249
$$ 179903 185923 191986 200588 217107 235114 242663 233497 209701 181744 168026 184911 229251 273500
4342B73500J3126k2827l3197j8652r683k3146l5013j5842J7992K0168j7389m7616
$$ 273500 286626 263799 230602 211950 202267 179121 144108 128266 146258 166426 149037 101421
4330A01421l3245M408K3710K0141J5195J1785j994j8503j7799l588J884m196m579
$$ 101421 68176 72584 96294 116435 131630 143415 141421 122918 105119 101531 103415 99219 94640
4317I4640K605J115r055p671R774K2809K0709J7745K4101K8362K0200O702m260
$$ 94640 97245 98360 89305 81634 91408 114217 134926 152671 176772 205134 225334 232036 227776
4304B27776j4661k1796j6221k760J52r920j5169j0061r567j5774q426J7312L6163
$$ 227776 213115 191319 175098 172338 172490 162570 147401 137340 127773 111999 103573 120885 157048
4291A57048L3325K7224L1908L1141J4431L236J0139P287k5490n3425l4836Q890
$$ 157048 190373 217597 249505 280646 295077 298313 308452 315739 290249 236824 201988 210878
4279B10878K3892P156L018K4723L8093K6772J7476K6098K8393N978j9161k1146
$$ 210878 234770 241926 244944 269667 307760 334532 352008 378106 406499 412477 393316 372170
4267C72170r474p756j8137k8601l5140l6855k5702R87K8526L6873J7685k0105
$$ 372170 362696 354940 336803 308202 273062 236207 210505 211492 240018 276891 294576 274471
4255B74471m9145l6851J5722N6517L7801j5953l7094j1085P160j6776m7204m3542
$$ 274471 225326 188475 204197 260714 298515 282562 245468 234383 241543 224767 177563 134021
4243A34021k0884q850J195K1937K5720j0841m9834l8999N449K2905J985j0962
$$ 134021 113137 104287 105482 127419 153139 142298 92464 53465 58914 81819 83804 72842
4231G2842O986K6544K5915K3717L5510M3633L0883P851j1705l1196n0067n1424
$$ 72842 79828 106372 132287 156004 191514 235147 266030 273881 262176 230980 180913 129489
4219A29489k7662N418L2322N1633N7069L3586j3144m8639m6926j7383J4590L2862
$$ 129489 101827 107245 139567 191200 248269 281855 268711 220072 173146 155763 170353 203215
4207B03215L0870J1799m648j369O279r829l8319l6082K305K9179J7486K248J7338
$$ 203215 234085 245884 241236 239867 246146 236317 197998 161916 164221 193400 210886 213134 230472
4194B30472L5214J2350l8374o6536n3009j9354J1141K3594M774l3126m3896o065
$$ 230472 265686 278036 239662 173126 120117 100763 111904 135498 140272 107146 63250 57185
4182E7185L1955J5127l1232l7504J187K1344k469j9837P447M4492M3455J2927
$$ 57185 89140 104267 73035 35531 36718 58062 55593 35756 43203 87695 131150 144077
4170A44077j0429j8979k3770j9054L012K4083K2046O876M345J6779K6111K4282
$$ 144077 133648 114669 90899 71845 74857 98940 120986 127862 132207 148986 175097 199379
4158A99379J7064Q532K295O922K0864K3659J327l0004m2891l0632o871J3520J9722
$$ 199379 216443 224975 227270 234192 255056 278715 280042 250038 207147 176515 169644 183164 202886
4145B02886P362r985r212Q264J2611q195k5347j5485q70j0928k9625k1724O832
$$ 202886 210248 200263 191051 199315 211926 203731 178384 162899 162029 151101 121476 99752 106584
4132A06584J8652M368j0681j2898j1343o136J0900K4772J1187j5300j3198J8265
$$ 106584 125236 129604 118923 106025 94682 88546 99446 124218 135405 120105 106907 125172
4120A25172L1239K840l1305l8173l4963m5562n1822k7677R768K5017J8890J9641
$$ 125172 156411 159251 127946 89773 54810 9248 -42574 -70251 -60483 -35466 -16576 3065
4108C065L5254N0663N9980O6625O0913L1266p941l0122l2492l0476k4809p128
$$ 3065 38319 88982 148962 215587 276500 307766 299825 269703 237211 206735 181926 174798
4096A74798P534q347m8256p1092n5557k4549m938O808K2915L4022K3202l850k1984
$$ 174798 182332 173985 125729 54637 -920 -25469 -30407 -23599 -684 33338 56540 52690 30706
4083C0706j4369J3425M1048M9182L5211J6458R423P038r425l6742m8203l0766
$$ 30706 16337 29762 70810 119992 155203 171661 181084 188122 178697 141955 93752 62986
$$ [...]
##END NTUPLES=NMR SPECTRUM
##END=
