##TITLE=1H ikalashn
CG-1212-x1
18.9.2024
##JCAMPDX= 6.0         $$ Bruker NMR JCAMP-DX V2.0
##DATA TYPE= NMR SPECTRUM
##DATA CLASS= NTUPLES
##ORIGIN= UXNMR, Bruker Analytische Messtechnik GmbH
##OWNER= root
$$ TOPSPIN		Version 1.3
$$ 2024-09-18 09:52:23.437 +0400  Irina@DPX200
$$ Compression mode = diff/dup
##.OBSERVE FREQUENCY= 200.131392401
##.OBSERVE NUCLEUS= ^1H
##.ACQUISITION MODE= SIMULTANEOUS
##.ACQUISITION SCHEME= undefined
##.AVERAGES= 64
##.DIGITISER RES= 18
##SPECTROMETER/DATA SYSTEM= spect
##.PULSE SEQUENCE= zg
##.SOLVENT NAME= CDCl3
##.SHIFT REFERENCE= INTERNAL, CDCl3, 1, 17.95386
##AUDIT TRAIL= $$ (NUMBER, WHEN, WHO, WHERE, WHAT)
$$ ##TITLE= Audit trail, TOPSPIN		Version 1.3
$$ ##JCAMPDX= 5.01
$$ ##ORIGIN= Bruker BioSpin GmbH
$$ ##OWNER= Irina
$$ $$ F:/spectra/data/iren/nmr/1H/4/pdata/1/auditp.txt
$$ ##AUDIT TRAIL=  $$ (NUMBER, WHEN, WHO, WHERE, VERSION, WHAT)
(   1,<2024-09-18 09:51:29.484 +0400>,<Irina>,<DPX200>,<TOPSPIN 1.3>,
      <created by zg
	started at 2024-09-18 09:47:16.625 +0400,
	POWCHK disabled, PULCHK disabled
       configuration hash MD5:
       BE 6D 3F 07 2A EA 11 49 91 17 2B D3 AF B3 58 0D
       data hash MD5: 16K
       D2 43 83 23 4E CE 7C 49 9D 5D 81 B7 1C BC D6 8B>)
(   2,<2024-09-18 09:52:09.515 +0400>,<Irina>,<DPX200>,<TOPSPIN 1.3>,
      <Start of raw data processing
       efp BC_mod = 2 LB = 0.02 FT_mod = 6 PKNL = 1 PHC0 = 111.0696 PHC1 = -5.603941 SI = 32K 
       data hash MD5: 32K
       9E 04 E3 96 11 19 8F 68 DF AB 7A 99 92 E7 78 F9>)
(   3,<2024-09-18 09:52:12.218 +0400>,<Irina>,<DPX200>,<TOPSPIN 1.3>,
      <apk 
       data hash MD5: 32K
       D7 4D C9 40 C0 D9 D3 56 67 8C E9 F9 F8 04 0B 14>)
(   4,<2024-09-18 09:52:14.578 +0400>,<Irina>,<DPX200>,<TOPSPIN 1.3>,
      <abs n ABSG = 5 
       data hash MD5: 32K
       E1 50 74 92 63 67 7D A1 E7 18 41 EA D0 D8 E5 AF>)
$$ ##END=
$$ 
$$ $$ hash MD5
$$ $$ C5 F0 47 BB 23 F6 88 8E 11 7B 4F D8 98 2D 6D 3B
##$RELAX= 
##$RELAX= 
##$RELAX= 
##$RELAX= 
##$RELAX= 
##$RELAX= 
##$RELAX= 
##$RELAX= 
##$RELAX= 
$$ Bruker specific parameters
$$ --------------------------
##$DU= <F:/spectra>
##$EXPNO= 4
##$NAME= <1H>
##$PROCNO= 1
##$TYPE= <nmr>
##$USER= <iren>
##$AMP= (0..31)
100 100 100 100 100 100 100 100 100 100 100 100 100 100 100 100 100 100 
100 100 100 100 100 100 100 100 100 100 100 100 100 100 
##$ANAVPT= -1
##$AQSEQ= 0
##$AQ_mod= 1
##$AUNM= <au_zg>
##$AUTOPOS= <>
##$BF1= 200.13
##$BF2= 200.13
##$BF3= 200.13
##$BF4= 200.13
##$BF5= 200.13
##$BF6= 200.13
##$BF7= 200.13
##$BF8= 200.13
##$BYTORDA= 1
##$CFDGTYP= 0
##$CFRGTYP= 5
##$CHEMSTR= <none>
##$CNST= (0..63)
1 1 145 1 1 1 1 1 1 1 1 1 1 1 1 1 1 1 1 1 1 1 1 1 1 1 1 1 1 1 1 1 1 1 
1 1 1 1 1 1 1 1 1 1 1 1 1 1 1 1 1 1 1 1 1 1 1 1 1 1 1 1 1 1 
##$CPDPRG= <>
##$CPDPRG1= <>
##$CPDPRG2= <>
##$CPDPRG3= <>
##$CPDPRG4= <mlev>
##$CPDPRG5= <mlev>
##$CPDPRG6= <mlev>
##$CPDPRG7= <mlev>
##$CPDPRG8= <mlev>
##$CPDPRGB= <>
##$CPDPRGT= <>
##$D= (0..63)
0 2 0 0 0 0 0 0 0 0.06 0 0.03 0 0 0 0 0.0002 0 0 0 0 0 0 0 0 0 0 0 0 0 
$$ [...]
##$SW_h= 4401.40845070422
##$TD= 16384
##$TD0= 1
##$TE= 300
##$TE2= 300
##$TE3= 300
##$TEG= 300
##$TL= (0..7)
0 120 120 120 120 120 120 120 
##$TP= (0..7)
150 150 150 150 150 150 150 150 
##$TP07= 0
##$TPNAME0= <>
##$TPNAME1= <>
##$TPNAME2= <>
##$TPNAME3= <>
##$TPNAME4= <>
##$TPNAME5= <>
##$TPNAME6= <>
##$TPNAME7= <>
##$TPOAL= (0..7)
0.5 0.5 0.5 0.5 0.5 0.5 0.5 0.5 
##$TPOFFS= (0..7)
0 0 0 0 0 0 0 0 
##$TUNHIN= 0
##$TUNHOUT= 0
##$TUNXOUT= 0
##$USERA1= <user>
##$USERA2= <user>
##$USERA3= <user>
##$USERA4= <user>
##$USERA5= <user>
##$V9= 5
##$VALIST= <valist>
##$VCLIST= <CCCCCCCCCCCCCCC>
##$VD= 0
##$VDLIST= <DDDDDDDDDDDDDDD>
##$VPLIST= <PPPPPPPPPPPPPPP>
##$VTLIST= <TTTTTTTTTTTTTTT>
##$WBST= 1024
##$WBSW= 25
##$XGAIN= (0..3)
0 0 0 0 
##$XL= 0
##$YL= 0
##$YMAX_a= 1036723
##$YMIN_a= -645745
##$ZGOPTNS= <>
##$ZL1= 120
##$ZL2= 120
##$ZL3= 120
##$ZL4= 120
##$ABSF1= 17.95386
##$ABSF2= -4.038887
##$ABSG= 5
##$ABSL= 3
##$ALPHA= 0
##$AQORDER= 0
##$ASSFAC= 0
##$ASSFACI= 0
##$ASSFACX= 0
##$ASSWID= 0
##$AUNMP= <proc_1d>
##$AXLEFT= 0
##$AXRIGHT= 0
##$AXTYPE= 0
##$AXUNIT= <>
##$AZFE= 0.1
##$AZFW= 0.1
##$BCFW= 0
##$BC_mod= 2
##$BYTORDP= 0
##$COROFFS= 0
##$CY= 7568.61572265625
##$DATMOD= 1
##$DC= 0
##$DFILT= <>
##$DTYPP= 0
##$F1P= 17.9538593292236
##$F2P= -4.03888763876832
##$FCOR= 0.5
##$FTSIZE= 32768
##$FT_mod= 6
##$GAMMA= 0
##$GB= 0
##$INTBC= 0
##$INTSCL= 1.483618e-010
##$ISEN= 128
##$LB= 0.02
##$LEV0= 0
##$LPBIN= 0
##$MAXI= 945.577
##$MC2= 0
##$MEAN= 0
##$ME_mod= 0
##$MI= -402.1523
##$NCOEF= 0
##$NC_proc= -6
##$NLEV= 6
##$NOISF1= 8.587773
##$NOISF2= 6.764455
##$NSP= 0
##$NTH_PI= 0
##$NZP= 0
##$OFFSET= 17.95386
##$PC= 1
##$PHC0= 98.26936
##$PHC1= 13.98207
##$PH_mod= 1
##$PKNL= yes
##$PPARMOD= 0
##$PPDIAG= 0
##$PPIPTYP= 0
##$PPMPNUM= 100
##$PPRESOL= 1
##$PSCAL= 0
##$PSIGN= 0
##$REVERSE= no
##$SF= 200.13
##$SI= 32768
##$SIGF1= 16.12182
##$SIGF2= -4.496377
##$SINO= 3.521527
##$SIOLD= 32768
##$SREGLST= <1H.CDCl3>
##$SSB= 0
##$STSI= 32768
##$STSR= 0
##$SW_p= 4401.40845070423
##$SYMM= 0
##$S_DEV= 0
##$TDeff= 16384
##$TDoff= 0
##$TI= <>
##$TILT= no
##$TM1= 0
##$TM2= 0
##$TOPLEV= 0
##$USERP1= <user>
##$USERP2= <user>
##$USERP3= <user>
##$USERP4= <user>
##$USERP5= <user>
##$WDW= 1
##$XDIM= 32768
##$YMAX_p= 496944621
##$YMIN_p= -1383815
$$ End of Bruker specific parameters
$$ ---------------------------------
##NTUPLES= NMR SPECTRUM
##VAR_NAME=  FREQUENCY,     SPECTRUM/REAL,   SPECTRUM/IMAG
##SYMBOL=    X,             R,               I
##VAR_TYPE=  INDEPENDENT,   DEPENDENT,       DEPENDENT
##VAR_FORM=  AFFN,          ASDF,            ASDF
##VAR_DIM=   32768,         32768,           32768
##UNITS=     HZ,            ARBITRARY UNITS, ARBITRARY UNITS
##FACTOR=    0.134324425510551, 1,           1
##FIRST=     4401.40845070423, -501447,      -2608431
##LAST=      0,             -288162,         -3179857
##MIN=       0,             -1383815,        0
##MAX=       4401.40845070423, 496944621,    0
$$ Real data points
##PAGE= N=1
##DATA TABLE= (X++(R..R)), XYDATA
$$ [...]
10025C256425N148m15003k27737K12478L76959K21442N8241N6353O3641j09239
$$ 3256425 3261573 2846570 2618833 2831311 3208270 3429712 3487953 3544306 3607947 3498708
10015C498708l44686l08559N3383L23288J56633j72663j60046J29541J75435r7326
$$ 3498708 3154022 2845463 2898846 3222134 3378767 3206104 3046058 3175599 3351034 3253708
10005C253708j63462J78453L78417J5823m56598l88620O7272K52877L8432r5079
$$ 3253708 3090246 3268699 3647116 3662939 3206341 2817721 2884993 3137870 3176302 3081223
9995C081223Q4296K39988Q4029j83070k19319o105J82761R8181k39241m94264
$$ 3081223 3165519 3405507 3489536 3306466 3087147 3081042 3263803 3361984 3122743 2628479
9985B628479l14751J76932M00339O9815l38957k49533J59101K71518P178j54785
$$ 2628479 2313728 2490660 2890999 2960814 2621857 2372324 2531425 2802943 2810121 2655336
9975B655336l5473M5057l0707K2536K34212K03208j60383l66239j44582J03826
$$ 2655336 2619863 2664920 2634213 2656749 2890961 3094169 2933786 2567547 2422965 2526791
9965B526791M2972l3244J56089K80554L2639j97048K3709L17328R5325l74420
$$ 2526791 2569763 2536519 2692608 2973162 3005801 2808753 2832462 3149790 3245115 2870695
9955B870695l75121M8751K17375K795p7889Q0775L2286k18884j20809K94794K67517
$$ 2870695 2495574 2544325 2761700 2764495 2686606 2767381 2799667 2580783 2459974 2754768 3022285
9944C022285l13563m94885J66803O95944K30091n09283l90377K59535K82858l07135
$$ 3022285 2708722 2213837 2380640 3076584 3306675 2797392 2407015 2666550 2949408 2642273
9934B642273m15818J93819N21779P3946l74410j91590J42639R2752J8504K95684
$$ 2642273 2226455 2420274 2942053 3015999 2641589 2449999 2592638 2685390 2703894 2999578
9924B999578M12132j14361o42057l05554M73317N25097k35373o84164k60577K51968
$$ 2999578 3411710 3297349 2655292 2349738 2823055 3348152 3112779 2428615 2168038 2420006
9914B420006Q3337l40746k06909L66473N92460K52659j01394j12291p4649k57456
$$ 2420006 2503343 2162597 1955688 2322161 2914621 3167280 3065886 2953595 2878946 2621490
9904B621490l55066j1238M75622M89234J7151k97143j06283J52640K365k97443
$$ 2621490 2266424 2255186 2730808 3220042 3237193 2940050 2833767 2986407 2988772 2691329
9894B691329k04562J74987K37976j20016l18786j8090L75288L77984R6195j02563
$$ 2691329 2486767 2661754 2899730 2779714 2460928 2442838 2818126 3196110 3292305 3189742
9884C189742j54232j72717j12524P4427K22440K03899J26821M5611j57139l58264
$$ 3189742 3035510 2862793 2750269 2824696 3047136 3251035 3377856 3423467 3266328 2908064
9874B908064j62061L66767N14187k9363n22879k66008K38099R7002m64903m90463
$$ 2908064 2746003 3112770 3626957 3597594 3074715 2808707 3046806 3143808 2678905 2188442
9864B188442R2686M16730J84231L4487K50982K79880j22907l61146q6281J80606
$$ 2188442 2281128 2697858 2882089 2916576 3167558 3447438 3324531 2963385 2877104 3057710
9854C057710N2899l9427K18586L25157r3788m81088k85316O8329j772j70873Q8777
$$ 3057710 3110609 3071182 3289768 3614925 3521137 3040049 2754733 2823062 2821290 2650417 2739194
9843B739194M11198K01767j66557K7304M79230L32516k74864m13696K4439K10963
$$ 2739194 3150392 3352159 3185602 3212906 3692136 4024652 3749788 3336092 3360531 3571494
9833C571494j09611k76052l2255O5521j54512j11519K89220K70902l89446p25161
$$ 3571494 3461883 3185831 3153576 3219097 3064585 2953066 3242286 3513188 3123742 2398581
9823B398581j22305N75888M23079j13221o3992L70808K82762k99790m83287l4197
$$ 2398581 2276276 2852164 3275243 3162022 3098030 3468838 3751600 3451810 2968523 2934326
9813B934326L28289J85148n3810k4373O3711N198k5284O4932O4264n8350k95K96136
$$ 2934326 3262615 3447763 3393953 3369580 3433291 3438489 3413205 3478137 3542401 3484051 3483756 3779892
9801C779892M24443J45804k10622k60057q1034M8513P2552M5957n6788j45062
$$ 3779892 4204335 4350139 4139517 3879460 3798426 3846939 3919491 3965448 3908660 3763598
9791C763598M5402N03270P38426L86837k20837m72133k73364m8333o0800j50500
$$ 3763598 3809000 4312270 5050696 5437533 5216696 4744563 4471199 4422866 4362066 4211566
9781D211566j19868j989J12793K06199K13581M7351j79666k11102k7551P6539
$$ 4211566 4091698 4089709 4202502 4408701 4622282 4669633 4489967 4278865 4251314 4327853
9771D327853p9085k95067l08494j40629N3836K37351L46093J58452l31393o19680
$$ 4327853 4248768 3953701 3645207 3504578 3558414 3795765 4141858 4300310 3968917 3349237
9761C349237k56087L89733M80944j10840n72613l14673K12295K76179n2798j58942
$$ 3349237 3093150 3482883 3963827 3852987 3280374 2965701 3177996 3454175 3401377 3242435
9751C242435R6384K76928J80577Q6415J36339O7240k41726m40111k10833K31568
$$ 3242435 3338819 3615747 3796324 3882739 4019078 4086318 3844592 3404481 3193648 3425216
9741C425216M33466K77012K5818n9271L4517J28692N6891j33249j97558j9187
$$ 3425216 3858682 4135694 4161512 4102241 4136758 4265450 4322341 4189092 3991534 3972347
9731C972347J78213J32517n6856r9806K2767R6693P7063P5221L3115j56671k86953
$$ 3972347 4150560 4283077 4226221 4126415 4149182 4245875 4322938 4398159 4431274 4274603 3987650
9720C987650q9897K11849J80963n7851M88K80692J68370l51251n13702n5172K76609
$$ 3987650 3897753 4109602 4290565 4232714 4233202 4513894 4682264 4331013 3817311 3762139 4038748
9709D038748n819k94958k3641K74990l6599m32940p6528O40763O44835o6410m71574
$$ 4038748 4032929 3737971 3714330 3989320 3952721 3519781 3443253 4084016 4728851 4662441 4190867
9698D190867k02537N9624p2614j34616J51961L33546J07695j19176J7366K46473
$$ 4190867 3988330 4047954 3975340 3840724 3992685 4326231 4433926 4314750 4332116 4578589
9688D578589K15343K9242r3896j60777j42285P4636K85589J16254k64858k48662
$$ 4578589 4793932 4823174 4729278 4568501 4426216 4500852 4786441 4902695 4637837 4389175
9678D389175K16582M67192K03862o4171K0082Q9116j19554j96974J04469K67159
$$ 4389175 4605757 5072949 5276811 5212640 5232722 5321838 5202284 5005310 5109779 5376938
9668E376938p5275l50925J2876N00884K87113l73011n23936r598L92922K51455
$$ 5376938 5301663 4950738 4963614 5464498 5751611 5378600 4854664 4845066 5237988 5489443
9658E489443k8276o3164l7243j67431k59540r3453J68064K21357L2247j62121
$$ 5489443 5461167 5398003 5360760 5193329 4933789 4840336 5008400 5229757 5262004 5099883
9648E099883j36427Q7592K38928J12825j01681n0351J97815J90242j45926k84129
$$ 5099883 4963456 5051048 5289976 5402801 5301120 5250769 5448584 5638826 5492900 5208771
9638E208771P2076M56875L50777n1205k50051j78738k8893K08044M78262M07499
$$ 5208771 5280847 5737722 6088499 6037294 5787243 5608505 5579612 5787656 6265918 6673417
9628F673417p8822l47696L3126M59888J88755l81607l05321L51854O33156K31626
$$ 6673417 6594595 6246899 6280025 6739913 6928668 6547061 6241740 6593594 7226750 7458376
9618G458376j80028j69115m3058k1347R1697K31866L1219l38004k16205L97008
$$ 7458376 7278348 7109233 7066175 7044828 7136525 7368391 7399610 7061606 6845401 7242409
9608G242409O88916L20497q2840p3881l2488k22723j95970K69402N56713K29239
$$ 7242409 7931325 8251822 8168982 8095101 8062613 7839890 7643920 7913322 8470035 8699274
9598H699274j78198j12326O8537q0669j44189L22979P36051L59793l12221k65179
$$ 8699274 8521076 8408750 8477287 8396618 8252429 8575408 9311459 9671252 9359031 9093852
9588I093852L28721L97573j91366m13941J57808O53725L72572j39450j02556K62009
$$ 9093852 9422573 9820146 9628780 9214839 9372647 10026372 10398944 10259494 10156938 10418947
9578A0418947K75213j1159J703L74016N05553R2716m04489m20507p253L28791
$$ 10418947 10694160 10683001 10684704 11058720 11564273 11656989 11252500 10831993 10824740 11153531
9568A1153531K86050L7575o9771R6715L65384M46030K04620j64129k77543r354
$$ 11153531 11439581 11477156 11407385 11504100 11869484 12315514 12520134 12356005 12078462 12069108
9558A2069108K71004J47054j92640j54843L06565M82327j636m61157j59852M41615
$$ 12069108 12340112 12487166 12294526 12139683 12446248 12928575 12926939 12465782 12305930 12747545
9548A2747545L50946l08756m27742K69037P09816J81165n43176m64861J27115
$$ 12747545 13098491 12789735 12361993 12631030 13340846 13522011 12978835 12513974 12641089
9539A2641089K73629j37427l89764j34244K63351M18033L09929O0650j76470k06071
$$ 12641089 12914718 12777291 12387527 12253283 12516634 12934667 13244596 13305246 13128776 12922705
9529A2922705l6260M4426r2859k04560j43133r3984q0023J78034N56049M10617
$$ 12922705 12886445 12930871 12838012 12633452 12490319 12396335 12316312 12494346 13050395 13461012
9519A3461012l20943p06625j95789M16903K72540j48372l939L20643k1000n96999
$$ 13461012 13140069 12433444 12237655 12654558 12927098 12778726 12774787 13095430 13074430 12477431
9509A2477431l24835M99396N16857l83446q07659j68383M32849J67533k40561
$$ 12477431 12152596 12651992 13168849 12785403 11977744 11809361 12242210 12409743 12169182
9500A2169182J5718M32743K34489k65726l38247m9553J16452J61755K57195J48138
$$ 12169182 12184900 12617643 12852132 12586406 12248159 12198606 12315058 12476813 12734008 12882146
9490A2882146l03529n38215p0171O14716O94560J72802k81472l20897j18360J30403
$$ 12882146 12578617 12040402 11970231 12584947 13279507 13452309 13170837 12849940 12731580 12861983
9480A2861983L34896L69877K37351J26304N1605j67249l70188j07834M89242O32537
$$ 12861983 13196879 13566756 13804107 13930411 13982016 13814767 13444579 13336745 13825987 14458524
9470A4458524Q6206l42265p5493L02968J15132k21748J1942N25674N31457Q7007
$$ 14458524 14544730 14202465 14126972 14429940 14545072 14323324 14335266 14860940 15392397 15479404
9460A5479404j15302K9884L8207j57792j46917J24766K87882K38523J78390J03491
$$ 15479404 15364102 15393986 15432193 15274401 15127484 15252250 15540132 15778655 15957045 16060536
9450A6060536p6466j09350K23066N30368L23771j33401k03269J39831M13545M43653
$$ 16060536 15984070 15874720 16097786 16628154 16951925 16818524 16615255 16755086 17168631 17612284
9440A7612284L55392R0743k89713k41001M27824Q07253P6420r59188q16061M04441
$$ 17612284 17967676 18058419 17768706 17527705 17955529 18762782 18839202 17880014 17063953 17468394
9430A7468394J118828O24706r2180j38016J25224J52065J59018L72415M12984
$$ 17468394 18587222 19211928 19119748 18981732 19106956 19259021 19418039 19790454 20203438
9421B0203438R5257o6560K34107N12231L83116K24398L69614M43837J40837p8889
$$ 20203438 20298695 20232135 20466242 20978473 21361589 21585987 21955601 22399438 22540275 22461386
9411B2461386K41704P17142P35671L94296J88609K21307K87975L48816M22846
$$ 22461386 22703090 23420232 24155903 24550199 24738808 24960115 25248090 25596906 26019752
9402B6019752L88373K78254L59193O04659N93694K43184O4644L46703O83491O81262
$$ 26019752 26408125 26686379 27045572 27650231 28243925 28487109 28551753 28898456 29581947 30263209
9392C0263209N13201M06224K48546R9402L53618R32861J074017M76555p8626J37176
$$ 30263209 30776410 31182634 31431180 31530582 31884200 32817061 33891078 34367633 34289007 34426183
9382C4426183P60379J060476R95121Q66877O32004K79983K30906O13900Q21318
$$ 34426183 35186562 36247038 37242159 38109036 38741040 39021023 39251929 39865829 40687147
9373D0687147N22758L72949Q71580J327289R86817M43085P04388J455243J567443
$$ 40687147 41209905 41582854 42454434 43781723 44768540 45211625 45916013 47371256 48938699
9364D8938699R52684N68166P81662J022450J006413J096483J366869J389763J105580
$$ 48938699 49891383 50459549 51241211 52263661 53270074 54366557 55733426 57123189 58228769
9355E8228769R92074J235783J512645J636123J712704J709311J557365J528977
$$ 58228769 59220843 60456626 61969271 63605394 65318098 67027409 68584774 70113751
9347G0113751J804918J944975J576470J242020J624186K300213K352533J908002
$$ 70113751 71918669 73863644 75440114 76682134 78306320 80606533 82959066 84867068
9339H4867068J886885K437433K835025K788660K651456K507921K281111K496680
$$ 84867068 86753953 89191386 92026411 94815071 97466527 99974448 102255559 104752239
9331A04752239L574839M645666M620416M160782M785256O245812O932460O856576
$$ 104752239 108327078 112972744 117593160 121753942 126539198 132785010 139717470 146574046
9323A46574046P725678R720032J1085257J1895042J4997394K0990922K4829674
$$ 146574046 154299724 164019756 175105013 187000055 201997449 222988371 247818045
9316B47818045K0560471Q366754n576006j5399550j9478617j9173762j6676251
$$ 247818045 268378516 276745270 271169264 255769714 236291097 217117335 200441084
9309B00441084j4251388j3176490j2654011j1103783q630463o819001o221634
$$ 200441084 186189696 173013206 160359195 149255412 140624949 133805948 127584314
9302A27584314n774321m852059m163990m162209m126470l485524k773718k595722
$$ 127584314 121809993 116957934 112793944 108631735 104505265 101019741 98246023 95650301
9294I5650301k685933k608660k475941k422110k207811j846232j823125k221119
$$ 95650301 92964368 90355708 87879767 85457657 83249846 81403614 79580489 77359370
9286G7359370k401546k030643j662234j786092k012623j786113j309935j158104
$$ 77359370 74957824 72927181 71264947 69478855 67466232 65680119 64370184 63212080
9278F3212080j407219j684293j744550j588724j300771j075964j117494j299003
$$ 63212080 61804861 60120568 58376018 56787294 55486523 54410559 53293065 51994062
9270E1994062j263992r87508q18575q62212q38793o94551p47777j002575r66458
$$ 51994062 50730070 49742562 48923987 48061775 47222982 46528431 45780654 44778079 43811621
9261D3811621n06783k61149o95982j278135j189280n18496j12117l87371q69116
$$ 43811621 43304838 43043689 42347707 41069572 39880292 39361796 39249679 38862308 37993192
9252C7993192r35972n86460k97763l65412o02827o76718n66486n24401o40336
$$ 37993192 37057220 36470760 36172997 35807585 35204758 34528040 33961554 33437153 32796817
9243C2796817p23428o72344o23972n92656l72565l5587l8395m68075p18359m19798
$$ 32796817 32073389 31401045 30777073 30184417 29811852 29776265 29737870 29269795 28551436 28131638
9233B8131638j15074l41611o41033l62302R3363p8193o04446n62722m7212l5146
$$ 28131638 28016564 27674953 27033920 26671618 26764981 26686788 26082342 25519620 25472408 25437262
9223B5437262o20083q11485k81335J11720r0864k19001J38166L25035j23787n96833
$$ 25437262 24817179 24005694 23724359 23836079 23745215 23526214 23664380 23989415 23865628 23268795
9213B3268795n09817k35429k17172j87377K7308k1520m03446l97418J47526K62197
$$ 23268795 22758978 22523549 22306377 22119000 22146308 22124788 21721342 21323924 21471450 21733647
9203B1733647m24185p50140K3217O79922j2736j051700p32803M78029O83163l43716
$$ 21733647 21309462 20559322 20582539 21262461 21249725 20198025 19465222 19943251 20626414 20282698
9193B0282698r22746k52125N77283N90663J71356j26930m40259p35101m62663
$$ 20282698 19359952 19107827 19685110 20275773 20447129 20320199 19879940 19144839 18682176
9184A8682176L26888O90283J92168m14860m26590j43699q5169j52177j13226j26608
$$ 18682176 19009064 19699347 19891515 19476655 19050065 18906366 18821197 18669020 18555794 18429186
9174A8429186k65871k16438J16156L28247J91155k0533j20602k56076l61923j20965
$$ 18429186 18163315 17946877 18063033 18391280 18582435 18561902 18441300 18185224 17823301 17702336
9164A7702336L20824L85898K5813j71743l4002m7541l11572k55547K38982M62284
$$ 17702336 18023160 18409058 18434871 18263128 18229126 18181585 17870013 17614466 17853448 18315732
9154A8315732Q4375k68247j61328n1885k39512j80627L93123O90415J08460o26829
$$ 18315732 18400107 18131860 17970532 17918647 17679135 17498508 17891631 18582046 18690506 18063677
9144A8063677n67483k6769Q8570k12213k41915R8429L24734K88488J79756m7795
$$ 18063677 17496194 17469425 17557995 17345782 17103867 17202296 17527030 17815518 17995274 17947479
9134A7947479m25235n22543o4067M24447L79748J16152J28407Q0952m65699r03358
$$ 17947479 17522244 16999701 16935634 17360081 17739829 17855981 17984388 18065340 17599641 16696283
9124A6696283m13028M73679N41608j24774l04609K57686M72798j24628n52587
$$ 16696283 16283255 16756934 17298542 17173768 16869159 17126845 17599643 17475015 16922428
9115A6922428q8769N38705M47614o145l6850K10697Q0713l60737m45182L194M41265
$$ 16922428 16833659 17372364 17819978 17813833 17776983 17987680 18068393 17707656 17262474 17265668 17706933
9104A7706933L90119o2017m71973m39932O4262N55771M50610j75600n58086k14379
$$ 17706933 18097052 18035035 17563062 17123130 17187392 17743163 18193773 18018173 17460087 17245708
9094A7245708L98193N21336R4066k86468k26886M9860J49203M8647M9599K83665
$$ 17245708 17643901 18165237 18259303 17972835 17745949 17795809 17945012 17993659 18043258 18326923
9084A8326923M47568J85574l21627m66795m1605M14775L74324M7646o8625M813
$$ 18326923 18774491 18960065 18638438 18171643 18130038 18544813 18919137 18966783 18898158 18902971
9074A8902971m1757r2944J58764M69572L31061r2955j54381J66359K33455p1046
$$ 18902971 18861214 18768270 18927034 19396606 19727667 19634712 19480331 19646690 19880145 19809099
9064A9809099j16196K88022M55036P997m17473k32913J56317J37288q0423L7769
$$ 19809099 19692903 19980925 20435961 20443958 20026485 19793572 19949889 20087177 20006754 20044523
9054B0044523L93017N36231M41831K98442j2452n02532o03223O2605Q09358P00185
$$ 20044523 20437540 20973771 21415602 21714044 21701592 21199060 20595837 20658442 21467800 22167985
9044B2167985j7038k48280K68906O32433K52965k82632k04351L20410N70005L03198
$$ 22167985 22150947 21902667 22171573 22804006 23056971 22774339 22569988 22890398 23460403 23763601
9034B3763601q7498k06918l6574K14718L59414L48355K81772K95708L95820M44157
$$ 23763601 23676103 23469185 23432611 23647329 24006743 24355098 24636870 24932578 25328398 25772555
9024B5772555L24980R0761n6566M7082L02679L95879K27618J57201M90015Q52345
$$ 25772555 26097535 26188296 26131730 26178812 26481491 26877370 27104988 27262189 27752204 28604549
9014B8604549O17852l5211j98671M00011Q77039N27735n6329M3602N88515O37854
$$ 28604549 29222401 29187190 28988519 29388530 30265569 30793304 30736975 30780577 31369092 32006946
9004C2006946J35835m6361L97117P35531M52489N2918J86537O48343P71698L89791
$$ 32006946 32142781 32096420 32493537 33229068 33681557 33734475 33921012 34569355 35341053 35730844
8994C5730844o2266j67080R0633M15345M76120K06408r5407j00820J40462L24326
$$ 35730844 35668578 35501498 35592131 36007476 36483596 36690004 36594597 36493777 36634239 36958565
8984C6958565L33639K76805J92627O4873L4824K08860L47813J76886r9945q5806
$$ 36958565 37292204 37569009 37761636 37826509 37861333 38070193 38418006 38594892 38494947 38409141
8974C8409141J16817Q1352j45407r9473K25649K99312j5568k06284k3616J02582
$$ 38409141 38525958 38607310 38461903 38362430 38588079 38887391 38871823 38665539 38641923 38744505
8964C8744505r9566k36145k8559J08593j59672l82972p5782L65758K68304k00706
$$ 38744505 38644939 38408794 38380235 38488828 38329156 37946184 37870402 38236160 38504464 38303758
8954C8303758l38636p0337L6142j84989k60234L8229K96554J59212j45139k33303
$$ 38303758 37965122 37894785 37930927 37745938 37485704 37523933 37820487 37979699 37834560 37601257
8944C7601257r1547P4107J75083K06909J45586O7339J46273L63108M24378J60298
$$ 37601257 37509710 37583817 37758900 37965809 38111395 38178734 38325007 38688115 39112493 39272791
8934C9272791j64475j63243J28607K65263J743l11233j57402L90398O72687L40773
$$ 39272791 39108316 38945073 39073680 39338943 39340686 39029453 38872051 39262449 39935136 40275909
8924D0275909q7372O9703O45739Q52049M22557r0500k29923j65718r0765K05172
$$ 40275909 40188537 40258240 40903979 41756028 42178585 42088085 41858162 41692444 41601679 41806851
8914D1806851P27718Q93692L60952k64782k30154K60646M61341K66420J72889
$$ 41806851 42534569 43428261 43789213 43524431 43294277 43554923 44016264 44282684 44455573
8905D4455573K87710K48822O3821J49414M74906N13104J95176Q2568L53959M65109
$$ 44455573 44743283 44992105 45055926 45205340 45680246 46193350 46388526 46471094 46825053 47290162
8895D7290162J76088P2801N29034R20494N87495l7772r7649L40705N06859K41658
$$ 47290162 47466250 47539051 48068085 48988579 49576074 49538302 49440653 49781358 50288217 50529875
8885E0529875J33061L74855M48355J55753Q9869O14047J081513P28750j00074
$$ 50529875 50662936 51037791 51486146 51641899 51731768 52345815 53427328 54156078 54056004
8876E4056004l65939J96744P55550O11955J12893N806L51281N79701M25970K58447
$$ 54056004 53690065 53886809 54642359 55254314 55367207 55373013 55724294 56303995 56729965 56988412
8866E6988412M05051O10962M56668N5710m6399L62782Q36767Q43014M33808J20990
$$ 56988412 57393463 58004425 58461093 58516803 58470404 58833186 59669953 60512967 60946775 61067765
8856F1067765J92455M34139N54615N79983O37294O08203L50759J18821K90222
$$ 61067765 61260220 61694359 62248974 62828957 63466251 64074454 64425213 64544034 64834256
8847F4834256O78021O66699K02081K3371N17356R75932O62795P9311K24944R21881
$$ 64834256 65512277 66178976 66381057 66404428 66921784 67897716 68560511 68639822 68864766 69786647
8837F9786647J027270K98848j83682K33946Q07857P48771M45343N22611O45213
$$ 69786647 70813917 71112765 70929083 71163029 71970886 72719657 73165000 73687611 74332824
8828G4332824K82995r7294K35974Q97970R34139L88605J35841L79825N22587M14187
$$ 74332824 74615819 74518525 74754499 75652469 76586608 76975213 77111054 77490879 78013466 78427653
8818G8427653N17818Q14629P41495L33600K54809N22887M19023p6615m7117P33370
$$ 78427653 78945471 79760100 80501595 80835195 81090004 81612891 82031914 81955299 81908182 82641552
8808H2641552J227253Q11969K92598M43119P05186L33755j81586M784N92657P19223
$$ 82641552 83868805 84680774 84973372 85416491 86121677 86455432 86273846 86278630 86871287 87590510
8798H7590510M50524M91588Q29298Q26929M14751J35725J82000L05743M78681
$$ 87590510 88041034 88532622 89361920 90188849 90603600 90739325 90921325 91227068 91705749
8789I1705749P67285Q22437M01783R5647N40225J206190J084347L52177J24251
$$ 91705749 92473034 93295471 93697254 93792901 94333126 95539316 96623663 96975840 97100091
8780I7100091O28715R48661O81674N16043Q36013J034350P24880M90574P91583
$$ 97100091 97728806 98677467 99359141 99875184 100711197 101745547 102470427 102961001 103752584
8771A03752584J130961R99736P72775R36177J195649J105039R12918J031748J244806
$$ 103752584 104883545 105883281 106656056 107592233 108787882 109892921 110805839 111837587 113082393
8762A13082393J171337R95129J023066J032782P86204O85338J120119J613942
$$ 113082393 114253730 115248859 116271925 117304707 118090911 118776249 119896368 121510310
8754A21510310J480893R69632Q43713J100314J082253P21859O40483R46562R44056
$$ 121510310 122991203 123960835 124804548 125904862 126987115 127708974 128349457 129296019 130240075
8745A30240075L31576j82967O5459O95270Q69214M39606l6427j56010m0313N2774
$$ 130240075 130571651 130388684 130454143 131149413 132018627 132458233 132421806 132265796 132225483 132278257
8735A32278257O0485R223j39244l97460o26762o50858n12168m86946p13858r07659
$$ 132278257 132338742 132347965 132208721 131811261 131184499 130533641 130021473 129534527 128820669 127913010
8725A27913010p09484l08778l25121r14494j425236j292205q84573r31656j372369
$$ 127913010 127203526 126894748 126569627 125655133 124229897 122937692 122053119 121121463 119749094
8716A19749094j466414j009032o93119j032164j567496j589235j187717j024638
$$ 119749094 118282680 117273648 116580529 115548365 113980869 112391634 111203917 110179279
8708A10179279j296159j523346j363438j080581j028629j107167j053194r60794
$$ 110179279 108883120 107359774 105996336 104915755 103887126 102779959 101726765 100765971
8700A00765971j082515j277556j156703p75310o49035r17067j037695o68505l30172
$$ 100765971 99683456 98405900 97249197 96473887 95824852 94907785 93870090 93201585 92871413
8691I2871413o25082j189102j162038n07639n6374k42105o04503o74247n50984
$$ 92871413 92246331 91057229 89895191 89387552 89331178 89089073 88484570 87810323 87259339
8682H7259339l68532L36L55961J17455o43686r18124j63488P37653P14410N1859
$$ 87259339 86890807 86891143 87247104 87364559 86720873 85802749 85639261 86376914 87091324 87143183
8672H7143183k24211L5831J70664L0020P8376L09820K00839j89131j43745M71677
$$ 87143183 86918972 86954803 87125467 87155487 87233863 87543683 87744522 87555391 87411646 87883323
8662H7883323Q79348O15410J98027J66192K51041P902l75565m45641j96742L5867
$$ 87883323 88762671 89378081 89576108 89742300 89993341 90001243 89625678 89180037 88983295 89019162
8652H9019162M6311j96102o14873r12973p93244m66762m73498q47893j034376
$$ 89019162 89065473 88869371 88254498 87341525 86548281 86081519 85608021 84760128 83725752
8643H3725752q20709o82153q97600j044516q19845o61959r62050j271954j008361
$$ 83725752 82905043 82222890 81325290 80280774 79460929 78798970 77836920 76564966 75556605
8634G5556605m72581m04120q28892j097141r00669n82257m97442o23165p78518
$$ 75556605 75084024 74679904 73851012 72753871 71853202 71270945 70773503 70150338 69371820
8625F9371820q07049n95383k52276j42520m27661p56946p28076m29988k12627
$$ 69371820 68564771 67969388 67717112 67574592 67146931 66389985 65661909 65231921 65019294
8616F5019294j81742k46036l69134m54055l23114j17226k56396o58224o07507
$$ 65019294 64837552 64591516 64222382 63768327 63445213 63327987 63071591 62413367 61805860
8607F1805860R4356N55312R4448n81505m62191J22016J22731m08174m89681P60
$$ 61805860 61900216 62455528 62549976 61968471 61506280 61628296 61751027 61342853 60853172 60853932
8597F0853932J68117k07758k84623K24924M62205j3221l81618j4499M15261J60702
$$ 60853932 61022049 60814291 60529668 60754592 61216797 61203576 60821958 60807459 61222720 61383422
8587F1383422k94280j73747K02681Q1816l29888k85657J45481K72692M0553O347
$$ 61383422 61089142 60915395 61118076 61199892 60870004 60584347 60729828 61002520 61043073 61049420
8577F1049420K24802J96693j11257j71215J29302L12911K14121K02348L61611
$$ 61049420 61274222 61470915 61359658 61188443 61317745 61630656 61844777 62047125 62408736
8568F2408736K94976k9257p1717L07603M71157M8723l66581j45849L67552M65524
$$ 62408736 62703712 62674455 62602738 62910341 63381498 63430221 63063640 62917791 63285343 63750867
8558F3750867K13524J91758L95929K75303j67667j98482M58379R93790O09499
$$ 63750867 63964391 64156149 64552078 64827381 64659714 64461232 64919611 65913401 66522900
8549F6522900k52560m53255K70178R81633Q75709K73771l5453Q7324K17731K29384
$$ 66522900 66270340 65817085 66087263 67068896 67944605 68218376 68182923 68270247 68487978 68717362
8539F8717362L83250O40727N94007K26005J01263N01183R22116Q36254M72042
$$ 68717362 69100612 69741339 70335346 70561351 70662614 71163797 72085913 72922167 73394209
8530G3394209L45292M28351L87582L36256O38116J091611J054808M56678J1713
$$ 73394209 73739501 74167852 74555434 74891690 75529806 76621417 77676225 78132903 78144616
8521G8144616K11830O69158P63725M85833K63642K79165L54707L52867L43128
$$ 78144616 78356446 79025604 79789329 80275162 80538804 80817969 81172676 81525543 81868671
8512H1868671M05229M88258M81031L39121J57549J03695J95165K16615K5752j58822
$$ 81868671 82273900 82762158 83243189 83582310 83739859 83843554 84038719 84255334 84281086 84122264
8502H4122264n3982J78238J07717k53088l68487K4324M69634M31822K8502k33087
$$ 84122264 84068282 84246520 84354237 84101149 83732662 83756986 84226620 84658442 84686944 84453857
8492H4453857j91313r7968j02138p8427M6959J36959P6957n0772r2031J707J37259
$$ 84453857 84262544 84164576 84062438 83984011 84030970 84167929 84244886 84194114 84102083 84103790 84241049
8481H4241049J53169j9191k12726j64657J18637L12645K26012R1078J86535L75072
$$ 84241049 84394218 84375027 84162301 83997644 84116281 84428926 84654938 84746016 84932551 85307623
8471H5307623L31350R3189J1755J94205L81016M20413M79056O41224O61086L74902
$$ 85307623 85638973 85732162 85743917 85938122 86319138 86739551 87218607 87859831 88520917 88895819
8461H8895819R5404K55428P76489J126078J001600O63410N07723N71161O41654
$$ 88895819 88991223 89246651 90023140 91149218 92150818 92814228 93321951 93893112 94534766
8452I4534766O71266P99659J019708J122922J059358J073265J288148J401661
$$ 94534766 95206032 96005691 97025399 98148321 99207679 100280944 101569092 102970753
8444A02970753J116622P22581Q06748J369662J707888J382282Q70730Q87329J374355
$$ 102970753 104087375 104809956 105616704 106986366 108694254 110076536 110947266 111834595 113208950
8435A13208950J663380J473488J195272J164168J192231J020480P94638P75393
$$ 113208950 114872330 116345818 117541090 118705258 119897489 120917969 121712607 122488000
8427A22488000Q77936Q49061P14308P05055Q42891R15054Q16768O30742L96596
$$ 122488000 123365936 124214997 124929305 125634360 126477251 127392305 128209073 128839815 129236411
8418A29236411R8253j17333l2986K51432L34681N6784k51394k40127m741J43145
$$ 129236411 129334664 129217331 129184345 129435777 129770458 129827242 129575848 129335721 129330980 129474125
8408A29474125J23738L0309j57066m50400o13801m48444k09979k88867n28569
$$ 129474125 129597863 129628172 129471106 129020706 128406905 127958461 127748482 127459615 126931046
8399A26931046m02897O1217J48356m85781j171161j087346l75870J13970p1313
$$ 126931046 126528149 126589366 126737722 126251941 125080780 123993434 123617564 123731534 123660221
8390A23660221o37683j111013j257790j047629o72208n49239q81299j276893j239833
$$ 123660221 123022538 121911525 120653735 119606106 118933898 118384659 117503360 116226467 114986634
8381A14986634r37738r68883j411086j691743j481149j140920j107225j332050
$$ 114986634 114048896 113080013 111668927 109977184 108496035 107355115 106247890 104915840
8373A04915840j546212j634342j554712j307820j146346j371034j777179j812258
$$ 104915840 103369628 101735286 100180574 98872754 97726408 96355374 94578195 92765937
8365I2765937j437161j236935j460817j628358j416243j214070j339565j435287
$$ 92765937 91328776 90091841 88631024 87002666 85586423 84372353 83032788 81597501
8357H1597501j234598j185012j560164j683030j000218k97620o58439j638532
$$ 81597501 80362903 79177891 77617727 75934697 74934479 74636859 73978420 72339888
8349G2339888j820024j010872m70948q31489j221344r01886m48100n74137q85275
$$ 72339888 70519864 69508992 69038044 68206555 66985211 66083325 65635225 65061088 64175813
8340F4175813p18839l92126n96845j108424j120662n73950k13971m14026p41363
$$ 64175813 63456974 63064848 62468003 61359579 60238917 59664967 59450996 59036970 58295607
8331E8295607p53423n73112n05844n51221n08189l09388q9231j0052p7821j49248
$$ 58295607 57542184 56969072 56463228 55912007 55403818 55094430 55005199 54995147 54917326 54768078
8321E4768078j73711l05580n63884n73120q7535L78083J12424o07588p37382n8682
$$ 54768078 54594367 54288787 53724903 53151783 53064248 53442331 53554755 52947167 52209785 52151103
8311E2151103M08458K8658m30086j51677L10694M2396n62568m51035K29110L48480
$$ 52151103 52559561 52588219 52158133 52006456 52317150 52359546 51796978 51345943 51575053 51923533
8301E1923533k71529n96404j98241O3189l78834p95886m39289J97783K26554k71952
$$ 51923533 51652004 51055600 50857359 50920548 50541714 49745828 49306539 49504322 49730876 49458924
8291D9458924n71678m62653k89404k04144j21430j65035m91170q22937p38418
$$ 49458924 48887246 48424593 48135189 47931045 47809615 47644580 47153410 46330473 45592055
8282D5592055l17225j4632k671q5559j62048l22084n32713o22052n61940m63938
$$ 45592055 45274830 45260198 45257527 45171968 45009920 44687836 44155123 43533071 42971131 42507193
8272D2507193l51328k06823j44846k53059l77034l49711k98676m06908n11212
$$ 42507193 42155865 41949042 41804196 41551137 41174103 40824392 40525716 40118808 39607596
8263C9607596l21703M1606J39169j53147m60848m23230r8585K06019K70115P4129
$$ 39607596 39285893 39327499 39466668 39313521 38852673 38429443 38330858 38536877 38806992 38881121
8253C8881121k20310l75042l23590k83042m37596n93186m09387O8857M13096L69344
$$ 38881121 38660811 38285769 37962179 37679137 37241541 36648355 36238968 36307825 36720921 37090265
8243C7090265J27894l1162q8180j51878k02851j57703p6536j29244l50202n14992
$$ 37090265 37218159 37186997 37098817 36946939 36744088 36586385 36509849 36380605 36030403 35515411
8233C5515411l35049J72801N61736L78401k31264n65371j98045M31209N45207
$$ 35515411 35180362 35353163 35914899 36293300 36062036 35496665 35298620 35729829 36275036
8224C6275036K6200m62497l54700J55938M59388K93561l4169j00835J26490K94781
$$ 36275036 36301236 35838739 35484039 35639977 36099365 36392926 36358757 36257922 36384412 36679193
8214C6679193J40697j46669j75051Q7760K57934J15432o4934L3703K72497L23982
$$ 36679193 36819890 36673221 36498170 36585930 36843864 36959296 36894362 36928065 37200562 37524544
8204C7524544K12848K10590L37037L74543L01895L04452L80697L46627K37304
$$ 37524544 37737392 37947982 38285019 38659562 38961457 39265909 39646606 39993233 40230537
8195D0230537K85783M56068M31289J76055P7179L37246O28816O14053M68989N59900
$$ 40230537 40516320 40972388 41403677 41579732 41656911 41994157 42622973 43237026 43706015 44265915
8185D4265915Q32655Q90714N99784L01218L64723P02077Q55329N83066K49983
$$ 44265915 45098570 45989284 46589068 46890286 47255009 47957086 48812415 49395481 49645464
8176D9645464M20551J041601J386068J051308O11333P79684J256447J159615M87782
$$ 49645464 50066015 51107616 52493684 53544992 54156325 54936009 56192456 57352071 57839853
8167E7839853K49935R42816J767890J812439J277951R33413R33310Q94946P55318
$$ 57839853 58089788 59032604 60800494 62612933 63890884 64824297 65757607 66652553 67407871
8158F7407871P98240J012923J083862R42240P92426O74866M94239L79497N10750
$$ 67407871 68206111 69219034 70302896 71245136 72037562 72712428 73206667 73586164 74096914
8149G4096914O69444M79416N8239q7509J71993M25100L76726K08832J82686K81539
$$ 74096914 74766358 75245774 75304013 75216504 75388497 75813597 76190323 76399155 76581841 76863380
8139G6863380L64740L56342K11173k8007j50950n3223J499k32252m65577k58750
$$ 76863380 77228120 77584462 77795635 77767628 77616678 77563455 77564954 77332702 76867125 76608375
8129G6608375J56541P6341n79924j039868p84196k74130k04759n30027o88824
$$ 76608375 76764916 76841257 76261333 75221465 74437269 74163139 73958380 73428353 72739529
8120G2739529m67085j75991j37827l45380n55663n23872k35181K3398q066j68536
$$ 72739529 72272444 72096453 71958626 71613246 71057583 70533711 70298530 70321928 70313862 70145326
8110G0145326j01640J50448K10276N6239J04924M47533O02079L23570P3739K65451
$$ 70145326 70043686 70194134 70404410 70460649 70565573 71013106 71615185 71938755 72012494 72277945
8100G2277945N83157N75258M39361O00578Q93639Q51801N58201N18785Q23864
$$ 72277945 72861102 73436360 73875721 74476299 75369938 76221739 76779940 77298725 78122589
8091G8122589J087926J156994J251164J402488J346384J063817R29884J189870
$$ 78122589 79210515 80367509 81618673 83021161 84367545 85431362 86361246 87551116
8083H7551116J658886K016296K094838J894068J612530J588517J896381K158108
$$ 87551116 89210002 91226298 93321136 95215204 96827734 98416251 100312632 102470740
8075A02470740K102836K046744K340788K668322K565292K355914K700364L352806
$$ 102470740 104573576 106620320 108961108 111629430 114194722 116550636 119251000 122603806
8067A22603806L387170K731804K405129K920900L505367L406281L012346K993330
$$ 122603806 125990976 128722780 131127909 134048809 137554176 140960457 143972803 146966133
8059A46966133L180473L116042L002283L194875L323617K896078K352427K489465
$$ 146966133 150146606 153262648 156264931 159459806 162783423 165679501 168031928 170521393
8051A70521393L094743L200437K605587K124705K257455K572613K607102K491429
$$ 170521393 173616136 176816573 179422160 181546865 183804320 186376933 188984035 191475464
8043A91475464K385409K095886J636184J448162J624157J559999R10939L16036
$$ 191475464 193860873 195956759 197592943 199041105 200665262 202225261 203136200 203452236
8035B03452236N10529J120859J091423J69403p35586p77601k28140l3061o04815
$$ 203452236 203962765 205083624 206175047 206344450 205608864 204831263 204603123 204570062 203965247
8026B03965247j390390j637185j333826j145670j455861j851393j815843j578940
$$ 203965247 202574857 200937672 199603846 198458176 197002315 195150922 193335079 191756139
8018A91756139j746427k259948k425086k051292j824596k218500k709028k617408
$$ 191756139 190009712 187749764 185324678 183273386 181448790 179230290 176521262 173903854
8010A73903854k209130k258007k823890l203184l003592k588063k397372k427049
$$ 173903854 171694724 169436717 166612827 163409643 160406051 157817988 155420616 152993567
8002A52993567k524112k691339k877431k874819k666915k546356k654987k711544
$$ 152993567 150469455 147778116 144900685 142025866 139358951 136812595 134157608 131446064
7994A31446064k464912k148343k143858k367569k370939k020461j710240j782642
$$ 131446064 128981152 126832809 124688951 122321382 119950443 117929982 116219742 114437100
7986A14437100k022363j971796j611944j408556j618785j856883j622069j086594
$$ 114437100 112414737 110442941 108830997 107422441 105803656 103946773 102324704 101238110
7978A01238110r42151j421040j909334j782064j255344j000019j151564j231619
$$ 101238110 100295959 98874919 96965585 95183521 93928177 92928158 91776594 90544975
7970I0544975r97872q08281r74951j223233j110460o88744m04943m88365p42160
$$ 90544975 89547103 88738822 87763871 86540638 85430178 84741434 84336491 83848126 83105966
7961H3105966q81495q21820o32329m08571k40499j82645k08060k49384k86243
$$ 83105966 82224471 81402651 80770322 80361751 80121252 79938607 79730547 79481163 79194920
7952G9194920l33235l51846k51726j6031K10854K26627M057k23940k18844o8911
$$ 79194920 78861685 78509839 78258113 78242082 78452936 78679563 78683620 78459680 78240836 78171925
7942G8171925r0244l30285m18566j28636J51510r8447o95273q97434m55603j0324
$$ 78171925 78081681 77751396 77332830 77204194 77355704 77257257 76561984 75664550 75208947 75198623
7932G5198623j85316p12468q63740m77833q3353r1356l09102l31922j01352Q4062
$$ 75198623 75013307 74300839 73437099 72959266 72875913 72784557 72475455 72143533 72042181 72126243
7922G2126243k8409l43343m97204k54214J73215L21643M7518k83331k97708q7148
$$ 72126243 72097834 71754491 71257287 71003073 71176288 71497931 71545449 71262118 70964410 70877262
7912G0877262L0798R233K6012R2113O3713k2607R385J07099K2625k38572l57669
$$ 70877262 70908060 70917293 70943305 71035418 71099131 71076524 71085909 71193008 71215633 70977061 70619392
7901G0619392k00766n1549j82835m73687o53319p02503p83428r16455r50792q00519
$$ 70619392 70418626 70367077 70184242 69710555 69057236 68354733 67571305 66654850 65704058 64903539
7891F4903539n57126l88861l96148n21985n89259n06873m15155m89305o39305
$$ 64903539 64346413 63957552 63561404 63039419 62450160 61943287 61528132 61038827 60399522
7882F0399522o23847m61349m51524p08265r43338q62838n57118l33106l35779
$$ 60399522 59775675 59314326 58862802 58154537 57211199 56348361 55791243 55458137 55122358
7873E5122358m77471n80774m85824k00598k1080k48667o89510p61736k83018J98803
$$ 55122358 54644887 54064113 53578289 53377691 53356611 53107944 52418434 51656698 51373680 51572483
7863E1572483J36457k86399n08228l76462j49327N6192L12899M93182L37612q0464
$$ 51572483 51708940 51422541 50914313 50537851 50388524 50444716 50757615 51250797 51588409 51507945
7853E1507945l77031l63090j71214Q6666L88694N62266M24307J82177K35202N29185
$$ 51507945 51130914 50767824 50596610 50683276 51071970 51634236 52058543 52240720 52475922 53005107
7843E3005107N97346L28615J56680L17779M85881M19394M07912O79071Q79086
$$ 53005107 53602453 53931068 54087748 54405527 54891408 55310802 55718714 56397785 57276871
7834E7276871O64675L90041N87212J054574J137120P68634N40400P19480Q74523
$$ 57276871 57941546 58331587 58918799 59973373 61110493 61879127 62419527 63139007 64013530
7825F4013530O67965M33932O16680J040262J160203Q50975N65468P34738J266307
$$ 64013530 64681495 65115427 65732107 66772369 67932572 68783547 69349015 70083753 71350060
7816G1350060J696771J716957J477775J391431J658239K044650K171032J956933
$$ 71350060 73046831 74763788 76241563 77632994 79291233 81335883 83506915 85463848
7808H5463848J690934J691706J990487K338799K474353K398226K389880K658001
$$ 85463848 87154782 88846488 90836975 93175774 95650127 98048353 100438233 103096234
7800A03096234K998455L010525K699861K561498K878216L255550L189804K842818
$$ 103096234 106094689 109105214 111805075 114366573 117244789 120500339 123690143 126532961
7792A26532961K793108L136294L338862L031460K502619K246256K332471K395297
$$ 126532961 129326069 132462363 135801225 138832685 141335304 143581560 145914031 148309328
7784A48309328K060309J306534N27352J62393J08429k73387j237771k065010j990468
$$ 148309328 150369637 151676171 152203523 152365916 152474345 152200958 150963187 148898177 146907709
7775A46907709j479142j707709k786868l521829l238079k780061l053752l551769
$$ 146907709 145428567 143720858 140933990 137412161 134174082 131394021 128340269 124788500
7767A24788500l308984k606543k518851l123972l410499k933677k408770k450774
$$ 124788500 121479516 118872973 116354122 113230150 109819651 106885974 104477204 102026430
7759A02026430k731877k745478k560124k398339k187371j956366k028192k377579
$$ 102026430 99294553 96549075 93988951 91590612 89403241 87446875 85418683 83041104
7751H3041104k421971j926000j502877j667740j981759j799597j350054j290733
$$ 83041104 80619133 78693133 77190256 75522516 73540757 71741160 70391106 69100373
7743F9100373j569430j589274j296450j220764j464981j503540j127722q36115
$$ 69100373 67530943 65941669 64645219 63424455 61959474 60455934 59328212 58492097
7735E8492097j012730j334367j336586j096533r95017j125802j253831j160812
$$ 58492097 57479367 56145000 54808414 53711881 52716864 51591062 50337231 49176419
7727D9176419q45365n41344n73220r53326j175677p93423j57896o0705n96265
$$ 49176419 48331054 47789710 47216490 46263164 45087487 44294064 44136168 44075463 43479198
7718D3479198j000230p94799m23223m11379n70123n39011n18684p98994j032392
$$ 43479198 42478968 41684169 41260946 40849567 40279444 39740433 39221749 38422755 37390363
7709C7390363p36710j99900r6810m10342n36467l47131l01134m88811m47966j07937
$$ 37390363 36653653 36453753 36356943 35946601 35410134 35063003 34761869 34273058 33825092 33717155
7699C3717155o0625n41675r05461n99307l4076P0402k79787n39515m69728k45313
$$ 33717155 33656530 33114855 32209394 31610087 31576011 31646413 31366626 30827111 30357383 30112070
7689C0112070j5380J23528k9430m60491p03048m21651J73p270l10000l34075m9985
$$ 30112070 30096690 30220218 30190788 29730297 29027249 28605598 28605771 28598501 28288501 27954426 27904441
7678B7904441J7268k70550m47356k80295j26728k22284k57607j0505J63206q2385
$$ 27904441 27921709 27651159 27203803 26923508 26796780 26574496 26316889 26306384 26469590 26387205
7668B6387205m38914l84913J3624K25237J6293l26577m61859l45667j51741q0246
$$ 26387205 25948291 25563378 25577002 25802239 25818532 25491955 25030096 24684429 24532688 24452442
7658B4452442k07227l68413k94566J2099K14322J02148j08803j38725m8159k3342
$$ 24452442 24245215 23876802 23582236 23594335 23808657 23910805 23802002 23663277 23615118 23591776
7648B3591776j8847N6724L9912k03628l91252j83255J92818J87551k25805m75272
$$ 23591776 23572929 23629653 23669565 23465937 23074685 22891430 23084248 23271799 23045994 22570722
7638B2570722k45256Q3302L9940k91954m84296l22670O5546M05486M24509M9135
$$ 22570722 22325466 22408768 22448708 22156754 21672458 21349788 21415334 21820820 22245329 22294464
7628B2294464l86143l88072N7412L77932J72626k20025k38947O8571J76286p5040
$$ 22294464 21908321 21520249 21577661 21955593 22128219 21908194 21669247 21737818 21914104 21839064
7618B1839064k60222q1969J45032n963l71612l74791J49995O61140N86543O2993
$$ 21839064 21578842 21496873 21641905 21635942 21264330 20889539 21039534 21700674 22287217 22350210
7608B2350210k65245j01508J74331J15467j66936k42388k0842J70058J07913n8190
$$ 22350210 22084965 21983457 22157788 22273255 22106319 21863931 21843089 22013147 22121060 22062870
7598B2062870j04245j6055J01034J74705J55593M1402n5108m8414o2909k19537
$$ 22062870 21958625 21942570 22043604 22218309 22373902 22415304 22360196 22311782 22248873 22029336
7588B2029336k98938j64M61091N04087O8779j88755J18087M56467J88947l93554
$$ 22029336 21730398 21730234 22191325 22695412 22764191 22575436 22693523 23149990 23338937 22945383
7578B2945383m87682J5552M26403L16214K6237j6505P3354j5322k07552j64560
$$ 22945383 22457701 22473253 22899656 23215870 23242107 23225602 23298956 23283634 23076082 22911522
7568B2911522J75550M70036L87399J5049k13674k0482L47377M07274R8679j31977
$$ 22911522 23087072 23557108 23944507 23959556 23745882 23725400 24072777 24480051 24578730 24446753
7558B4446753m526K07309K03655J63091L13148L89374R4409k18878k8423M04760
$$ 24446753 24442227 24649536 24853191 25016282 25329430 25718804 25813213 25594335 25565912 25970672
7548B5970672L83010j8075k0202M83826O45953J01304l14072R7752P15829N91591
$$ 25970672 26353682 26335607 26315405 26799231 27445184 27546488 27232416 27330168 28045997 28637588
7538B8637588n0463k62120J21842M25286L43657K33288K51764J48920m489K27893
$$ 28637588 28587125 28325005 28446847 28872133 29215790 29449078 29700842 29849762 29845273 30073166
7528C0073166P48946Q15871J84927l61789j17969N07270O27364J45555k30186
$$ 30073166 30822112 31637983 31822910 31461121 31343152 31850422 32477786 32623341 32393155
7519C2393155l5931M43405O87847N35867K11970M5067K17461O13192Q84772P87522
$$ 32393155 32357224 32800629 33488476 34024343 34236313 34281380 34498841 35112033 35996805 36784327
7509C6784327M44291K01145K64629N48599Q06290Q37069O39906M41218M96728
$$ 36784327 37228618 37429763 37694392 38242991 39049281 39886350 40526256 40967474 41464202
7500D1464202P90899J006331Q73088M98513K75522M71132R33669J227570J105696
$$ 41464202 42255101 43261432 44134520 44633033 44908555 45379687 46313356 47540926 48646622
7491D8646622Q26543Q51243J198369J372302J102987Q23901J039644J500442J569372
$$ 48646622 49473165 50324408 51522777 52895079 53998066 54821967 55861611 57362053 58931425
7482E8931425J270538J274054J768681K093164J800842J420137J646144K285841
$$ 58931425 60201963 61476017 63244698 65337862 67138704 68558841 70204985 72490826
7474G2490826K621366K493118K390888K639777L078143L474366L751328L819268
$$ 72490826 75112192 77605310 79996198 82635975 85714118 89188484 92939812 96759080
7466I6759080L630246L373331L207167K867417J995877P97961j51771p56072j467487
$$ 96759080 100389326 103762657 106969824 109837241 111833118 112631079 112479308 111723236 110255749
7457A10255749k422050l113458l172135k908482k737443k563493k177847j840081
$$ 110255749 107833699 104720241 101548106 98639624 95902181 93338688 91160841 89320760
7449H9320760j905412k136064j972129j386011r16750q49195q84570p48726o35746
$$ 89320760 87415348 85279284 83307155 81921144 81004394 80155199 79270629 78521903 77886157
7440G7886157p65618q72160n45169P3101L59646L4463m24619l93282Q4436L92878
$$ 77886157 77120539 76248379 75703210 75776311 76135957 76170420 75745801 75352519 75436955 75829833
7430G5829833J98855j36236j16271K31289N24023O18347O54793O36370M27705
$$ 75829833 76028688 75892452 75776181 76007470 76531493 77149840 77804633 78441003 78868708
7421G8868708J88950L05563P20914Q42109M29672J10660N03763J188502J219453
$$ 78868708 79057658 79363221 80084135 80926244 81355916 81466576 81970339 83158841 84378294
7412H4378294N39244J36119O40932J436287J561254J027608O89396J018258J571393
$$ 84378294 84917538 85053657 85694589 87130876 88692130 89719738 90409134 91427392 92998785
7403I2998785J717128J434223J167066J162380J263972J301244J380054J658770
$$ 92998785 94715913 96150136 97317202 98479582 99743554 101044798 102424852 104083622
7395A04083622K020399K193164K138792K071557K077231K015466J915734K109771
$$ 104083622 106104021 108297185 110435977 112507534 114584765 116600231 118515965 120625736
7387A20625736K681082L118332K979468K653821K848496L436866L594065L180199
$$ 120625736 123306818 126425150 129404618 132058439 134906935 138343801 141937866 145118065
7379A45118065L104329L882289M669449M482859L748402L656266M358276M916063
$$ 145118065 148222394 152104683 156774132 161256991 165005393 168661659 173019935 177935998
7371A77935998M939706N093473N746136O259217O162977O075726O691638P594101
$$ 177935998 182875704 187969177 193715313 199974530 206137507 212213233 218904871 226498972
7363B26498972P946804P830289P975592Q541700R104429R625725J0441498J1352332
$$ 226498972 234445776 242276065 250251657 258793357 267897786 277523511 287965009 299317341
7355B99317341J1732018J1656728J1968840J2962985J3915194J4290446J4540048
$$ 299317341 311049359 322706087 334674927 347637912 361553106 375843552 390383600
7348C90383600J5161086J5744242J5632426J4888010J3854238J2273184R680529
$$ 390383600 405544686 421288928 436921354 451809364 465663602 477936786 487617315
7341D87617315O345301K982005k80978l838860p596899j0803892j2976784j4351968
$$ 487617315 493962616 496944621 496663643 492824783 485227884 474423992 461447208 447095240
7333D47095240j5315565j5936100j6159442j5985400j5388428j4485474j3725004
$$ 447095240 431779675 415843575 399684133 383698733 368310305 353824831 340099827
7326C40099827j3407356j3122234j2280787j1111314j0374666j0123826r652608
$$ 340099827 326692471 313570237 301289450 290178136 279803470 269679644 260027036
7319B60027036q800975q292181q409806q370212p625596o846480o781588o949428
$$ 260027036 251226061 242933880 234524074 226153862 218528266 211681786 204900198 197950770
7311A97950770o474884n611053n285510n515560n479230n012005m805050n009618
$$ 197950770 191475886 185864833 180579323 175063763 169584533 164572528 159767478 154757860
7303A54757860m837945l947350l192420l378566m033530m135091l550447l019044
$$ 154757860 149919915 145972565 142780145 139401579 135368049 131232958 127682511 124663467
7295A24663467k969573l044074k794858k338474k134320k347413k626907k537629
$$ 124663467 121693894 118649820 115854962 113516488 111382168 109034755 106407848 103870219
7287A03870219k126229j872330k007257k169669j999696j757537j874975k139940
$$ 103870219 101743990 99871660 97864403 95694734 93695038 91937501 90062526 87922586
7279H7922586j986386j495067j333878j627363j715867j309633j049890j436609
$$ 87922586 85936200 84441133 83107255 81479892 79764025 78454392 77404502 75967893
7271G5967893j939388j830481j315866j095563j237693j277512j139315j155458
$$ 75967893 74028505 72198024 70882158 69786595 68548902 67271390 66132075 64976617
7263F4976617j315971j263231j001051r22261j106288j205967j071974r15865
$$ 64976617 63660646 62397415 61396364 60474103 59367815 58161848 57089874 56174009
7255E6174009q23177o77091n89789q03537j115813j048931o75888n75852q25639
$$ 56174009 55350832 54673741 54083952 53280415 52164602 51115671 50439783 49863931 49038292
7246D9038292q25741m06754k50640p14561j071197o63555j09137l83549j178872
$$ 49038292 48212551 47805797 47555157 46840596 45769399 45105844 44996707 44613158 43434286
7237D3434286j301323n41286J9188k73692p19042n29617r8948k47850q29131r82431
$$ 43434286 42132963 41591677 41610865 41337173 40618131 40088514 39989566 39741716 38912585 37930154
7227C7930154n10947j23838k81173n72082m95364k35662k39192m48276m78589
$$ 37930154 37419207 37295369 37014196 36442114 35946750 35711088 35471896 35023620 34545031
7218C4545031l25126l38514n51792n78967k98660j29033l52183o04275m49897
$$ 34545031 34219905 33881391 33329599 32750632 32451972 32322939 31970756 31366481 30916584
7209C0916584j27606j83680n49428o13962k26704K2610k55910o17871m92135p6876
$$ 30916584 30788978 30605298 30055870 29441908 29215204 29237814 28981904 28364033 27871898 27795022
7199B7795022o275l77553o53888m64461l6211J99355P5369k68988n34549m51132
$$ 27795022 27788747 27411194 26757306 26292845 26256634 26455989 26531358 26262370 25727821 25276689
7189B5276689p7010J43842r6028m89527n18623k27076j13889k97462l64271j39696
$$ 25276689 25199679 25343521 25247493 24757966 24239343 24012267 23898378 23600916 23236645 23096949
7179B3096949J0563j22868k11323n6606m0925m15989o94558l88696R9623P3736
$$ 23096949 23107512 22984644 22773321 22716715 22675790 22259801 21565243 21176547 21276170 21349906
7169B1349906l18788l85854j01484p4136l72500l95150l5391N8426l05325m25795
$$ 21349906 21031118 20645264 20543780 20469644 20097144 19701994 19666603 19725029 19419704 18993909
7159A8993909J1058K37300k78197p59831l54296L54568K52114m43729n72532K918
$$ 18993909 19004967 19242267 18964070 18204239 17849943 18204511 18456625 18012896 17440364 17443282
7149A7443282K56538j65165m10399l1236K46219p5247l43363k2254K27340k81298
$$ 17443282 17699820 17534655 17124256 17093020 17339239 17263992 16920629 16898375 17125715 16844417
7139A6844417r22074p30239l3393J28697k40576k31099K75875L83969k19122o66338
$$ 16844417 15922343 15192104 15158711 15287408 15046832 14815733 15091608 15475577 15256455 14590117
7129A4590117l11340K83627L08005j18787l36735j70821K4046R564j34304k58354
$$ 14590117 14278777 14562404 14870409 14751622 14414887 14244066 14268112 14277676 14143372 13885018
7119A3885018k57873r9157O1036j7263k91399m28796k79930o6137J3670L0867
$$ 13885018 13627145 13527988 13589024 13571761 13280362 12851566 12571636 12505499 12519169 12550036
7109A2550036N2896k5618k11383k99409j95441n4205J6951P2184P8439o5345k09047
$$ 12550036 12602932 12577314 12365931 12066522 11871081 11816876 11833827 11906011 11984450 11919105 11710058
7098A1710058j03073Q4560n0349l79285l21553J47661L38161j4179k78277m6315
$$ 11710058 11606985 11691545 11641196 11261911 10940358 11088019 11426180 11412001 11133724 11087409
7088A1087409J47321j39406l63591P131L80722j6153o88488n78901J72644M68036
$$ 11087409 11234730 11095324 10731733 10738864 11119586 11103433 10414945 9836044 10008688 10476724
7078A0476724O5907j76126Q8955J81960k23464m60345j13700J92658q5933m35662
$$ 10476724 10542631 10366505 10455460 10637420 10413956 9953611 9839911 10032569 9946636 9510974
7068I510974j92515L00296K79577j94989m06414j07410K39107K34804k948j56556
$$ 9510974 9318459 9618755 9898332 9703343 9296929 9189519 9428626 9663430 9660482 9503926
7058I503926j03182K1447j0248k25121l27556r8872J64819M4161k41813r6417
$$ 9503926 9400744 9422191 9411943 9186822 8859266 8760394 8925213 8969374 8727561 8631144
7048H631144L85928L98284k78970p82325m32950K51837M12034N8900k29641k63022
$$ 8631144 9017072 9415356 9136386 8354061 7921111 8172948 8584982 8643882 8414241 8151219
7038H151219j88528J4731K85631J98998l38427n98967n0141O23684M53623k75140
$$ 8151219 7962691 7977422 8263053 8462051 8123624 7524657 7474516 8098200 8551823 8276683
7028H276683m84534j5321K89610R5175n5075M4239j05083n69241o32443m1069
$$ 8276683 7792149 7776828 8066438 8161613 8106538 8150777 8045694 7476453 6844010 6802941
7018F802941M30781K27176j00244Q6545M17777K26084k88995m44918j86247o346
$$ 6802941 7233722 7460898 7360654 7447199 7864976 8091060 7802065 7357147 7170900 7164554
7008G164554m4275p380J56682J70731l2401k00468j75283k7021J55987K78758
$$ 7164554 7120279 7112899 7269581 7440312 7407911 7207443 7032160 7005139 7161126 7439884
6998G439884J68170j72189l83208j81722J71830K11414n0508j81347j7399J12187
$$ 7439884 7608054 7435865 7052657 6870935 7042765 7254179 7203671 7022324 7004925 7117112
6988G117112q3343m08477m13953L6115N27077M87470j10091n89941l97507O7420
$$ 7117112 7033769 6625292 6211339 6247454 6774531 7262001 7151910 6561969 6164462 6231882
6978F231882k1273n75331n66943L54339J084750O04133m23864n91837J46853N02774
$$ 6231882 6210609 5635278 5068335 5422674 6507424 7111557 6687693 6095856 6242709 6745483
6968F745483r9525p31062n26547O1976J98127j9629Q453K18108Q0333l10479k83143
$$ 6745483 6645958 5914896 5388349 5450325 5648452 5628823 5637276 5855384 5935717 5625238 5342095
6957E342095K50825N21392N7386n48204m82356J36077M99763K65932j20625k21506
$$ 5342095 5592920 6114312 6171698 5623494 5141138 5277215 5776978 6042910 5922285 5700779
6947E700779j48755j48337j27309P7201K96723K78954J11114K5015k3932j79083
$$ 5700779 5552024 5403687 5276378 5353579 5650302 5929256 6040370 6065385 6041453 5862370
6937E862370k68216n0242K52315K15279o0953r6261J12051Q1565k18734k25215
$$ 5862370 5594154 5543912 5796227 6011506 5950553 5854292 5966343 6047908 5829174 5603959
6927E603959J76949L14898j27066m62575j33306L00517J13485l27547k42733J66646
$$ 5603959 5780908 6095806 5968740 5506165 5372859 5673376 5786861 5459314 5216581 5383227
6917E383227J28596k51328j76082L43305M32040j09050m26918p2824K99132J39801
$$ 5383227 5511823 5260495 5084413 5427718 5859758 5750708 5323790 5250966 5550098 5689899
6907E689899j24773j4713J27722j22204m15512k53927J38597K86242K67744L40424
$$ 5689899 5565126 5550413 5678135 5555931 5140419 4886492 5025089 5311331 5579075 5919499
6897E919499K65448k09294o10696l31258L16202M80973O1174k25671l3361J71373
$$ 5919499 6184947 5975653 5364957 5033699 5349901 5830874 5892048 5666377 5633016 5804389
6887E804389P816k03738m6243L00171L61481P5510j58345m1034K54965L27991
$$ 5804389 5812205 5608467 5562224 5862395 6223876 6299386 6141041 6100007 6354972 6682963
6877F682963Q3308j08763Q3490M17934L67317q4063l84911k65211j08944k21146
$$ 6682963 6766271 6657508 6740998 7158932 7526249 7442186 7057275 6792064 6683120 6461974
6867F461974k90381j8436K39456N0051l05691k83642N577M6755j54840j65332
$$ 6461974 6171593 6153157 6392613 6442664 6136973 5853331 5858908 5905663 5750823 5585491
6857E585491P892n7616l33799l11239P4870K58323k4994l18799k20642N0470J51042
$$ 5585491 5593383 5535767 5201968 4890729 4965599 5223922 5198928 4880129 4659487 4709957 4860999
6846D860999J15875O0881r9789l23698l04646Q625K02028L0160j71274n8672J49352
$$ 4860999 4976874 5037755 4937966 4614268 4309622 4318247 4520275 4550435 4379161 4320489 4469841
6835D469841Q3306j44839j66294K9409J27470l125j77163j89495j1878K20079
$$ 4469841 4553147 4408308 4242014 4271423 4398893 4395768 4218605 4029110 4017232 4237311
6825D237311K82965P0742k01059k10626K97O3964j46801l45427l11223j44700
$$ 4237311 4520276 4591018 4389959 4179333 4179630 4243594 4096793 3751366 3440143 3295443
6815C295443N4227L03572M13980R6932l99951l84765K32027O29049K58730l07122
$$ 3295443 3349670 3653242 4067222 4164154 3764203 3379438 3611465 4240514 4499244 4192122
6805D192122l08639L5564N2078j92789j23452K15772K09349k26331m65386j78459
$$ 4192122 3883483 3919047 3971125 3778336 3654884 3870656 4080005 3853674 3388288 3209829
6795C209829K32888L46268K18560L1334j76211k65806l9100L11139K92380j62454
$$ 3209829 3442717 3788985 4007545 4038879 3862668 3596862 3557762 3868901 4161281 3998827
6785C998827n17265l64915O8218L17810K21964o5504k77600j80155J69361L29748
$$ 3998827 3481562 3116647 3184865 3502675 3724639 3659135 3381535 3201380 3370741 3700489
6775C700489J2367l88311k91431J52210K74025k3130j46391J29800L05880R2991
$$ 3700489 3712856 3324545 3033114 3185324 3459349 3436219 3289828 3419628 3725508 3818499
6765C818499j07772j8350J4882k13999k80957L2299J70154k38888n65392j57382
$$ 3818499 3710727 3692377 3707259 3493260 3212303 3244602 3414756 3175868 2610476 2453094
6755B453094M74770M25375j16145k18087K23701M00550K1681k80246j27747L8530
$$ 2453094 2927864 3353239 3237094 3019007 3242708 3643258 3664939 3384693 3256946 3295476
6745C295476j11720k09660L9923K57647P0666k08225j10727K31434L52336J36906
$$ 3295476 3183756 2974096 3014019 3271666 3342332 3134107 3023380 3254814 3607150 3744056
6735C744056j65723l30713k51842N0424K77272Q5516l04322k27491L92241P13886
$$ 3744056 3578333 3247620 2995778 3046202 3323474 3408990 3104668 2877177 3269418 3983304
6725C983304J66157o05023o40678n9110K55995M3926j48785m5661K0891q2498
$$ 3983304 4149461 3544438 2903760 2844650 3100645 3144571 2995786 2950125 2971016 2888518
6715B888518k5140K20462J65445k89947m90294l8633M88391M17956M877r8740
$$ 2888518 2863378 3083840 3249285 2959338 2469044 2430411 2918802 3336758 3341635 3242895
6705C242895O6612l190k61919j95719J76074K48323j22564l25587r737L29275
$$ 3242895 3309507 3306317 3044398 2848679 3024753 3273076 3150512 2824925 2815188 3144463
6695C144463J76082j91236k14914P0199K18491J07522m0148j37841k24891j57674
$$ 3144463 3320545 3129309 2914395 2984594 3203085 3310607 3270459 3132618 2907727 2750053
6685B750053J67777M17496J91568k74835l56857O877K11731m7510l20663j63690
$$ 2750053 2917830 3335326 3526894 3252059 2895202 2902079 3113810 3066300 2745637 2581947
6675B581947J96905L17293J89764L7108j43045l72564l81637k0954K94345J20675
$$ 2581947 2778852 3096145 3285909 3323017 3179972 2807408 2425771 2404817 2699162 2819837
6665B819837k46844j75465K65832L84797Q56k66829n7243J41851j14618m07671
$$ 2819837 2572993 2397528 2663360 3048157 3049013 2782184 2724941 2866792 2752174 2344503
6655B344503j45421L97494M63047k2019l99728l15150q0706L1388J52732L02838
$$ 2344503 2199082 2596576 3059623 3037604 2637876 2322726 2242020 2273408 2426140 2728978
6645B728978J94078j39077j58993K85890M92734o3848p40954n63811K77852O95599
$$ 2728978 2923056 2783979 2624986 2910876 3403610 3339762 2598808 2034997 2312849 3008448
6635C008448L44838j8527M7958q728n34391q03802j87526N94891M49832l35788
$$ 3008448 3353286 3334759 3382717 3373989 2839598 2035796 1848270 2443161 2892993 2557205
6625B557205m95922K22408O97484K38271m09870l54758J19398K25749n3969j82349
$$ 2557205 2061283 2283691 2981175 3219446 2809576 2454818 2574216 2799965 2745996 2563647
6615B563647o5527j8583k5325J77818M22520K52878k70495n63887l60431J9408
$$ 2563647 2498120 2479537 2454212 2632030 3054550 3307428 3036933 2473046 2112615 2132023
6605B132023K77530M36423M49749J29626l46963m36077j1871L53786K19855r4088
$$ 2132023 2409553 2845976 3295725 3425351 3078388 2642311 2630440 2984226 3204081 3109993
6595C109993j02776O4367k110k03675r7710K84930M04674N2735l07801k34922
$$ 3109993 3007217 3071584 3069474 2865799 2768089 3053019 3457693 3510428 3202627 2967705
6585B967705P1648J24214j56174m17376m08195k17536j0094J83267L26523K71487
$$ 2967705 3039353 3163567 3007393 2590017 2181822 1964286 1954192 2137459 2463982 2735469
6575B735469k0405k86986k29831P0004K35832J12316n6471m8607J9984j1809j7318
$$ 2735469 2715064 2428078 2198247 2268251 2504083 2616399 2559928 2511321 2531305 2519496 2502178
6564B502178J52393K81607P2117k91849l14968N7559L21093J69704p6116m4911
$$ 2502178 2654571 2936178 3008295 2716446 2401478 2459037 2780130 2949834 2873718 2828807
6554B828807Q5981n3235l42042l06853J35649M94680L47034j30464m10003k23461
$$ 2828807 2914788 2861553 2519511 2212658 2348307 2842987 3190021 3059557 2649554 2426093
6544B426093K10510M82064L93392Q1015j79538k40821j68834j15636j39593j36185
$$ 2426093 2636603 3118667 3512059 3593074 3413536 3172715 3003881 2888245 2748652 2612467
6534B612467M2780L45968M50454J16839l73098m27967N5931M46040K27639k25640
$$ 2612467 2655247 3001215 3451669 3568508 3195410 2767443 2823374 3269414 3497053 3271413
6524C271413k21986J58292K10569k09424m02845O4496O51298O33581J01143k87430
$$ 3271413 3049427 3207719 3418288 3208864 2806019 2870515 3521813 4155394 4256537 3969107
6514C969107j90729J85371M69467L89431q6763n76215n29885N8648N08372L09749
$$ 3969107 3778378 3963749 4433216 4822647 4735884 4159669 3629784 3688432 4196804 4506553
6504D506553k16067m33522k00492J77219M02866K52761l48631r22138o72305L44107
$$ 4506553 4290486 3856964 3656472 3833691 4236557 4489318 4140687 3218549 2546244 2890351
6494B890351R28539L27234n56020m75487K45793L51781k23556l51249K47364N16186
$$ 2890351 3818890 4146124 3590104 3114617 3360410 3712191 3488635 3137386 3384750 3900936
6484C900936o3427n84533k98531K04749J75278o8751Q216O7705l14284n84503
$$ 3900936 3837509 3252976 2954445 3159194 3334472 3265721 3273937 3341642 3027358 2442855
6474B442855p2635O87313O59003p1824n03708k94633k9359l5743j2985J25419
$$ 2442855 2370220 3057533 3716536 3644712 3141004 2846371 2817012 2781269 2768284 2893703
6464B893703M4422k13484j22092L84888O52213K90851k47200m02588k31146o9317
$$ 2893703 2938125 2724641 2602549 2987437 3639650 3930501 3683301 3280713 3049567 2980250
6454B980250N350M4075j3038j36544j22039N4382J39501M5564L286R6604Q9881
$$ 2980250 2985600 3029675 3016637 2880093 2758054 2812436 2951937 2997501 3000787 3097391 3187272
6443C187272n8188o527L14154L70025j62564o82200m12585L76630O41968N8318
$$ 3187272 3129084 3122557 3436711 3806736 3644172 2961972 2549387 2926017 3567985 3626303
6433C626303n08944k95158K58799K52123k56754l70127J72231N12945M2660n23165
$$ 3626303 3117359 2822201 3081000 3333123 3076369 2706242 2878473 3391418 3434078 2910913
6423B910913j95383O56593P63214p4929o40743k06171L69907J19415m71674l82457
$$ 2910913 2715530 3372123 4135337 4060408 3419665 3213494 3583401 3702816 3231142 2848685
6413B848685K09204L27800j01908k48775R3489K53287J4817m9305J91218R5088
$$ 2848685 3057889 3385689 3283781 3035006 3128495 3381782 3396599 3347294 3538512 3633600
6403C633600m40148n42987J42367O52332K00154n06969m15481K19766M11874N7637
$$ 3633600 3193452 2650465 2792832 3445164 3645318 3138349 2722868 2942634 3354508 3412145
6393C412145j70390j25940k09123l15732N8298O85891O97267l3402n77512l18012
$$ 3412145 3241755 3115815 2906692 2590960 2649258 3335149 4032416 3999014 3421502 3103490
6383C103490K28183L23077J6471j92157j32093L6394J85206K21366N4629j76212
$$ 3103490 3331673 3654750 3671221 3479064 3346971 3383365 3568571 3789937 3844566 3668354
6373C668354j71518L8905N5980k29375l68932m9198L48457K73720j90120m65200
$$ 3668354 3496836 3535741 3591721 3362346 2993414 2944216 3292673 3566393 3376273 2911073
6363B911073k66069J23308L05159K06084L6235q180N9521Q3457J0814j6104R3003
$$ 2911073 2645004 2768312 3073471 3279555 3315790 3307610 3367131 3450588 3461402 3445298 3538301
6352C538301J70880M0971j52460j48224O17M5974N343Q1666J83677L8210k09916
$$ 3538301 3709181 3750152 3597692 3449468 3450085 3496059 3501402 3583068 3766745 3804955 3595039
6341C595039j01874L15001M10439l3298l89510j44766K99862L01418m5682k00523
$$ 3595039 3493165 3808166 4218605 4185307 3795797 3651031 3950893 4252311 4206629 4006106
6331D006106o4411N2827P8584J59386J91622k0180k73552k11352O7418J91965
$$ 4006106 3941695 3994522 4073106 4232492 4424114 4403934 4130382 3919030 3986448 4178413
6321D178413J57780J85177J31584k33087n14411j30718N54218N26821k67686o68787
$$ 4178413 4336193 4521370 4652954 4419867 3905456 3774738 4328956 4855777 4588091 3919304
6311C919304p4694N87473L69744j91607q3459M27291K97248m44299p06532j61602
$$ 3919304 3844610 4432083 4801827 4610220 4526761 4954052 5251300 4807001 4100469 3938867
6301C938867K57040l0488l30875N2402O16003N15570p2166l21016n9935J56324
$$ 3938867 4195907 4165419 3834544 3886946 4502949 5018519 4946353 4625337 4565402 4721726
6291D721726O9280n77J25799J82227l791k03646j81118m706J51349K04632J08661
$$ 4721726 4791006 4790429 4916228 5098455 5094664 4891018 4709900 4705194 4856543 5061175 5169836
6280E169836j02051k03770k9014K14427K12258N0985L0874P2396j25194l72650
$$ 5169836 5067785 4864015 4835001 5049428 5261686 5312671 5343545 5415941 5290747 4918097
6270D918097j48251M23218N46807J8605l15006J13051N94066K57487m66383m99079
$$ 4918097 4769846 5193064 5739871 5758476 5443470 5556521 6150587 6408074 5941691 5442612
6260E442612J62655M87631P7038l11209q4416L25351L17243M1957l8377P5931
$$ 5442612 5605267 6092898 6169936 5858727 5774311 6099662 6416905 6458862 6420485 6496416
6250F496416J03887K9283J3697O0566J08538J89817K48948J19926j11229j09146
$$ 6496416 6600303 6629586 6643283 6703849 6812387 7002204 7251152 7371078 7259849 7150703
6240G150703J33825J90465o1318j30613K61160O00239L67701q3856r9130K26394
$$ 7150703 7284528 7474993 7413675 7283062 7544222 8144461 8512162 8428306 8329176 8555570
6230H555570L01205O6440k4933R9132P9878o5351P7811M43231M23000p7614l27929
$$ 8555570 8856775 8923215 8898282 8997414 9077292 9011941 9089752 9532983 9955983 9878369 9550440
6219I550440Q9593N53346L59853j88243l15758K6374K32845R4543L0042K65922
$$ 9550440 9640033 10193379 10553232 10364989 10049231 10075605 10308450 10402993 10433035 10698957
6209A0698957M49842K61078r5964k52179j58049L3881K56738M28853L38101l5797
$$ 10698957 11148799 11409877 11313913 11061734 10903685 10937566 11194304 11623157 11961258 11925461
6199A1925461k77607r962M84604N50867Q4925k99785j80801Q6962K0645j98570
$$ 11925461 11647854 11637892 12122496 12673363 12758288 12458503 12277702 12364664 12385309 12186739
6189A2186739j00582K16564K54828O954l0916K32408K98559l698j49464J75887
$$ 12186739 12086157 12302721 12557549 12564503 12533587 12765995 13064554 13060856 12911392 13087279
6179A3087279M81841K82883r3714j04686J25469J86444J82791L92145N21837J75969
$$ 13087279 13569120 13852003 13758289 13653603 13779072 13965516 14148307 14540452 15062289 15238258
6169A5238258k30194J2421O41181P18227J80528k0478M75932Q24122M05089j59603
$$ 15238258 15008064 15020485 15661666 16379893 16560421 16539943 17015875 17839997 18245086 18085483
6159A8085483p8088L87668N33862L66926L22288L56476J67810m5144J20734M56959
$$ 18085483 18007395 18395063 18928925 19295851 19618139 19974615 20142425 20097281 20218015 20674974
6149B0674974M18961Q1154N0838M56097P38064N39227J74445N4940J60319K85284
$$ 20674974 21093935 21175089 21225927 21682024 22420088 22959315 23133760 23188700 23349019 23634303
6139B3634303L94580N02295M97313L15791J18775J32957L80802O34068O24145
$$ 23634303 24028883 24531178 25028491 25344282 25463057 25596014 25976816 26610884 27235029
6130B7235029L41255J16342K56301N98706O88971M44048K80874M58094P15957
$$ 27235029 27576284 27692626 27948927 28547633 29236604 29680652 29961526 30419620 31135577
6121C1135577P96322Q54549J016475J003272O64689M54788Q04355J360665J472586
$$ 31135577 31931899 32786448 33802923 34806195 35470884 35925672 36730027 38090692 39563278
6112C9563278J171938J030106J231185J447064J524739J657583J900076K068282
$$ 39563278 40735216 41765322 42996507 44443571 45968310 47625893 49525969 51594251
6104E1594251K110823K126533K112262K117820K434498L135614L697367L630403
$$ 51594251 53705074 55831607 57943869 60061689 62496187 65631801 69329168 72959571
6096G2959571L185039K854461K610468K334624K453319L202706L832961L719188
$$ 72959571 76144610 78999071 81609539 83944163 86397482 89600188 93433149 97152337
6088I7152337L701091M864156O502590P106734P030116P982268R933256J1118847
$$ 97152337 100853428 105717584 112220174 119326908 126357024 134339292 144272548 155391395
6080A55391395J1494241J3169743J6406423J8676035J9864358K4642611L5317521
$$ 155391395 166885636 180055379 196461802 215137837 235002195 259644806 294962327
6073B94962327M4465693M0232452J9711533o828738k6137603l3263315l1926527
$$ 294962327 339428020 379660472 399372005 392543267 366405664 333142349 301215822
6066C01215822k7778283k4193087k2235651k1168040j9194928j5651952j2172507
$$ 301215822 273437539 249244452 227008801 205840761 186645833 170993881 158821374
6059A58821374j0483347r949625q816770p002666n847102n644503n326125m439945
$$ 158821374 148338027 138388402 129571632 122568966 116721864 111077361 105751236 101311291
6051A01311291l683923l364937k917366k231083k030981k531400k966941k908753
$$ 101311291 97627368 94262431 91345065 89113982 87083001 84551601 81584660 78675907
6043G8675907k891122l236924l377743k951801k546572k630764k676897k164160
$$ 78675907 75784785 72547861 69170118 66218317 63671745 61040981 58364084 56199924
6035E6199924j623792j742234k109021j915535j395069j405871j854261j766722
$$ 56199924 54576132 52833898 50724877 48809342 47414273 46008402 44154141 42387419
6027D2387419r66584m80555r20467j499891j279584n92511m25679q83061j151933
$$ 42387419 41420835 40940280 40019813 38519922 37240338 36647827 36222148 35339087 34187154
6018C4187154q25067m05091l77602n07935m05644k50713m51102q77698j006316
$$ 34187154 33362087 32956996 32579394 32071459 31665815 31415102 30964000 30086302 29079986
6009B9079986p46669n75738p30831p93301m04032J8251j99320r20045j254130
$$ 29079986 28333317 27757579 27026748 26233447 25829415 25847666 25648346 24728301 23474171
6000B3474171p53529j6309J52811k50922o39839p17028o57398n69349l30069q291
$$ 23474171 22720642 22704333 22857144 22606222 21966383 21249355 20591957 20022608 19692539 19684248
5990A9684248M1380k90443o10460n52468k86613k15207l72559m50979l03734r7455
$$ 19684248 19725628 19435185 18824725 18272257 17985644 17770437 17397878 16946899 16643165 16545710
5980A6545710K094Q457l5796j39927k52648k74500k26113k23611k60796k10860
$$ 16545710 16547804 16556261 16520465 16380538 16127890 15853390 15627277 15403666 15142870 14932010
5970A4932010q0072m8961j91794l52196l85082l42800l27021l17976k43492q5866
$$ 14932010 14851938 14802977 14611183 14258987 13873905 13531105 13204084 12886108 12642616 12556750
5960A2556750J21660K60349J26052k82231n24475j77602M28176M56828k49631
$$ 12556750 12678410 12938759 13064811 12782580 12258105 12080503 12508679 12965507 12715876
5951A2715876q16431n55321L8613J10044k37175k62470Q4996J36042k50272m09675
$$ 12715876 11899445 11344124 11382737 11492781 11255606 10993136 11078132 11214174 10963902 10554227
5941A0554227n2166K13624o0249m01187k65851M9394P252k25808j68853O4228
$$ 10554227 10502061 10715685 10655436 10254249 9988398 10037792 10045044 9819236 9650383 9714611
5931I714611K2509k04463j59155J03149R8205j84126k48411m634P5644j38315
$$ 9714611 9737120 9532657 9373502 9476651 9574856 9390730 9142319 9137685 9213329 9075014
5921I075014j67286J55506K58122k06749o37267l48714L24028N00476L4012m04734
$$ 9075014 8907728 9063234 9321356 9114607 8477340 8128626 8452654 8953130 8987142 8582408
5911H582408l90784j85828r6620m7917M5350L7150q7768q3331P6289M3919k62286
$$ 8582408 8191624 8005796 7909176 7861259 7906609 7943759 7855991 7772660 7848949 7892868 7630582
5900G630582l42810J07203N31120K50236m08786m97474R9446M33663o3534p05590
$$ 7630582 7287772 7394975 7926095 8176331 7767545 7270071 7369517 7803180 7739646 7034056
5890G034056o04607L3249L33410O0378k43604k31206j26762j39742j52253r3721
$$ 7034056 6429449 6462698 6796108 6856486 6612882 6381676 6254914 6115172 5962919 5869198
5880E869198q8050j11987J2670J96502J40571j05150j74017n7464j28516l52058
$$ 5869198 5781148 5669161 5681831 5878333 6018904 5913754 5739737 5682273 5553757 5201699
5870E201699k06090L19501M49568j45141o21652j99820N36915M96708k31060n83976
$$ 5201699 4995609 5315110 5764678 5619537 4997885 4798065 5334980 5831688 5600628 5016652
5860E016652k01599J78324K7852k60714k08823K9647J19457P4850K0547o6290
$$ 5016652 4815053 4993377 5021229 4760515 4551692 4581339 4700796 4775646 4796193 4729903
5850D729903j34810m9701M8751j13789l45857j55766L44587M35898m7294l45488
$$ 4729903 4595093 4545392 4594143 4480354 4134497 3978731 4323318 4759216 4711922 4366434
5840D366434Q455L96355J57390l00309k37810J36183P7465l57408m09298N7364
$$ 4366434 4374889 4771244 4928634 4628325 4390515 4526698 4604163 4246755 3837457 3894821
5830C894821L29177O3279j88423J0575K43957P740l97199l52500P2830K53511
$$ 3894821 4223998 4287277 4098854 4109429 4353386 4361126 3963927 3611427 3684257 3937768
5820C937768j118k02677K054K94041K09284j59825l46500j97233J8282J18037
$$ 3937768 3936650 3733973 3736027 4030068 4239352 4079527 3733027 3535794 3554076 3672113
5810C672113J92952K16958m8248n15562o08032o4082M83164L20280k38782k97518
$$ 3672113 3865065 4082023 4033775 3518213 2910181 2846099 3329263 3649543 3410761 3113243
5800C113243K04477L93817j02421n33869k35231L30837L40478j54771m27806j60313
$$ 3113243 3317720 3711537 3609116 3075247 2840016 3170853 3511331 3356560 2928754 2768441
5790B768441K80051M43943K18635j87825l73159j05215K43378O9582m48769m07170
$$ 2768441 3048492 3492435 3711070 3523245 3150086 3044871 3288249 3357831 2909062 2501892
5780B501892L68447P76583O7821q27059o34103K83011N60225L594l24566l2850
$$ 2501892 2870339 3646922 3714743 2887684 2253581 2536592 3096817 3100411 2775845 2742995
5770B742995J08420k29623l16185J95748N32200J58794k67131p2773K90374J34085
$$ 2742995 2851415 2621792 2305607 2501355 3033555 3192349 2925218 2852445 3142819 3276904
5760C276904k72023k93255l9532J4344n0233O3622J13500j93726m10125l370N62030
$$ 3276904 3004881 2711626 2672094 2686438 2636205 2699827 2813327 2619601 2209476 2206106 2768136
5749B768136M32302j88476l03983K17475M00848k07770p49344l88438M05203N90687
$$ 2768136 3200438 3011962 2707979 2925454 3326302 3118532 2369188 1980750 2385953 2976640
5739B976640L4932m52621l23117J03735K42226l652k55199k09858K2476J28338
$$ 2976640 3011572 2558951 2235834 2339569 2581795 2578143 2322944 2113086 2135562 2263900
5729B263900J3175j07774l6716J38107J81417M708k63223m00529k45271J28616
$$ 2263900 2277075 2169301 2132585 2270692 2452109 2456817 2193594 1793065 1547794 1676410
5719A676410L66265J87091j76954k09013J33950K86996q2962n20153m20233J15116
$$ 1676410 2042675 2229766 2052812 1843799 1977749 2264745 2181783 1661630 1241397 1356513
5709A356513M92542M42343J79779n3334j69951j07974O8140O8554k31138m60888
$$ 1356513 1849055 2291398 2471177 2417843 2247892 2139918 2208058 2276612 2045474 1584586
5699A584586k31753K32591M06488K48932J49324J85856L2015l60273n45908k22837
$$ 1584586 1352833 1585424 1991912 2240844 2390168 2576024 2608039 2247766 1701858 1479021
5689A479021L25610N87590L48457j89157n60278l71205K26098N27344J21980m40617
$$ 1479021 1804631 2392221 2740678 2551521 1991243 1620038 1846136 2373480 2495460 2054843
5679B054843l52280K47156M55304n985l75709o7739M25772L17061l01902o38755
$$ 2054843 1702563 1949719 2405023 2399038 2023329 1955590 2381362 2698423 2396521 1757766
5669A757766l18437J92084K73031p5100k94833k0839M10017L88744q4612l53579
$$ 1757766 1439329 1631413 1904444 1829344 1534511 1513672 1923689 2312433 2227821 1874242
5659A874242q6644K13865O8593j69369L517K61120K6061l56872j06396N30053
$$ 1874242 1787598 2001463 2070056 1900687 1904204 2165324 2191385 1834513 1728117 2258170
5649B258170N25595j69837m36290J44329N50105N1941n54713l21930K88379K74522
$$ 2258170 2783765 2613928 2177638 2321967 2872072 2924013 2369300 2047370 2335749 2610271
5639B610271k44339l62600J10473N35593N30156K67973p2340l74978l42160J03523
$$ 2610271 2365932 2003332 2113805 2649398 3179554 3447527 3375187 3000209 2658049 2761572
5629B761572M38204K29669j25084n5821J91438L8693l34927l27270m2246o7441
$$ 2761572 3199776 3429445 3304361 3248540 3439978 3478671 3143744 2816474 2774228 2706787
5619B706787l07021j19269M09112M28220k68721q15996n61655P6482L94252L03820
$$ 2706787 2399766 2280497 2689609 3117829 2849108 2033112 1471457 1547939 1942191 2246011
5609B246011Q9776j05672j98603q1206R5583J6271k42683k41295R5508L10249
$$ 2246011 2335787 2230115 2031512 1950306 2045889 2062160 1819477 1578182 1673690 1983939
5599A983939J37232j30965j73856m5763R7193J98670J40317j37692l34355j43628
$$ 1983939 2121171 1990206 1816350 1770587 1867780 2066450 2206767 2069075 1734720 1591092
5589A591092J39169K0247k70592r6139L72505K77753m23235o96229p0297N57034
$$ 1591092 1730261 1750508 1479916 1383777 1756282 2034035 1610800 914571 844274 1401308
5579A401308L64676j54890j81507R8841O1284j73589j08648J06087j550k57676
$$ 1401308 1765984 1611094 1429587 1528428 1589712 1416123 1307475 1413562 1412012 1154336
5569A154336j40541K21491K49838n3855j25236J80045L83205J80770j81064l65417
$$ 1154336 1013795 1235286 1485124 1431269 1306033 1486078 1869283 2050053 1868989 1503572
5559A503572k90933m6772J43751R943l46313l72872J64777O68923M90171j09929
$$ 1503572 1212639 1165867 1309618 1319561 973248 600376 765153 1434076 1924247 1814318
5549A814318l86072j96526R387M0388Q2892J40339M8760p1279j5729K0052j96634
$$ 1814318 1428246 1231720 1241107 1281495 1364387 1504726 1553486 1482207 1466478 1486530 1289896
5538A289896l31364J7890M63715L34370j56368k17187J41716J20055m14562o15543
$$ 1289896 958532 976422 1440137 1774507 1618139 1400952 1542668 1662723 1248161 632618
5528F32618r0179M30933L14091m5963p5820M1481p2093k07819m8934J37738j2533
$$ 632618 542439 973372 1287463 1241500 1165680 1207161 1135068 927249 878315 1016053 1003520
5517A003520k33883o7693L14301L78382Q3223j35239q6021O623j0003j9839M7745
$$ 1003520 769637 701944 1016245 1394627 1477850 1342611 1256590 1263213 1253210 1233371 1281116
5506A281116M4511j58735m14988l83400O6078N31922M24450j80599m26311J37029
$$ 1281116 1325627 1166892 751904 368504 434582 966504 1390954 1210355 784044 921073
5496I21073O96880K91033n88167o13102K67908O83084M6373n19813j10520M84467
$$ 921073 1617953 1908986 1320819 707717 975625 1658709 1705082 1185269 1074749 1559216
5486A559216K34283l73709l02906J99283J63743l15025l43774O8120O7670l87900
$$ 1559216 1793499 1419790 1116884 1316167 1479910 1164885 821111 889231 956901 569001
5476E69001m00335K19037N48819J45628k19574P1795M67194K48587l02187m58626
$$ 569001 168666 387703 936522 1082150 862576 934371 1401565 1650152 1347965 889339
5466H89339j54729J26325J37927j656j45361j73154J521K08265J38495j20975
$$ 889339 734610 860935 998862 997206 851845 678691 680212 888477 1026972 905997
5456I05997j11269K37323L89375M1875l51635k79258P8717K31442J12125j6817
$$ 905997 794728 1032051 1421426 1463301 1111666 832408 911125 1142567 1254692 1237875
5446A237875p1561j29034j48592p5337k771L7888J73349L40486K16089k19166
$$ 1237875 1166314 1037280 888688 813351 810580 848468 1021817 1362303 1578392 1359226
5436A359226m61761j93205J95797J97376q3705k30522j63939k7410J84593L78400
$$ 1359226 897465 704260 900057 1097433 1013728 783206 619267 591857 776450 1154850
5426A154850J75543m22609o43354J8646P81369N45085l89602o87244j2919N15469
$$ 1154850 1330393 907784 264430 283076 1064445 1609530 1219928 532684 519765 1035234
5416A035234J59223l68511k31556J97337J60505j66309j58468M9524j01668m17377
$$ 1035234 1194457 825946 594390 791727 952232 785923 627455 676979 575311 157934
5406A57934k01073M40444O23280J14067k82349m6344K80211J09232k20268j28133
$$ 157934 -43139 397305 1020585 1134652 852303 805959 1086170 1195402 975134 847001
5396H47001J83477J46517j64003k26486k6912k7620k70156k69541J27923M59998
$$ 847001 1030478 1176995 1012992 786506 759594 731974 461818 192277 320200 780198
5386G80198L87768J34191j6935j20038k27755j66242N9317J09555j16004k11081
$$ 780198 1167966 1302157 1285222 1165184 937429 771187 830504 940059 824055 612974
5376F12974O2932K94305P2913k92863k67483L3349Q2043j54837k07740O9315K83854
$$ 612974 675906 970211 1043124 750261 482778 516127 598170 443333 235593 304908 588762
5365E88762J62830r4706k07581j33564N6302K57246K78902O2375j13192j4446
$$ 588762 751592 656886 449305 315741 372043 629289 908191 970566 857374 842928
5355H42928R7234j23784m12255k25697L18360N49592K95955O1860N9991r4429
$$ 842928 940162 816378 404123 178426 496786 1046378 1342333 1404193 1464184 1369755
5345A369755m72771m83984J09997O01028L47356k45523l93282p4756J50880P5632
$$ 1369755 896984 413000 522997 1124025 1471381 1225858 832576 757820 908700 984332
5335I84332n3925r0027p6024K080J10964N9068j54024k12392l0403L6852j16392
$$ 984332 930407 840380 764356 766436 877400 936468 782444 570052 539649 576501 460109
5324D60109m9830L56767M53017j00882n46335j97218L18791R5526m06259j15551
$$ 460109 410279 767046 1220063 1119181 572846 375628 694419 789945 383686 268135
5314B68135O66056O18575l43462q23438k15089L79218R1677l22528N9407O99516
$$ 268135 934191 1552766 1209304 385866 170777 549995 641672 319144 378551 1078067
5304A078067N49262k19360n88543k88279L4720l1030k24911k18054M563K89624
$$ 1078067 1627329 1407969 819426 531147 565867 534837 309926 91872 96435 386059
5294C86059M01757J39411l01809l86950J3873L44986J86435j29092j51270l4940
$$ 386059 787816 927227 625418 238468 252341 597327 783762 654670 503400 468460
5284D68460r5634j61166R350J30335j00950l17676m0976M27294M35235K7062k07681
$$ 468460 372826 211660 221010 351345 250395 -67281 -108257 319037 754272 781334 573653
5273E73653j10257j9795l9682J9887J02632J2198q7934M5510J65582l8661k21261
$$ 573653 463396 443601 403919 423806 526438 538636 450702 496212 661794 623133 401872
5262D01872P9228M62113K22058l38101l03876K38509K82924l07710m97629P9807
$$ 401872 481100 943213 1165271 827170 523294 761803 1044727 737017 239388 319195
5252C19195M11736j05540n35308k0115O55462L46455n05793n85989J89202O68733
$$ 319195 730931 625391 90083 69968 725430 1071885 566092 -19897 169305 838038
5242H38038L36532j15891j10796N8589L966j38764j49146q9047o580J51974K09295
$$ 838038 1174570 1058679 947883 1006472 1010438 871674 722528 633481 626901 778875 988170
5231I88170q4025m65724l64224J78824M40450R3301k92168j57344K13646K25902
$$ 988170 904145 438421 74197 253021 693471 786772 494604 337260 550906 776808
5221G76808j05476k81665j09827J12180J02745p5464j81113o9149J81409L11877
$$ 776808 671332 389667 279840 392020 494765 419301 238188 169039 350448 662325
5211F62325J43521j55384k31439l0610J20487K0227j13649m8530N7392m3979k11324
$$ 662325 805846 650462 419023 388413 508900 529127 415478 366948 424340 380361 169037
5200A69037j22701J48242J92054p0747k01165R1880M36625K90488k31746m49697
$$ 169037 46336 194578 386632 315885 114720 206600 643225 933713 701967 252270
5190B52270p0302L71657K65149k14836m00107j00920K21300K34158J27472P6092
$$ 252270 181968 553625 818774 603938 203831 102911 324211 558369 685841 761933
5180G61933j07860m44828m57644R4556N90326L31273l41877m89200K4887M12647
$$ 761933 654073 209245 -248399 -153843 436483 767756 425879 -63321 -38434 374213
5170C74213K55921K1306P8696R4491j86591l55781r1106J89872N5999j67038m4311
$$ 374213 630134 651440 730136 824627 638036 282255 191149 381021 437020 269982 225671
5159B25671J26201p1908k41530J69726O78651L76067m61336o20643J15511N76491
$$ 225671 351872 279964 38434 208160 886811 1262878 801542 180899 296410 872901
5149H72901Q9834n03985l57610K6346j31774m25414m1789O62924O69833L1960
$$ 872901 962735 458750 101140 127486 -4288 -429702 -471491 191433 861266 893226
5139H93226k20575J60018K91701k08023n05862m891N61100K85467m44275n74390
$$ 893226 672651 832669 1124370 916347 410485 405594 966694 1252161 807886 233496
5129B33496o071L77432J29063k23267j54153R6088M8991k31337k97357k0331K44308
$$ 233496 227425 604857 733920 510653 356500 452588 501579 270242 -27115 -47446 196862
5118A96862J80387n8041q2131J53093K40708p2732l97784j87556L67742M66765
$$ 196862 377249 319208 237077 390170 630878 558146 160362 -27194 340548 807313
5108H07313j23514n88438j87646O17826P83497J42116m72444m78615j80946l3182
$$ 807313 683799 95361 -92285 525541 1309038 1451154 978710 500095 319149 285967
5098B85967K7270J87612K65023M5428k51646k83277j19668p4487j63900j14935
$$ 285967 313237 500849 765872 811300 559654 276377 156709 82222 -81678 -196613
5088a96613J57551M07493L97889J64102p7562j50791o2251P940p8826j99954j22580
$$ -196613 -39062 368431 766320 930422 852860 702069 639818 647758 568932 368978 246398
5077B46398J08204J84349K1050q0363O8121J95570J053l38020m16003j59409J83660
$$ 246398 354602 538951 560001 479638 547759 743329 744382 406362 -9641 -169050 14610
5066A4610M24282M68789J86733l40559o11882k39980L90485N20526O4493k91225
$$ 14610 438892 907681 1094414 753855 141973 -98007 292478 813004 877497 586272
5056E86272j23220J74540J08802j68826k19744l1751P3572J6628J3077J54631
$$ 586272 463052 637592 746394 577568 357824 326073 399645 416273 429350 583981
5046E83981K89961K82003J19089j70112m70948n32593k31000J68664K80420R7186
$$ 583981 873942 1155945 1275034 1104922 633974 101381 -129619 39045 319465 416651
5036D16651n1976k1597M74q9962j08710L9194J11686o2744k01721K0999L52538
$$ 416651 364675 343078 343552 253590 144880 184074 295760 233016 31295 52294 404832
5025D04832K35621k97125n37179j12140M09607L27760j54542k70738J24030L69281
$$ 404832 640453 343328 -193851 -305991 103616 431376 276834 6096 130126 499407
5015D99407N2635l84292l55006N3111L30053K61244K6105j65629j98734k2843
$$ 499407 552042 167750 -187256 -134145 195908 457152 483257 317628 118894 96051
5005I6051K08876J86902j05168k58338m0458K05289J28187m0624M9691J86815
$$ 96051 304927 491829 386661 128323 87865 293154 421341 380717 430408 617223
4995F17223q940l07522k07184J55319K11283m6394j06247P9101N2859j72115q1195
$$ 617223 608283 300761 93577 248896 460179 413785 307538 386639 439498 267383 186188
4984A86188K54648J30996m39025m73157L31934Q50877K47343o11229n22005J53891
$$ 186188 440836 571832 132807 -340350 -8416 842461 1089804 478575 -43430 110461
4974A10461K35551k78325l76602J35090M16846J55298k4069J41362J10585k83815
$$ 110461 346012 67687 -308915 -173825 243021 398319 374250 515612 626197 342382
4964C42382l92127N9471L83648R5996k73550j59520J00585J7256j20102J26046
$$ 342382 -49745 9726 393374 489370 215820 56300 156885 174141 54039 180085
4954A80085M05246J64247k93384k60546J58794K31475j37942k70161P9499K72458
$$ 180085 585331 749578 456194 195648 354442 585917 447975 177814 257313 529771
4944E29771j31809n80462l31959M09580P55213L47971k23290k91200L0974J26251
$$ 529771 397962 -182500 -514459 -104879 650334 998305 775015 483815 514789 641040
4934F41040k06343m93813k98383J63584L58742J65400p0824q6560O3484K59922
$$ 641040 434697 -59116 -357499 -193915 164827 330227 259403 172843 236327 496249
4924D96249M09058K99857j76798o26465m79495J47897M64806J08522l30844k44780
$$ 496249 905307 1205164 1028366 401901 -77594 70303 535109 643631 312787 68007
4914F8007J00539J28464p4605k7364K15899J55109k33372l84328m3024L25553
$$ 68007 168546 297010 222405 195041 410940 566049 332677 -51651 -94675 230878
4904B30878K33842j65891l59348j25584K87139M74241K48050j98054m71760l90518
$$ 230878 464720 298829 -60519 -186103 101036 575277 823327 625273 153513 -237005
4894b37005j26324J09238K94409L80881J92278j82223k69061R6876L38921l3024
$$ -237005 -363329 -254091 40318 421199 613477 431254 162193 259069 597990 564966
4884E64966n13882k87771M06834N35360j07572n46139j66586L71261K88954j07982
$$ 564966 51084 -236687 170147 705507 597935 51796 -114790 256471 545425 437443
4874D37443j15924J50249R9807k09636k08662J28321K42557k4928k16462j12349
$$ 437443 321519 471768 571575 361939 153277 281598 524155 499227 282765 170416
4864A70416m8604j83172j53404K03135M13355J11992k82340j84246K25378K94444
$$ 170416 121812 -61360 -214764 -11629 401726 513718 231378 47132 272510 566954
4854E66954p2872l17203j21367J90215K56304J55440P8818j1171j29473q3439
$$ 566954 494082 176879 55512 245727 502031 657471 736289 725118 595645 512206
4844E12206J41911J84291j37114m14614k53552N3879K0169j66250J8299L99090
$$ 512206 654117 838408 701294 286680 33128 87007 107176 -59074 -40775 358315
4834C58315K81613l07996n02738K5734M95766K83408j21973p4449J34479k5305
$$ 358315 639928 331932 -170806 -145072 350694 634102 512129 437680 572159 546854
4824E46854k36580L8650L93058R0418n05444l81271L72918N82935j07384o55001
$$ 546854 310274 348924 741982 832400 326956 -54315 318603 901538 794154 139153
4814A39153l20592K53972K65113j4591K0300J89402J3942l05528k54179P8380
$$ 139153 -181439 72533 337646 323055 343355 532757 546699 241171 -13008 65372
4804F5372J97669J1788j83426k35890j38572J60273M85735L98104j05471l62687
$$ 65372 263041 274829 91403 -144487 -283059 -122786 362949 761053 655582 292895
4794B92895m3623K29148q4491m46499j46552L96315L03408k35375k97253J58832
$$ 292895 249272 478420 393929 -52570 -199122 197193 500601 265226 -32027 126805
4784A26805K74577j48953l40006K3630K83340L5853j91578K1227K38594K4379
$$ 126805 401382 252429 -87577 -63947 219393 255246 63668 84895 323489 347868
4774C47868k68594j64069J48490K51325J58648N7703o8860j53284M0550L36629
$$ 347868 79274 -84795 63695 315020 473668 531371 462511 309227 349777 686406
4764F86406J63050m35537n91156L1085N26704J62012l55663m2713O30322M53250
$$ 686406 849456 413919 -177237 -146152 380552 542564 186901 144188 774510 1227760
4754A227760m79194q36813j43073N42961L33224k59485l37018M3319K21476K7759
$$ 1227760 748566 -88247 -231320 311641 644865 385380 48362 91681 313157 340916
4744C40916j52185q2539R2516J68062P9350r5307j47079O3296L18311K47389q0410
$$ 340916 188731 106192 198708 366770 446120 350813 203734 267030 585341 832730 752320
4733G52320j60619J61321L53682j8432n70210o20030j61673K11377K08500J02667
$$ 752320 591701 753022 1106704 1088272 518062 -101968 -263641 -52264 156236 258903
4723B58903Q2324o5976l98085m46874J24879P97971P05602j45874p42630l85602
$$ 258903 341227 275251 -122834 -569708 -444829 353142 1058744 912870 170240 -215362
4713b15362L52351M54524j08758m46516j36532K35068J25470j31698l1949J83043
$$ -215362 136989 591513 482755 36239 -100293 134775 260245 128547 96598 279641
4703B79641J4103l14885j98119K38034K62103k06199l80311J05915N53727L03978
$$ 279641 293744 -21141 -219260 18774 280877 74678 -305633 -199718 354009 657987
4693F57987k48773l70941j33495q6985k00855J3536M86929N66905Q1076l46064
$$ 657987 409214 38273 -95222 -182207 -383062 -369526 117403 684308 765384 419320
4683D19320k63662q153j1393r1353R3747L42896K36737j12834k22214j6716J06333
$$ 419320 155658 147505 136112 44759 138506 481402 718139 605305 383091 366375 472708
4672D72708k7197j42528n6611N4068O8706J30243K33351Q3742l24802m59402j4378
$$ 472708 445511 302983 246372 300440 369146 499389 732740 816482 491680 32278 17900
4661A7900M69903L16009k55590m57988j35456J15208J6739J32L00849M37755M2270
$$ 17900 487803 803812 548222 90234 -45222 69986 86725 86857 387706 825461 867731
4650H67731m20633l48203M3120J16389j31087j26627K63646M76069J25013m14301
$$ 867731 447098 98895 142015 258404 127317 690 264336 740405 865418 451117
4640D51117n44914k10651J44915J86450K1417l2895J18752K36314J03083j17408
$$ 451117 -93797 -304448 -159533 26917 48334 15439 134191 370505 473588 356180
4630C56180j08795O8070M3270k09044k60206L5019K23600K7483j23923J46916
$$ 356180 247385 315455 358725 149681 -110525 -75506 148094 175577 51654 198570
4620A98570M09408J26407l40723k80020J47011J94590j46882j83042J63061K01270
$$ 198570 607978 734385 393662 113642 260653 455243 308361 125319 288380 489650
4610D89650j89644k49056K59069M76332j01589o57449l43209L50396M53055K8032
$$ 489650 300006 50950 310019 786351 684762 27313 -315896 34500 487555 515587
4600E15587j87505r9761j44967k43978L1166M47177L36881k07688l79238L5025
$$ 515587 328082 228321 83354 -160624 -129458 317719 654600 446912 67674 102699
4590A02699L41359J20314j72240q4889J40384J46889O1328Q3103L5352k21026
$$ 102699 444058 564372 392132 307243 447627 594516 655844 738947 774299 553273
4580E53273l81870j67861J58709J87350j0241p0295N2412Q9198l6879j02125J8452
$$ 553273 171403 3542 162251 349601 339360 269065 321477 410675 373796 271671 290123
4569B90123J47027Q1597j03148j49904L4513K24562J46193j26672k21300K554
$$ 290123 437150 518747 415599 265695 300208 524770 670963 544291 322991 325545
4559C25545J91174o339l64404l49367J09730M94830L89219l2775l17116k72539
$$ 325545 516719 510380 145976 -203391 -93661 401169 790388 757613 440497 167958
4549A67958n8865R1871R5873K1808m5716j13744j91555j49909J08197L37431J71527
$$ 167958 109093 200964 296837 318645 272929 159185 -32370 -182279 -74082 263349 434876
4538D34876k42180k98265J34915L89533K8822l79554j61555L29035L22385m7459
$$ 434876 192696 -105569 29346 418879 447701 68147 -93408 235627 558012 510553
4528E10553n9719K23797P8992m44571m66357J53403M45953l7643m41164q3012
$$ 510553 450834 674631 753623 309052 -157305 -3902 442051 404408 -36756 -119768
4518a19768L96451K04147k54141j86798J79361R2515l56459m45123p8762J69072
$$ -119768 276683 480830 226689 39891 219252 311767 -44692 -489815 -568577 -399505
4508c99505J01349P8234K31688K88425J51203K225j19275k77290l01911l4007
$$ -399505 -298156 -219922 11766 300191 451394 453619 334344 57054 -244857 -278864
$$ [...]
##END NTUPLES=NMR SPECTRUM
##END=
