##TITLE=1H ikalashn
CG-1212-2
16.9.2024
##JCAMPDX= 6.0         $$ Bruker NMR JCAMP-DX V2.0
##DATA TYPE= NMR SPECTRUM
##DATA CLASS= NTUPLES
##ORIGIN= UXNMR, Bruker Analytische Messtechnik GmbH
##OWNER= root
$$ TOPSPIN		Version 1.3
$$ 2024-09-16 09:46:35.531 +0400  Irina@DPX200
$$ Compression mode = diff/dup
##.OBSERVE FREQUENCY= 200.131392401
##.OBSERVE NUCLEUS= ^1H
##.ACQUISITION MODE= SIMULTANEOUS
##.ACQUISITION SCHEME= undefined
##.AVERAGES= 8
##.DIGITISER RES= 18
##SPECTROMETER/DATA SYSTEM= spect
##.PULSE SEQUENCE= zg
##.SOLVENT NAME= CDCl3
##.SHIFT REFERENCE= INTERNAL, CDCl3, 1, 17.95386
##AUDIT TRAIL= $$ (NUMBER, WHEN, WHO, WHERE, WHAT)
$$ ##TITLE= Audit trail, TOPSPIN		Version 1.3
$$ ##JCAMPDX= 5.01
$$ ##ORIGIN= Bruker BioSpin GmbH
$$ ##OWNER= Irina
$$ $$ F:/spectra/data/iren/nmr/1H/4/pdata/1/auditp.txt
$$ ##AUDIT TRAIL=  $$ (NUMBER, WHEN, WHO, WHERE, VERSION, WHAT)
(   1,<2024-09-16 09:46:18.125 +0400>,<Irina>,<DPX200>,<TOPSPIN 1.3>,
      <created by zg
	started at 2024-09-16 09:45:40.406 +0400,
	POWCHK disabled, PULCHK disabled
       terminated by command 'halt'
       configuration hash MD5:
       BE 6D 3F 07 2A EA 11 49 91 17 2B D3 AF B3 58 0D
       data hash MD5: 16K
       A0 79 67 17 C5 0F 49 56 F2 E7 C1 D1 86 51 2E 28>)
(   2,<2024-09-16 09:46:18.312 +0400>,<Irina>,<DPX200>,<TOPSPIN 1.3>,
      <Start of raw data processing
       efp BC_mod = 2 LB = 0.02 FT_mod = 6 PKNL = 1 PHC0 = 106.4115 PHC1 = 0.3335867 SI = 32K 
       data hash MD5: 32K
       AE F7 6C 43 57 2E 14 A0 C2 82 DD 6F AD DC 73 E6>)
(   3,<2024-09-16 09:46:20.593 +0400>,<Irina>,<DPX200>,<TOPSPIN 1.3>,
      <apk 
       data hash MD5: 32K
       BF 2F AF 48 B9 8C 47 70 CD 17 D8 1E 5E 95 74 74>)
(   4,<2024-09-16 09:46:23.390 +0400>,<Irina>,<DPX200>,<TOPSPIN 1.3>,
      <abs n ABSG = 5 
       data hash MD5: 32K
       B7 16 85 27 E3 34 CC 69 57 1E 5C F6 C1 83 EE 14>)
$$ ##END=
$$ 
$$ $$ hash MD5
$$ $$ 73 25 94 CF A0 60 54 66 27 30 8B 49 CB 9B E5 D6
##$RELAX= 
##$RELAX= 
##$RELAX= 
##$RELAX= 
##$RELAX= 
##$RELAX= 
##$RELAX= 
##$RELAX= 
##$RELAX= 
$$ Bruker specific parameters
$$ --------------------------
##$DU= <F:/spectra>
##$EXPNO= 4
##$NAME= <1H>
##$PROCNO= 1
##$TYPE= <nmr>
##$USER= <iren>
##$AMP= (0..31)
100 100 100 100 100 100 100 100 100 100 100 100 100 100 100 100 100 100 
100 100 100 100 100 100 100 100 100 100 100 100 100 100 
##$ANAVPT= -1
##$AQSEQ= 0
##$AQ_mod= 1
##$AUNM= <au_zg>
##$AUTOPOS= <>
##$BF1= 200.13
##$BF2= 200.13
##$BF3= 200.13
##$BF4= 200.13
##$BF5= 200.13
##$BF6= 200.13
##$BF7= 200.13
##$BF8= 200.13
##$BYTORDA= 1
##$CFDGTYP= 0
##$CFRGTYP= 5
##$CHEMSTR= <none>
##$CNST= (0..63)
1 1 145 1 1 1 1 1 1 1 1 1 1 1 1 1 1 1 1 1 1 1 1 1 1 1 1 1 1 1 1 1 1 1 
1 1 1 1 1 1 1 1 1 1 1 1 1 1 1 1 1 1 1 1 1 1 1 1 1 1 1 1 1 1 
##$CPDPRG= <>
##$CPDPRG1= <>
##$CPDPRG2= <>
##$CPDPRG3= <>
##$CPDPRG4= <mlev>
##$CPDPRG5= <mlev>
##$CPDPRG6= <mlev>
##$CPDPRG7= <mlev>
##$CPDPRG8= <mlev>
##$CPDPRGB= <>
##$CPDPRGT= <>
##$D= (0..63)
$$ [...]
##$SW_h= 4401.40845070422
##$TD= 16384
##$TD0= 1
##$TE= 300
##$TE2= 300
##$TE3= 300
##$TEG= 300
##$TL= (0..7)
0 120 120 120 120 120 120 120 
##$TP= (0..7)
150 150 150 150 150 150 150 150 
##$TP07= 0
##$TPNAME0= <>
##$TPNAME1= <>
##$TPNAME2= <>
##$TPNAME3= <>
##$TPNAME4= <>
##$TPNAME5= <>
##$TPNAME6= <>
##$TPNAME7= <>
##$TPOAL= (0..7)
0.5 0.5 0.5 0.5 0.5 0.5 0.5 0.5 
##$TPOFFS= (0..7)
0 0 0 0 0 0 0 0 
##$TUNHIN= 0
##$TUNHOUT= 0
##$TUNXOUT= 0
##$USERA1= <user>
##$USERA2= <user>
##$USERA3= <user>
##$USERA4= <user>
##$USERA5= <user>
##$V9= 5
##$VALIST= <valist>
##$VCLIST= <CCCCCCCCCCCCCCC>
##$VD= 0
##$VDLIST= <DDDDDDDDDDDDDDD>
##$VPLIST= <PPPPPPPPPPPPPPP>
##$VTLIST= <TTTTTTTTTTTTTTT>
##$WBST= 1024
##$WBSW= 25
##$XGAIN= (0..3)
0 0 0 0 
##$XL= 0
##$YL= 0
##$YMAX_a= 559482
##$YMIN_a= -810775
##$ZGOPTNS= <>
##$ZL1= 120
##$ZL2= 120
##$ZL3= 120
##$ZL4= 120
##$ABSF1= 17.95386
##$ABSF2= -4.038887
##$ABSG= 5
##$ABSL= 3
##$ALPHA= 0
##$AQORDER= 0
##$ASSFAC= 0
##$ASSFACI= 0
##$ASSFACX= 0
##$ASSWID= 0
##$AUNMP= <proc_1d>
##$AXLEFT= 0
##$AXRIGHT= 0
##$AXTYPE= 0
##$AXUNIT= <>
##$AZFE= 0.1
##$AZFW= 0.1
##$BCFW= 0
##$BC_mod= 2
##$BYTORDP= 0
##$COROFFS= 0
##$CY= 7568.61572265625
##$DATMOD= 1
##$DC= 0
##$DFILT= <>
##$DTYPP= 0
##$F1P= 17.9538593292236
##$F2P= -4.03888763876832
##$FCOR= 0.5
##$FTSIZE= 32768
##$FT_mod= 6
##$GAMMA= 0
##$GB= 0
##$INTBC= 0
##$INTSCL= 1.483618e-010
##$ISEN= 128
##$LB= 0.02
##$LEV0= 0
##$LPBIN= 0
##$MAXI= 945.577
##$MC2= 0
##$MEAN= 0
##$ME_mod= 0
##$MI= -402.1523
##$NCOEF= 0
##$NC_proc= -6
##$NLEV= 6
##$NOISF1= 8.587773
##$NOISF2= 6.764455
##$NSP= 0
##$NTH_PI= 0
##$NZP= 0
##$OFFSET= 17.95386
##$PC= 1
##$PHC0= 306.4838
##$PHC1= 3.598677
##$PH_mod= 1
##$PKNL= yes
##$PPARMOD= 0
##$PPDIAG= 0
##$PPIPTYP= 0
##$PPMPNUM= 100
##$PPRESOL= 1
##$PSCAL= 0
##$PSIGN= 0
##$REVERSE= no
##$SF= 200.13
##$SI= 32768
##$SIGF1= 16.12182
##$SIGF2= -4.496377
##$SINO= 3.521527
##$SIOLD= 32768
##$SREGLST= <1H.CDCl3>
##$SSB= 0
##$STSI= 32768
##$STSR= 0
##$SW_p= 4401.40845070423
##$SYMM= 0
##$S_DEV= 0
##$TDeff= 16384
##$TDoff= 0
##$TI= <>
##$TILT= no
##$TM1= 0
##$TM2= 0
##$TOPLEV= 0
##$USERP1= <user>
##$USERP2= <user>
##$USERP3= <user>
##$USERP4= <user>
##$USERP5= <user>
##$WDW= 1
##$XDIM= 32768
##$YMAX_p= 535130598
##$YMIN_p= -502359
$$ End of Bruker specific parameters
$$ ---------------------------------
##NTUPLES= NMR SPECTRUM
##VAR_NAME=  FREQUENCY,     SPECTRUM/REAL,   SPECTRUM/IMAG
##SYMBOL=    X,             R,               I
##VAR_TYPE=  INDEPENDENT,   DEPENDENT,       DEPENDENT
##VAR_FORM=  AFFN,          ASDF,            ASDF
##VAR_DIM=   32768,         32768,           32768
##UNITS=     HZ,            ARBITRARY UNITS, ARBITRARY UNITS
##FACTOR=    0.134324425510551, 1,           1
##FIRST=     4401.40845070423, 109100,       -2169527
##LAST=      0,             -19562,          -2371843
##MIN=       0,             -502359,         0
##MAX=       4401.40845070423, 535130598,    0
$$ Real data points
##PAGE= N=1
##DATA TABLE= (X++(R..R)), XYDATA
$$ [...]
12095 85980534 83318684 80473620 77539625 74641501 71897615 69318711 66833978 64450368
12087 64450368 62298022 60474727 58926393 57532098 56234355 55031240 53912032 52871309
12079 52871309 51935643 51108885 50330093 49546141 48790296 48128595 47556646 47006712 46437225
12070 46437225 45867352 45340937 44895361 44544415 44255736 43965254 43638501 43288474 42917933
12061 42917933 42496714 42022199 41536187 41038636 40453608 39736990 38946239 38133296 37246822
12052 37246822 36239606 35205844 34284282 33459047 32588090 31623763 30681851 29877986 29206726
12043 29206726 28608668 28058505 27549478 27068335 26619872 26219239 25848519 25479643 25131781
12034 25131781 24829482 24520301 24134368 23713884 23358309 23035947 22597752 22016387 21457490
12025 21457490 21038285 20658762 20176653 19623188 19114218 18647872 18142053 17610361 17146756
12016 17146756 16760134 16362345 15919956 15500338 15155168 14855934 14561477 14267887 13974196
12007 13974196 13667316 13359114 13086556 12864733 12677794 12509569 12344894 12159561 11952319
11998 11952319 11762433 11611329 11462186 11288658 11136896 11050451 10980942 10858711 10709946 10603240
11988 10603240 10514207 10362370 10169660 10053525 10045799 10039006 9951659 9841412 9797425 9802055 9764659
11977 9764659 9645221 9495198 9401392 9408571 9471037 9484639 9403477 9303064 9274110 9289377 9257856
11966 9257856 9177197 9122874 9103604 9053576 8970496 8928373 8934751 8913087 8858829 8866609 8950109 8985688
11954 8985688 8911993 8839029 8859735 8893324 8838888 8757041 8751541 8775700 8721984 8627822 8617623
11943 8617623 8683139 8692037 8602230 8514094 8504481 8542329 8579709 8607758 8611368 8577039 8552760 8595829
11931 8595829 8661772 8657888 8608126 8636863 8768433 8874418 8867477 8829011 8875976 8995376 9090175
11920 9090175 9126064 9158305 9245958 9389949 9536913 9622980 9636996 9640623 9693761 9781457 9868034
11909 9868034 9985926 10176447 10365379 10422422 10357145 10329238 10426925 10558839 10623355 10663606
11899 10663606 10767308 10913568 11025862 11108378 11222992 11372630 11502384 11592549 11675169 11779905
11889 11779905 11924221 12126769 12369120 12577117 12707376 12826687 13038858 13350005 13666107
11880 13666107 13908757 14078179 14218117 14376913 14597272 14892385 15226895 15550531 15843713
11871 15843713 16109533 16343738 16541342 16712663 16870717 17028052 17218793 17477967 17775146
11862 17775146 18021660 18178449 18305156 18467690 18659149 18856509 19084425 19358900 19633359
11853 19633359 19876025 20140864 20478158 20831401 21119417 21373914 21689261 22067511 22420553
11844 22420553 22705496 22953359 23179709 23373932 23568326 23810112 24067606 24271212 24445819
11835 24445819 24687212 25000192 25283742 25500713 25738660 26062058 26422354 26768637 27136271
11826 27136271 27556651 27975106 28335365 28669298 29033550 29426529 29829630 30256276 30694590
11817 30694590 31077457 31384457 31705073 32125515 32621223 33140025 33716056 34401548 35151424
11808 35151424 35893770 36672338 37596013 38666240 39772857 40858661 41975661 43163246
11800 43163246 44370561 45527118 46608373 47602160 48478646 49221858 49838920 50326514 50682568
11791 50682568 50949033 51170293 51305820 51271542 51087161 50888617 50756175 50625980 50434758
11782 50434758 50261624 50231101 50338163 50483510 50656163 50963412 51467428 52098020 52773504
11773 52773504 53529057 54461427 55599357 56904815 58379028 60085296 62052218 64219836
11765 64219836 66520703 68972665 71641399 74527918 77539728 80568163 83545934 86417459
11757 86417459 89097438 91488770 93517953 95130110 96273867 96923588 97107583 96889809
11749 96889809 96325704 95443296 94248063 92730150 90890504 88787833 86546267 84293963
11741 84293963 82107468 80027937 78091434 76303790 74623908 73036171 71620987 70483136
11733 70483136 69617882 68932417 68414182 68183169 68325298 68756092 69335362 70068840 71100572
11724 71100572 72525888 74311347 76405958 78830832 81618348 84743966 88169885 91871906
11716 91871906 95729599 99442581 102680180 105329563 107512643 109347309 110781027 111678420
11708 111678420 111956528 111559655 110400249 108451841 105866862 102887959 99647639 96153694
11700 96153694 92467012 88770862 85219443 81813131 78488488 75267873 72255564 69526897
11692 69526897 67074839 64838338 62748652 60781772 58994065 57467099 56196838 55095014
11684 55095014 54127249 53372255 52888749 52599228 52388529 52265310 52337637 52663045 53205865
11675 53205865 53914126 54755349 55696334 56722012 57846869 59030293 60119654 60978442 61642596
11666 61642596 62233532 62729167 62950040 62782282 62281631 61523529 60484948 59143306 57580793
11657 57580793 55900980 54118332 52213686 50239962 48293122 46419125 44615759 42892818
11649 42892818 41275463 39777226 38410111 37188269 36094972 35093718 34194755 33444745
11641 33444745 32822071 32227752 31630472 31131139 30813032 30614741 30439889 30308893 30289300
11632 30289300 30344364 30385984 30440595 30623505 30955276 31327795 31655737 31942938 32187404 32343211
11622 32343211 32410993 32457866 32501026 32462257 32283527 32004057 31678955 31308985 30904760 30529605
11612 30529605 30201000 29826170 29333106 28815261 28441008 28240843 28085516 27876171 27658498
11603 27658498 27520266 27461594 27424634 27395026 27400042 27429361 27435041 27420621 27461140 27595188 27748750
11592 27748750 27825399 27837772 27871332 27928480 27904359 27746176 27547337 27422780 27358654 27258339
11582 27258339 27083072 26863951 26617993 26347893 26097747 25905822 25712453 25421683 25058968
11573 25058968 24757016 24563346 24376356 24117627 23856421 23689729 23592001 23476784 23338738
11564 23338738 23232963 23159753 23078044 23015247 23059956 23234454 23455067 23636342 23766048 23857620
11554 23857620 23898564 23885935 23857109 23827963 23731182 23480349 23094005 22696023 22366589 22039387
11544 22039387 21597061 21044490 20519191 20121191 19801157 19453598 19060558 18685107 18370860
11535 18370860 18122441 17951181 17852432 17755212 17590543 17409387 17332797 17371748 17403125 17356429
11525 17356429 17312100 17355424 17439790 17484025 17519968 17633364 17809989 17951887 18025832 18098857
11515 18098857 18227917 18390699 18533303 18635135 18725176 18863011 19082351 19331486 19520194
11506 19520194 19658675 19873326 20222186 20582683 20823617 21009508 21297174 21682179 22009451
11497 22009451 22219903 22417543 22670901 22912372 23089362 23267388 23503541 23741965 23925631
11488 23925631 24105928 24343493 24591036 24778484 24938330 25139413 25362972 25560139 25778725
11479 25778725 26104696 26506283 26864392 27152388 27465026 27859194 28283607 28695749 29137540
11470 29137540 29642395 30161198 30651248 31169045 31795082 32509350 33218662 33885486 34558635
11461 34558635 35281028 36028843 36751381 37424316 38050778 38648765 39254079 39903543 40593479
11452 40593479 41274196 41901048 42475426 43030280 43603768 44237680 44960162 45739132 46494031
11443 46494031 47206519 47989259 48973163 50137141 51334214 52501316 53753599 55222505
11435 55222505 56872067 58535376 60070177 61408164 62513170 63393245 64127362 64780766
11427 64780766 65298709 65566705 65564416 65370452 65029657 64530022 63919383 63319685 62786382 62269990
11417 62269990 61770703 61412551 61283029 61304990 61369045 61502039 61786148 62190254 62629591 63149428
11407 63149428 63887754 64853161 65892807 66922647 68061180 69468785 71154619 73019720
11399 73019720 75008929 77117216 79279277 81349466 83205913 84826746 86257063 87534701
11391 87534701 88646704 89515213 90005003 89973488 89354858 88210073 86682921 84897982 82910738
11382 82910738 80757455 78511059 76239217 73930133 71537621 69116220 66836412 64824516
11374 64824516 63052557 61437714 59979747 58720388 57626890 56626250 55732624 55034489
11366 55034489 54557881 54240956 54047653 54003980 54105497 54294924 54566025 54989037 55584858
11357 55584858 56265943 56951840 57639068 58279286 58691499 58717596 58409081 57938192 57352457
11348 57352457 56533252 55385360 53946893 52292502 50437988 48393086 46234735 44070420
11340 44070420 41968624 39961139 38073510 36315437 34670227 33125336 31691726 30372449
11332 30372449 29138809 27959369 26827904 25744922 24702818 23714927 22829329 22077990
11324 22077990 21427310 20807717 20179956 19549902 18937052 18358030 17826544 17338468 16867664
11315 16867664 16404824 15984893 15640304 15341819 15030795 14701167 14395534 14119865 13826064
11306 13826064 13497927 13190991 12950941 12747469 12533466 12318042 12126043 11933896 11714533
11297 11714533 11505468 11351770 11213881 11026183 10825104 10705997 10651398 10526496 10278662
11288 10278662 10021924 9865122 9766334 9636775 9490453 9390234 9320602 9221628 9096270 8983591
11278 8983591 8872895 8742471 8634606 8587742 8543719 8437456 8327875 8304369 8308229 8210505
11268 8210505 8045164 7977366 8023334 7997514 7800876 7580093 7500628 7515255 7479051 7371852
11258 7371852 7276701 7228062 7203925 7199733 7205323 7173392 7101152 7067658 7101584 7103709 7003967 6894797
11246 6894797 6881178 6897326 6827161 6720680 6709495 6768830 6762587 6693103 6695647 6781970 6802127
11235 6802127 6701805 6617311 6644976 6698893 6689152 6674848 6726053 6776953 6747418 6696917 6720492
11224 6720492 6778332 6765102 6686017 6634153 6637054 6646393 6647197 6662634 6672807 6639190 6598283 6625629
11212 6625629 6707565 6749714 6724550 6714787 6781058 6868771 6892512 6857135 6846054 6917247 7046537
11201 7046537 7161723 7213876 7221469 7247156 7322530 7407489 7448238 7466307 7551397 7752291 8001956
11190 8001956 8177609 8232302 8246834 8339184 8534603 8753052 8927694 9092328 9317564 9596554
11180 9596554 9850651 10031425 10156459 10253037 10333597 10425628 10550720 10663254 10686703 10628178
11170 10628178 10575902 10560406 10511042 10389029 10264149 10197822 10144180 10045442 9938266 9872404
11160 9872404 9803916 9679756 9562618 9546222 9590966 9574191 9479435 9406360 9402388 9413965 9411279
11149 9411279 9433140 9482688 9498512 9471077 9482242 9578344 9695838 9768155 9825549 9928785 10072859
11138 10072859 10221710 10386427 10604286 10870985 11144019 11394864 11628581 11871420 12151978
11129 12151978 12468301 12774468 13037708 13295078 13592860 13884423 14074704 14164462 14244708 14331364
11119 14331364 14329882 14211731 14091953 14039043 13927177 13610076 13159034 12776070 12513942 12240261
11109 12240261 11873066 11493281 11185050 10905198 10590650 10292611 10100431 9985624 9823953
11100 9823953 9561803 9278636 9071922 8944321 8834643 8713355 8600328 8509024 8425558 8347623
11090 8347623 8298174 8280284 8257363 8207858 8165045 8165774 8194204 8221897 8265126 8340103 8401684 8414869
11078 8414869 8456251 8626625 8867779 9003894 8994406 8998447 9120455 9240648 9213731 9107819
11068 9107819 9088154 9148980 9137333 9001240 8836446 8692178 8503886 8249951 8019976 7868825
11058 7868825 7729098 7534131 7319519 7132547 6938623 6699965 6470461 6324464 6239151 6121302
11048 6121302 5921353 5673478 5456042 5340008 5325042 5304724 5168114 4962954 4861002 4915161
11038 4915161 4969985 4896258 4786218 4781270 4818502 4737410 4574115 4528623 4640426 4720298 4661488
11027 4661488 4606610 4692144 4811223 4795194 4697444 4702259 4828224 4925867 4946565 5012289 5187221
11016 5187221 5360609 5432935 5475498 5604200 5801252 5974873 6120408 6298021 6486243 6578644
11006 6578644 6533593 6438708 6404097 6448436 6505917 6502113 6411799 6272876 6144766 6033409 5881358
10995 5881358 5665140 5462647 5361667 5332407 5271941 5158883 5068605 5031030 4979082 4873919
10985 4873919 4784787 4784351 4840283 4879997 4904043 4959617 5042101 5099739 5118042 5137417 5195876 5299062
10973 5299062 5434048 5576525 5703088 5827754 6000091 6238302 6500874 6756765 7036210
10964 7036210 7370078 7734037 8110746 8552529 9107317 9723933 10306160 10819816 11266561
10955 11266561 11600363 11775196 11845518 11907651 11957302 11916406 11785494 11639510 11469193 11168677
10945 11168677 10714737 10224422 9781529 9332026 8821685 8318466 7905360 7549953 7186249
10936 7186249 6852098 6635051 6527348 6433133 6291626 6115985 5941089 5802667 5734547 5720581
10926 5720581 5686244 5600966 5541801 5583154 5674244 5715125 5712809 5761325 5892183 6047771 6193610
10915 6193610 6358001 6558070 6778854 7035852 7372980 7782787 8206248 8628320 9098991
10906 9098991 9638418 10189643 10687313 11109190 11439055 11646707 11738792 11776971 11812736 11838363
10896 11838363 11811109 11680494 11393349 10939733 10405958 9910393 9466981 8988323 8448775
10887 8448775 7951450 7578632 7263988 6899040 6502517 6181071 5955967 5740261 5491913
10878 5491913 5286039 5191232 5145677 5023873 4802788 4600377 4533645 4574323 4582874 4481939
10868 4481939 4350906 4316024 4381100 4431453 4401074 4356729 4383422 4459262 4509267 4532150 4589218
10857 4589218 4692618 4798638 4912770 5100670 5359303 5569747 5646403 5662941 5741602 5867464
10847 5867464 5923312 5888045 5868884 5910950 5908032 5778899 5620328 5567306 5575821 5485063 5261987
10836 5261987 5038501 4906080 4818692 4727161 4664912 4639865 4573245 4430831 4301752 4251364
10826 4251364 4202208 4072196 3928701 3867688 3827269 3688452 3504182 3439484 3495935 3485473
10816 3485473 3311159 3103836 3015937 3022816 3011255 2951016 2886338 2836671 2788788 2735868 2669660
10805 2669660 2583583 2515562 2522383 2583634 2609281 2572239 2542910 2555054 2542146 2466581 2409966
10794 2409966 2455083 2563188 2650470 2708204 2762228 2788587 2764982 2746037 2795016 2890472 2980622
10783 2980622 3072065 3182433 3271318 3311670 3362530 3465344 3535844 3485738 3396844 3427319 3570501
10772 3570501 3655369 3587896 3454446 3367669 3336282 3320085 3303063 3269360 3195198 3101288 3038837
10761 3038837 3001205 2926817 2807605 2711226 2674064 2657430 2635504 2637378 2664687 2654039 2571509
10750 2571509 2470462 2402285 2337510 2236968 2143361 2127528 2174897 2196886 2150425 2090290 2088385
10739 2088385 2137104 2164514 2140086 2126103 2189787 2291452 2327875 2285484 2261481 2307313 2358168
10728 2358168 2377451 2451295 2631676 2795378 2810125 2758773 2818989 2971775 3030830 2948005 2879333
10717 2879333 2921461 2986625 2995987 3002302 3036407 3011045 2883786 2759905 2721007 2693888 2605776
10706 2605776 2528512 2532758 2526753 2396386 2208748 2119324 2145728 2174971 2136772 2042719 1914854
10695 1914854 1798463 1780033 1866295 1914029 1814029 1674565 1672224 1783802 1834791 1771442 1705976
10684 1705976 1706475 1717897 1704323 1710381 1750785 1772390 1757296 1752647 1781031 1823467 1887377 1977705
10672 1977705 2016089 1927548 1801929 1811881 1954935 2042839 1986186 1919464 1970526 2063426 2057221
10661 2057221 1959765 1885619 1882325 1904674 1908218 1883381 1835044 1788174 1776444 1787833 1769850 1714256
10649 1714256 1673588 1670595 1666676 1646372 1648245 1678967 1686444 1657085 1646871 1672361 1669308 1611832
10637 1611832 1571333 1594608 1625392 1619326 1633264 1711422 1779376 1756154 1692935 1691846 1750789 1794085
10625 1794085 1800709 1798183 1780229 1735167 1711265 1749238 1789409 1751771 1674700 1665298 1734618 1789639
10613 1789639 1778418 1743474 1732981 1747508 1776494 1812514 1832371 1827874 1837860 1884406 1908757 1851094
10601 1851094 1761993 1739653 1779494 1790864 1753394 1745293 1803261 1856954 1835678 1763144 1712487
10590 1712487 1720132 1763298 1783999 1738087 1656127 1626590 1672280 1698294 1637543 1579108 1635131
10579 1635131 1740549 1743077 1660640 1659772 1764814 1794375 1659099 1529043 1577758 1714689 1733977
10568 1733977 1624187 1554303 1605325 1686211 1709535 1702212 1713350 1727014 1714263 1695778 1705701
10557 1705701 1738665 1765882 1772329 1755767 1715508 1664251 1637035 1669846 1764673 1874882 1933062
10546 1933062 1911468 1854735 1831223 1854060 1881501 1892860 1914411 1954933 1970114 1928754 1875231
10535 1875231 1882076 1962118 2062371 2127413 2141497 2127164 2127131 2170633 2241327 2299990 2345079 2411095
10523 2411095 2496071 2548152 2555108 2586891 2697552 2835557 2915842 2942693 2990505 3090206 3211105
10512 3211105 3339153 3488920 3632466 3696945 3661385 3596808 3579548 3610187 3643582 3651762 3623650
10501 3623650 3545690 3428557 3325978 3280031 3261660 3209054 3117233 3042490 3013551 2987434 2917715
10490 2917715 2827552 2776447 2778187 2796125 2808700 2829660 2859486 2868458 2849108 2841636 2877020 2931029
10478 2931029 2967810 2993947 3028948 3054425 3042591 3013579 3014637 3057511 3119141 3181396 3223792
10467 3223792 3211170 3152955 3139240 3230901 3337826 3314021 3172393 3086029 3148865 3254304 3267567
10456 3267567 3209013 3182323 3206561 3221570 3208715 3207418 3235286 3273142 3317099 3378983 3442604
10445 3442604 3474340 3472742 3467558 3479402 3511769 3565202 3629573 3682032 3716464 3751118 3792481 3828283
10433 3828283 3867199 3931860 3997281 4006712 3975980 3999099 4104985 4197004 4198631 4169953 4196623
10422 4196623 4249456 4259862 4262001 4336259 4459684 4537776 4555152 4576260 4620195 4652860 4685091
10411 4685091 4757024 4833715 4839536 4799475 4826176 4953298 5093916 5179857 5232297 5276563 5299682
10400 5299682 5320128 5392367 5509342 5600556 5658070 5764918 5966466 6212275 6454855 6700491
10390 6700491 6931006 7094705 7225761 7455474 7838384 8271672 8654468 9023922 9462620
10381 9462620 9979495 10566579 11265406 12077716 12918490 13779252 14828773 16173430 17565279
10372 17565279 18538844 18872505 18792038 18690423 18758083 18925186 19043700 19011478 18750491 18179983
10362 18179983 17284302 16191068 15112525 14167353 13300290 12430237 11625077 11023986 10610262
10353 10610262 10206656 9728614 9296138 9018889 8807355 8516687 8173892 7919832 7789785
10344 7789785 7693503 7577312 7471134 7388217 7300653 7216170 7173648 7157125 7109413 7037964 7017753
10333 7017753 7076466 7155008 7194171 7192519 7171911 7150342 7153376 7193808 7241557 7267587 7302714 7390699
10321 7390699 7503422 7577091 7617364 7687993 7802963 7911204 7986693 8055329 8131345 8202129 8277400
10310 8277400 8382189 8504249 8618258 8747710 8921256 9086859 9171675 9220293 9358772 9608995
10300 9608995 9853783 10012221 10133989 10278895 10418801 10523153 10639840 10810049 10982306
10291 10982306 11096990 11196591 11365282 11598091 11811849 11967625 12114350 12315090 12579621
10282 12579621 12873096 13161669 13446123 13758742 14118727 14494439 14835247 15140902 15469576
10273 15469576 15874647 16360711 16899142 17457482 18017761 18592195 19213233 19896438 20647200
10264 20647200 21515622 22575222 23817923 25177280 26719029 28644453 30922847 33038085
10256 33038085 34367447 34817613 34872088 35011191 35328213 35728787 36169494 36522955 36471799
10247 36471799 35799760 34664162 33384809 32087003 30746304 29451582 28371596 27521440
10239 27521440 26793187 26183962 25772253 25488424 25146235 24731030 24438952 24371794 24391623 24359757
10229 24359757 24334401 24415113 24547546 24628019 24689566 24827531 25011391 25131512 25203828 25368408
10219 25368408 25666164 25961656 26153042 26343327 26696537 27194891 27672396 28068859 28500951
10210 28500951 29045046 29602141 30079825 30579044 31242757 32005426 32686191 33291561 34009578
10201 34009578 34893799 35780131 36576396 37407256 38365130 39334483 40214154 41117250 42164611
10192 42164611 43254471 44254837 45275658 46501223 47865974 49168698 50436203 51888239
10184 51888239 53568094 55290677 56965193 58686164 60453809 62074740 63432990 64623663
10176 64623663 65711351 66574162 67112719 67417525 67587563 67552576 67225253 66686326 66067246
10167 66067246 65369943 64554612 63709583 62986159 62430516 62000494 61688869 61527262 61524691 61685161
10157 61685161 62024674 62510643 63071891 63728195 64598464 65708478 66920880 68152372 69522497
10148 69522497 71159185 72984519 74843994 76734394 78729777 80768598 82698241 84473617
10140 84473617 86132518 87612601 88769237 89556178 90020987 90127029 89744988 88840335 87528503
10131 87528503 85920115 84033555 81880078 79518270 76999264 74361141 71698050 69138112
10123 69138112 66732784 64453316 62305464 60359925 58660716 57187342 55911661 54810958
10115 54810958 53830411 52923613 52130269 51527979 51114558 50827088 50660120 50658962 50808224 51045177
10105 51045177 51381801 51888054 52541477 53215232 53829367 54384433 54825329 55020753 54931278
10096 54931278 54659460 54260083 53626404 52653265 51402545 50004970 48487898 46807760 44983362
10087 44983362 43089579 41169201 39250938 37414049 35734985 34191959 32708703 31274657
10079 31274657 29941352 28717642 27557817 26455114 25461594 24592201 23779279 22961228 22166914
10070 22166914 21464689 20855734 20271957 19679109 19129946 18683758 18306259 17902738 17445947
10061 17445947 17012154 16670252 16390386 16100635 15786755 15485885 15220295 14992542 14811574
10052 14811574 14663092 14486195 14246484 14003381 13831895 13705775 13542894 13344760 13192838
10043 13192838 13110191 13025701 12888180 12725861 12575132 12435241 12314316 12238676 12192974 12128117
10033 12128117 12049995 12021976 12056891 12087466 12071015 12042272 12031216 12011783 11974473 11974255 12055711
10022 12055711 12188392 12318456 12434767 12554196 12692737 12874495 13118305 13401502 13689120
10013 13689120 13996213 14353521 14724793 15053245 15384191 15822916 16353552 16824305 17149167
10004 17149167 17401412 17656895 17868632 17969701 17993809 18011522 18028566 18014626 17956802 17833634
9994 17833634 17622406 17378201 17208979 17127249 17034275 16895572 16804115 16811895 16840975 16840496 16885643
9983 16885643 17021976 17156083 17217307 17289540 17453912 17635637 17747994 17856254 18043605 18242442
9973 18242442 18368481 18497417 18717973 18924638 18968748 18919457 18946782 19021633 18975743 18810453
9963 18810453 18690958 18646012 18522658 18259137 17970923 17726072 17449422 17103747 16771416 16495133
9953 16495133 16211419 15897910 15622560 15397687 15149399 14879187 14685867 14572129 14403786
9944 14403786 14135176 13911562 13860178 13922416 13979012 14011040 14051881 14094938 14125842 14147446 14123957
9933 14123957 14008295 13853869 13764534 13701927 13498583 13109033 12682108 12324221 11965295 11535128
9923 11535128 11089889 10663474 10174361 9605791 9110420 8790993 8525277 8161691 7754823
9914 7754823 7444911 7221802 6979400 6709989 6475945 6262970 6021235 5792857 5651075 5563162
9904 5563162 5445884 5305797 5201189 5119440 5012103 4896201 4805299 4699897 4540884 4387473
9894 4387473 4305659 4248530 4149187 4058121 4052308 4076189 4020495 3905630 3839330 3835171 3817258 3767763
9882 3767763 3727165 3679933 3581347 3472954 3435013 3445742 3418250 3353014 3321660 3322943 3291711
9871 3291711 3235173 3223916 3254338 3249788 3195944 3152903 3135339 3098708 3044164 3026011 3053687 3083017
9859 3083017 3093875 3086823 3033910 2933184 2870782 2914471 2987568 2972212 2893775 2866683 2899026
9848 2899026 2900645 2853124 2815650 2786275 2718581 2658833 2698347 2794066 2804566 2709786 2630386 2620055
9836 2620055 2607182 2562454 2555746 2609427 2646903 2626678 2594507 2576542 2549210 2526556 2545488 2566427
9824 2566427 2529545 2491771 2544229 2618152 2569487 2444454 2436483 2563675 2626412 2530352 2414315
9813 2414315 2390363 2391677 2364934 2382859 2459516 2473237 2389821 2351799 2425250 2469561 2390604 2310795
9801 2310795 2339850 2385610 2355819 2342256 2421614 2469748 2376901 2268953 2299677 2385555 2371272
9790 2371272 2309173 2335648 2399069 2361333 2270083 2280110 2377659 2423421 2413818 2465760 2576793
9779 2576793 2620744 2566758 2510105 2499031 2500066 2511402 2554747 2590259 2584776 2608937 2721768 2838706
9767 2838706 2874328 2917648 3077208 3255799 3301447 3289973 3407056 3620990 3743323 3766090
9757 3766090 3848831 3988355 4006622 3892107 3850291 3948402 3998346 3894124 3796082 3840877 3902301
9746 3902301 3807410 3607639 3463815 3396033 3307787 3168331 3037517 2962298 2934843 2913262 2849776
9735 2849776 2752496 2709777 2763316 2791249 2658350 2456277 2412684 2558686 2686117 2664972 2593116
9724 2593116 2572037 2548887 2478517 2445661 2502644 2551854 2516775 2483171 2541197 2618219 2601715
9713 2601715 2520216 2476363 2489894 2518348 2553253 2597257 2618050 2605738 2604593 2627028 2619856 2568572
9701 2568572 2539235 2564701 2590941 2585836 2593728 2634781 2662479 2662371 2673543 2681869 2632012 2573027
9689 2573027 2624416 2757314 2798760 2712269 2666870 2744622 2803104 2746841 2707387 2793176 2874300
9678 2874300 2812183 2716427 2753475 2855503 2853403 2776267 2778300 2856072 2875371 2825597 2824947 2896619
9666 2896619 2937075 2902163 2858144 2845898 2833254 2805722 2795155 2819540 2867752 2918498 2927927 2863884
9654 2863884 2792520 2826025 2937093 2966776 2882006 2849304 2953019 3038440 2980131 2907156 2973075
9643 2973075 3083334 3069843 2982291 2975468 3038078 3062194 3060008 3084356 3059773 2930868 2851374
9632 2851374 2968955 3142143 3142846 3025394 3003033 3064819 3035742 2936407 2943431 3038712 3038978 2953346
9620 2953346 2971693 3096010 3121668 3010336 2952392 3017156 3060117 3027985 3041439 3116923 3119795
9609 3119795 3058737 3107342 3255281 3266266 3086236 2967985 3060542 3187518 3181453 3138540 3175952
9598 3175952 3218672 3204015 3234299 3346806 3383190 3268950 3180020 3247344 3333206 3290791 3212385
9587 3212385 3219097 3229853 3153503 3100827 3183213 3288399 3273313 3205656 3207190 3231122 3201492 3199867
9575 3199867 3301745 3395457 3376898 3357683 3460128 3570710 3532648 3432942 3452490 3558815 3591141
9564 3591141 3543290 3528970 3559176 3571292 3591349 3665373 3719880 3680601 3631457 3672378 3730827
9553 3730827 3702532 3659277 3716796 3812291 3818463 3770272 3778964 3831394 3868352 3937867 4068704 4126280
9541 4126280 4014412 3888927 3938708 4081032 4115576 4056737 4056188 4107033 4093009 4042173 4069657
9530 4069657 4143054 4150000 4122169 4158792 4216776 4207770 4199164 4280833 4351473 4289982 4209745 4271730
9518 4271730 4382315 4371267 4327399 4430282 4583058 4571231 4470607 4515065 4654466 4649402 4536727
9507 4536727 4576276 4767584 4849655 4781263 4793264 4934804 4991168 4910667 4903543 5035699 5112534
9496 5112534 5057737 5039455 5130037 5194441 5196243 5261611 5371724 5356908 5258327 5308182 5484307
9485 5484307 5500657 5328330 5285880 5487821 5651041 5608226 5566628 5665563 5720416 5633147 5627783
9474 5627783 5820338 5962093 5888392 5835024 6012094 6229257 6256116 6213961 6289523 6378111 6336859
9463 6336859 6299026 6413806 6544996 6537319 6519291 6643835 6791729 6825714 6872265 7058075 7237037
9452 7237037 7272133 7309444 7473962 7588220 7513720 7470716 7666165 7892936 7876814 7755059
9442 7755059 7817463 8014915 8125397 8188866 8373899 8601392 8688408 8698036 8792204 8914332 8950474
9431 8950474 9002794 9173441 9306698 9285146 9322945 9596590 9861177 9844587 9750605 9920657
9421 9920657 10247195 10398801 10405907 10539054 10801235 11013703 11214667 11510902 11741315 11757776
9411 11757776 11813982 12184789 12641808 12828561 12897688 13203690 13620698 13798326 13867575 14213595
9401 14213595 14731646 15013295 15125627 15484197 16067604 16498438 16817969 17413614 18214076
9392 18214076 18726527 18877829 19064935 19359117 19431553 19305979 19401977 19760392 19998030 20097666
9382 20097666 20441351 20978017 21205229 21112634 21281183 21861573 22323212 22446898 22690564 23282182
9372 23282182 23810860 24055783 24395129 25034516 25627939 26022598 26586544 27434775 28127178
9363 28127178 28503489 29013890 29853176 30600823 31104136 31846524 33012852 34075170 34763797
9354 34763797 35549403 36683175 37694847 38362061 39206892 40456421 41502021 42012419 42565747
9345 42565747 43506880 44242716 44426067 44745521 45685276 46591635 46907569 47238105 48160020
9336 48160020 49070069 49359744 49674938 50766462 52088767 52841454 53438693 54581310 55804910
9327 55804910 56387274 56818295 57896034 59210752 60015575 60737554 62089507 63576312 64482552
9318 64482552 65407684 67144018 69036870 70255602 71602249 74084133 76854150 78772625
9310 78772625 80804538 84383643 88606665 91829630 94860531 99467294 104880972 109275843
9302 109275843 113645076 120299839 128498109 135917022 143502623 153828976 165590121 175891406
9294 175891406 187475510 206011387 229652753 250646256 270019186 299662989 342664585
9287 342664585 381205805 395011270 386236052 374873832 373292693 377440841 381198720 384909019
9279 384909019 386412652 376521653 350952324 318615886 290781459 267948818 244243287
9272 244243287 219574622 199523031 185959272 175189893 164556293 154877851 146534553
9265 146534553 138217119 129936215 123223935 117983287 112509979 106783834 102575356 100117113
9257 100117113 97628790 94381516 91479761 89331545 86969121 84256472 82314013 81289322
9249 81289322 79969666 78080265 76813073 76553729 76140324 74976841 73951432 73598184 73152055
9240 73152055 72141576 71256020 70895783 70393486 69401635 68618679 68415722 68098739 67252487
9231 67252487 66519769 66316569 66020722 65204451 64498779 64429220 64471951 64082918 63673211 63737382
9221 63737382 63908565 63695276 63359830 63289336 63218577 62806087 62312993 62037153 61713118 61093341
9211 61093341 60483940 60112582 59616853 58747735 57923162 57484024 57055525 56266756 55460242
9202 55460242 55037038 54713823 54109063 53492002 53248612 53121977 52684342 52098682 51727897
9193 51727897 51418600 50844966 50165592 49679562 49195005 48375770 47372333 46499513 45632491
9184 45632491 44528690 43407055 42587682 41871562 40895745 39811199 38994177 38357462 37562260
9175 37562260 36672007 35994362 35485845 34884673 34233104 33726238 33251000 32598394 31909629
9166 31909629 31399007 30886016 30128229 29341388 28828239 28376360 27629108 26777069 26227449
9157 26227449 25836986 25173109 24332661 23765752 23430143 22874768 22087260 21505843 21200054
9148 21200054 20774516 20132958 19631490 19376442 19034644 18471923 17963620 17629566 17241619
9139 17241619 16737600 16367639 16177541 15881777 15402649 15017633 14821893 14558820 14137625
9130 14137625 13802540 13619598 13312872 12804828 12413292 12293081 12168464 11853902 11566758
9121 11566758 11466178 11335141 11004077 10676043 10541927 10450905 10242338 10046047 9979916 9893916
9111 9893916 9682541 9517513 9506301 9449955 9207748 8976708 8932065 8906498 8714425 8491791
9101 8491791 8415223 8369941 8204403 8047313 8052340 8067181 7880229 7593858 7443618 7423407 7377768
9090 7377768 7299999 7262214 7201142 7036127 6865709 6811126 6796692 6697826 6565591 6501404 6453449
9079 6453449 6331987 6185981 6091440 6013455 5930802 5923747 5992131 5982406 5842030 5730277 5729680
9068 5729680 5692438 5535062 5415865 5432561 5425906 5294026 5206859 5270078 5280429 5089327 4908087
9057 4908087 4945327 5034778 4959017 4855224 4926024 5017197 4893673 4698147 4701124 4800332 4721852
9046 4721852 4545017 4553412 4695068 4674360 4496031 4438363 4527670 4507034 4325553 4215677 4255807
9035 4255807 4265698 4177697 4131920 4159744 4128570 4036062 4018983 4051222 3975413 3841149 3853905
9024 3853905 3979601 3974389 3827122 3783504 3892272 3926237 3816815 3765681 3837407 3839138 3715700
9013 3715700 3675202 3792858 3867366 3809167 3795347 3886900 3873425 3680848 3563848 3682165 3828102
9002 3828102 3792762 3676940 3619966 3546955 3419769 3414012 3587075 3680873 3532831 3384890 3483975
8991 3483975 3660924 3639497 3507498 3516663 3622443 3600758 3471040 3436751 3508994 3525957 3467913
8980 3467913 3444347 3437068 3347558 3238497 3249206 3325289 3301909 3205655 3204004 3292225 3301890 3209166
8968 3209166 3175141 3263261 3347642 3334096 3276552 3241616 3220706 3199515 3182456 3148795 3095291
8957 3095291 3084062 3135521 3146464 3049364 2962780 3019768 3138150 3150774 3081364 3078729 3141576
8946 3141576 3139057 3070002 3068621 3155550 3201880 3157715 3116918 3127158 3117694 3052009 2992825 2979869
8934 2979869 2978343 2970696 2977688 2982645 2950147 2909574 2908326 2914114 2882900 2870974 2938767 3004210 2957759
8921 2957759 2868324 2889264 3000889 3042916 2976195 2911632 2895867 2874974 2866546 2954299 3094249
8910 3094249 3130950 3037052 2948453 2936012 2930228 2897281 2895894 2924279 2900194 2832782 2831029 2905423
8898 2905423 2945665 2927477 2947922 3021656 3047530 3018525 3047138 3129620 3117432 2998146 2963567
8887 2963567 3092814 3205226 3164285 3101845 3174148 3297354 3315135 3259905 3248950 3258723 3202572
8876 3202572 3125564 3128206 3176225 3165674 3116396 3134564 3225086 3289535 3284965 3262822 3269826 3305104
8864 3305104 3352136 3382984 3366207 3320420 3304831 3319950 3300025 3241814 3233103 3299646 3342761 3299631
8852 3299631 3247161 3267568 3327367 3371698 3420891 3489619 3529521 3533075 3567223 3628413 3615167 3531202
8840 3531202 3540276 3702715 3841286 3816596 3753519 3816520 3935644 3965461 3958274 4039780 4140862
8829 4140862 4111708 4013722 4038976 4195415 4318611 4357892 4412479 4507528 4566488 4598614 4696836
8818 4696836 4850585 4963569 5049346 5205293 5402653 5514753 5549673 5635433 5768959 5807974
8808 5807974 5734715 5697544 5749726 5772883 5714868 5679063 5702131 5658267 5480128 5282949 5171001
8797 5171001 5097204 5008371 4954480 4952613 4909308 4784644 4679537 4658884 4639269 4550323 4453351
8786 4453351 4401163 4341709 4265685 4276196 4386606 4426289 4298774 4164143 4188953 4272583 4226790
8775 4226790 4093850 4055603 4119535 4134576 4067210 4029374 4050640 4043767 4005039 4039304 4149555
8764 4149555 4193615 4111955 4030521 4056591 4115786 4088922 3996082 3935722 3923744 3908750 3898747
8753 3898747 3953247 4052688 4081024 3979582 3849358 3834879 3937957 4025499 4025460 4021602 4099336 4185481
8741 4185481 4153237 4037649 4001395 4085443 4149049 4105121 4063208 4142437 4268467 4287840 4200874
8730 4200874 4140922 4168120 4217384 4233300 4236232 4251599 4273124 4305683 4362261 4412340 4410829 4384679
8718 4384679 4412338 4500475 4556100 4515652 4443916 4455935 4567745 4672703 4672770 4602752 4589551 4687685
8706 4687685 4805444 4833300 4795724 4797815 4856119 4893806 4897438 4945097 5048729 5108135 5085525
8695 5085525 5089464 5191695 5288904 5269909 5208718 5242006 5340163 5366609 5311098 5292763 5353681
8684 5353681 5413708 5431661 5458769 5514040 5546068 5547789 5582210 5657381 5691885 5647978 5595843 5601143
8672 5601143 5642891 5686495 5745016 5814234 5830425 5758473 5664331 5642471 5710286 5810759 5878924
8661 5878924 5879195 5823194 5776961 5805651 5888008 5931441 5894065 5843482 5865146 5952530 6021271 6009007
8649 6009007 5937618 5886406 5909361 5975687 6010743 6003043 6023716 6108910 6184313 6169746 6104448 6084632
8637 6084632 6119322 6145103 6152738 6190704 6257064 6297197 6306749 6330516 6357809 6331157 6270701 6273949
8625 6273949 6362895 6439262 6431429 6390302 6396320 6455143 6525744 6577606 6589202 6561939 6555193 6628528
8613 6628528 6737105 6777054 6747271 6757133 6848132 6926166 6916260 6871426 6869228 6902219 6933396 6967455
8601 6967455 7005991 7019025 7015662 7053590 7128122 7151034 7095991 7060370 7117316 7210425 7264896 7296454
8589 7296454 7334256 7347344 7335136 7379655 7509372 7618806 7628429 7614735 7665423 7720184 7696382
8578 7696382 7667342 7749231 7890804 7952480 7938872 7971955 8065905 8111606 8080945 8073277 8139050
8567 8139050 8212928 8257239 8332567 8474654 8614047 8674692 8670489 8660554 8674729 8714494 8771920
8556 8771920 8826000 8861797 8895379 8943216 8987193 9013473 9050871 9119021 9186014 9237265 9322737
8545 9322737 9458347 9555944 9555408 9552091 9663240 9831243 9910233 9902128 9941186 10067158 10184292
8534 10184292 10246294 10318229 10437906 10564549 10681109 10805919 10898199 10906081 10910690 11046228 11261809
8523 11261809 11359884 11313209 11333604 11545855 11797706 11908894 11922222 11965164 12027110 12043358 12072364
8512 12072364 12207125 12391050 12487975 12484558 12484288 12544208 12639806 12750234 12865627 12945971 12969467
8501 12969467 12981915 13017960 13034730 13008120 13013784 13103591 13182446 13140940 13044746 13044482 13144718 13220161
8489 13220161 13233913 13271316 13353233 13384530 13331224 13300753 13373595 13471928 13485937 13448350 13481642
8478 13481642 13609994 13721020 13724597 13681928 13731946 13911001 14099925 14173513 14157359 14177631 14281915
8467 14281915 14397857 14473106 14551900 14670137 14772331 14806032 14823627 14906592 15042971 15161459
8457 15161459 15244821 15333140 15448872 15586953 15747631 15919564 16062599 16154865 16217729 16263648
8447 16263648 16286387 16333055 16482234 16694532 16809588 16781661 16783796 16948614 17139448 17155806
8437 17155806 17056399 17063253 17215196 17351794 17412254 17503377 17651841 17730539 17696997 17690663 17800840
8426 17800840 17925369 17967044 18002319 18129037 18287528 18370679 18403474 18477322 18587955 18667553
8416 18667553 18718286 18795128 18895026 18964833 18995094 19028215 19095334 19199281 19327488 19441304 19500926
8405 19500926 19536196 19625016 19760104 19824734 19767011 19708902 19787479 19958316 20066190 20065016 20053243
8394 20053243 20109674 20202460 20270904 20312873 20365966 20454886 20576795 20706788 20810549 20873304 20914097
8383 20914097 20958422 21011365 21069816 21139059 21223429 21320703 21429548 21537178 21610273 21642741 21698930
8372 21698930 21844786 22043554 22198757 22297855 22415940 22569273 22685431 22753767 22874852 23090729
8362 23090729 23288690 23371205 23415841 23549207 23747160 23892905 23975809 24093625 24282595 24475031
8352 24475031 24627683 24784082 24991247 25234993 25477899 25706843 25932572 26177852 26460959
8343 26460959 26768549 27071320 27382650 27747064 28145123 28489584 28766253 29089647 29542551
8334 29542551 30045715 30481207 30862956 31270328 31686547 32041756 32365575 32744933 33149959
8325 33149959 33448462 33597760 33691599 33804534 33912845 33991429 34073471 34177985 34272625 34343439
8315 34343439 34424391 34532847 34645823 34756462 34887190 35037180 35180719 35319701 35475768 35638567
8305 35638567 35786242 35938660 36118814 36287149 36393183 36458985 36522567 36542260 36468437 36368465
8295 36368465 36347034 36369681 36309433 36153140 36009666 35919423 35818468 35699632 35638528 35633153 35587940
8284 35587940 35495420 35462917 35512380 35533039 35496094 35530622 35697826 35871403 35953707 36040228 36238421
8273 36238421 36478831 36653140 36804969 37030575 37306526 37567230 37846474 38190719 38533761
8264 38533761 38812198 39106940 39508451 39938155 40281767 40614138 41094139 41696103 42250243
8255 42250243 42718774 43231773 43855243 44512197 45147446 45800024 46489331 47184037 47910141
8246 47910141 48748327 49698482 50677149 51666301 52731169 53873957 55011952 56133519 57342943
8237 57342943 58709510 60189573 61731454 63341907 65020726 66750750 68582101 70599953
8229 70599953 72776592 74991307 77239034 79671515 82364266 85188037 88005380 90862918
8221 90862918 93867445 96971402 100013938 102912364 105688021 108336596 110787005 112987103
8213 112987103 114946874 116681695 118157314 119304134 120080416 120532887 120779799 120894197 120828455
8204 120828455 120524444 120070980 119639924 119267850 118838259 118313929 117837766 117524048 117284070
8195 117284070 116971422 116591678 116233004 115863348 115341106 114593538 113656315 112549026 111226441
8186 111226441 109659076 107866661 105856272 103603827 101117306 98460861 95695439 92832307
8178 92832307 89857887 86783047 83667353 80605292 77672645 74875923 72176306 69563113
8170 69563113 67063861 64686177 62416190 60285055 58356673 56619674 54973491 53363237
8162 53363237 51847549 50486904 49253823 48111538 47085350 46178576 45310633 44431617 43613077
8153 43613077 42923257 42296476 41643808 41014096 40506086 40080903 39612527 39087779 38606688
8144 38606688 38206399 37833257 37478906 37192683 36952806 36672837 36357127 36110738 35964133
8135 35964133 35818875 35606067 35379039 35209170 35100328 35039168 35017656 34978761 34863826 34742773
8125 34742773 34756037 34884243 34933168 34818688 34704101 34748723 34874355 34922295 34909867 34959412
8115 34959412 35068413 35139025 35183038 35308328 35514397 35678889 35768336 35904833 36174769 36500621
8105 36500621 36766582 36971197 37185231 37431727 37680515 37919817 38173873 38466478 38797956
8096 38797956 39143081 39462419 39741955 40022793 40353530 40710985 41016130 41239500 41441007
8087 41441007 41686564 41974550 42271213 42568999 42867601 43136218 43350969 43555485 43831332
8078 43831332 44202396 44607970 44983110 45331760 45696744 46084271 46460694 46823113 47227526
8069 47227526 47717336 48250766 48742362 49171711 49608193 50117344 50681431 51237747 51768320
8060 51768320 52316718 52921441 53560403 54174773 54744220 55324529 55988365 56726660 57449238
8051 57449238 58112609 58800326 59611979 60505768 61344687 62092930 62858034 63714237 64599130
8042 64599130 65442801 66289706 67204220 68150178 69076243 70043546 71133617 72281906 73355292
8033 73355292 74375071 75502822 76791216 78109651 79366654 80652441 82071680 83565911
8025 83565911 85028548 86508126 88151320 89975781 91833469 93612790 95376204 97262533
8017 97262533 99318953 101470308 103623319 105773924 108020288 110469735 113120947 115854402
8009 115854402 118566682 121301010 124209129 127386653 130781470 134275196 137831023 141541781
8001 141541781 145533037 149831427 154352912 159037659 163964497 169274089 174985987 180971185
7993 180971185 187131729 193520219 200214745 207147994 214160958 221187396 228270845 235399452
7985 235399452 242430441 249203953 255641937 261698220 267294121 272358502 276870785 280812407
7977 280812407 284132067 286818083 288957952 290661315 291959983 292851585 293414131 293800874
7969 293800874 294126262 294420126 294693404 294984785 295326217 295709396 296104538 296481255 296801616
7960 296801616 297015778 297060456 296839207 296228045 295143910 293584881 291548820 288944187 285670694
7951 285670694 281779656 277445152 272749714 267608702 261966894 255971940 249863976 243765380
7943 243765380 237680976 231653813 225801240 220207772 214888457 209872666 205240744 201054149
7935 201054149 197308596 193970287 191008485 188392503 186115394 184222540 182757373 181680458
7927 181680458 180909012 180434879 180324843 180598368 181195795 182091299 183344821 185000633 187020262
7918 187020262 189367223 192075109 195166319 198575010 202218070 206068611 210078142 214100056
7910 214100056 218001275 221805781 225613588 229401059 233014264 236349959 239423791 242243104
7902 242243104 244725599 246789282 248438694 249716605 250640834 251232470 251539905 251584202 251334760
7893 251334760 250784851 249994485 249005928 247776245 246266613 244553082 242761020 240914381
7885 240914381 238946637 236859761 234766482 232737335 230698977 228553973 226332482 224132486
7877 224132486 221949741 219677276 217272407 214813108 212354533 209831319 207165166 204381680
7869 204381680 201534070 198583125 195463310 192221635 188971380 185737323 182476395 179229225
7861 179229225 176082134 172948619 169562231 165776704 161744179 157705101 153727506 149761304
7853 149761304 145815731 141916990 137971873 133853673 129601091 125388038 121314520 117363816
7845 117363816 113553129 109981372 106707996 103700316 100922169 98380520 96075739 93992851
7837 93992851 92138434 90501985 89004797 87589326 86331852 85350236 84626405 84046506 83586718
7828 83586718 83317213 83257708 83395509 83800084 84486406 85159524 85365760 84998482 84442659 84111968
7818 84111968 84031999 83970800 83750678 83282043 82507715 81523532 80607988 79944705 79441183 78978856
7808 78978856 78672499 78669627 78840251 78915216 78837661 78740912 78661462 78523058 78351051 78251739 78196131
7797 78196131 78046150 77783045 77509396 77253853 76979408 76744264 76628238 76537701 76330525 76104704
7787 76104704 76091537 76274822 76411398 76442696 76570003 76880384 77240407 77641173 78264547 79029526
7777 79029526 79438330 79148787 78428204 77759631 77231748 76611321 75799400 74857241 73713280
7768 73713280 72216883 70457401 68729479 67180937 65741250 64383233 63203192 62225448
7760 62225448 61351427 60532715 59807821 59156760 58505243 57884007 57403385 57061520 56757126
7751 56757126 56494077 56378398 56397404 56403984 56353637 56359142 56468512 56594527 56726066 56997488
7741 56997488 57452101 57933264 58332497 58770770 59391789 60125021 60811921 61451802 62162979
7732 62162979 62986051 63881744 64866510 66004376 67290825 68660839 70094434 71625566 73270972
7723 73270972 75025182 76895731 78879820 80945746 83090999 85357552 87727161 90078448
7715 90078448 92334158 94578301 96923915 99327882 101654787 103875781 106073385 108273036
7707 108273036 110399344 112396330 114271315 116012534 117577354 118977666 120265219 121408910
7699 121408910 122303628 122944710 123476345 123989843 124369386 124439353 124202582 123820807 123385916
7690 123385916 122823016 122029235 121004432 119794422 118378473 116691016 114729857 112571740
7682 112571740 110274937 107821507 105175611 102353258 99401490 96343249 93186924 89972342
7674 89972342 86762357 83594660 80480223 77442957 74518496 71715101 69019240 66441105
7666 66441105 64007864 61709417 59509011 57423932 55532214 53860633 52319242 50803602
7658 50803602 49331582 48017978 46917855 45944749 44960520 43921677 42916704 42059387 41359290
7649 41359290 40718496 40056662 39397279 38798330 38242959 37668462 37082479 36563477 36136376
7640 36136376 35728353 35272622 34783684 34302935 33845581 33436702 33118065 32864410 32566664
7631 32566664 32166635 31749550 31433018 31215570 31006921 30760729 30498826 30242410 30002849
7622 30002849 29816491 29707755 29627687 29496389 29299682 29092540 28926125 28820946 28779325 28762151
7612 28762151 28684817 28506266 28296800 28150888 28065669 27981717 27905017 27887261 27904046 27861386 27728888
7601 27728888 27572292 27446491 27346519 27269186 27222194 27154255 26979704 26707529 26451212 26268045
7591 26268045 26079591 25803689 25476553 25172118 24872622 24506775 24075458 23656385 23297226
7582 23297226 22967006 22612065 22216930 21808157 21425161 21089811 20795626 20529286 20291308
7573 20291308 20072768 19830686 19535682 19238508 19029043 18918042 18817071 18654712 18458077
7564 18458077 18294871 18186253 18106868 18027351 17926713 17797606 17662468 17554708 17474337 17396626
7554 17396626 17320650 17258661 17186492 17077743 16986534 17002629 17103149 17150049 17079701 16995742 17007519
7543 17007519 17069594 17073744 17029115 17040933 17142568 17248396 17271655 17222640 17190256 17263046 17446778
7532 17446778 17632711 17695179 17656935 17688501 17883697 18116515 18217703 18223463 18313757 18534840
7522 18534840 18734916 18795530 18788629 18842040 18954843 19033676 19049016 19061712 19112924 19165994 19173543
7511 19173543 19153916 19168894 19241579 19328022 19378369 19402067 19448589 19538408 19645926 19742166 19814482
7500 19814482 19849887 19849071 19855960 19912457 19979411 19977515 19921476 19921648 20014780 20093184 20069075 20015708
7488 20015708 20053109 20170802 20272288 20338149 20428427 20559161 20691524 20824057 20988365 21164118
7478 21164118 21298111 21400710 21531518 21701269 21881206 22092243 22377602 22693549 22938729
7469 22938729 23097940 23251162 23433821 23599781 23737179 23901987 24100739 24247882 24290323 24290594
7459 24290594 24342930 24477376 24675420 24907771 25134540 25340421 25580294 25910883 26281512 26595893
7449 26595893 26879371 27254543 27734758 28187781 28544956 28894282 29300785 29689204 30001125
7440 30001125 30325125 30746490 31186180 31526645 31803322 32128229 32498229 32829494 33135354
7431 33135354 33521709 34020584 34553879 35063940 35580054 36149211 36776020 37433303 38081983
7422 38081983 38696101 39301921 39948956 40610285 41184957 41647564 42104556 42634543 43174939
7413 43174939 43655284 44130317 44662360 45183956 45629119 46102968 46740569 47470533 48117195
7404 48117195 48690169 49360202 50165152 50960902 51683107 52442286 53307266 54193545 55042267
7395 55042267 55930945 56915661 57921193 58884793 59867339 60922627 61987735 63005101 64028777
7386 64028777 65103666 66162840 67164491 68213000 69402440 70636704 71761629 72807903
7378 72807903 73941612 75210575 76495946 77707780 78885860 80087985 81299178 82490706
7370 82490706 83681307 84897253 86128415 87356034 88588611 89855395 91189554 92614384
7362 92614384 94119019 95661781 97230591 98883126 100689104 102645829 104687417 106768968
7354 106768968 108913119 111183462 113632364 116259419 119007240 121821234 124721138 127777174
7346 127777174 131008733 134360736 137801955 141392832 145230049 149379610 153891478 158818401
7338 158818401 164190196 170038609 176480598 183689968 191721607 200419316 209529297 218817582
7330 218817582 228050342 237024706 245761595 254574218 263794816 273480483 283504285 293867233
7322 293867233 304790614 316591445 329658202 344495339 361548438 380922279 402391130
7315 402391130 425605646 449954149 474082853 495861149 513232972 525251573 532262727
7308 532262727 535130598 534334363 529674718 520619926 506864885 488699185 467025380 443119408
7300 443119408 418336990 393883318 370646427 349118947 329465910 311674304 295630184
7293 295630184 281112955 267842139 255588447 244202570 233542958 223465997 213911852
7286 213911852 204907415 196437343 188388223 180661037 173250501 166155090 159296982 152611060
7278 152611060 146142164 139970110 134099664 128509213 123243434 118352257 113784723 109456242
7270 109456242 105388371 101657383 98212809 94879510 91571776 88395110 85482586 82817080
7262 82817080 80282129 77825677 75493445 73324717 71287297 69326655 67435332 65646075
7254 65646075 63968394 62360235 60780158 59253429 57848971 56580744 55370465 54134711
7246 54134711 52875417 51648563 50476102 49339913 48242003 47210075 46244367 45313287
7238 45313287 44410904 43571401 42810024 42088939 41364238 40640798 39959782 39346773 38786227
7229 38786227 38239433 37683711 37139754 36653846 36242765 35868445 35481296 35070128 34647159
7220 34647159 34206736 33736539 33256255 32800519 32362448 31892845 31362155 30790723 30210345
7211 30210345 29627092 29034609 28439749 27859719 27305801 26776661 26261106 25751313 25260222
7202 25260222 24810749 24394454 23964875 23498552 23039495 22645970 22311261 21980748 21634391
7193 21634391 21302104 21002060 20716870 20436145 20171685 19918811 19650936 19369031 19110405
7184 19110405 18886797 18657209 18390530 18117615 17886750 17693300 17487487 17238095 16963162
7175 16963162 16705776 16493112 16308674 16099662 15829809 15527749 15257803 15039106 14826186
7166 14826186 14579475 14320084 14096754 13927640 13791602 13650160 13465604 13228802 12981185
7157 12981185 12773937 12596007 12389885 12152527 11956220 11834141 11713942 11525144 11311754
7148 11311754 11156435 11038543 10868658 10643476 10455812 10343080 10236422 10095136 9985536
7139 9985536 9959384 9940356 9824047 9638044 9502965 9457251 9417552 9314780 9179175 9064942
7129 9064942 8965730 8848002 8716235 8598672 8500055 8405461 8307082 8201477 8089509 8000339
7119 8000339 7971929 7975286 7912480 7747288 7587903 7556646 7609566 7588341 7445950 7305861 7267618
7108 7267618 7266816 7194934 7064930 6964209 6905792 6830554 6724829 6633119 6562410 6467717 6340690
7097 6340690 6229781 6156032 6084609 6003380 5956859 5965835 5976483 5935919 5868526 5825610 5797035
7086 5797035 5731240 5623909 5528664 5477969 5442442 5388006 5337927 5340032 5380166 5372819 5264941
7075 5264941 5119296 5044701 5053675 5055306 5001249 4957547 4983625 5017982 4967401 4854893 4778928
7064 4778928 4758749 4729002 4674303 4654221 4684435 4700286 4661571 4597956 4530657 4448671 4382215
7053 4382215 4386570 4423264 4383489 4275904 4250876 4361386 4443394 4348989 4172232 4100165 4141105
7042 4141105 4163500 4130244 4117291 4138217 4124685 4072279 4047225 4047250 4008901 3960069 4003230 4116861
7030 4116861 4134820 3983626 3798842 3729946 3752213 3757329 3723614 3698535 3691262 3676196 3649040
7019 3649040 3608572 3538113 3464431 3468011 3567895 3662607 3657710 3587557 3534080 3494761 3428811 3375234
7007 3375234 3404612 3479339 3481648 3384678 3290533 3276575 3296307 3273351 3220964 3210551 3259866 3307245
6995 3307245 3289802 3212967 3136444 3107789 3121811 3143630 3155311 3163347 3169918 3162985 3135421 3092641
6983 3092641 3045855 3019241 3044215 3107013 3126083 3044138 2926378 2887448 2927671 2939721 2885165
6972 2885165 2846215 2868781 2884312 2853445 2855496 2935148 2983535 2904630 2794412 2794330 2850833 2809680
6960 2809680 2697229 2691637 2813872 2868658 2751014 2613025 2624781 2732921 2783294 2756352 2738137
6949 2738137 2744898 2722251 2671314 2645162 2642494 2616738 2579680 2594656 2665812 2723241 2727869 2713977
6937 2713977 2713109 2705007 2666741 2613882 2567378 2525367 2493720 2504294 2569270 2642469 2660845 2617435
6925 2617435 2567981 2563619 2595736 2617805 2609803 2598513 2610195 2630043 2630792 2619836 2623828 2641515
6913 2641515 2654382 2673158 2718930 2759558 2733160 2653908 2623985 2699056 2802031 2824915 2768374
6902 2768374 2717962 2717263 2731714 2719512 2678334 2632446 2621057 2679562 2781591 2828170 2761897 2668768
6890 2668768 2682800 2797379 2867496 2815938 2738759 2759597 2864141 2947604 2963384 2943736 2912152
6879 2912152 2862205 2813329 2811246 2863073 2927484 2977675 3024841 3072571 3101174 3112122 3136094 3175430
6867 3175430 3191710 3181311 3206720 3302396 3399393 3414443 3380830 3405240 3505988 3589077 3599897
6856 3599897 3602801 3667763 3765850 3842132 3916739 4028558 4138441 4190675 4230575 4344488 4498442
6845 4498442 4562562 4509675 4462613 4499636 4531805 4447456 4277876 4123919 3996099 3839986 3671302
6834 3671302 3565445 3526202 3471627 3356635 3220019 3099693 2987841 2889867 2842573 2835647 2787193
6823 2787193 2648986 2485226 2395064 2392949 2413053 2401598 2353154 2274956 2173180 2079074 2040305
6812 2040305 2060941 2075563 2015481 1898862 1824573 1855279 1926224 1913242 1795890 1697710 1724296
6801 1724296 1808365 1791080 1643288 1514860 1533639 1634227 1652935 1545284 1424552 1392908
6791 1392908 1418607 1411835 1358968 1322785 1337672 1368673 1377122 1371594 1372076 1368174 1346430 1323489 1309946
6778 1309946 1272182 1186547 1111285 1133190 1240253 1317738 1288816 1194584 1112436 1065645 1049894
6767 1049894 1076393 1131292 1151485 1105041 1048201 1041720 1061616 1060086 1059169 1099078 1142167 1126745
6755 1126745 1079802 1071152 1085012 1052976 995410 1001124 1067244 1094585 1060593 1057987 1121420 1153399
6743 1153399 1087637 1000953 980917 992471 969203 941090 968437 1025188 1049185 1044721 1040451 1009147
6731 1009147 928412 860891 868182 897989 868062 815253 839212 929461 974843 933237 873133 847517
6719 847517 838169 831239 841721 850155 813790 754980 744249 781380 787498 731834 672689 653903
6707 653903 655668 668932 718418 782348 790737 741659 718704 748802 748739 673025 608698 639644 708357
6694 708357 712956 671192 677235 738299 764748 710653 632466 601644 624644 659074 666304 643755
6682 643755 626283 643031 665704 640192 581136 569734 627010 667997 636130 600402 637754 693938
6670 693938 666773 572051 508481 495112 470734 436088 461133 544144 596130 592004 609181 672079
6658 672079 686167 598732 511492 535401 620141 638162 577827 536340 553861 572041 553426 534468
6646 534468 539701 534584 500567 483633 519674 565741 560732 519379 507258 537588 552084 513718
6634 513718 469505 488972 564871 614262 578690 491607 431870 433808 467747 494670 505775 507268
6622 507268 501140 496462 512294 547522 568269 549396 511659 491242 488628 481245 473894 491560 521996
6609 521996 515756 461202 413809 420354 452761 457123 436221 432792 452378 460917 451058 451333 467248
6596 467248 472812 468686 484005 503708 467462 376084 324893 375421 459125 476523 432897 395483
6584 395483 371852 331538 306508 351906 426362 435311 390431 395548 461216 475632 400156 348958
6572 348958 403125 479634 478457 437301 428443 414934 344206 288877 339662 429906 432038 376207
6560 376207 393778 472467 464607 350489 294827 383083 478414 433301 301481 232104 261422
6549 261422 317968 353946 368825 358732 327991 309122 313138 311232 305854 341079 395556 369758
6537 369758 255906 208857 334653 504988 523058 402417 321861 347164 373527 341132 329174
6526 329174 389340 439679 405767 353319 385035 480954 535129 507653 456325 435367 433777 421151
6514 421151 406205 422039 463778 469225 390956 281849 254987 333891 407247 388427 350070 402649
6502 402649 495456 479193 352314 283788 354351 432940 392003 304954 308236 376914 388853 344482
6490 344482 356051 436698 462751 374255 275073 274207 333875 349896 306376 268872 271478 289241
6478 289241 299509 303320 294868 266040 240574 256574 310908 358699 369798 348898 301759 231320
6466 231320 178103 206601 315562 408753 404988 340784 303446 295744 254420 191636 203692 301911
6454 301911 347657 242584 98457 97720 232642 320647 271172 192125 194937 232918 216476 178836
6442 178836 210496 294031 327352 283845 234510 216203 189670 147340 156000 242713 323431 313803
6430 313803 251955 234616 269311 276196 226580 190222 219308 260727 239546 181699 179809 251693
6418 251693 310284 291537 243039 242813 284744 306200 292383 277864 261314 203390 116733 74315
6406 74315 100611 132222 127268 135469 196699 241080 180122 54157 -8812 35803 111502 150831
6394 150831 171581 207424 245194 262331 263583 253273 227157 211054 243131 294643 281788 193134
6382 193134 128812 159418 220003 216632 172006 172107 216262 228482 194596 174853 181312 159484
6370 159484 115679 144393 270657 368277 324371 211792 190824 278949 332801 258373 134027
6359 134027 90973 151106 235079 278823 282594 267452 237532 191035 139922 107888 113710 153624
6347 153624 199380 223845 227175 222126 200439 145636 81214 63940 109951 165933 181811 175398
6335 175398 187914 211491 213972 210661 244683 299595 299716 217204 123844 103931 153324 199234
6323 199234 195466 164097 152898 177849 210863 216539 197433 190878 211446 220495 183465 135212
6311 135212 138789 189750 221209 205689 185379 187016 179857 150909 149356 202958 251344 228845
6299 228845 167507 145176 164156 159392 112163 79576 106290 166801 206996 200720 158940 116427
6287 116427 110547 147444 195768 230859 260306 285129 278286 237756 211441 220105 211052 153368
6275 153368 117900 172901 255561 259404 206065 198183 229886 199833 114534 109286 224509 322081
6263 322081 295915 219743 195526 192736 153894 139377 225870 346147 375279 320043 285765 298091
6251 298091 295474 272332 290057 345460 353821 282512 201465 180429 217218 278204 333374 345794
6239 345794 301591 254156 267566 320182 339854 325609 345900 415461 465161 446279 382809 311575
6227 311575 252313 241669 306322 392072 411744 373999 365932 397913 384553 309887 283796 374219
6215 374219 497294 547887 536754 517965 480809 412381 380342 439556 520559 525868 487813 512085
6203 512085 597400 634185 575490 497040 475711 503046 538584 567308 579264 561068 536013 557036
6191 557036 632208 701426 711349 676940 647615 644652 655073 664260 670582 676608 683964 700746 744811
6178 744811 821785 892900 894540 823069 770529 815147 894885 876130 752717 675014 746551 892767
6166 892767 988184 1015680 1022776 1012719 977855 966211 1009632 1049530 1038693 1047543 1148147 1260989
6154 1260989 1263260 1197967 1212166 1318213 1389863 1383700 1381031 1402180 1375981 1330095 1405199 1603795
6142 1603795 1725555 1666243 1594916 1684392 1830623 1829812 1711311 1676856 1774787 1855473 1841151
6131 1841151 1835060 1920186 2018332 2027714 1983037 1990013 2069823 2148349 2168396 2151934 2154970 2196644
6119 2196644 2248225 2287367 2340867 2444117 2569504 2648060 2670419 2705295 2796717 2909163 3005485
6108 3005485 3106951 3232892 3354075 3457237 3582610 3743798 3890524 4009172 4168895 4399033
6098 4399033 4622470 4792280 4982103 5246165 5519435 5772443 6112354 6580470 7030707 7420575
6088 7420575 8021864 9033713 10171143 11068021 11975433 13488343 15493783 16987278 17246437
6079 17246437 16720222 16351400 16394459 16391272 16030196 15424246 14620795 13437827 11912935 10457787
6069 10457787 9374532 8548556 7786347 7147845 6739408 6438008 6061743 5638763 5292833
6060 5292833 5002958 4678423 4358257 4139761 3990337 3806452 3593839 3428600 3298956 3141503
6050 3141503 2984427 2900659 2854863 2744341 2567945 2417913 2324867 2242515 2166141 2130791 2103187
6039 2103187 2011742 1882454 1810434 1791689 1722258 1582932 1483925 1487678 1518586 1498981 1452397
6028 1452397 1413442 1353083 1264641 1215159 1229995 1225937 1149140 1086126 1131517 1223811 1232134 1149622
6016 1149622 1075665 1043214 995269 922512 893692 926819 941146 879532 792920 755616 763849 768957
6004 768957 760772 765801 791727 815330 810390 765524 694601 644010 660189 729444 778103 756610
5992 756610 699474 676396 704944 740733 740786 706468 665221 632646 600322 554156 500375 467771
5980 467771 475669 505135 518607 506528 494850 505413 530947 552050 554331 525272 465132 410258
5968 410258 408685 451630 466793 414866 359939 390848 486508 522836 430165 291742 246358 321564
5956 321564 410742 410475 332883 263283 248081 270578 318238 406532 514911 561330 497360 392422
5944 392422 353394 378129 371494 308985 283992 350025 412264 360146 239740 187179 227029 256373
5932 256373 226482 215123 278690 341664 308081 209478 157385 191443 254438 293104 307141 306678
5920 306678 290291 270620 267525 271412 260751 252426 277194 304613 264140 161816 102786 154161
5908 154161 248752 283880 260446 245696 240989 192968 127673 151415 276389 356078 280113 151387
5896 151387 150885 270742 324643 229817 127121 153626 228475 187973 47687 -23470 40798
5885 40798 131487 159226 166779 193329 173506 72465 3541 76705 208303 231418 149816 118671
5873 118671 182140 205861 113059 22875 60731 160267 175912 104259 60540 86012 112792 103753
5861 103753 102020 127858 132689 89336 46797 55327 95019 112797 86553 30337 -22958 -30926
5849 -30926 20144 76851 72381 28912 40129 128977 196739 158464 62934 16215 36559 57145
5837 57145 42877 31697 65462 133760 188186 181638 106992 23673 17391 97979 171859 160408
5825 160408 104669 91561 117050 107963 57243 36830 68697 80535 23688 -44817 -45640 15799
5813 15799 73059 86443 64424 30987 9711 16587 41115 54570 50588 49795 56771 50283 25878
5800 25878 7176 6848 20122 56299 117297 147141 85534 -15918 -29598 62517 124525 62345
5788 62345 -44843 -85071 -74710 -75013 -52655 39081 121317 89780 1187 -4640 64364 72732
5776 72732 -3595 -40575 15061 69091 59961 41171 30997 -40668 -157725 -169973 -28937 95658
5764 95658 67667 -3995 35637 121576 96780 -6128 -31561 20581 14072 -54823 -41838 75615
5752 75615 135703 55863 -37777 -26647 27469 26827 4807 28428 53189 6083 -70211 -81942
5740 -81942 -36336 -14505 -30257 -20150 43883 116908 147753 123087 59506 -1908 -18642 -4814
5728 -4814 -27654 -102857 -144958 -81632 31584 83368 55373 21700 26654 42243 36035 11297
5716 11297 -17336 -33986 -16849 29365 56114 34185 5417 17197 42114 30034 2043 10369
5704 10369 38021 33327 17441 46962 84989 38213 -69009 -97082 -7186 63249 12236 -68334
5692 -68334 -49837 25167 26915 -40057 -51080 26428 81072 35089 -51343 -95832 -109623 -134958
5680 -134958 -146377 -94733 -6047 40548 17722 -28430 -54552 -61460 -57112 -33673 -1098 1529
5668 1529 -40348 -81871 -71353 -17625 28005 39467 28557 5450 -25815 -37824 -99 63121
5656 63121 89817 70714 64076 92970 93737 18135 -70251 -73013 4734 66422 55876 10291 -7036
5643 -7036 31720 110479 168495 133958 19863 -50604 6256 102742 103573 39727 52051 136830
5631 136830 130846 -10303 -108563 -33941 90566 91836 13694 10430 76064 74901 -9354 -50403
5619 -50403 317 46012 20630 -20299 -24420 -25259 -50531 -61839 -40446 -36106 -75583 -106043 -81928
5606 -81928 -36076 -17868 -24979 -34718 -41928 -37711 -14338 -7941 -59507 -121607 -101116 -13899 19449
5593 19449 -31583 -49141 32948 109288 80316 18698 29864 60676 5344 -83961 -72003 21842
5581 21842 44629 -43198 -117539 -102424 -67325 -75073 -83180 -53038 -25003 -19525 16511 91953
5569 91953 112260 25011 -72627 -69314 -3836 8466 -48070 -93911 -94528 -90356 -104073 -111087 -100147
5556 -100147 -88502 -77698 -57450 -47692 -74133 -107933 -95657 -49658 -40078 -84011 -108285 -52316
5544 -52316 42582 85200 44849 -27842 -75873 -96333 -119813 -151305 -156297 -113550 -60342 -53685
5532 -53685 -91573 -113200 -85648 -44946 -30252 -25803 -4882 12049 -8148 -50811 -77411 -83251
5520 -83251 -82296 -62959 -14756 26371 20237 -11561 -24724 -32998 -74945 -120414 -101615 -34564 -12257
5507 -12257 -61645 -103912 -87795 -67831 -100241 -144784 -135221 -83425 -46149 -36581 -31986 -30682 -42688
5494 -42688 -53468 -46230 -33679 -30330 -26528 -20667 -32367 -52755 -39299 2319 612 -67179 -120215
5481 -120215 -99583 -65547 -83024 -96462 -35757 28338 -18965 -132699 -162660 -91460 -50097
5470 -50097 -90854 -117936 -78819 -52800 -83842 -86795 -12701 36842 -25152 -113436 -105959 -36977
5458 -36977 -17461 -41868 -21379 42235 64015 31740 15623 27823 1353 -77046 -125749 -89262
5446 -89262 -15328 15367 -26042 -110904 -174962 -153875 -59484 -1247 -57027 -149149 -144227 -53421
5434 -53421 -13740 -71120 -115377 -62626 23418 46908 6175 -60419 -153209 -255349 -284401 -193559
5422 -193559 -62456 -1009 -10011 -17305 -6392 -18789 -55943 -68353 -38183 -2521 7008 -5925
5410 -5925 -29945 -56122 -65169 -46402 -24024 -29481 -58279 -86143 -109559 -133971 -142577 -119607 -87972
5397 -87972 -79990 -84493 -68308 -39661 -40726 -76096 -94292 -55327 11814 36929 -13900 -95974
5385 -95974 -127748 -83473 -29800 -42315 -101849 -123899 -83270 -39838 -32290 -28969 -12566 -24220
5373 -24220 -72958 -89541 -40662 -6019 -53730 -114064 -83534 5000 34604 -15003 -61293 -67092
5361 -67092 -70855 -81316 -64833 -37740 -53192 -90723 -76849 -24790 -29069 -99824 -130938 -71825
5349 -71825 -7137 -11422 -38013 -17238 34584 71010 90962 95195 53951 -18177 -39551 21469
5337 21469 88069 94028 72855 64783 35256 -32428 -63369 -9424 48901 27188 -21218 -7304
5325 -7304 31920 13845 -15559 48830 162944 166001 26894 -97955 -87411 -5265 22201 -27368
5313 -27368 -86522 -104355 -86905 -75234 -107814 -169802 -185899 -113991 -26519 -27692 -105151 -147245
5301 -147245 -101518 -27819 9084 10905 -2219 -28458 -55851 -67018 -79717 -116927 -146598 -130379
5289 -130379 -112974 -161203 -229382 -208939 -111526 -63413 -99085 -112325 -56230 -31503 -97157 -147269
5277 -147269 -90231 -19903 -68727 -187866 -223359 -147366 -66733 -38069 -14318 33482 62356
5266 62356 36336 -28721 -103683 -160245 -157958 -87856 -14592 -5636 -36093 -33707 4500 19504
5254 19504 -4290 -26191 -34741 -61802 -106710 -122875 -92582 -52171 -32765 -30870 -42691 -74207
5242 -74207 -111338 -125695 -111766 -82867 -44185 -8529 -11988 -63776 -110448 -107555 -92853 -120758
5230 -120758 -160854 -144433 -82063 -43403 -43288 -44653 -53157 -99162 -138164 -91482 8511 38307
5218 38307 -32506 -100353 -99137 -84074 -100241 -97663 -43044 3751 1667 4459 40379 29631 -72448
5205 -72448 -154422 -100393 17428 38011 -51250 -119328 -101881 -64440 -61831 -67575 -59871 -65457
5193 -65457 -92312 -110050 -116080 -136943 -152873 -111837 -33364 -2151 -34662 -51727 -18773 -8002
5181 -8002 -63861 -108016 -62419 14208 14131 -50750 -76735 -35234 -2347 -25551 -64293 -81988 -103742
5168 -103742 -143987 -155495 -105089 -40938 -23054 -30650 -6040 39167 37436 -23525 -77321 -77981
5156 -77981 -56799 -57206 -71868 -76816 -74548 -62790 -12441 68810 97008 9866 -121358 -159518
5144 -159518 -78464 6161 -2594 -65575 -83881 -33098 24935 27999 -30688 -110049 -151890 -121079
5132 -121079 -41727 17473 10398 -43903 -90701 -94281 -60781 -26863 -26092 -49136 -50992 -22403 -22283
5119 -22283 -88185 -148925 -108551 1335 55840 24546 5239 41732 39975 -64690 -176879
5108 -176879 -178263 -100818 -52349 -48249 -39000 -39499 -93726 -151945 -125065 -44276 -29374 -98630 -143377
5095 -143377 -106843 -59902 -66614 -91487 -85853 -65435 -52881 -32239 -9941 -38644 -126795 -195766
5083 -195766 -180042 -110978 -58056 -46225 -69145 -118959 -159596 -134365 -48409 13110 -5300 -56474
5071 -56474 -70574 -50880 -42008 -55827 -78328 -103311 -115310 -85737 -24596 14791 16098 22660
5059 22660 44548 22147 -63162 -125107 -96486 -44407 -69240 -145792 -167809 -114182 -67829 -84216
5047 -84216 -131843 -159925 -150832 -108360 -55580 -35197 -58021 -70695 -29397 22735 13476 -52635
5035 -52635 -110444 -124126 -95917 -27376 50843 58050 -33354 -119162 -97554 -37468 -76429 -180294
5023 -180294 -172897 -17671 104132 53989 -78842 -136064 -101997 -55193 -18111 28193 56835
5012 56835 36641 8235 19349 30587 -20459 -103522 -137906 -115221 -89878 -80770 -73250 -84016
5000 -84016 -123331 -124154 -25743 88983 71290 -68703 -151319 -80649 22902 13442 -74657 -111951
4988 -111951 -74104 -36857 -28595 -14915 -3403 -38259 -92102 -83361 -18369 1992 -48308 -66596
4976 -66596 1289 51804 -8184 -89939 -57968 36385 24052 -105584 -176539 -97846 6676
4965 6676 4757 -58833 -77477 -55360 -48288 -34908 21056 57264 1081 -82994 -76741 -3018 8883
4952 8883 -65100 -116513 -92845 -64540 -76839 -76836 -36856 -21180 -63711 -91185 -45518 10486 -7818
4939 -7818 -76131 -110993 -93883 -69973 -64986 -69448 -76414 -84785 -88587 -91455 -101270 -99697 -65277 -30276
4925 -30276 -47118 -93887 -97292 -57059 -45591 -70191 -59183 -13656 -28037 -105583 -114087 -14020
4913 -14020 35026 -76258 -208025 -186443 -80534 -67418 -129918 -111769 -5654 47052 14468
4902 14468 3153 30199 -8596 -114518 -144341 -48442 42342 34718 -209 9038 15219 -17198
4890 -17198 -24380 17566 16073 -70531 -130485 -77703 -3054 -22633 -90637 -93857 -33737 15197
4878 15197 41007 61952 40015 -46374 -117522 -104093 -68894 -91995 -115992 -50446 42753 32262
4866 32262 -65034 -116858 -93091 -81538 -104411 -91761 -40013 -26898 -49259 -12034 86548 122125
4854 122125 49435 -15463 10633 47472 4511 -66675 -80655 -68559 -100040 -139066 -102670 -8314
4842 -8314 52694 50493 22644 -19315 -84467 -129729 -101939 -45253 -60924 -150646 -199727 -142625
4830 -142625 -54437 -33372 -67871 -81147 -55417 -42854 -75539 -124568 -146978 -131811 -97846 -75323
4818 -75323 -87610 -123450 -134267 -93106 -48936 -74016 -152888 -184859 -123957 -51985 -58600 -107257
4806 -107257 -102230 -46502 -25162 -46577 -26283 48970 71384 -14110 -105831 -103151 -62010 -79632
4794 -79632 -116134 -73752 10220 12569 -63046 -90915 -41522 -24087 -80628 -108332 -52205 -14206
4782 -14206 -72027 -129538 -73422 33353 57158 9672 5027 53635 58073 -3236 -42730 -28024
4770 -28024 -38515 -116075 -178790 -146500 -62155 -18935 -31330 -46471 -39757 -36862 -63831 -118546
4758 -118546 -172671 -177179 -99450 18733 82881 59807 21493 29187 31781 -42242 -137378 -127957
4746 -127957 -16262 49278 -9781 -85572 -59482 9780 -8662 -95571 -114025 -41351 -7525
4735 -7525 -75008 -136111 -101745 -53396 -94926 -162114 -122117 4731 74008 37832 -10818 -11055
4723 -11055 -9322 -38782 -52582 -21946 4671 -11895 -44121 -65194 -86080 -91999 -39710 40917
4711 40917 47481 -38215 -100234 -63736 -13686 -51410 -131968 -149897 -103471 -59430 -24562 26194
4699 26194 51347 649 -69759 -66951 -15382 -14456 -65798 -78069 -36251 -25628 -70648 -84668
4687 -84668 -21120 40926 18059 -59713 -107548 -94937 -50755 -12021 -1454 -16064 -25846 -22416
4675 -22416 -52623 -141516 -208383 -153851 -20046 44177 -14938 -99560 -123289 -114448 -120652 -122487
4663 -122487 -95611 -65605 -51164 -35939 -31383 -72640 -121780 -90622 -1908 3602 -115752 -216427
4651 -216427 -186903 -110712 -99622 -102708 -30716 47767 13245 -84893 -104265 -52465 -61866 -146462
4639 -146462 -177419 -107698 -37575 -26396 -11114 38507 44865 -26532 -82637 -54301 -13119 -47020
4627 -47020 -120305 -150068 -135764 -118793 -87340 -19564 36104 20852 -35050 -59442 -49062 -50048
4615 -50048 -61821 -50128 -33714 -64281 -123831 -131076 -64363 -2264 -16958 -88125 -149685 -169186
4603 -169186 -150215 -103759 -57592 -58699 -118329 -171675 -139827 -33091 46617 20295 -78346 -145878
4591 -145878 -122727 -41296 26725 41824 14417 -21776 -40624 -40786 -40594 -48570 -43937 -6380 39502
4578 39502 42627 -5745 -58212 -79294 -85910 -97235 -91077 -51449 -19073 -37835 -76456 -66807 -10462
4565 -10462 17914 -18959 -66738 -61588 -22794 -23665 -85607 -140132 -113573 -31621 2440 -48510
4553 -48510 -86184 -16086 86348 63742 -72453 -128189 -17395 91992 36999 -80535 -65957
4542 -65957 44302 48047 -85305 -177452 -144977 -107648 -142374 -150702 -67441 -5913 -67554 -165976
4530 -165976 -177911 -135598 -128385 -131282 -80553 -21288 -28503 -62404 -48090 -23374 -58957 -104095
4518 -104095 -70238 -4861 -13895 -63774 -40274 34201 35183 -30432 -30355 42802 38302 -86335 -167265
4505 -167265 -89385 36154 59537 9988 -362 25541 4013 -72170 -134137 -148046 -127779
4494 -127779 -77223 -5153 37880 13432 -41564 -63455 -41403 -2526 37258 60323 37004 -20848
4482 -20848 -49844 -29963 -28121 -87342 -139672 -106671 -27457 1989 -29436 -59051 -65759 -77866
4470 -77866 -92006 -83587 -83433 -141848 -215501 -193008 -57194 67180 66663 -29065 -110680 -127051
4458 -127051 -108501 -90109 -69440 -36575 -6655 -5564 -32680 -53172 -36927 3523 33273 45047
4446 45047 53943 44218 -24117 -135148 -200951 -166774 -84945 -36686 -25924 -8091 17404 14345
4434 14345 -18037 -51030 -84559 -128056 -141443 -76919 23570 54979 -14199 -104484 -141287 -137971
4422 -137971 -137704 -138384 -115502 -73802 -37985 -20803 -23722 -41747 -54724 -46778 -42488 -81321 -143746
4409 -143746 -153167 -78630 8468 18090 -47008 -100852 -79232 -3710 52736 41378 -20884 -73739
4397 -73739 -73648 -31552 6404 2642 -49420 -122800 -166381 -147138 -99585 -95492 -141717 -158420 -95601
4384 -95601 -10773 26541 40682 75804 80879 -11737 -133988 -149270 -62044 -15646 -69499 -128310
4372 -128310 -125522 -119540 -144128 -118832 -6474 76808 29939 -66242 -79185 -25549 -5086 -19115
4360 -19115 -7882 -2895 -74776 -167131 -152601 -43493 17964 -13911 -35388 5167 16015 -66987
4348 -66987 -161199 -171715 -129105 -103217 -77319 -8212 62020 59190 -2186 -43732 -40898 -35048
4336 -35048 -46955 -54045 -49755 -61259 -99268 -135827 -143875 -129601 -115583 -108574 -92955 -56023 -19228
4323 -19228 -28204 -92081 -151458 -144583 -92138 -66459 -83990 -91304 -62823 -40961 -55452 -70303
4311 -70303 -48378 -13053 -5454 -25519 -48719 -57963 -35853 20541 57350 8788 -86158 -100377
4299 -100377 -1161 81406 43128 -37590 -37969 6148 -21507 -99576 -97980 -4590 49841 10727
4287 10727 -23286 8289 18044 -61976 -139684 -106319 -19301 -10232 -75759 -97257 -38806 9225
4275 9225 -10401 -40024 -21581 4932 -20524 -66686 -54027 15678 46846 -17890 -106178 -100645
4263 -100645 3972 83755 42724 -62766 -103944 -50513 8533 7707 -13449 1478 28985 10548
4251 10548 -50946 -93631 -70897 11466 100966 115630 9034 -141149 -175795 -52668 63726
4240 63726 7527 -147282 -181178 -43008 82625 49290 -59450 -87889 -33607 -3649 -28612
4229 -28612 -46376 -31807 -24818 -38046 -36888 -18062 -22629 -55410 -64553 -22796 30442 48151 26868
4216 26868 -13358 -48669 -43226 19201 84249 74798 7751 -14138 41407 76613 19553 -48560
4204 -48560 -17522 67145 68064 -24594 -74432 -13044 59017 38767 -24946 -30304 7065 -7948
4192 -7948 -82984 -122892 -80732 -24788 -26464 -58818 -53322 -5155 32332 30978 14426 8534 7720
4179 7720 -566 -6075 11830 50878 79044 65679 16961 -27148 -36041 -19947 -6767 2353 29384
4166 29384 70734 83854 41168 -24392 -54107 -34102 -6975 -15671 -57078 -93861 -96379 -69140
4154 -69140 -45945 -58679 -101807 -131830 -113350 -59862 -14789 -166 -4063 -11742 -21848 -31295
4142 -31295 -32080 -28277 -30302 -28993 -6399 23517 25435 4220 3929 20911 -18095 -137071 -230606
4129 -230606 -190564 -75839 -44951 -124567 -170657 -96289 -10942 -46469 -147072 -160033 -76947
4118 -76947 -36212 -91820 -127696 -48431 67248 85841 7448 -61900 -75436 -79578 -98682 -86753
4106 -86753 -16880 56261 65122 16654 -27817 -33155 -16931 -12183 -33733 -73644 -106799 -105548 -66905
4093 -66905 -20901 2010 2497 -4718 -22845 -56285 -72693 -30779 42399 54778 -32359 -131796
4081 -131796 -133867 -56787 -19764 -68385 -111451 -64295 21398 34317 -39495 -110636 -114721 -77325
4069 -77325 -56418 -78727 -133531 -180754 -169085 -93338 -23116 -21074 -50788 -36165 6318 -6965
4057 -6965 -68658 -68984 19182 68163 -12782 -121858 -111539 -9566 38216 -4154 -36183 -10039
4045 -10039 -2934 -71219 -151202 -158952 -103812 -49481 -26618 -31016 -54594 -75461 -62614 -26373
4033 -26373 -20623 -62824 -96912 -70868 -9577 26181 17671 -9544 -30251 -35088 -27141 -25629 -47022
4020 -47022 -70794 -59345 -18740 8021 13602 27219 30879 -38602 -164871 -220701 -131737 2844
4008 2844 37568 -30546 -91226 -89379 -62038 -39324 -16120 -10822 -50420 -96400 -80134 -17915
3996 -17915 1443 -46743 -92549 -91997 -77327 -60433 3839 104715 131647 28140 -91945 -83987
3984 -83987 23926 75766 10712 -71725 -80337 -60403 -99907 -177963 -186077 -83955 35827 62205
3972 62205 1187 -47324 -31621 -8153 -40398 -93848 -86559 -14243 43239 35852 -2926 -28408
3960 -28408 -46285 -72046 -81689 -45194 22263 77446 95076 73791 23476 -29972 -54103 -47026
3948 -47026 -41390 -55902 -72712 -75909 -73308 -63584 -29338 11984 3095 -68875 -132162 -121253 -64644
3935 -64644 -31103 -29966 -23564 -3329 10811 19447 27706 6139 -61965 -115241 -76316 26882
3923 26882 81675 39356 -31110 -52370 -29459 -6478 1283 -5320 -38382 -96807 -142326 -135828
3911 -135828 -81081 -17703 10086 -22674 -95859 -141274 -106263 -24889 17861 -3001 -29481 -18445
3899 -18445 -1004 -16492 -43944 -42330 -18792 -11243 -26405 -32236 -263 62828 109615 76511
3887 76511 -47566 -170213 -167586 -32983 98667 109929 34129 -15508 -1075 19978 2232
3876 2232 -30114 -34688 -9936 10805 -290 -37923 -68657 -68975 -54792 -50512 -38648 12097 70378
3863 70378 63709 -4647 -40852 -4070 20391 -40452 -116585 -99517 -15709 19846 -13936 -32807
3851 -32807 -5726 3257 -32210 -46174 214 45116 26107 -25237 -44993 -29823 -14301 -7249
3839 -7249 -2244 -10425 -36864 -56266 -48182 -27690 -16739 -17236 -27768 -45816 -43275 5161 56311
3826 56311 30498 -65385 -123110 -81894 -15043 -12575 -50918 -50982 -4915 34654 45279 37353 6811
3813 6811 -39284 -49376 2180 49275 20886 -42870 -50173 1554 41370 50212 61012 56839 -6375
3800 -6375 -80913 -64294 29577 70237 13214 -34991 -7245 9627 -63932 -151258 -145363 -84142
3788 -84142 -73442 -109811 -110860 -67090 -29868 10071 89228 140862 55309 -119183 -192098 -91331
3776 -91331 34667 43855 -5590 7797 52994 13892 -90424 -115395 -19683 62558 22923 -65413
3764 -65413 -70132 3518 35315 -29116 -116573 -143257 -111246 -68494 -40235 -34496 -61728 -105079
3752 -105079 -112457 -65990 -24444 -43801 -89468 -93650 -70280 -84447 -119305 -83127 27467 84967
3740 84967 13883 -82701 -72165 7386 12596 -79645 -138476 -73204 48361 104766 63374 -14718
3728 -14718 -53475 -21943 37132 32535 -67725 -160580 -116681 33907 121583 65272 -26049 -30552
3716 -30552 14158 2226 -60625 -79206 -26810 25149 19731 -30924 -95832 -154117 -178307 -154982
3704 -154982 -116099 -92421 -56962 16123 65152 10665 -97453 -114964 -7631 87839 55362
3693 55362 -44962 -83863 -47480 -23311 -46414 -56492 -4263 73164 100321 47295 -44198 -97518
3681 -97518 -68448 6668 43663 6768 -52738 -73574 -62363 -57397 -52858 -17465 33675 52929
3669 52929 40912 45697 72643 64857 2205 -44595 -9327 65870 84162 27540 -28555 -29783
3657 -29783 -7112 -9004 -25536 -16715 20788 56690 72824 64754 18111 -66255 -133094 -117198
3645 -117198 -35429 21339 7052 -24662 -15017 8409 -13398 -69886 -100665 -89433 -71049 -59343
3633 -59343 -34266 4066 31165 45852 61502 56179 3708 -47508 -15238 79244 107623 9211
3621 9211 -115554 -141459 -73218 588 39275 56710 49148 3299 -51957 -74283 -64723 -39458
3609 -39458 13921 85789 101420 18265 -74926 -61045 30050 63515 4076 -46847 -27232 3926
3597 3926 -3071 -4624 26808 24903 -50170 -106692 -44447 78414 114091 30482 -57942 -59366 -10373
3584 -10373 5095 -31223 -72801 -77011 -41487 5832 33270 32537 26339 41413 75395 98866 87115
3571 87115 44783 4173 -2392 19826 24944 -17257 -71391 -77757 -37956 -11934 -25615 -37906
3559 -37906 -18482 -80 -18131 -48121 -46771 -17053 10927 30477 47376 48967 27530 9575
3547 9575 22106 51707 69787 72061 63975 41130 13950 9034 13225 -27905 -109952 -133801 -40357
3534 -40357 78218 92688 17434 -26542 -512 15921 -25847 -74167 -79774 -64480 -49272 -3364
3522 -3364 84455 154641 152033 101268 59471 35999 4285 -38960 -68690 -68210 -44908 -22801 -28248
3509 -28248 -62063 -85555 -63127 -14066 14062 13534 10626 3641 -29419 -63548 -42030 25686 54493
3496 54493 424 -76941 -100938 -68548 -21653 16142 35169 20718 -19937 -45466 -26305 23510
3484 23510 71247 87872 50036 -26515 -63640 -6113 72291 43732 -81600 -152516 -100523 -40564
3472 -40564 -80196 -151032 -134732 -57337 -29546 -58132 -51320 16373 66075 39710 -29878 -78856
3460 -78856 -75220 -25662 27729 32235 -12019 -42932 -26366 -3293 -4771 7754 55090 73365
3448 73365 17029 -48488 -50414 -25698 -29682 -15779 62281 112229 28701 -106826 -129342 -49291
3436 -49291 -18426 -64174 -65560 3618 23279 -44463 -82587 -36762 -10381 -62957 -98644 -50415
3424 -50415 -1035 -14933 -18390 33829 39364 -61534 -131223 -39039 105615 106778 -24905 -113470
3412 -113470 -85051 -21329 7253 942 -42612 -114729 -139217 -65305 17411 -7680 -94130 -101474
3400 -101474 -23019 13265 -39356 -87949 -69464 -33141 -26080 -24005 -10662 -18864 -59486 -96484
3388 -96484 -111115 -115022 -102228 -67488 -51231 -75407 -71907 12247 85490 34012 -66840 -45962
3376 -45962 73734 90913 -41703 -126524 -41816 65117 34861 -45684 -14088 85009 85901 -18816
3364 -18816 -81038 -41028 6370 -12539 -53618 -55507 -27157 -4868 2851 3517 1874 1582 -4202
3351 -4202 -31062 -67130 -71633 -40977 -31543 -74984 -118758 -100886 -37628 15638 43175 52408 29068
3338 29068 -24993 -52010 -6948 64470 78909 20324 -58827 -107345 -99689 -34149 42830 56527
3326 56527 -2408 -55087 -49310 -28396 -33257 -24092 24695 44789 -11775 -67575 -45148 -10416
3314 -10416 -53710 -109888 -62800 35311 38801 -35422 -34747 52916 70462 -26740 -81200 -2902
3302 -2902 76620 34600 -38130 -7425 73682 68036 -16331 -65484 -58559 -67663 -99431 -86082 -21031
3289 -21031 25382 24899 16425 12304 -14687 -41814 1905 114196 186612 138127 20343 -56309
3277 -56309 -57722 -40120 -53983 -84102 -90379 -71816 -59941 -59365 -36980 13060 39121 11053 -11509
3264 -11509 38225 109502 88287 -23146 -88814 -32390 56509 64965 11794 -13640 9888 40672
3252 40672 57962 60249 29623 -27795 -54789 -26599 -6064 -41883 -76906 -45656 4926 -634
3240 -634 -25488 8433 58777 19790 -84917 -121810 -57977 1670 2397 7401 42004 29951 -49199
3227 -49199 -87177 -20407 53637 36235 -13148 3620 46011 16952 -52009 -49938 20539 52651
3215 52651 25307 31569 96754 110678 317 -141984 -181955 -117002 -43199 -4380 31834 70303
3203 70303 58185 -19328 -84743 -58232 33857 91090 66542 12907 -2722 19247 36755 30614
3191 30614 6436 -32769 -69529 -58458 10849 62380 21352 -58142 -45827 72681 158117 112753
3179 112753 14202 -14539 20327 34837 24209 48830 98683 97834 42122 13779 38449 39251
3167 39251 -24360 -73371 -30374 56099 87599 59246 42425 59635 64444 34907 5632 -1133
3155 -1133 -6937 -21078 -13752 25306 51050 23921 -30182 -61310 -67792 -80522 -94766 -74329 -24066
3142 -24066 -980 -30134 -55137 -11829 74779 111712 51061 -54382 -114023 -91544 -24863 26267
3130 26267 38005 32263 36514 42119 18326 -30436 -50752 -7656 57212 70901 20026 -42168
3118 -42168 -71317 -69803 -50051 -10880 35548 59020 55629 58985 84828 100976 77771 34056
3106 34056 4542 -7371 -15051 -16888 -9898 -7466 -13250 -4864 26591 50912 44016 24687 11334
3093 11334 -16519 -65698 -80711 -14084 82483 110287 54168 -8586 -22188 -4107 15536 31877
3081 31877 33215 2644 -31979 -18220 31160 39031 -17996 -63900 -35253 28014 54043 42073
3069 42073 35327 39587 33397 23992 29328 30247 1026 -32937 -25947 16627 52946 71342 82657
3056 82657 66163 -3076 -79903 -83385 -16811 26027 256 -23802 19434 77007 57593 -20296
3044 -20296 -48686 11309 74536 55653 -18101 -59312 -43388 -25807 -48500 -79620 -64262 -6078
3032 -6078 32896 12256 -32586 -34833 14880 53166 29919 -17091 -10159 53716 86312 28327
3020 28327 -59708 -76276 -21696 6611 -36587 -75352 -29595 61516 96329 53385 3297 -8476
3008 -8476 -12483 -36610 -48964 -16319 32782 49781 36738 28073 24536 -3235 -50986 -69476 -30265
2995 -30265 30412 54378 30260 -1460 -5314 8693 8782 -10528 -25343 -24921 -28725 -46232 -47109 -3207
2981 -3207 56535 74047 41571 10869 15633 25893 -346 -51061 -71248 -26532 56506 104608
2969 104608 59720 -49689 -113369 -58276 47400 69770 -10237 -69266 -18103 78443 110716
2958 110716 77528 53740 60438 57167 32743 16020 9766 -7238 -20518 2182 39190 38097
2946 38097 8491 9535 39390 27541 -37908 -65024 11171 124073 161444 105601 28383 -18073
2934 -18073 -45883 -82394 -124083 -139100 -96133 -2569 78751 81675 19557 -22278 2545 42493
2922 42493 32178 -10656 -21905 9196 37467 43542 56726 90773 109064 77563 22546 7458
2910 7458 57924 126450 139660 80306 12193 11300 78649 140506 132408 61365 -13430 -36932 2515
2897 2515 60739 65648 -9586 -102913 -129810 -87434 -43874 -30343 -13472 17197 19238 -11231
2885 -11231 -3440 74515 141339 117146 49629 36608 71105 65785 4857 -35875 -18063 11290
2873 11290 16242 24940 57489 80207 70038 57811 64564 53272 -4094 -56604 -33058 49644
2861 49644 94941 47899 -34163 -53318 8834 74816 77750 46629 49492 79766 69072 14780
2849 14780 6117 82480 152002 123678 46422 21487 38507 17352 -28818 -11616 61529 76620
2837 76620 -7621 -100768 -131563 -129847 -118061 -54962 50749 99019 49759 -1533 16550 36011
2825 36011 -8188 -47012 -16080 -4283 -100594 -191839 -109945 78357 142035 31317 -59875
2814 -59875 -2336 101897 124750 97293 92309 77769 5873 -71176 -91283 -89087 -101371 -64886
2802 -64886 63757 174128 138398 21835 -4727 68890 85973 -11780 -89291 -44793 24816
2791 24816 -13312 -114691 -134342 -51294 17026 5829 -15868 23108 85616 99980 73171 61942
2779 61942 71744 59729 26929 31500 90782 134465 99577 28338 12077 57942 77909 18005
2767 18005 -61502 -66264 11156 89528 99353 50382 4577 7804 50158 80455 60516 10546
2755 10546 -8990 30583 84658 82220 10245 -64339 -64731 6771 61889 25006 -65924 -93542
2743 -93542 -13529 74757 59767 -23130 -48582 3117 20849 -46752 -99958 -55596 7335 -18197
2731 -18197 -73136 -19494 120024 173898 82977 -8758 21323 98534 89678 8836 -31575 -6515
2719 -6515 8999 -16164 -28284 4842 41212 39823 19263 17447 42438 77834 94925 57731
2707 57731 -32964 -99874 -57156 68300 149715 119713 49853 32819 54357 46394 14236 25961
2695 25961 94754 151598 139899 76128 8013 -35007 -40651 -13145 13997 9562 -2441 28334
2683 28334 87090 94356 24561 -41088 -26537 31880 51509 28748 20343 29281 434 -70459
2671 -70459 -110670 -77723 -22053 -6408 -18650 -8301 30003 54516 35609 -16598 -67711 -81171
2659 -81171 -45753 3271 18055 7118 32032 114250 190407 193536 134335 61209 -11868 -80802
2647 -80802 -100351 -35991 56933 86566 48299 17766 25193 23412 -8629 -21768 12236 47748
2635 47748 47030 40783 55978 55372 14543 -6017 51298 129518 126103 45558 -11988 -2382 20579
2622 20579 20405 33671 77395 91392 31725 -43497 -49120 8121 51443 47592 32322 34250 39031
2609 39031 36714 48281 83448 114055 115378 101262 90398 68590 23577 -6514 24973 86203
2597 86203 86070 5486 -51903 5181 115503 139153 50936 -35209 -44733 -39608 -86309 -126056
2585 -126056 -71873 31764 64704 17628 -854 54217 99302 73017 36167 56792 90660
2574 90660 62480 -2318 -22614 4232 9168 -27187 -48988 -19455 34872 79415 105199 100903
2562 100903 55711 2989 369 46068 69480 30240 -22234 -19917 32323 72793 66277 37573
2550 37573 30524 55669 81561 76603 55612 61642 91532 83127 14954 -31236 19960 103752 92984
2537 92984 -3330 -41314 37793 118132 95907 31323 22962 38952 -3216 -67526 -54036 18763
2525 18763 32412 -39135 -92273 -62114 -1858 33993 65497 100744 84537 -355 -69325 -45763
2513 -45763 32197 79126 74310 43801 -5759 -62128 -70919 -4934 70301 78860 47060 51928 87213
2500 87213 73944 -5792 -76987 -80718 -35570 20924 75058 102557 67714 -10320 -55174 -34309
2488 -34309 -5107 -21430 -52854 -47905 -23863 -26914 -43499 -30614 -10441 -42123 -97215 -65414
2476 -65414 73687 177060 117981 -23751 -59426 47166 140574 112012 44655 51372 85331
2465 85331 35461 -65290 -81533 -955 42691 -7673 -44349 9425 61460 9810 -78155 -74488
2453 -74488 4510 40933 9616 -11021 6068 10314 -4719 12420 53219 45624 -9224 -21305
2441 -21305 31406 52550 -12363 -79073 -59798 2235 17121 -11055 -17206 7377 16591 -6487
2429 -6487 -36465 -50191 -35954 7352 43349 21025 -37108 -35795 52657 122627 80397 -13794
2417 -13794 -35326 29045 87549 82738 33919 -23314 -53059 -12147 83706 127156 49325 -58899
2405 -58899 -65115 4428 12261 -66731 -115215 -71747 -13747 -11378 -30675 -27218 -17527 -6982 42107
2392 42107 115575 126787 50925 -20603 -21597 -4487 -22793 -26006 37692 106683 98099 42803 25233
2379 25233 47957 56939 49764 57504 61295 24428 -29449 -61026 -95415 -161067 -193863 -115164 24253
2366 24253 94256 62969 14093 2516 8626 26169 69959 92832 25500 -82760 -96105 2139
2354 2139 70843 29388 -23445 11873 69330 43029 -26226 -27471 26231 27055 -35023 -53779 12283
2341 12283 70528 45398 -4521 16937 97794 137588 81155 -23615 -91656 -84093 -26056 29524
2329 29524 46076 24402 -9299 -33500 -48052 -62025 -71868 -61626 -29737 -6139 -23637 -68734
2317 -68734 -85004 -43424 11314 13459 -38102 -80168 -64786 -4624 56882 84219 60808 1605
2305 1605 -43474 -39100 -17250 -32853 -67897 -45574 43605 103795 64218 -15644 -30158 29311
2293 29311 80341 68406 14743 -38366 -68416 -62081 -17313 35821 52413 18795 -36821 -73325
2281 -73325 -62931 -9606 40902 38966 388 -2157 53544 92627 52406 -16175 -27213 5519
2269 5519 1639 -46529 -67136 -33715 2306 12091 26874 55837 58891 30491 22290 46159 42199
2256 42199 -11250 -43011 -3012 51323 53696 39232 72502 128577 140402 116418 110236 107845
2244 107845 53605 -26204 -36471 39889 106141 87633 21191 -21055 -24459 -12873 2557 18007
2232 18007 25135 30412 44082 39080 -19112 -86089 -59917 70789 175879 143460 29222 -29093
2220 -29093 2277 42276 42748 46238 87823 127710 118059 76987 53012 52517 43578 14020 -9196
2207 -9196 1159 33071 44564 15459 -17193 2250 67336 100901 52963 -26734 -56633 -33508
2195 -33508 -14218 -8028 31132 97734 107187 16695 -94188 -120837 -65349 -12297 -5305 -10170
2183 -10170 12568 53836 76611 54849 -5467 -59853 -56053 251 34275 -4350 -61657 -46444
2171 -46444 36260 81149 19297 -95039 -154075 -114382 -24041 42046 54416 45294 56806 76095
2159 76095 50892 -17174 -46670 9289 74311 52001 -20684 -26185 44777 79875 34700 3114
2147 3114 46249 78449 14315 -74423 -65986 18576 56868 19624 -4936 28793 60285 37112
2135 37112 -8333 -29642 -35790 -52387 -71775 -76812 -73103 -71259 -66803 -51721 -22819 18908 51529
2122 51529 33798 -36825 -92849 -76739 -25480 -8594 -11400 28658 86391 64663 -39334 -100939
2110 -100939 -46420 40392 54310 19406 20391 55489 56478 16329 801 39632 80410 61695
2098 61695 -11690 -74990 -66114 10985 78718 66867 5089 -8926 56516 123072 115933 57993
2086 57993 13134 -2667 -5832 2807 17392 8546 -22412 -19713 45369 119117 139579 110014 53999
2073 53999 -26654 -91929 -55638 75563 147943 57301 -84773 -111598 -47130 -32142 -72449
2062 -72449 -54156 22059 34778 -18903 7097 145924 229306 150370 33216 26334 85267 92441
2050 92441 57804 54726 64431 32857 -2835 12496 27783 -22798 -75151 -34559 41286 26130
2038 26130 -49301 -37514 69827 112462 17706 -85921 -73718 1817 25607 -5598 -15307 24576
2026 24576 79174 109465 85588 -5134 -112545 -141987 -68581 20285 42369 20461 14097 17901
2014 17901 -1767 -23355 -4941 33234 41163 29076 45447 81346 80516 44284 42957 103946 162135
2001 162135 154860 106467 76491 70873 55295 27272 21124 49242 82367 91848 79582 60145
1989 60145 39549 20632 9193 4901 1067 431 15848 47628 74831 77252 53192 12100 -31223
1976 -31223 -51833 -32748 2682 11670 214 22903 85125 106278 40543 -24673 15038 107282
1964 107282 107770 8149 -42734 27781 110602 109461 93802 146155 187864 112783 563 11897
1952 11897 119692 140673 30299 -51066 -4859 61006 34898 -17329 8772 67626 54987
1941 54987 -2357 2758 68507 90171 38318 -1815 20990 52219 40786 24453 55662 109139
1929 109139 120397 78409 29939 10633 14040 24756 46336 81595 104617 79808 14222 -33028
1917 -33028 -16110 37099 59489 30668 -7840 -19575 -11363 1178 20361 44339 60846 77507
1905 77507 112927 141778 103283 -7065 -106302 -121274 -72591 -26668 -10723 -12864 -17769 -563
1893 -563 64452 144898 157673 88096 36426 73762 117247 47668 -96497 -160201 -89706 7416
1881 7416 28108 -7429 -30228 -24256 -11196 1112 15337 31932 58803 94326 100650 47290
1869 47290 -21977 -31915 12693 32399 -1466 -28731 -10436 5633 -30502 -89758 -112066 -81779
1857 -81779 -19185 50714 90789 70480 22825 22939 78750 109284 66229 2633 -23914 -35144
1845 -35144 -57737 -47119 29244 98476 70986 -21824 -75953 -67343 -56444 -64005 -48949 -6642
1833 -6642 13185 -876 -3671 14063 6625 -24158 -1446 96941 162105 88087 -64910 -129426
1821 -129426 -42932 75438 79122 -29673 -115800 -77711 44250 129749 115338 44286 -5217
1810 -5217 -5959 11975 12542 -7806 -19320 14931 97297 172920 172452 91810 5952 -15338 16243
1797 16243 35459 6864 -43284 -63997 -29702 35162 73506 54694 15355 11042 34007 30896
1785 30896 1048 1353 35033 28231 -35177 -54009 33706 123989 88173 -27641 -75831 -34116
1773 -34116 -12271 -50895 -70846 -38594 -27505 -68127 -78786 -14805 37041 -2291 -76389 -97169
1761 -97169 -82914 -90419 -91287 -33862 30709 11100 -65965 -81789 -3348 74462 73486 23443 -11356
1748 -11356 -14081 3417 33632 56589 42959 2145 -15548 11568 42320 29958 -16496 -47065
1736 -47065 -25595 38555 93730 83853 9707 -55561 -46908 6190 19315 -25611 -54803 -9156
1724 -9156 77765 130802 117014 53698 -25143 -79666 -76220 -21647 37275 69390 84676 87351
1712 87351 50186 -27116 -78279 -46240 27924 53365 13431 -22601 -10045 17017 18655 11229
1700 11229 20754 27011 3904 -20089 2455 60447 97368 96181 97469 124266 136762 86598 -11187
1687 -11187 -83160 -65847 31641 120141 102733 -11538 -87286 -15825 123397 142797 4086
1676 4086 -112326 -56246 80289 109555 25666 -15817 37961 67360 2952 -46964 22812 132771
1664 132771 135609 35124 -35797 -14308 35346 53189 59778 79271 76507 17803 -58896 -83072
1652 -83072 -38644 22449 46819 36478 32831 53712 65104 29908 -30327 -54995 -23227 24724
1640 24724 48901 48822 31013 -11448 -63219 -78509 -40268 10728 29821 10594 -39736 -105958
1628 -105958 -129278 -51083 70262 85752 -35038 -124187 -42351 111111 144492 52078 -11272
1617 -11272 13543 33478 -4502 -36405 -22241 -11433 -27136 -22823 2807 -17284 -78800 -82075
1605 -82075 -7487 28050 -32607 -79285 -24742 39797 11733 -28683 42282 154284 135532 -6069
1593 -6069 -86984 -27581 51419 39435 -18078 -40119 -39711 -54140 -50712 6335 65015 53185 -2654
1580 -2654 -10511 48767 90882 49534 -26810 -37649 33105 91371 57001 -27847 -59040 -15803
1568 -15803 21517 2954 -19105 14661 70989 77453 28249 -22759 -39817 -22229 22696 70431
1556 70431 76390 35143 7525 36613 78690 76295 51817 57429 79768 78036 73942 109236 148470
1543 148470 125733 62400 33827 40879 25705 -3149 14801 60082 50411 -1269 11975 101160
1531 101160 136658 51432 -43282 -25856 62376 102013 66445 16598 -8522 -11094 7204 37075
1519 37075 50731 45050 49099 60297 40834 4683 19062 80661 92816 19980 -45014 -37134
1507 -37134 -24514 -66330 -86457 -12092 68284 34235 -59106 -61282 39570 119428 118306 85513
$$ [...]
##END NTUPLES=NMR SPECTRUM
##END=
