##TITLE=1H ikalashn
CG-1212-x
18.9.2024
##JCAMPDX= 6.0         $$ Bruker NMR JCAMP-DX V2.0
##DATA TYPE= NMR SPECTRUM
##DATA CLASS= NTUPLES
##ORIGIN= UXNMR, Bruker Analytische Messtechnik GmbH
##OWNER= root
$$ TOPSPIN		Version 1.3
$$ 2024-09-18 09:41:32.796 +0400  Irina@DPX200
$$ Compression mode = diff/dup
##.OBSERVE FREQUENCY= 200.131392401
##.OBSERVE NUCLEUS= ^1H
##.ACQUISITION MODE= SIMULTANEOUS
##.ACQUISITION SCHEME= undefined
##.AVERAGES= 64
##.DIGITISER RES= 18
##SPECTROMETER/DATA SYSTEM= spect
##.PULSE SEQUENCE= zg
##.SOLVENT NAME= CDCl3
##.SHIFT REFERENCE= INTERNAL, CDCl3, 1, 17.95386
##AUDIT TRAIL= $$ (NUMBER, WHEN, WHO, WHERE, WHAT)
$$ ##TITLE= Audit trail, TOPSPIN		Version 1.3
$$ ##JCAMPDX= 5.01
$$ ##ORIGIN= Bruker BioSpin GmbH
$$ ##OWNER= Irina
$$ $$ F:/spectra/data/iren/nmr/1H/4/pdata/1/auditp.txt
$$ ##AUDIT TRAIL=  $$ (NUMBER, WHEN, WHO, WHERE, VERSION, WHAT)
(   1,<2024-09-18 09:41:14.406 +0400>,<Irina>,<DPX200>,<TOPSPIN 1.3>,
      <created by zg
	started at 2024-09-18 09:37:01.187 +0400,
	POWCHK disabled, PULCHK disabled
       configuration hash MD5:
       BE 6D 3F 07 2A EA 11 49 91 17 2B D3 AF B3 58 0D
       data hash MD5: 16K
       9B C5 41 B0 E8 3C C0 D2 E0 EB 8A BF F1 B8 7F 20>)
(   2,<2024-09-18 09:41:17.062 +0400>,<Irina>,<DPX200>,<TOPSPIN 1.3>,
      <Start of raw data processing
       efp BC_mod = 2 LB = 0.02 FT_mod = 6 PKNL = 1 PHC0 = 88.4967 PHC1 = 28.71943 SI = 32K 
       data hash MD5: 32K
       25 80 6E B4 99 17 5E 4D 4C 71 9A 35 54 05 CF CB>)
(   3,<2024-09-18 09:41:19.828 +0400>,<Irina>,<DPX200>,<TOPSPIN 1.3>,
      <apk 
       data hash MD5: 32K
       9F 28 91 50 57 DB 59 F4 D5 9A 9B 2B 2B EB 07 3D>)
(   4,<2024-09-18 09:41:22.750 +0400>,<Irina>,<DPX200>,<TOPSPIN 1.3>,
      <abs n ABSG = 5 
       data hash MD5: 32K
       0E E5 89 F8 45 5D 6A CD AA 72 CF D1 BE 51 BA A2>)
$$ ##END=
$$ 
$$ $$ hash MD5
$$ $$ 37 F6 7D 9A 96 AD FC 0E 1D 69 2A C1 A7 37 7A 68
##$RELAX= 
##$RELAX= 
##$RELAX= 
##$RELAX= 
##$RELAX= 
##$RELAX= 
##$RELAX= 
##$RELAX= 
##$RELAX= 
$$ Bruker specific parameters
$$ --------------------------
##$DU= <F:/spectra>
##$EXPNO= 4
##$NAME= <1H>
##$PROCNO= 1
##$TYPE= <nmr>
##$USER= <iren>
##$AMP= (0..31)
100 100 100 100 100 100 100 100 100 100 100 100 100 100 100 100 100 100 
100 100 100 100 100 100 100 100 100 100 100 100 100 100 
##$ANAVPT= -1
##$AQSEQ= 0
##$AQ_mod= 1
##$AUNM= <au_zg>
##$AUTOPOS= <>
##$BF1= 200.13
##$BF2= 200.13
##$BF3= 200.13
##$BF4= 200.13
##$BF5= 200.13
##$BF6= 200.13
##$BF7= 200.13
##$BF8= 200.13
##$BYTORDA= 1
##$CFDGTYP= 0
##$CFRGTYP= 5
##$CHEMSTR= <none>
##$CNST= (0..63)
1 1 145 1 1 1 1 1 1 1 1 1 1 1 1 1 1 1 1 1 1 1 1 1 1 1 1 1 1 1 1 1 1 1 
1 1 1 1 1 1 1 1 1 1 1 1 1 1 1 1 1 1 1 1 1 1 1 1 1 1 1 1 1 1 
##$CPDPRG= <>
##$CPDPRG1= <>
##$CPDPRG2= <>
##$CPDPRG3= <>
##$CPDPRG4= <mlev>
##$CPDPRG5= <mlev>
##$CPDPRG6= <mlev>
##$CPDPRG7= <mlev>
##$CPDPRG8= <mlev>
##$CPDPRGB= <>
##$CPDPRGT= <>
##$D= (0..63)
0 2 0 0 0 0 0 0 0 0.06 0 0.03 0 0 0 0 0.0002 0 0 0 0 0 0 0 0 0 0 0 0 0 
$$ [...]
##$SW_h= 4401.40845070422
##$TD= 16384
##$TD0= 1
##$TE= 300
##$TE2= 300
##$TE3= 300
##$TEG= 300
##$TL= (0..7)
0 120 120 120 120 120 120 120 
##$TP= (0..7)
150 150 150 150 150 150 150 150 
##$TP07= 0
##$TPNAME0= <>
##$TPNAME1= <>
##$TPNAME2= <>
##$TPNAME3= <>
##$TPNAME4= <>
##$TPNAME5= <>
##$TPNAME6= <>
##$TPNAME7= <>
##$TPOAL= (0..7)
0.5 0.5 0.5 0.5 0.5 0.5 0.5 0.5 
##$TPOFFS= (0..7)
0 0 0 0 0 0 0 0 
##$TUNHIN= 0
##$TUNHOUT= 0
##$TUNXOUT= 0
##$USERA1= <user>
##$USERA2= <user>
##$USERA3= <user>
##$USERA4= <user>
##$USERA5= <user>
##$V9= 5
##$VALIST= <valist>
##$VCLIST= <CCCCCCCCCCCCCCC>
##$VD= 0
##$VDLIST= <DDDDDDDDDDDDDDD>
##$VPLIST= <PPPPPPPPPPPPPPP>
##$VTLIST= <TTTTTTTTTTTTTTT>
##$WBST= 1024
##$WBSW= 25
##$XGAIN= (0..3)
0 0 0 0 
##$XL= 0
##$YL= 0
##$YMAX_a= 2055107
##$YMIN_a= -1291558
##$ZGOPTNS= <>
##$ZL1= 120
##$ZL2= 120
##$ZL3= 120
##$ZL4= 120
##$ABSF1= 17.95386
##$ABSF2= -4.038887
##$ABSG= 5
##$ABSL= 3
##$ALPHA= 0
##$AQORDER= 0
##$ASSFAC= 0
##$ASSFACI= 0
##$ASSFACX= 0
##$ASSWID= 0
##$AUNMP= <proc_1d>
##$AXLEFT= 0
##$AXRIGHT= 0
##$AXTYPE= 0
##$AXUNIT= <>
##$AZFE= 0.1
##$AZFW= 0.1
##$BCFW= 0
##$BC_mod= 2
##$BYTORDP= 0
##$COROFFS= 0
##$CY= 7568.61572265625
##$DATMOD= 1
##$DC= 0
##$DFILT= <>
##$DTYPP= 0
##$F1P= 17.9538593292236
##$F2P= -4.03888763876832
##$FCOR= 0.5
##$FTSIZE= 32768
##$FT_mod= 6
##$GAMMA= 0
##$GB= 0
##$INTBC= 0
##$INTSCL= 1.483618e-010
##$ISEN= 128
##$LB= 0.02
##$LEV0= 0
##$LPBIN= 0
##$MAXI= 945.577
##$MC2= 0
##$MEAN= 0
##$ME_mod= 0
##$MI= -402.1523
##$NCOEF= 0
##$NC_proc= -4
##$NLEV= 6
##$NOISF1= 8.587773
##$NOISF2= 6.764455
##$NSP= 0
##$NTH_PI= 0
##$NZP= 0
##$OFFSET= 17.95386
##$PC= 1
##$PHC0= 111.0696
##$PHC1= -5.603941
##$PH_mod= 1
##$PKNL= yes
##$PPARMOD= 0
##$PPDIAG= 0
##$PPIPTYP= 0
##$PPMPNUM= 100
##$PPRESOL= 1
##$PSCAL= 0
##$PSIGN= 0
##$REVERSE= no
##$SF= 200.13
##$SI= 32768
##$SIGF1= 16.12182
##$SIGF2= -4.496377
##$SINO= 3.521527
##$SIOLD= 32768
##$SREGLST= <1H.CDCl3>
##$SSB= 0
##$STSI= 32768
##$STSR= 0
##$SW_p= 4401.40845070423
##$SYMM= 0
##$S_DEV= 0
##$TDeff= 16384
##$TDoff= 0
##$TI= <>
##$TILT= no
##$TM1= 0
##$TM2= 0
##$TOPLEV= 0
##$USERP1= <user>
##$USERP2= <user>
##$USERP3= <user>
##$USERP4= <user>
##$USERP5= <user>
##$WDW= 1
##$XDIM= 32768
##$YMAX_p= 321310914
##$YMIN_p= -435434
$$ End of Bruker specific parameters
$$ ---------------------------------
##NTUPLES= NMR SPECTRUM
##VAR_NAME=  FREQUENCY,     SPECTRUM/REAL,   SPECTRUM/IMAG
##SYMBOL=    X,             R,               I
##VAR_TYPE=  INDEPENDENT,   DEPENDENT,       DEPENDENT
##VAR_FORM=  AFFN,          ASDF,            ASDF
##VAR_DIM=   32768,         32768,           32768
##UNITS=     HZ,            ARBITRARY UNITS, ARBITRARY UNITS
##FACTOR=    0.134324425510551, 1,           1
##FIRST=     4401.40845070423, 16666,        -1636007
##LAST=      0,             -60874,          -1657353
##MIN=       0,             -435434,         0
##MAX=       4401.40845070423, 321310914,    0
$$ Real data points
##PAGE= N=1
##DATA TABLE= (X++(R..R)), XYDATA
$$ [...]
12182 52033217 51894728 51814898 51820333 51851000 51842479 51835931 51914742 52056033 52152475 52181240 52238986
12171 52238986 52378084 52508499 52519954 52424847 52304825 52161260 51900784 51462442 50892927 50276439
12161 50276439 49633691 48927519 48153403 47377307 46659113 45970943 45245472 44502059 43859369
12152 43859369 43395793 43060579 42774506 42560046 42490371 42545510 42623694 42700685 42877209 43224316
12142 43224316 43653650 44001408 44201561 44319024 44428983 44515183 44493620 44301068 43933603 43401971
12132 43401971 42679510 41731126 40595028 39389791 38210462 37052265 35874747 34707098
12124 34707098 33636469 32712980 31920619 31226184 30602412 30019943 29477811 29026997 28697802
12115 28697802 28422677 28114167 27806852 27618025 27558846 27501901 27376355 27277448 27305467 27395863
12105 27395863 27418291 27382264 27423987 27609613 27863801 28106113 28362051 28694286 29088041 29468746
12095 29468746 29812507 30174477 30580275 30925553 31042455 30878019 30555233 30220358 29873574
12086 29873574 29405017 28760197 27995644 27194578 26412234 25694405 25058642 24452479 23816015
12077 23816015 23187261 22652014 22192414 21702417 21165201 20683701 20306568 19965788 19630419
12068 19630419 19364745 19166716 18919427 18601845 18370187 18294667 18195060 17919288 17616936 17502526
12058 17502526 17483804 17307150 16991312 16806447 16833713 16854066 16724908 16579212 16549565 16550076
12048 16550076 16473056 16392410 16412449 16476894 16481380 16444916 16431049 16416772 16370487 16349391 16391944
12037 16391944 16418746 16366337 16317011 16365990 16456430 16479130 16445449 16427349 16413906 16366038 16329288
12026 16329288 16349259 16356950 16285279 16213568 16235802 16275831 16222138 16163881 16265962 16455457 16481868
12015 16481868 16295255 16121978 16120007 16188079 16193907 16178662 16223418 16292213 16334677 16396939 16503331
12004 16503331 16559250 16507057 16465096 16563737 16727786 16772627 16663566 16538307 16499984 16516099
11994 16516099 16517475 16489420 16451545 16422471 16416429 16427307 16420553 16377294 16328401 16314450 16342537 16408576
11982 16408576 16512900 16620238 16666598 16653841 16673116 16778847 16908562 16991828 17059046 17157522
11972 17157522 17243289 17271906 17326762 17514349 17772782 17937674 17984680 18049292 18195335 18328420
11962 18328420 18386373 18458112 18626068 18818391 18928014 18986517 19104026 19298441 19496104 19662700
11952 19662700 19830619 20021763 20237318 20503349 20831794 21150805 21375871 21549757 21804312
11943 21804312 22165866 22511823 22763797 23009294 23351798 23738983 24052844 24299535 24572367
11934 24572367 24864926 25081411 25240236 25496954 25900837 26285105 26510014 26681502 26973925
11925 26973925 27337278 27581761 27711550 27949229 28393783 28863406 29172031 29387578 29683844
11916 29683844 30073910 30450548 30796174 31178734 31589819 31958576 32312271 32762565 33319238
11907 33319238 33863943 34342027 34846380 35457859 36120272 36745623 37351048 38010523 38732996
11898 38732996 39462587 40162367 40845241 41551054 42321162 43153368 43963652 44653609 45239966
11889 45239966 45843501 46513954 47149223 47641800 48017717 48349945 48611249 48721236 48698079
11880 48698079 48657573 48674980 48731108 48781078 48800762 48783433 48767457 48847407 49076720 49381181 49659394
11869 49659394 49946528 50369087 50948581 51579191 52212919 52924591 53746187 54580165 55364293
11860 55364293 56196251 57174577 58214288 59165162 60052118 61042561 62196226 63400100 64566327
11851 64566327 65754330 67046867 68411437 69741522 70955120 72005456 72869098 73567741
11843 73567741 74129619 74494663 74551144 74317784 73982765 73680459 73335529 72839817 72278559
11834 72278559 71820183 71452916 71024252 70513445 70047874 69622872 69032344 68173803 67225386
11825 67225386 66383393 65595851 64732404 63875497 63217596 62747536 62276593 61759416 61364237
11816 61364237 61197209 61162052 61150240 61181575 61271960 61333202 61317049 61320132 61428070 61577347 61693621
11805 61693621 61845707 62112505 62396862 62542952 62569592 62606938 62648821 62571826 62400085 62340691
11795 62340691 62494741 62713997 62846702 62984419 63337153 63957908 64720160 65501198 66243422
11786 66243422 66856015 67205761 67254842 67115164 66906491 66623846 66213144 65729598 65317344
11777 65317344 65023353 64737360 64384092 64092020 64048869 64219312 64352068 64291745 64131410 63980568
11767 63980568 63736889 63237397 62527711 61789858 61051694 60170867 59111809 58041102 57096097
11758 57096097 56233137 55383543 54603874 53966745 53431052 52937942 52535280 52292949 52183174
11749 52183174 52158729 52264787 52548625 52934949 53330010 53790087 54437932 55251197 56086592
11740 56086592 56894493 57756198 58711065 59703433 60720721 61828868 63024493 64193871 65280481
11731 65280481 66357077 67443739 68372435 68943553 69129936 69007632 68552290 67648608 66292581
11722 66292581 64657734 62924418 61126802 59216417 57220133 55265516 53452318 51754600
11714 51754600 50091407 48473790 47015320 45770844 44634023 43471433 42319100 41343329
11706 41343329 40607719 39984093 39323869 38624090 37980131 37461800 37093076 36870255 36724770
11697 36724770 36538874 36285165 36093871 36088538 36202866 36266874 36242641 36252461 36373040 36523548
11687 36523548 36592714 36571936 36499548 36348304 36045029 35563564 34932222 34173787 33306265 32398118
11677 32398118 31548576 30775644 29969589 29018255 27970284 27010975 26254174 25617001 24948941
11668 24948941 24230420 23561523 22989116 22457220 21929260 21435572 20966047 20446245 19890146
11659 19890146 19446871 19184032 18938945 18535338 18061474 17749685 17624785 17475872 17181951
11650 17181951 16858056 16622049 16412474 16146817 15901002 15786226 15751774 15656448 15473060 15291634
11640 15291634 15163153 15062219 14978751 14933487 14909629 14861425 14786497 14715750 14648615 14572310 14518869
11629 14518869 14517315 14514060 14438909 14334456 14311866 14378843 14423912 14385206 14318032 14263129 14169280
11618 14169280 14008899 13862668 13803489 13779875 13708138 13611729 13563785 13541128 13452571 13291205
11608 13291205 13144857 13057788 12995539 12960738 13018877 13155751 13225081 13134134 12999633 12999500 13116541
11597 13116541 13167884 13086127 13023384 13119569 13292429 13360884 13296354 13229465 13246535 13305791 13352529
11586 13352529 13396029 13442064 13450800 13409049 13365284 13348767 13327533 13285930 13258042 13233890 13132272
11575 13132272 12945381 12811119 12831383 12902841 12861422 12724586 12629965 12583382 12463828 12276604
11565 12276604 12188744 12252536 12289337 12154957 11954669 11857246 11832796 11743144 11597283 11531741
11555 11531741 11579132 11629162 11614346 11585207 11590948 11618670 11668591 11762701 11851402 11836399 11730841
11544 11730841 11680996 11769617 11902017 11956051 11945339 11945501 11948272 11905737 11861329 11903180 12001752
11533 12001752 12023598 11933026 11868896 11958963 12134748 12212949 12125931 11990061 11945211 11997343 12050590
11522 12050590 12045986 12015569 12012748 12038460 12048986 12008450 11920556 11827092 11780448 11795465 11826466
11511 11826466 11821812 11800808 11828877 11906678 11950659 11920967 11897663 11960917 12056354 12078041 12048904
11500 12048904 12099976 12270599 12447023 12527068 12537748 12546503 12563021 12596101 12706545 12903303
11490 12903303 13059715 13051855 12946554 12937813 13102946 13325752 13474181 13557546 13669886 13851786
11480 13851786 14060901 14235411 14337504 14354896 14296390 14181082 14017895 13808232 13577006 13379264
11470 13379264 13256767 13198698 13163447 13137575 13157152 13256790 13399229 13481628 13440111 13333218
11460 13333218 13272931 13268864 13203113 12991200 12704324 12468877 12291877 12072682 11770249 11464717
11450 11464717 11238924 11084477 10963202 10887885 10877094 10873630 10787552 10622914 10501919 10532439
11440 10532439 10679696 10806169 10833330 10820536 10859895 10935435 10950968 10884515 10827520 10844217 10884007
11429 10884007 10899068 10965550 11180616 11487000 11721629 11822723 11869195 11916552 11924580 11871387
11419 11871387 11803721 11720683 11537942 11248252 10995652 10879484 10789070 10572611 10291802 10139655
11409 10139655 10139512 10111029 9961187 9835132 9891228 10054410 10114333 10000867 9841175 9763966
11399 9763966 9754749 9723900 9636659 9530225 9448251 9410811 9430897 9506097 9582676 9571911 9435896
11388 9435896 9235808 9062544 8938495 8827743 8721299 8645078 8581162 8458621 8255637 8045999
11378 8045999 7899132 7790302 7662224 7523393 7423359 7373729 7355219 7356509 7338133 7216037
11368 7216037 6978388 6770857 6741669 6824473 6813807 6659282 6531348 6552727 6620100 6584323
11358 6584323 6476698 6424520 6428262 6373314 6230933 6107175 6081878 6110831 6118510 6102141 6101043
11347 6101043 6121091 6134108 6120607 6080854 6021530 5951530 5879370 5804370 5718257 5617541 5508961
11336 5508961 5409478 5344491 5326288 5323564 5280370 5186969 5102237 5075404 5076792 5049224 5000137 4982850
11324 4982850 4997094 4976015 4888160 4796745 4782799 4840194 4883028 4850434 4780624 4770968 4863614
11313 4863614 4981252 5002532 4907910 4812685 4827190 4923668 4992885 5001059 5013277 5064147 5093470
11302 5093470 5050792 4999102 5049306 5215341 5391369 5474510 5471632 5471633 5533818 5625120 5671570 5657778
11290 5657778 5647218 5689863 5740899 5717116 5626919 5587863 5691189 5889685 6055165 6121791 6134171
11279 6134171 6167100 6240075 6318006 6364787 6376836 6378000 6400944 6469930 6580998 6688151 6725792
11268 6725792 6672360 6593416 6593046 6705625 6854937 6937370 6924694 6863451 6800247 6748748 6716477
11257 6716477 6712867 6720861 6699307 6630953 6542769 6466377 6403105 6343210 6297073 6283514 6293428 6284397
11245 6284397 6221433 6121264 6041488 6009816 5978804 5888326 5766929 5710988 5747546 5791228 5776948
11234 5776948 5750240 5752600 5707758 5545769 5374307 5363151 5480443 5524071 5433067 5375047 5458642
11223 5458642 5554234 5523793 5456011 5499179 5592253 5572291 5470891 5475820 5616100 5707848 5649489
11212 5649489 5572166 5618885 5738915 5808857 5835280 5914637 6064502 6206060 6281926 6311906 6349105
11201 6349105 6428156 6536751 6617875 6638657 6661602 6777361 6955715 7062797 7063411 7090518 7239067
11190 7239067 7404385 7440285 7387702 7403394 7517073 7614489 7640280 7659068 7702233 7707271 7655805
11179 7655805 7635403 7692902 7742234 7706198 7651306 7674097 7728833 7694988 7576228 7499649 7518442
11168 7518442 7539402 7477770 7376173 7310906 7265042 7175428 7051652 6956866 6891641 6788745 6634760
11157 6634760 6515139 6495566 6513894 6449368 6277350 6099268 6014651 6004786 5965186 5837292 5684482
11146 5684482 5623323 5677035 5721348 5616077 5388276 5222305 5233115 5313340 5281533 5137989
11136 5137989 5058684 5131347 5224500 5181352 5040313 4958387 4978239 4997212 4951852 4904603 4914006
11125 4914006 4926959 4871259 4785075 4767265 4829178 4880042 4860224 4815255 4811689 4837307 4832645 4789761
11113 4789761 4761038 4770892 4773655 4725988 4663365 4660410 4728252 4796042 4799316 4748045 4692447 4657029
11101 4657029 4635827 4627015 4635250 4647626 4639882 4611076 4591623 4611140 4669325 4738822 4786214 4791044
11089 4791044 4755541 4700700 4652132 4629410 4641346 4678515 4713762 4726856 4725565 4723169 4706434 4662293
11077 4662293 4627331 4652571 4710245 4707911 4629940 4588618 4669857 4796441 4837910 4805883 4819983
11066 4819983 4898118 4917728 4813436 4686456 4654574 4697095 4729429 4743914 4775952 4796744 4759281
11055 4759281 4717217 4773122 4909981 4994132 4970884 4944477 5011961 5119554 5166130 5171297 5233227
11044 5233227 5360428 5462436 5507106 5577075 5735091 5920840 6035022 6061682 6049376 6023287
11034 6023287 5981217 5938724 5911313 5877373 5815953 5745756 5663453 5498970 5234843 5021992 5027702
11023 5027702 5174704 5201000 5017065 4826584 4811871 4883275 4879791 4848813 4922916 5039010 5024814
11012 5024814 4909986 4899329 5037303 5144867 5130553 5125366 5226424 5331398 5349177 5374334
11002 5374334 5500376 5631694 5654526 5652664 5767617 5961292 6112589 6252503 6492420 6788096
10992 6788096 6999168 7152917 7429116 7881035 8376183 8828061 9278276 9708131 9976580
10983 9976580 10024858 9963302 9865360 9646832 9262028 8860171 8598134 8415259 8152846 7815798
10973 7815798 7549439 7392331 7211291 6902762 6546208 6309126 6250985 6260121 6182395 6003272
10963 6003272 5870119 5895912 5986428 5959290 5809990 5715310 5751373 5776841 5676275 5559877
10953 5559877 5592533 5751363 5901269 6006831 6107306 6171737 6164082 6186824 6356352 6572248
10943 6572248 6631646 6575045 6684838 7082794 7548671 7843560 8022672 8288092 8689932 9142084
10933 9142084 9612497 10097998 10471184 10557497 10374238 10129261 9948493 9746142 9420237 9044303
10923 9044303 8760061 8560497 8305241 7933534 7550667 7277272 7100601 6932149 6751247
10914 6751247 6606990 6500673 6363727 6176102 6022617 5976448 5986705 5950916 5858380 5783769
10904 5783769 5760206 5741093 5688811 5627932 5594980 5592026 5604669 5619569 5617187 5591824 5577950 5607571
10892 5607571 5649580 5653343 5645333 5704077 5831445 5933426 5955331 5959173 6031343 6182036 6373618
10881 6373618 6581809 6782492 6933622 7018046 7064575 7095222 7092992 7041402 6946676 6811447 6650379
10870 6650379 6534345 6528449 6571495 6525800 6379518 6279919 6314665 6389053 6392946 6354032 6328101
10859 6328101 6277437 6187498 6168355 6276069 6354652 6252535 6097202 6125929 6309905 6403048
10849 6403048 6342001 6320617 6429062 6494100 6381896 6221252 6181957 6223904 6224181 6194448 6205599
10838 6205599 6224906 6196492 6181449 6254087 6344304 6342986 6288038 6284351 6311067 6285546 6260650 6357722
10826 6357722 6524967 6571156 6462815 6392486 6493683 6664133 6758598 6801488 6888844 6998740
10816 6998740 7042306 7035088 7075576 7176274 7243442 7238206 7252330 7379285 7582025 7748439 7836797
10805 7836797 7898971 7974306 8038857 8084060 8169351 8327728 8470707 8487523 8421330 8429296 8551089
10794 8551089 8645865 8615012 8557049 8600796 8697811 8717282 8663304 8639982 8657484 8648135 8644969 8746669
10782 8746669 8892230 8878644 8673182 8520449 8624003 8872269 9017899 9009601 8987911 9033610
10772 9033610 9095051 9139792 9218606 9355593 9490583 9568381 9609669 9665580 9757442 9877858 10003698
10761 10003698 10097075 10134844 10144613 10178267 10251600 10344162 10452159 10600162 10795829 11004632
10751 11004632 11179518 11304127 11409162 11547488 11735735 11925827 12072414 12222455 12468278
10742 12468278 12792836 13045974 13128281 13125414 13188595 13345129 13513777 13657357 13816754 14013242
10732 14013242 14210572 14374332 14502642 14607898 14723865 14903974 15152202 15393041 15575829
10723 15575829 15756182 15993169 16234986 16420245 16621520 16933349 17269417 17461482 17543360
10714 17543360 17723149 18046965 18316155 18415811 18503591 18741829 19039795 19236301 19378626 19615135
10704 19615135 19923305 20161980 20327744 20543800 20821517 21042984 21194289 21425377 21825360
10695 21825360 22286562 22653720 22898504 23097853 23334706 23660540 24070339 24479169 24797111
10686 24797111 25047007 25334009 25695306 26071280 26427982 26797037 27174353 27495848 27752419
10677 27752419 28020503 28333595 28629678 28876863 29141408 29463722 29768354 29976158 30118935
10668 30118935 30265186 30416311 30557442 30726821 30942252 31134348 31251158 31361629 31554384
10659 31554384 31797902 32007840 32190214 32397199 32594780 32710714 32780093 32901381 33063175
10650 33063175 33159432 33180952 33245698 33410368 33589111 33707802 33813061 33959649 34096641 34150247
10640 34150247 34143496 34152106 34196048 34246742 34299632 34374402 34469312 34561258 34626816 34637877 34579161
10629 34579161 34498934 34490945 34585721 34702963 34746974 34702820 34605064 34471229 34318059 34191098
10619 34191098 34113496 34038152 33907490 33734987 33578233 33455582 33334178 33178934 32978450 32748178
10609 32748178 32532485 32363885 32199145 31956618 31648072 31393476 31250059 31113599 30871147
10600 30871147 30568619 30320649 30127698 29912844 29683668 29505944 29346529 29105393 28801947
10591 28801947 28564731 28415243 28229219 27955925 27704017 27535096 27342200 27047246 26767666
10582 26767666 26637209 26576879 26410566 26127210 25854598 25624077 25341925 24981870 24635280
10573 24635280 24349868 24064604 23735732 23396716 23058176 22675746 22263011 21911515 21637530
10564 21637530 21329268 20927625 20548643 20319263 20176596 19954096 19615977 19280931 19032521
10555 19032521 18823657 18580111 18302278 18033635 17794596 17578182 17368720 17148047 16918163
10546 16918163 16720483 16590066 16488755 16334402 16108084 15881286 15713577 15569252 15371223
10537 15371223 15104876 14824295 14567353 14307921 14005653 13678774 13400738 13221204 13108401
10528 13108401 12984067 12799858 12553610 12249477 11899294 11569174 11350954 11243609 11125958
10519 11125958 10910406 10666783 10507678 10399817 10209741 9922459 9678253 9563305 9492942
10510 9492942 9363636 9204375 9088077 8988592 8836532 8652101 8509754 8416291 8332303 8272519
10500 8272519 8265938 8250506 8144214 8005630 7971888 8027763 8003828 7850389 7737770 7787610 7867818
10489 7867818 7802732 7657386 7623164 7701508 7718526 7635243 7618795 7754494 7888131 7861904 7751326
10478 7751326 7729847 7809401 7869521 7873634 7891813 7934262 7924748 7857982 7838626 7912471 7979437 7946897
10466 7946897 7871579 7860378 7905355 7919066 7883425 7853587 7838940 7793872 7727988 7713078 7752643
10455 7752643 7749297 7654786 7561790 7572853 7649048 7676009 7628992 7575876 7548260 7514801 7476607
10444 7476607 7485674 7550145 7611017 7641000 7683412 7756815 7803536 7786609 7766256 7811466 7886577
10433 7886577 7895955 7810335 7692542 7626159 7662229 7794764 7940068 7989491 7941080 7925577 8034159
10422 8034159 8184109 8248503 8257569 8345636 8535609 8720275 8850841 8996430 9197143 9401848
10412 9401848 9590323 9818914 10094027 10339546 10557216 10879248 11373392 11931882 12461398
10403 12461398 13051659 13828985 14773480 15831801 17066041 18461206 19667699 20204019 19937905
10394 19937905 19167885 18220707 17185077 16077459 15020830 14119142 13315438 12517279 11762605
10385 11762605 11152998 10710361 10388631 10142049 9908220 9620220 9308945 9090465 8982201
10376 8982201 8855248 8649442 8484393 8437727 8373152 8160283 7924658 7863338 7914756 7857070
10366 7857070 7676767 7575594 7614910 7617606 7474940 7307632 7229205 7163704 7022924 6885439
10356 6885439 6853206 6865467 6801746 6671486 6569177 6517956 6473138 6415547 6344559 6245761 6148573
10345 6148573 6134854 6206051 6235438 6146474 6035622 6009344 6013943 5967243 5945986 6059532 6218868
10334 6218868 6239232 6134976 6104974 6229312 6379819 6451088 6487872 6541560 6582630 6616939 6719903
10323 6719903 6879942 6965284 6933473 6925946 7052875 7219684 7285279 7278340 7330002 7479579 7667330
10312 7667330 7850969 8024846 8187703 8379012 8671072 9042957 9359070 9565143 9787332
10303 9787332 10117043 10430425 10589768 10705928 10992077 11445651 11910835 12393686 13044945
10294 13044945 13854034 14670481 15573903 16881978 18621756 20266132 21228407 21437980 21215289
10285 21215289 20766132 20084291 19231640 18370541 17500807 16447407 15187252 13964286 12976381
10276 12976381 12132629 11252264 10364511 9657019 9202598 8878907 8534335 8127895 7710237
10267 7710237 7343905 7049476 6788465 6506058 6212901 5988277 5866624 5769162 5606821 5408226
10257 5408226 5264990 5175913 5047062 4855668 4706502 4670605 4656331 4534290 4339554 4231451
10247 4231451 4253994 4260170 4126272 3933527 3837691 3834320 3791037 3683644 3638040 3704485 3747488
10236 3747488 3649643 3495226 3425538 3415015 3350268 3260770 3276672 3373724 3367876 3208401 3080895
10225 3080895 3123762 3214018 3173133 3048182 3013946 3082534 3099563 2995833 2864077 2782016 2722832
10214 2722832 2671033 2676025 2733892 2745621 2666569 2590375 2603870 2652615 2643113 2600263 2614361 2679162
10202 2679162 2691788 2598223 2451478 2333087 2289809 2336460 2445410 2534934 2537458 2481474 2444923
10191 2444923 2436419 2399042 2329559 2299742 2333964 2356499 2308914 2241304 2222879 2228613 2195903 2145418
10179 2145418 2147715 2186867 2158977 2027816 1900590 1903267 2029671 2159946 2198929 2153177 2087135
10168 2087135 2046967 2035221 2034062 2033127 2032915 2029257 2009405 1972819 1943649 1944618 1966871 1987296 2006166
10155 2006166 2035562 2055763 2028118 1961124 1914523 1912180 1901331 1843498 1798535 1844475 1938224
10144 1938224 1950912 1856895 1791744 1864661 1989309 1994593 1865456 1761220 1786094 1854066 1839052
10133 1839052 1766618 1755104 1815975 1837970 1774895 1728122 1788694 1892260 1913673 1842698 1772289
10122 1772289 1751854 1753233 1763960 1806063 1855177 1846025 1784378 1754713 1781673 1788040 1741021 1725392
10110 1725392 1787472 1819022 1720947 1593218 1605140 1729429 1779744 1699075 1628477 1660211 1700892
10099 1700892 1653492 1580496 1580765 1624589 1627759 1597355 1586225 1577731 1537476 1520130 1595767 1705806
10087 1705806 1718859 1617595 1519023 1512803 1577912 1655767 1709652 1711107 1659512 1618705 1648582
10076 1648582 1702952 1685770 1603643 1559158 1588983 1621090 1611614 1609108 1646990 1681875 1685820 1697082
10064 1697082 1726536 1714801 1643394 1589270 1598914 1607286 1564145 1540395 1602846 1672523 1637808 1545029
10052 1545029 1532847 1610322 1647748 1587175 1520379 1527173 1561989 1558366 1543824 1572127 1612596 1598892
10040 1598892 1553046 1564461 1639146 1660102 1552365 1425162 1452466 1623765 1732948 1661467
10030 1661467 1549209 1575453 1680502 1681040 1592416 1600804 1714773 1713210 1525427 1396251 1507655
10019 1507655 1676011 1656443 1545745 1590020 1736471 1718358 1523143 1421896 1517940 1606537
10009 1606537 1559091 1527660 1636167 1750648 1727939 1657368 1669942 1710077 1690513 1692923 1806543
9998 1806543 1922125 1902889 1828821 1848751 1904199 1837459 1686288 1624468 1666614 1679219 1650727
9987 1650727 1694747 1785409 1749431 1568466 1450548 1518616 1635678 1640155 1571210 1540514 1536699
9976 1536699 1497627 1463597 1515228 1623931 1682862 1650030 1575436 1518280 1503036 1529269 1575363
9965 1575363 1613604 1641830 1667013 1660596 1593018 1511484 1501094 1560179 1604677 1607776 1629329 1682799
9953 1682799 1692003 1628661 1578818 1606425 1652353 1641685 1600363 1591089 1616600 1656862 1718118 1775196
9941 1775196 1754710 1652713 1578799 1601588 1646108 1636816 1638078 1731976 1847877 1856007 1767202 1697209
9929 1697209 1679341 1654695 1615866 1618231 1662522 1695419 1717738 1771919 1833719 1836967 1795741 1781729
9917 1781729 1793209 1773374 1742162 1763167 1786164 1693032 1524079 1477893 1621902 1773042 1763277
9906 1763277 1672588 1671799 1758702 1804748 1783279 1785984 1840340 1860806 1797560 1718511 1705622 1747690
9894 1747690 1778061 1770396 1757805 1779456 1836334 1894445 1917176 1892657 1838706 1794918 1807381 1889281
9882 1889281 1978589 1973703 1852390 1723159 1706159 1793623 1891025 1959361 2024632 2069445 2034263
9871 2034263 1941107 1901985 1964157 2041887 2043627 1978213 1895693 1819258 1783922 1839798 1951435
9860 1951435 1992849 1921071 1861106 1928407 2055885 2103256 2061125 2026657 2034059 2034927 2013298 2003507
9848 2003507 2012666 2023992 2052704 2105333 2119037 2046013 1963196 1980675 2067336 2093315 2029688 1972396
9836 1972396 1970673 1972531 1958322 1989696 2086202 2174605 2204632 2206746 2199808 2156876 2101760 2116176
9824 2116176 2200013 2248715 2226328 2225535 2282402 2281679 2158614 2053810 2117671 2272805 2337499 2296184
9812 2296184 2265303 2261404 2213075 2171173 2276455 2490457 2578575 2441196 2273806 2285617 2415460
9801 2415460 2465532 2398717 2346630 2390858 2482249 2545295 2544892 2476724 2394989 2414693 2574754 2732524
9789 2732524 2722877 2601306 2579704 2712689 2813253 2737957 2601612 2601708 2743271 2867630 2885053
9778 2885053 2847714 2823547 2817588 2816813 2818435 2804229 2756047 2700162 2681464 2702501 2736121 2770677
9766 2770677 2787126 2737468 2624894 2554794 2601974 2674943 2643995 2564014 2598973 2733982 2766155
9755 2766155 2628227 2514009 2581805 2721669 2756424 2708714 2697821 2709623 2668072 2633168 2711710
9744 2711710 2831964 2823783 2696170 2627006 2681714 2745171 2747294 2755013 2802881 2825463 2814470 2859894
9732 2859894 2963494 2987026 2875010 2765585 2777104 2835565 2829394 2796795 2827979 2896777 2924660
9721 2924660 2920166 2929049 2927142 2879378 2828711 2820228 2818176 2796705 2813361 2884657 2905411 2824016
9709 2824016 2774077 2867808 2979514 2937266 2827855 2868464 3035879 3091912 2973551 2890022 2982359
9698 2982359 3131362 3189147 3184280 3189252 3176574 3131763 3143015 3242750 3301809 3222212 3113219
9687 3113219 3129499 3235812 3282792 3236448 3181042 3151230 3109832 3061513 3056201 3092721 3126171
9676 3126171 3154804 3204911 3252665 3254759 3233415 3240450 3264929 3270225 3289484 3375232 3478167 3495704
9664 3495704 3433439 3397543 3422815 3433724 3396968 3384969 3443194 3511877 3539791 3567642 3624255
9653 3624255 3643124 3581211 3535132 3614782 3752664 3774165 3645205 3520257 3524988 3611360 3677003
9642 3677003 3719910 3789330 3859627 3863920 3824604 3841690 3941152 4027184 4019191 3960841 3941967 3971637
9630 3971637 3996137 4005445 4042087 4109640 4146369 4113557 4059811 4064029 4141033 4233126 4282616 4288482
9618 4288482 4291588 4320459 4364062 4396928 4412840 4417226 4405705 4386904 4411924 4520169 4651475
9607 4651475 4688411 4615753 4558477 4611526 4714235 4764881 4775321 4812234 4860474 4869562 4875940 4936712
9595 4936712 4990635 4951134 4906500 5032272 5298339 5472107 5459948 5436152 5547815 5695517
9585 5695517 5732518 5699358 5706474 5738824 5745600 5788737 5920180 6027570 5995521 5923117 5979630
9574 5979630 6129165 6216557 6258057 6402338 6631871 6755963 6717978 6674899 6730270 6807577 6843551
9563 6843551 6891044 6955430 6941278 6860325 6886331 7074800 7220557 7155671 7022547 7057226 7226098
9552 7226098 7294765 7192786 7097033 7155972 7308335 7412692 7431321 7434889 7496866 7619594 7733066
9541 7733066 7765002 7729938 7716741 7765546 7816327 7819649 7822679 7877031 7933833 7921706 7871989 7864260
9529 7864260 7889060 7874432 7826019 7829426 7913179 8008970 8062406 8098573 8155296 8220217 8260319 8265910
9517 8265910 8249836 8240415 8274189 8352887 8413928 8393715 8317054 8271439 8291195 8320447 8301018 8248642
9505 8248642 8222471 8252395 8315263 8363539 8365757 8328502 8282928 8253358 8253627 8304600 8411823 8519715
9493 8519715 8548207 8504994 8498952 8591483 8694810 8692832 8617554 8608805 8712218 8817610 8821216 8765963
9481 8765963 8768065 8853192 8931418 8930602 8899440 8940966 9064474 9161503 9150439 9087314 9075802 9116102
9469 9116102 9135729 9143820 9230706 9396575 9508061 9484374 9420569 9449040 9565580 9676920 9747049
9458 9747049 9804055 9854818 9881790 9894940 9926290 10003970 10159633 10393724 10605204 10660383 10587315
9447 10587315 10584376 10755987 10964115 11045098 11041624 11081200 11148789 11154877 11134054 11184876 11277127
9436 11277127 11309073 11307623 11378920 11493476 11517242 11444116 11408513 11466825 11545799 11609803 11698211
9425 11698211 11786328 11791104 11741402 11774597 11932688 12111166 12228628 12303079 12358202 12404189 12499385
9414 12499385 12669586 12794417 12759427 12684140 12779823 13012646 13161639 13194233 13295667 13512785
9404 13512785 13683244 13768025 13924858 14166589 14289931 14270606 14378712 14724846 15035270 15102792
9394 15102792 15134105 15376161 15692433 15825692 15839077 15966289 16217125 16453889 16694766 17025047
9384 17025047 17346971 17522699 17643325 17870948 18143007 18318031 18476718 18776223 19136073
9375 19136073 19382650 19583150 19910719 20293648 20543193 20732877 21092715 21596726 22010616
9366 22010616 22295281 22615503 23001070 23352178 23730571 24279868 24897157 25355673 25715709
9357 25715709 26225819 26849736 27309048 27589791 27976681 28562602 29152821 29687672 30319496
9348 30319496 31022794 31581269 32028077 32639197 33416469 34060284 34546249 35217009 36176843
9339 36176843 37123495 37935536 38877709 40030244 41078260 41903835 42821827 43964429 45009203
9330 45009203 45808645 46691803 47824487 48905478 49849987 51081252 52726470 54276052 55545088
9321 55545088 57157222 59463930 61891972 64147687 67061641 71174557 75562799 79590428
9313 79590428 84847134 93121730 102656992 108758673 108732512 104388475 98983149 93587121
9305 93587121 87644088 81392728 75868415 71302476 67168787 63472989 60672894 58560113
9297 58560113 56425688 54233667 52569943 51478371 50345987 48968723 47790709 46972134
9289 46972134 46084735 44923374 43844556 43056024 42255155 41242367 40281469 39558389 38825964
9280 38825964 37895996 37005820 36375401 35812790 35078613 34286411 33628459 33013394 32287647
9271 32287647 31560225 31004717 30538584 29976241 29346482 28814116 28404846 28013455 27592643
9262 27592643 27170125 26753038 26329347 25892303 25407986 24861742 24354912 24003017 23725053
9253 23725053 23327420 22818742 22411179 22164999 21891429 21488562 21097526 20801847 20453183
9244 20453183 19972878 19564263 19396036 19289621 18977718 18512252 18151931 17955748 17749747
9235 17749747 17441889 17130065 16899454 16703383 16474827 16229391 16027927 15901831 15814123 15670253
9225 15670253 15416220 15139773 14984520 14944606 14866747 14687420 14516976 14431345 14346981 14190955
9215 14190955 14033510 13945861 13878428 13786277 13716226 13659213 13495639 13223158 13049803 13090585
9205 13090585 13153782 13026855 12800974 12683486 12649650 12548427 12425975 12443759 12547658 12520027
9195 12520027 12336303 12186157 12137673 12054701 11880401 11743861 11722197 11726029 11694337 11693514 11741150
9184 11741150 11726162 11599636 11474325 11436977 11415949 11334952 11255838 11258082 11294597 11278900 11223186
9173 11223186 11188416 11171615 11132106 11069632 11002809 10923553 10833193 10772789 10765883 10776067 10759348
9162 10759348 10715175 10663446 10621523 10615205 10649288 10657557 10557114 10372731 10236552 10240371 10346019
9151 10346019 10450732 10479183 10413191 10304787 10258721 10324028 10407399 10376499 10237770 10117738
9141 10117738 10082954 10089687 10102014 10130141 10143627 10082008 9978326 9943867 9996900 10030539 9985780
9130 9985780 9931013 9929045 9949853 9959821 9974380 9978150 9920784 9838034 9841134 9933265 9980194 9926730
9118 9926730 9890726 9958545 10034920 9997461 9869290 9739368 9640687 9604261 9692388 9864200 9946598
9107 9946598 9862248 9750134 9734559 9730006 9630244 9530029 9558922 9630661 9585083 9474947 9469206
9096 9469206 9545351 9532391 9421276 9376950 9445134 9493303 9466541 9465704 9521516 9513274 9389135 9273354
9084 9273354 9268150 9317406 9347609 9379869 9416264 9378969 9267601 9226405 9331480 9438974 9380202
9073 9380202 9208869 9117462 9176674 9285159 9333782 9308609 9255311 9227590 9255859 9313662 9343741
9062 9343741 9347968 9389523 9467422 9477352 9368999 9258048 9281233 9400291 9461969 9417856 9368119
9051 9368119 9391829 9444804 9456591 9444730 9477455 9563707 9633950 9627483 9565203 9519301 9527774 9570763
9039 9570763 9629697 9716300 9811926 9837909 9756911 9663288 9681833 9796572 9878804 9876552 9863419
9028 9863419 9890188 9913425 9909811 9938365 10024814 10093250 10091154 10085881 10149813 10238623 10283416 10323659
9016 10323659 10429490 10549032 10565319 10485199 10449884 10548772 10720863 10861808 10949550 11031707
9006 11031707 11142712 11270326 11383933 11476118 11575515 11713628 11885310 12064732 12247593 12433384
8996 12433384 12583408 12673337 12783207 13028936 13378190 13652149 13767052 13854350 14054661 14307931
8986 14307931 14468682 14535982 14624209 14764622 14884122 14951333 15005072 15049282 15046917 15018288 15030434
8975 15030434 15081628 15097961 15053221 15003439 14996739 15023365 15048590 15032113 14947955 14854754 14885014
8964 14885014 15066931 15230113 15218240 15119915 15120757 15192622 15143933 14951914 14805748 14797458 14807188
8953 14807188 14748615 14687285 14628623 14436520 14102114 13864265 13875780 13939000 13785260 13466620
8943 13466620 13242987 13193987 13180643 13119683 13057817 13001886 12893822 12758242 12690045 12686993 12657998
8932 12657998 12597537 12587581 12623933 12610421 12541898 12526080 12594947 12655671 12665401 12695421 12774902 12828849
8920 12828849 12830438 12859428 12936177 12952138 12860700 12794012 12872935 13020726 13092317 13090036 13119342
8909 13119342 13208648 13305465 13392651 13481316 13535037 13525926 13530113 13642256 13816395 13914582 13907995
8898 13907995 13912076 14011561 14159310 14276336 14360605 14456738 14582300 14718183 14828086 14874207
8888 14874207 14862137 14878055 15024255 15296723 15570361 15726198 15763611 15779219 15865563 16036008
8878 16036008 16224710 16358830 16438733 16521309 16615911 16662581 16657997 16719992 16928852 17166741 17249357
8867 17249357 17192795 17202625 17388974 17643843 17841840 18009260 18210268 18398722 18504331 18578205
8857 18578205 18727884 18959300 19192721 19397290 19607330 19832133 20045331 20247611 20457521
8848 20457521 20658685 20834598 21032480 21307065 21618868 21876861 22072687 22286150 22561926
8839 22561926 22863517 23145526 23390179 23579274 23717214 23875822 24122357 24406716 24622077
8830 24622077 24775680 24980465 25264223 25519542 25681686 25823802 26014387 26207326 26357144
8821 26357144 26529217 26792237 27091426 27334631 27531037 27742113 27962669 28158254 28365913
8812 28365913 28651934 29011056 29398644 29813871 30260905 30684798 31044279 31391352 31780406
8803 31780406 32168775 32520953 32929949 33490685 34124495 34693861 35228296 35851312 36541347
8794 36541347 37186292 37840826 38671959 39637950 40498569 41209931 42031687 43123757 44299245
8785 44299245 45340700 46321763 47415588 48598798 49776266 51009155 52352142 53619680
8777 53619680 54614673 55484661 56534542 57742503 58788816 59556564 60265429 61050591 61736507
8768 61736507 62158564 62427033 62695396 62895052 62903232 62801671 62754638 62745867 62638091 62417048
8758 62417048 62190612 61992439 61756353 61466379 61185228 60932733 60653407 60312213 59932514
8749 59932514 59535764 59111207 58634804 58064325 57349168 56504815 55631374 54787321 53895571
8740 53895571 52854913 51687993 50483023 49248373 47947102 46629713 45387988 44196070
8732 44196070 42949638 41665575 40479756 39413881 38316846 37119025 35987182 35096000
8724 35096000 34360392 33552338 32619006 31719839 30965622 30284990 29586003 28909459 28338151
8715 28338151 27844524 27328425 26765567 26229954 25780910 25402373 25058042 24739923 24440511
8706 24440511 24128740 23786087 23435593 23111911 22830784 22603099 22437112 22300624 22127389
8697 22127389 21900110 21680864 21511285 21337922 21110764 20903277 20825545 20843116 20809182 20683113
8687 20683113 20582476 20580679 20590708 20525731 20450951 20466209 20534095 20553217 20535344 20572876 20669842
8676 20669842 20743967 20782367 20859863 20994404 21112935 21189981 21301974 21494862 21699524 21844544
8666 21844544 21975473 22188910 22498119 22832239 23141923 23450294 23806402 24219469 24639584
8657 24639584 25005169 25327712 25710179 26232324 26829246 27353468 27763664 28172362 28678681
8648 28678681 29232833 29716698 30091480 30398478 30661265 30862902 30998240 31080852 31103577 31047664
8638 31047664 30931186 30798715 30655044 30453665 30170481 29855003 29577819 29344108 29095709
8629 29095709 28801206 28503231 28246178 27990002 27657588 27263405 26918540 26678329 26459501
8620 26459501 26165784 25830693 25555810 25356250 25161924 24942191 24729785 24536671 24346149
8611 24346149 24179869 24069414 23966613 23796302 23600011 23495379 23471965 23376272 23158036 22984889
8601 22984889 23011512 23150924 23197583 23100507 22991876 22988181 23071163 23150995 23172560 23166174 23224591
8590 23224591 23395999 23591849 23679648 23682734 23769390 23998058 24216011 24300193 24355451 24543047
8580 24543047 24835655 25096764 25301921 25515822 25735747 25930562 26158441 26465235 26742239
8571 26742239 26886645 27032006 27383807 27873742 28243040 28458527 28756939 29236887 29706129
8562 29706129 30034587 30376097 30885682 31463270 31963541 32448803 33026823 33616315 34098357
8553 34098357 34559404 35152172 35822530 36405692 36911940 37482697 38115703 38667961 39112336
8544 39112336 39569579 40079504 40545271 40926054 41290155 41638473 41860208 41924827 41955823 42041985
8534 42041985 42115743 42092848 42006045 41919704 41821800 41685492 41550386 41465433 41422164 41403714 41423773
8523 41423773 41459376 41426812 41295744 41160520 41126793 41180739 41233720 41245745 41242446 41254606 41302335
8512 41302335 41404636 41551660 41697473 41823718 41978403 42211239 42501093 42785131 43036067
8503 43036067 43285347 43592645 43998362 44470344 44906746 45253060 45603642 46094278 46696670
8494 46696670 47248728 47718811 48281668 49041572 49832716 50447329 50951906 51588584 52421012
8485 52421012 53282578 54073010 54901057 55871302 56901336 57858197 58759930 59724626 60793399
8476 60793399 61919633 63093538 64363293 65732162 67127426 68502024 69907571 71423682
8468 71423682 73041925 74664020 76219142 77747844 79335590 80972441 82528144 83890019
8460 83890019 85080218 86187361 87216314 88078290 88720654 89184043 89509640 89663902 89598290
8451 89598290 89329519 88915241 88395296 87801339 87175668 86522752 85786919 84950268 84114583
8442 84114583 83394717 82755392 82071087 81354023 80781976 80436502 80149358 79736187 79286961
8433 79286961 79051266 79071335 79124169 79058518 78993670 79083148 79251325 79328716 79331895 79407146 79551505
8422 79551505 79606456 79532981 79476199 79492254 79406802 79059328 78530036 77982488 77406495 76681152
8412 76681152 75801540 74860280 73852747 72686618 71377905 70062219 68785066 67436128
8404 67436128 65937845 64362747 62805717 61261341 59694752 58126165 56573527 55009318
8396 55009318 53447660 51977641 50627753 49292984 47895472 46529044 45325899 44253440
8388 44253440 43180078 42090692 41082790 40167241 39234494 38245759 37315480 36544996 35883053
8379 35883053 35218027 34522969 33840655 33193974 32583449 32025075 31524167 31045072 30560619
8370 30560619 30100896 29706169 29363601 29036274 28721102 28429486 28144466 27851268 27580064
8361 27580064 27359778 27157406 26929433 26709355 26563580 26469254 26326941 26112963 25934611 25893399
8351 25893399 25959370 26027424 26042168 26014703 25965736 25917840 25912829 25970186 26044327 26082421 26109743
8340 26109743 26193123 26327758 26433836 26475838 26513547 26607185 26733344 26830628 26874270 26863287 26784228
8329 26784228 26642266 26491406 26376379 26270133 26121973 25940046 25763774 25576585 25320033
8320 25320033 24989596 24644057 24315193 23979472 23630186 23302160 23001058 22681512 22328813
8311 22328813 21991103 21689553 21370379 21001753 20647695 20374699 20146856 19894019 19626303
8302 19626303 19387254 19148285 18866744 18608277 18469068 18388374 18199083 17892555 17666426 17633291
8292 17633291 17635509 17471805 17188925 16996192 16965806 16980801 16945055 16880456 16811169 16705180 16570554
8281 16570554 16481323 16450717 16385416 16232151 16079082 16033924 16070686 16078179 16012896 15929774 15895648
8270 15895648 15934467 16024773 16094279 16055127 15907582 15773370 15760118 15828164 15863980 15845832 15841532
8259 15841532 15866887 15861578 15814731 15802745 15863926 15928787 15928191 15897369 15914261 15990668 16079605 16144672
8247 16144672 16172007 16155662 16118702 16110124 16140091 16163542 16166617 16206358 16306729 16383685 16359087
8236 16359087 16294284 16307349 16395692 16457143 16467452 16506284 16597463 16656843 16640427 16622776 16665543
8225 16665543 16718135 16729820 16759547 16867325 16975789 16970413 16895702 16916363 17087582 17286885 17394439
8214 17394439 17430480 17472557 17532822 17583670 17640859 17748687 17910928 18087774 18242622 18358694
8204 18358694 18436438 18509662 18636767 18835073 19042919 19186051 19267221 19353663 19490854 19670286
8194 19670286 19873461 20100107 20345185 20586389 20810489 21028234 21253040 21486766 21734963
8185 21734963 22013781 22330144 22673450 23037637 23433605 23866608 24315034 24743403 25125309
8176 25125309 25446898 25706813 25929549 26166129 26460739 26816325 27200161 27578025 27939880
8167 27939880 28306075 28716693 29200016 29742018 30303825 30876793 31490685 32148024 32789306
8158 32789306 33369334 33942396 34608387 35374239 36128763 36770712 37309985 37821131 38347946
8149 38347946 38884682 39403744 39861862 40220853 40508684 40820848 41203401 41566135 41783463
8140 41783463 41868686 41971113 42189623 42459800 42657201 42756373 42837995 42966765 43118007 43236833
8130 43236833 43335759 43490164 43721241 43924089 43976163 43908925 43880429 43946837 43969474 43828402
8120 43828402 43616731 43482170 43363891 43088861 42698040 42434929 42363658 42247946 41936599 41638568
8110 41638568 41605788 41717354 41649749 41372084 41182304 41253178 41417529 41476153 41482050 41590308
8100 41590308 41802590 42014736 42205204 42430523 42702080 42991286 43312677 43701030 44140859
8091 44140859 44599676 45092516 45641114 46216760 46801708 47457237 48239878 49090526 49906362
8082 49906362 50696855 51564336 52538291 53533394 54487457 55452357 56519965 57725460 59049309
8073 59049309 60456739 61909843 63387246 64910912 66516014 68192707 69906156 71668576
8065 71668576 73521860 75442051 77343467 79204022 81097783 83050557 84949917 86686391
8057 86686391 88321037 89999408 91725016 93341999 94758192 96065769 97382643 98673317
8049 98673317 99823288 100834481 101838308 102929697 104086529 105259151 106442696 107629040
8041 107629040 108772826 109858673 110939919 112058395 113180203 114258658 115293150 116257296
8033 116257296 117036387 117534836 117806922 117983884 118099016 118078267 117871150 117483123 116908369
8024 116908369 116157124 115330856 114527678 113679231 112641768 111457590 110338607 109349309 108315141
8015 108315141 107136443 105979876 105006561 104096092 103037728 101856369 100735116 99714342
8007 99714342 98683619 97599408 96493953 95319960 94005027 92628656 91330105 90062578
7999 90062578 88659373 87129615 85648522 84244191 82749465 81113023 79505316 78033552
7991 78033552 76592367 75103028 73668227 72357719 71059984 69703765 68427735 67356652
7983 67356652 66387789 65380656 64389993 63517285 62694488 61832480 61037223 60438119 59923964
7974 59923964 59305917 58644766 58143675 57786666 57374661 56888666 56515987 56301018 56067296
7965 56067296 55748594 55518051 55482825 55495624 55401981 55268197 55223772 55258427 55322193 55464629
7955 55464629 55713701 55951892 56083621 56223578 56550584 57050315 57566098 58048632 58586789
7946 58586789 59210404 59822873 60353874 60853290 61381914 61889913 62264528 62464735 62558815 62627344
7936 62627344 62667223 62632168 62552006 62520920 62516952 62332640 61806020 61055340 60329266 59665933
7926 59665933 58897798 57995480 57170934 56557142 56001423 55313889 54544684 53853985 53253283
7917 53253283 52654991 52066735 51554453 51098595 50660097 50306287 50088462 49872075 49498649
7908 49498649 49070899 48854494 48899908 48973626 48892028 48728226 48636570 48646450 48700611 48756230 48779708
7897 48779708 48756512 48752380 48848601 48986653 49015401 48931532 48915629 49061814 49231577 49279079 49279889
7886 49279889 49406490 49687642 50032186 50412488 50881114 51445173 52035322 52558020 52879712
7877 52879712 52819432 52293204 51453226 50572303 49790498 49057004 48287119 47455090 46540136 45521178
7867 45521178 44470281 43540552 42794943 42127862 41425519 40733865 40180531 39779554 39422836
7858 39422836 39059045 38770219 38631416 38585789 38532820 38478177 38500485 38600685 38693079 38747126
7848 38747126 38827352 38966413 39113515 39263661 39521800 39945069 40416589 40792067 41102495 41490951
7838 41490951 42004617 42574476 43154004 43752896 44384723 45114558 46093302 47383321 48824612
7829 48824612 50279575 51926424 54000277 56233563 57896332 58518122 58296938 57679304 56862151
7820 56862151 55916198 55069378 54511827 54104218 53621695 53166247 53013050 53151614 53334088
7811 53334088 53530111 53965169 54687078 55449534 56112959 56850470 57834530 58986031 60171345
7802 60171345 61417343 62787725 64246466 65782600 67487891 69377690 71308722 73202985
7794 73202985 75176120 77309060 79475604 81553767 83635953 85857789 88176205 90490824
7786 90490824 92825114 95201964 97510534 99708654 101963464 104291005 106197005 107039607
7778 107039607 106719325 105684250 104266047 102378033 99943639 97245498 94625480 92077868
7770 92077868 89376715 86465456 83514004 80677177 77973749 75359243 72782980 70202977
7762 70202977 67644890 65219340 63011698 60993288 59088002 57259163 55479386 53705616
7754 53705616 51964757 50381081 49020844 47774568 46492122 45176711 43939871 42814366
7746 42814366 41732356 40665464 39664906 38753650 37878213 36991085 36106284 35249909 34415904
7737 34415904 33595864 32808908 32078752 31403813 30756394 30097373 29404830 28707293 28065982
7728 28065982 27502326 26975857 26458962 25983800 25570692 25163608 24702040 24212430 23755084
7719 23755084 23325745 22900555 22535362 22296884 22108885 21807772 21378957 21000979 20790831
7710 20790831 20629617 20340392 19940165 19585555 19328597 19077188 18790591 18563789 18464289 18398745
7700 18398745 18229543 17958160 17699829 17509563 17330652 17117559 16917904 16793475 16724100 16641072
7690 16641072 16512585 16344399 16135564 15900274 15707303 15617372 15585100 15503086 15350784 15213140
7680 15213140 15130388 15030211 14863404 14708725 14651305 14630396 14521507 14327147 14165238 14083916
7670 14083916 14009921 13891446 13776027 13711296 13667876 13608785 13551766 13509297 13438586 13309082 13161371
7659 13161371 13046299 12961519 12899213 12893453 12953095 13001858 12962763 12863870 12784871 12733750 12659680
7648 12659680 12562496 12495919 12467274 12425204 12357729 12315875 12314728 12292740 12212432 12131770 12116233
7637 12116233 12131179 12093080 12001856 11946579 11975064 12023592 12006823 11931920 11875870 11871432 11873830 11847919
7625 11847919 11829172 11857787 11894826 11867182 11780217 11717210 11722072 11749179 11747809 11731304 11733260 11756793
7613 11756793 11801136 11873517 11935756 11917325 11839425 11838248 11975564 12110253 12082803 11961723 11948069
7602 11948069 12066806 12137435 12070996 12006688 12074515 12186621 12189724 12108015 12090895 12186972 12307134
7591 12307134 12379900 12422151 12463291 12498856 12525012 12546516 12552320 12543263 12567558 12660907 12766776
7580 12766776 12791209 12732961 12688581 12725764 12815771 12895795 12938304 12952403 12971662 13046047 13193400
7569 13193400 13353892 13442086 13446949 13433229 13448925 13488831 13549131 13652398 13800678 13954542 14077047
7558 14077047 14163365 14225114 14283304 14367072 14472777 14542994 14548871 14571809 14715329 14940518 15092904
7547 15092904 15115695 15133130 15272819 15495247 15668585 15745871 15791093 15870444 15991908 16139440
7537 16139440 16310376 16507034 16706026 16845277 16874142 16849394 16935834 17233126 17630335 17929483
7527 17929483 18089170 18221677 18369342 18459246 18503172 18636390 18871269 19017170 18987222 18993646
7517 18993646 19241485 19588789 19756712 19763878 19869868 20139529 20365026 20441996 20532969 20769150
7507 20769150 21041719 21220021 21371802 21615406 21914760 22176218 22421674 22715778 23026540
7498 23026540 23302496 23597059 23973488 24366308 24684021 24986015 25408258 25953594 26493717
7489 26493717 26952512 27365267 27784372 28244518 28791727 29427319 30052023 30587788 31122568
7480 31122568 31799016 32589867 33341711 34028466 34781563 35647733 36506320 37291747 38118020
7471 38118020 39074635 40050270 40897603 41663545 42510917 43491972 44551592 45706417 47065220
7462 47065220 48675822 50477139 52408270 54453447 56562387 58615373 60469327 61944459
7454 61944459 62781153 62763615 61947657 60650885 59145233 57462829 55582325 53671148 51977458
7445 51977458 50548847 49245119 48022257 47012300 46272391 45641206 44965522 44332575 43921375
7436 43921375 43710206 43506310 43229773 42991798 42883824 42858267 42864733 42948218 43127382 43304322
7426 43304322 43405809 43518805 43764577 44105649 44405110 44637231 44908534 45277803 45675821
7417 45675821 46023171 46328548 46637479 46963927 47315514 47726337 48212907 48724878 49179632
7408 49179632 49545523 49880968 50289174 50823238 51434862 52041445 52641218 53308430 54061436
7399 54061436 54811555 55486204 56127556 56811268 57549622 58349641 59269732 60307665 61328446
7390 61328446 62253366 63238351 64476056 65877593 67176577 68334222 69587396 71054833
7382 71054833 72563643 73973901 75417887 77040939 78722869 80286201 81824358 83570295
7374 83570295 85535522 87534188 89519376 91645323 93990656 96449335 98946111 101570793
7366 101570793 104427976 107502297 110743163 114161148 117775462 121570604 125564580 129827951
7358 129827951 134382141 139163878 144140671 149385515 154994466 161003614 167424463 174286288
7350 174286288 181606924 189396244 197724322 206712428 216421690 226818916 237865452 249531428
7342 249531428 261668456 273953203 285993161 297363272 307446174 315349298 320155838
7335 320155838 321310914 318771388 312881631 304202675 293397713 281126337 267969120 254437316
7327 254437316 240996321 228013830 215701995 204155383 193427615 183544334 174485266
7320 174485266 166198974 158605133 151563768 144916766 138616229 132743966 127335293 122256035
7312 122256035 117349934 112646542 108297454 104330104 100592738 96954928 93450451 90184720
7304 90184720 87184173 84380686 81691200 79081686 76588274 74283142 72182306 70198236
7296 70198236 68235084 66309606 64503342 62812505 61145959 59478847 57895399 56440076
7288 56440076 55034013 53608117 52227725 50989682 49854701 48687743 47443905 46219882
7280 46219882 45115830 44120433 43150901 42150972 41123645 40102022 39113155 38158054 37218232
7271 37218232 36287181 35386253 34536714 33732289 32960231 32230815 31555656 30912063 30265297
7262 30265297 29616165 28988241 28378770 27771520 27193735 26696501 26262426 25799906 25269034
7253 25269034 24754786 24356779 24050780 23729452 23347231 22940986 22525611 22071676 21600133
7244 21600133 21196206 20885905 20588439 20248214 19926632 19683088 19444035 19099209 18677378
7235 18677378 18307906 18033900 17783343 17514981 17264738 17033412 16757211 16433243 16161351
7226 16161351 15999142 15864409 15645493 15338785 15024291 14770897 14608367 14519459 14416844 14205742
7216 14205742 13911337 13659911 13498462 13341078 13138799 12965479 12856571 12710901 12470593
7207 12470593 12255993 12169353 12095145 11882896 11620057 11502785 11506050 11420307 11189202 10975135
7197 10975135 10882513 10840454 10786261 10745247 10682458 10490619 10195175 9975141 9906785 9872492 9786052
7186 9786052 9699886 9614579 9421986 9158062 9065064 9224951 9355127 9188654 8866118 8698040
7176 8698040 8695695 8625182 8425547 8268483 8233188 8205022 8118149 8053738 8047597 8006200 7876410
7165 7876410 7732404 7637600 7559148 7461405 7360264 7258771 7146439 7069269 7074341 7087814 6987736
7154 6987736 6795433 6645805 6573190 6493133 6394943 6359763 6364887 6276586 6092167 5985540 6031664
7143 6031664 6080848 6006899 5891558 5840525 5795983 5681409 5575872 5574084 5596221 5511722 5361639
7132 5361639 5292454 5334706 5392452 5394033 5325814 5181601 5003291 4902981 4921008 4936566 4845398
7121 4845398 4737216 4746898 4817800 4794097 4683613 4628913 4650364 4625536 4526893 4477472 4529080
7110 4529080 4562699 4476146 4330315 4239059 4223091 4234225 4237967 4224198 4199411 4184549 4163323
7099 4163323 4063053 3878568 3762416 3845843 4005336 3992079 3791745 3646924 3683646 3739976
7089 3739976 3658608 3533045 3514187 3553733 3525410 3465453 3489473 3560510 3545952 3454873 3417649
7078 3417649 3446730 3416066 3301726 3256657 3373891 3521882 3518349 3374123 3255316 3250419 3279533
7067 3279533 3235743 3132834 3066718 3069553 3071766 3024148 2989694 3046256 3138861 3132570 3012236 2913882
7055 2913882 2922232 2957227 2932311 2906916 2966576 3043111 3000107 2849780 2738395 2733149 2762342
7044 2762342 2767634 2776892 2800385 2783784 2713657 2663765 2680748 2711313 2695870 2652797 2614775 2561693
7032 2561693 2483868 2442003 2484452 2552718 2548355 2466196 2392214 2386727 2430421 2475852 2497043 2486460
7020 2486460 2444935 2384892 2325462 2284723 2280463 2317801 2367217 2384062 2363846 2345510 2344604 2325347
7008 2325347 2265563 2206963 2203360 2251748 2309648 2348071 2354425 2323225 2283844 2292289 2345157 2351006
6996 2351006 2254685 2142359 2132703 2199318 2215763 2166740 2178442 2303060 2407086 2360033 2230811
6985 2230811 2179277 2218150 2218519 2129848 2052874 2066449 2107514 2091265 2055182 2087429 2168024 2189358
6973 2189358 2120971 2052240 2051007 2065940 2017704 1927532 1891068 1948487 2035543 2059902 1988784 1863812
6961 1863812 1761547 1739897 1794785 1862960 1884618 1864262 1856134 1894263 1952939 1973624 1922760
6950 1922760 1834052 1796132 1865893 1978399 1990569 1855181 1702528 1683729 1776722 1841022 1834909
6939 1834909 1849629 1917322 1931795 1830079 1725279 1745540 1831976 1832801 1743809 1704134 1763073
6928 1763073 1802173 1729324 1627614 1636074 1756569 1857401 1839693 1745776 1705221 1790479 1924727
6917 1924727 1953138 1829967 1692669 1691220 1791216 1844283 1816627 1807316 1843578 1830263 1751809
6906 1751809 1744215 1861043 1935692 1832903 1696915 1747346 1925729 1981196 1865355 1788228 1862521
6895 1862521 1945535 1917077 1883370 1965794 2073478 2058336 1961567 1928177 1976278 2029288 2096802
6884 2096802 2231278 2356156 2342055 2243428 2256307 2413309 2516088 2438187 2319156 2353341
6874 2353341 2526031 2683607 2760405 2799056 2812107 2763922 2672154 2613590 2618974 2635974 2604602
6863 2604602 2520538 2427003 2378236 2392063 2409817 2341605 2187035 2056205 2018237 1995295 1889157
6852 1889157 1750260 1704065 1745355 1744089 1658027 1597419 1636822 1693149 1667052 1599855 1589884 1626345
6840 1626345 1617515 1544081 1475859 1450518 1437288 1424278 1441234 1469501 1427450 1303649 1222329
6829 1222329 1285684 1401868 1385541 1222800 1107874 1168415 1277221 1248508 1132346 1142659
6819 1142659 1309230 1399250 1258896 1056478 1037255 1163105 1196999 1084976 1020985 1108585
6809 1108585 1186544 1097712 948236 937065 1047543 1094678 1021567 960946 1002787 1072341 1084599
6798 1084599 1075927 1100834 1105041 1008504 858036 789741 850306 941652 956782 903050 857309 847167
6786 847167 832941 797283 794844 880800 1018218 1100577 1064907 946940 823519 744652 733615
6775 733615 797549 897703 952516 923495 868976 857917 859420 790511 660251 579748 612511
6764 612511 694709 740509 755691 789776 829450 816336 753067 721865 785321 908381 989402
6753 989402 947399 787439 612996 563591 686879 858114 880226 705328 517899 534176
6743 534176 733317 870901 787907 622150 628914 840150 1024111 995007 835463 738916 736015
6732 736015 705271 606363 551161 620672 736968 778817 736495 679540 635330 581188 519437
6721 519437 480932 467923 457174 451263 470695 502808 514205 509962 524160 550954 544351 496703
6709 496703 459148 465440 491196 513238 549957 602737 613910 544441 456024 445873 516245 575467
6697 575467 563019 507932 460405 434561 434612 468463 506061 490389 429317 409978 468793 515873
6685 515873 465651 382510 393682 495478 565319 553876 536365 557694 559289 505566 457839 453794
6673 453794 430142 353023 313744 381573 461208 436376 374249 421402 549211 590443 515517
6662 515517 473995 530420 555753 461109 363199 395758 494655 515223 465389 466853 540485 582381
6650 582381 537229 464201 422588 400466 379012 380891 422560 476831 508282 506715 475068 421153
6638 421153 369008 348113 365560 406208 453367 495975 531523 568647 597546 561858 423351
6627 423351 265488 241854 377923 520166 548375 530017 560073 562131 415713 208621 157113
6616 157113 284546 383973 337400 274912 333652 436856 440507 364304 328064 350626 362352
6605 362352 356544 378241 396143 335328 232954 218393 315696 398751 390244 380535 467757 584278
6593 584278 598380 522576 482499 500826 466498 352508 306682 420368 533630 440481 222705
6582 222705 170570 360495 531246 470771 321984 335291 474743 502079 371829 285276 348181
6571 348181 419667 373578 302454 341667 446132 480985 430207 381088 369979 364997 358979 373688
6559 373688 393470 376790 323023 276651 282426 359135 473826 528528 448816 312126 292238
6548 292238 429678 560931 539975 422195 345571 338625 351412 377084 421519 436327 403385
6537 403385 404359 484708 542727 493262 437048 493251 565726 495945 373225 430216 652076 770118
6525 770118 678758 578777 618071 661493 567851 458952 510236 648965 682864 612178 592577
6514 592577 657903 695345 672734 691736 792646 869132 830762 736951 710545 787373 896056
6503 896056 945445 904653 819313 757801 733304 696016 611924 513614 455057 457625 516997 608181
6491 608181 665349 630470 552902 554184 647054 687884 581477 434345 403988 481617 545383
6480 545383 560480 586513 626009 611898 541636 496234 512141 537491 527985 495639 454410 402296
6468 402296 364171 376193 427224 481327 535823 581773 552100 419274 303995 344841 477691
6457 477691 504532 389139 311077 384749 500993 527187 501060 511732 526348 475360 411072
6446 411072 435664 533226 602963 612668 601465 573459 509185 452761 469806 534545 565302 557082
6434 557082 573148 617507 626923 587469 548613 518120 459918 410400 468262 626161 734707
6423 734707 699597 605917 567584 559919 510796 467261 524509 633796 641340 525129 442012 491880
6411 491880 572185 556683 507242 572017 727678 778466 629347 430217 384130 500907 624618
6400 624618 650457 616790 596796 594904 579720 553387 541094 545619 555627 581448 640659 709409
6388 709409 725819 660784 567369 535250 593577 675733 692889 633678 571893 575204 630463 674853
6376 674853 682357 689218 730174 774217 749609 639118 530192 533933 642924 714189 642324 517289
6364 517289 525008 688114 811413 741006 581001 546502 661496 743162 682749 595028 626570
6353 626570 730896 746334 644874 578868 663543 809225 835646 710469 592301 623704 752236
6342 752236 815794 764088 704257 723647 768821 753982 708023 727570 828321 930242 968792
6331 968792 944055 877533 797488 755286 780224 825263 827323 805432 821292 864135 871091 848507
6319 848507 862311 906602 900144 830475 781497 789476 794494 773809 793003 867587 907282 876736
6307 876736 880403 984864 1079934 1045154 948867 929873 961927 910988 788402 763824 906512
6296 906512 1067901 1080746 969798 895497 948639 1064223 1121326 1088224 1050771 1093312 1180339
6285 1180339 1207853 1157018 1109032 1096658 1054104 962040 922092 1002845 1119693 1169769 1184031
6274 1184031 1227112 1250185 1193947 1150588 1243655 1399393 1426473 1305014 1213252 1259601 1360042
6263 1360042 1407292 1402659 1379523 1337532 1300869 1320585 1376371 1385192 1339631 1328304 1389982 1457771
6251 1457771 1478930 1484613 1510897 1547787 1586961 1628705 1640279 1604638 1589541 1650669 1704703 1650450
6239 1650450 1571316 1620659 1738169 1724778 1603075 1620919 1838185 2007174 1977597 1921402 1987634
6228 1987634 2031721 1924557 1859912 2048147 2313268 2341461 2188772 2173363 2337950 2403260
6218 2403260 2265188 2168216 2289613 2470472 2515858 2508328 2627471 2834218 2943116 2913188
6208 2913188 2879163 2926568 2988874 2982277 2933472 2924811 2965974 2980790 2923826 2858556 2871803 2939797
6196 2939797 2960947 2922314 2929990 3037670 3153519 3184405 3170624 3190174 3224257 3222013 3214850 3251944
6184 3251944 3293694 3285050 3268241 3306320 3361793 3371882 3375590 3437410 3514319 3537984 3560744 3665202
6172 3665202 3787713 3800286 3728351 3717032 3802227 3878174 3885299 3880939 3920207 3990087 4059324 4101257
6160 4101257 4102331 4125247 4276611 4517834 4642817 4580862 4557623 4760508 5016731 5061284 4967123
6149 4967123 4994506 5137508 5180659 5128524 5190660 5366477 5442004 5413709 5515826 5775869 5940136
6138 5940136 5919330 5913954 6002796 6018648 5961368 6106439 6515671 6846949 6873441 6811475 6898617
6127 6898617 7027468 7063085 7148723 7392445 7598095 7629467 7711986 8037096 8388834 8521310
6117 8521310 8596299 8862907 9199573 9384683 9545173 9899551 10305283 10517903 10677868 11068093
6107 11068093 11579651 11900745 12079412 12421653 12963579 13506409 14045756 14709897 15407760
6098 15407760 16000512 16678073 17685136 18816723 19674706 20271268 20881756 21497904 21984344
6089 21984344 22565242 23529835 24653450 25573649 26516119 27913006 29565434 31046131 32656340
6080 32656340 34965204 37682271 40231662 43193351 47591790 52854990 57540156 62457223
6072 62457223 70526446 82022078 92074434 95194716 91104214 83922428 76643578 69078623
6064 69078623 60837142 53277839 47594602 43166139 39022744 35423258 32854556 30742213
6056 30742213 28353190 26047345 24521773 23540986 22440341 21273864 20469131 19849448 18978977
6047 18978977 18089686 17703558 17599702 17078770 16096192 15258773 14761573 14169577 13307397
6038 13307397 12587648 12271781 12044514 11565791 10947934 10441024 10035210 9609886 9191736
6029 9191736 8868885 8640654 8462017 8279615 7999505 7598085 7248191 7129181 7143032 7042941
6019 7042941 6802612 6607456 6509421 6362498 6107586 5865696 5720929 5632832 5578716 5572442
6009 5572442 5538580 5374091 5130602 4939364 4787898 4586317 4405172 4389235 4462168 4395384
5999 4395384 4174691 4020775 4020832 4017359 3909945 3796991 3748512 3689641 3587533 3522609 3503846
5988 3503846 3436794 3330127 3296745 3299654 3163300 2908962 2793275 2906360 3017867 2958312
5978 2958312 2866360 2885792 2898787 2777957 2650514 2661748 2691290 2571440 2403866 2376852 2418799
5967 2418799 2331706 2159373 2117005 2217054 2263175 2195821 2161099 2218699 2242665 2165778 2095281
5956 2095281 2107993 2116498 2025224 1875653 1761891 1717414 1737370 1802851 1842598 1781262 1663057
5945 1663057 1619408 1683286 1750502 1754953 1750707 1771159 1745836 1639614 1552251 1574053 1638505 1631870
5933 1631870 1572430 1556306 1578248 1541611 1430248 1343632 1347370 1394800 1421677 1421983 1393712 1303789
5921 1303789 1167300 1085172 1127642 1233827 1300072 1316252 1330369 1331240 1281642 1235418 1280151
5910 1280151 1362430 1327360 1171974 1094087 1200821 1323903 1259319 1063531 946031 962022
5900 962022 997452 997558 1010787 1029951 988045 917827 927954 999972 993169 882980 806593 825170
5888 825170 836779 793929 802101 896360 920263 776434 628039 673364 846529 924999 846868
5877 846868 749207 747997 827007 903131 889231 748030 577254 556571 710347 830018 749886
5866 749886 579198 517196 564835 595834 595090 620561 626327 547118 480369 549787 655055 610480
5854 610480 478981 486315 627866 669824 561615 522200 638719 700722 571735 432565 470035
5843 470035 575226 564213 487876 490233 527989 473508 372306 361509 420962 426758 383738 394168
5831 394168 449942 461511 450950 509256 587057 538833 378067 285751 337821 412181 409753 386671
5819 386671 399131 384763 297177 223966 256337 337763 356308 320200 328607 403526 456821 425511
5807 425511 359333 346734 396895 429249 374314 261853 188744 204236 261403 293678 292505 276852
5795 276852 240839 193035 199327 298262 401345 380777 253321 170411 209139 282324 293174
5784 293174 267397 266020 271510 257246 285156 408574 528852 491257 315843 193238 224730
5773 224730 299873 290060 236045 242378 286900 272601 212474 211722 279575 308342 259288 223905
5761 223905 251739 258404 184895 118683 147517 205631 197730 179660 256319 369478 367982 255725
5749 255725 184654 207191 224598 199279 219017 294483 290330 157148 57415 129669 268684
5738 268684 286780 184799 111196 131022 183484 216242 227208 208339 163665 152464 214869
5727 214869 290037 298649 261479 245376 245240 218963 186017 185214 183102 131378 69335 64961 103798
5714 103798 138403 184443 253233 262909 156126 39459 50369 142233 166859 117433 106129
5703 106129 142798 138188 104127 137226 208037 189456 108502 133928 272979 323920 202816
5692 202816 76146 67632 73528 5272 -18412 95576 192093 97543 -76611 -87597 80082
5681 80082 223280 222164 139406 60755 11942 11196 58039 89101 60381 33670 75242 132426
5669 132426 127860 99936 114722 119397 42782 -31046 26694 155162 176928 83934 50208 150134
5657 150134 257681 264805 224662 217488 224537 207604 193869 212342 238514 251495 261828 252093
5645 252093 182063 80461 37360 79844 148014 208087 279655 333919 295559 188258 149013
5634 149013 234126 329812 331794 300979 342990 426521 438663 365269 302271 308374 341733 346005
5622 346005 326856 319567 320061 282900 193976 123090 157173 268549 316792 232036 123450 119659
5610 119659 174062 155749 77402 66044 126720 123876 23473 -35026 28039 102632 81830 25655
5598 25655 26684 58142 73563 117834 203515 209771 65826 -78999 -51402 68312 64932 -71795
5586 -71795 -139956 -47122 68781 73065 6101 -38558 -53519 -57790 -23040 53982 100096 68907
5574 68907 21034 27179 57046 40369 -17189 -59995 -83001 -119680 -150163 -112528 -15512 42882
5562 42882 9257 -36503 8047 105383 113552 -12278 -145990 -161552 -93818 -51415 -42332 -3068
5550 -3068 41949 -2000 -117783 -160586 -68666 41990 54718 340 -43175 -73204 -92920 -43589
5538 -43589 76699 138539 60235 -38529 -12144 73981 57082 -46144 -78622 -20782 -13446 -97564
5526 -97564 -143617 -87922 -45203 -103887 -171627 -126653 -889 85080 75469 -12282 -143371 -252566
5514 -252566 -255276 -147843 -33672 8636 15937 48423 83626 65234 -5673 -85632 -140758 -142884
5502 -142884 -77432 6681 23927 -34799 -88626 -94690 -100079 -131621 -138907 -98741 -68759 -73699
5490 -73699 -49624 21698 38411 -62472 -177417 -180795 -103842 -51460 -31270 2159 17088 -30034
5478 -30034 -66370 -4482 74544 15723 -150571 -222672 -116582 22505 36916 -56156 -144541
5467 -144541 -169633 -141489 -100913 -107515 -179763 -225799 -134623 44595 133972 71260 -9185 4327
5455 4327 42163 8551 -36408 10275 90298 56112 -90038 -187536 -154148 -89837 -102590 -149523
5443 -149523 -127296 -42070 2216 -47256 -136387 -193701 -208259 -203892 -192684 -183963 -193608 -204282
5431 -204282 -157712 -42724 44250 4983 -113629 -175465 -155504 -160978 -222461 -214484 -77865
5420 -77865 23406 -72877 -248358 -253240 -85225 8551 -79780 -165545 -89868 26634 -1686
5409 -1686 -124306 -157992 -86822 -55286 -106823 -128046 -65488 -24831 -96817 -210832 -236380 -151709
5397 -151709 -47973 -15781 -71415 -155049 -173699 -87329 28559 54331 -22865 -88460 -56509
5386 -56509 20350 41968 -796 -42445 -49627 -36321 -4548 47161 71900 19699 -63064 -71570
5374 -71570 -1134 27030 -55715 -153953 -149587 -74559 -41349 -62200 -63772 -48858 -95360 -185077
5362 -185077 -187047 -66527 27516 -27208 -142946 -161080 -85259 -44486 -80096 -107076 -67732
5351 -67732 -1802 36687 34426 -4863 -51220 -34153 64721 129263 37805 -139564 -208388 -118041
5339 -118041 -14736 -1606 -8224 35865 55408 -31064 -145640 -157064 -79458 -41296 -95704
5328 -95704 -166150 -164884 -92678 -31234 -70692 -210521 -319583 -268031 -116494 -64591 -170364
5317 -170364 -258434 -187715 -60028 -30566 -50945 15267 123162 109763 -21798 -102019 -75132
5306 -75132 -68236 -149694 -216475 -185814 -125264 -109960 -102353 -67755 -73429 -161325 -232244 -178391
5294 -178391 -54058 769 -47895 -117262 -147573 -152822 -152733 -140860 -119223 -106299 -111721 -135448
5282 -135448 -172684 -193986 -156891 -69935 -4049 -4100 -34336 -51362 -76696 -139579 -197743 -190099
5270 -190099 -137819 -115310 -135513 -142531 -119896 -125579 -187692 -230125 -164289 -30608 22891 -73195
5258 -73195 -200790 -195405 -71075 -9738 -105688 -230068 -225148 -130381 -85472 -87080 -24996 67046
5246 67046 17134 -180625 -287726 -167516 -19492 -89240 -287479 -320982 -127543 56581
5236 56581 55588 -44130 -98552 -111797 -139857 -147587 -94114 -55815 -121723 -223730 -210660 -75843
5224 -75843 17294 -43338 -181014 -260626 -262857 -249851 -225913 -146260 -45318 -29916 -109909 -150355
5212 -150355 -67962 23365 -23444 -153284 -187591 -104777 -68181 -156341 -243559 -218436 -156807
5201 -156807 -163154 -177844 -94095 27421 31392 -86440 -165894 -112702 -10027 17521 -52396
5190 -52396 -154268 -214523 -199202 -136066 -89831 -80120 -59136 -12220 -9396 -82268 -134625 -88386
5178 -88386 -36608 -101918 -210870 -196774 -91157 -95922 -250893 -351484 -263154 -113042 -65791
5167 -65791 -89664 -77379 -47903 -73481 -117027 -99625 -55755 -77012 -152598 -192404 -167196 -114934
5155 -114934 -52073 12359 18818 -71596 -181382 -203564 -157193 -146522 -189123 -200486 -141203 -68836
5143 -68836 -40379 -61139 -129348 -230260 -284614 -214632 -81138 -45589 -158238 -284189 -289178
5132 -289178 -202796 -127923 -74902 11265 106251 107599 -9204 -130028 -142714 -77749 -47856
5121 -47856 -82965 -105207 -69062 -37443 -71477 -119217 -95942 -26189 -5156 -46229 -81844 -105713
5109 -105713 -177663 -268240 -251904 -116225 -27061 -86211 -162806 -99038 35828 62468 -23877
5098 -23877 -69861 -18400 37651 40283 27621 5001 -73633 -169841 -169496 -70185 -7559 -43073
5086 -43073 -76572 -38790 -20047 -107471 -222847 -243316 -187121 -155915 -165357 -158237 -136108 -152086
5074 -152086 -193364 -185518 -119890 -84030 -140488 -238595 -278049 -226850 -148779 -120322 -138409 -134098
5062 -134098 -84419 -61781 -119263 -174341 -109536 25693 45900 -102716 -238988 -194019 -51132
5051 -51132 -18052 -126574 -198050 -101176 72318 128551 4826 -165264 -209467 -111858 -21074
5040 -21074 -54176 -146789 -164716 -115674 -126088 -214319 -242113 -141402 -35933 -39695 -68881 8785
5028 8785 136855 142461 -3489 -149047 -171594 -103342 -46861 -61063 -130205 -176076 -121399 518
5016 518 51032 -28141 -110522 -67180 30437 28993 -56758 -85814 -42664 -53283 -145715 -185074
5004 -185074 -92509 32635 69147 19623 -52037 -106216 -107329 -41157 9364 -62868 -202131
4993 -202131 -223774 -87204 26463 -12462 -96711 -79875 -5928 -486 -59408 -101107 -130215
4982 -130215 -188870 -220939 -147188 -25534 15954 -28670 -57533 -36540 -23712 -40641 -52186
4971 -52186 -58874 -84506 -89522 -24854 45934 17336 -74491 -88903 -9823 19849 -73202 -183745
4959 -183745 -207072 -185340 -193016 -199391 -147410 -76787 -61679 -88229 -89933 -58614 -36313 -36103 -46671
4946 -46671 -78343 -131268 -153931 -109516 -52106 -57105 -102793 -109684 -79754 -92502 -155114 -167999
4934 -167999 -84387 -4420 -30085 -100814 -83246 11535 30522 -85960 -199929 -174623 -71040
4923 -71040 -36373 -72636 -64183 -5722 -29347 -169675 -267853 -199398 -63100 -23592 -73771 -96549
4911 -96549 -81463 -113680 -188952 -210224 -164426 -144847 -181714 -197027 -154143 -111197 -93224 -54902
4899 -54902 -11601 -52646 -160961 -179143 -48007 72917 39500 -65543 -96095 -83646 -138496
4888 -138496 -215370 -183696 -74417 -46745 -124166 -162848 -97884 -34210 -51039 -83992 -62486
4877 -62486 -19943 -1448 11080 18814 -26511 -112063 -143945 -104452 -98657 -164271 -178365 -68251
4865 -68251 23625 -56100 -209009 -213738 -58102 52285 4374 -89367 -96646 -41215 -13974 -35177
4853 -35177 -73998 -111053 -121167 -72874 3118 18275 -53560 -131345 -146719 -133944 -150013 -182074
4841 -182074 -197173 -213234 -246890 -250927 -184723 -100870 -79821 -111616 -119445 -74038 -12824 29715
4829 29715 41916 11860 -46657 -75685 -54450 -62659 -173052 -313432 -343444 -251428 -157959 -126555
4817 -126555 -97870 -29961 26177 32189 22514 8425 -57570 -158426 -178638 -80753 1249 -48761
4805 -48761 -154456 -184825 -162516 -181092 -200818 -116102 16903 24843 -104163 -183055 -113182
4794 -113182 -26678 -59610 -144297 -145951 -82477 -67994 -114471 -131513 -89933 -57801 -73618 -88558
4782 -88558 -58252 -14706 -9628 -33700 -34102 4285 31121 -4440 -79839 -119807 -91325 -37564
4770 -37564 -1158 31803 72321 78338 34031 14676 72997 121611 61689 -23300 20626 135801
4758 135801 102368 -98803 -215209 -112484 6053 -65664 -201570 -173630 -44376 -47491 -177690
4747 -177690 -203299 -64709 30383 -49826 -175345 -188269 -112905 -45080 -10459 -19944 -103874
4736 -103874 -204069 -184539 -38817 59423 2482 -102404 -127597 -114202 -144654 -173054 -132197
4725 -132197 -87080 -117779 -147961 -63140 73881 103272 16685 -48801 -40643 -42506 -92313 -110458
4713 -110458 -47119 27127 28338 -33618 -96319 -127262 -136199 -149300 -178399 -188919 -130457 -35568
4701 -35568 -18763 -105846 -150879 -41309 94396 50789 -128770 -190507 -43498 110460 84467
4690 84467 -42349 -92084 -56491 -53287 -109238 -138860 -102221 -56392 -51225 -67269 -71262 -69614
4678 -69614 -84200 -107313 -103414 -58017 -17241 -47072 -132611 -167056 -97185 -25616 -71590 -173634
4666 -173634 -169840 -63881 -41449 -179044 -307040 -257718 -105943 -38142 -93311 -170657 -207682
4655 -207682 -206510 -147486 -26114 62495 19461 -98793 -150237 -117239 -107405 -152297 -159165 -89142
4643 -89142 -35448 -65460 -110135 -88440 -40089 -42071 -67424 -30635 61963 104076 33644 -84204
4631 -84204 -140078 -107119 -56729 -59451 -99899 -109974 -69091 -25093 -9252 6524 31161 2237
4619 2237 -113074 -216990 -181848 -31158 81541 71203 -1564 -56754 -89857 -114946 -117500
4608 -117500 -106382 -120662 -141801 -94404 15097 64451 -7678 -92464 -74212 -11297 -32465
4597 -32465 -122377 -153944 -99775 -62976 -97800 -140806 -146015 -155963 -188136 -172484 -79866 -12546
4585 -12546 -66106 -169853 -175449 -67422 25470 18207 -39387 -73651 -85089 -92411 -70708 -17741
4573 -17741 -13638 -120362 -257392 -278681 -167357 -54834 -31858 -43020 -11600 30116 12099
4562 12099 -47973 -84697 -97892 -125537 -142890 -99911 -37706 -46328 -106445 -98804 6209 92819
4550 92819 73378 -5025 -80555 -170883 -263541 -244674 -66709 113708 117603 -3544 -56900
4539 -56900 -5872 129 -109075 -211863 -196885 -123614 -101816 -130509 -147617 -148552 -159689 -157899
4527 -157899 -108541 -43192 -21294 -43523 -68570 -87735 -119907 -154889 -161218 -135997 -99400 -59051
4515 -59051 -25197 -34457 -101680 -167019 -152335 -64737 10869 20598 -8104 -24913 -14193 12027
4503 12027 31791 15114 -48359 -114512 -122001 -76813 -54343 -99176 -167854 -194370 -165148 -96564
4491 -96564 10144 136213 207012 160692 43620 -34061 -39124 -38215 -70758 -90367 -76141 -107456
4479 -107456 -237215 -357665 -315038 -134182 -2181 -21834 -109557 -166091 -204605 -237090 -178045
4468 -178045 7378 164555 120589 -64698 -182789 -174533 -165716 -213194 -214511 -116186 -24686
4457 -24686 -23830 -44665 -22194 -28404 -117011 -175530 -97557 10066 -16781 -117566 -97095 39428
4445 39428 74492 -73654 -212585 -167903 -29215 15651 -46958 -90203 -64829 -42652 -77128
4434 -77128 -133552 -155549 -130534 -90226 -83551 -130764 -182570 -164034 -79879 -19627 -32300 -68377
4422 -68377 -83521 -111152 -168556 -182368 -101020 -5637 1107 -43894 -35664 14872 6720 -68007
4410 -68007 -115050 -109348 -122317 -158492 -126229 -23555 7494 -97474 -194917 -148365 -50163 -72132
4398 -72132 -185316 -213664 -125549 -74176 -131584 -170540 -84045 30170 15338 -115001 -211446
4387 -211446 -195163 -122504 -73778 -71488 -97903 -118799 -96214 -36642 -9335 -56531 -112942 -92007
4375 -92007 -28665 -37497 -131979 -195909 -158982 -90475 -68116 -58121 -3462 55479 48109 2735
4363 2735 3438 52069 74487 46428 16771 11267 3310 -17307 -29580 -38182 -65353 -87336 -66237
4350 -66237 -43538 -97986 -199102 -219822 -129043 -52093 -83536 -155703 -168507 -137707 -117114 -79064
4338 -79064 2571 36643 -66630 -211552 -211734 -58401 56789 6700 -117683 -161920 -105772
4327 -105772 -45780 -55450 -120439 -172537 -157032 -91652 -53144 -70557 -70658 634 53201 -33439
4315 -33439 -199262 -253803 -145105 -25034 -11607 -45534 -46469 -48390 -78081 -51377 71555 153031
4303 153031 60727 -110387 -168392 -105231 -67839 -99127 -105067 -67018 -83360 -167058 -190202 -97686
4291 -97686 -12074 -36419 -95067 -78742 -26254 -31151 -58215 -2359 114222 151130 56779 -58167
4279 -58167 -83944 -47373 -32084 -39904 -12256 41420 26846 -97184 -228815 -235106 -126614 -39817
4267 -39817 -42421 -54287 -7241 22757 -53578 -156185 -131069 3944 70667 -3852 -98505 -117084
4255 -117084 -124303 -174762 -169827 -27897 125765 111903 -34610 -124981 -101909 -82567 -124222
4244 -124222 -136028 -69766 -30616 -107464 -214711 -209329 -88681 27889 66305 54864 39012
4233 39012 22048 -4513 -27153 -25768 -3833 4343 -38691 -120612 -160676 -83421 78913 195594
4221 195594 166633 15246 -153250 -245035 -225589 -129062 -42446 -32235 -63987 -45545 28306
4210 28306 45108 -62182 -189851 -183702 -48023 55848 15905 -104226 -163162 -106361 -3091
4199 -3091 44902 1398 -84048 -134972 -124591 -91290 -81217 -97703 -117244 -126944 -123653 -101940
4187 -101940 -71282 -62806 -89540 -122163 -133620 -140335 -163032 -177032 -148871 -97007 -62182 -37806
4175 -37806 9247 61280 59905 -4771 -74513 -98766 -80338 -48184 -38464 -92375 -203535 -274212
4163 -274212 -209324 -60548 18128 -21706 -65944 -29177 14261 -32215 -125398 -167054 -168365 -198845
4151 -198845 -224791 -147193 9253 86671 1797 -148365 -226894 -211620 -167813 -142202 -129485
4140 -129485 -94460 -5674 106179 134391 22336 -109453 -84128 71086 135730 18825 -99505
4129 -99505 -57600 26905 -34017 -162428 -130018 50179 118590 -21366 -151164 -89403 38088
4118 38088 34289 -55706 -69653 -27942 -71142 -168165 -136427 42085 154267 66798 -88089
4107 -88089 -130606 -76730 -45097 -50088 -31378 -4928 -34889 -97823 -111593 -79922 -81951 -123377
4095 -123377 -123491 -65822 -40920 -99016 -164404 -151884 -83683 -32100 -20426 -40871 -96868 -156068
4083 -156068 -132831 -8603 88661 33168 -108911 -157444 -69667 15877 -1228 -53878 -46620
4072 -46620 -2491 11008 7150 30856 51224 10242 -62313 -87611 -67547 -73132 -114541 -128027
4060 -128027 -98765 -92845 -140708 -182235 -166149 -122124 -92019 -67716 -44400 -55714 -96076 -86820
4048 -86820 2808 72004 21425 -86273 -110480 -41581 -1544 -43485 -80681 -43584 11221 7944
4036 7944 -25700 -18401 25260 43093 15800 -20156 -39284 -47924 -49604 -37916 -18283 554 28997
4023 28997 75834 112144 91995 13486 -64167 -71114 11272 130420 198529 165844 69320 -7091
4011 -7091 -25672 -23322 -40953 -64567 -61988 -43382 -45757 -73554 -90079 -65516 -13767 17211 -10954
3998 -10954 -80574 -120914 -83610 -5303 43167 52400 57042 41679 -34880 -114381 -68850 90276
3986 90276 165909 36513 -153709 -194774 -100454 -40076 -59870 -60581 -12626 7922 -3851 30606
3974 30606 83727 23014 -141507 -211960 -96156 40273 31531 -53660 -76008 -59239 -84930
3963 -84930 -95848 -12044 60142 -36722 -224062 -266155 -122177 1674 -27829 -108424 -114646
3952 -114646 -83301 -96946 -130368 -115477 -56438 4131 51740 70317 28642 -47398 -70229 -10609
3940 -10609 56156 68189 55961 58804 54150 21781 -10319 -34581 -86499 -152648 -162095 -121019
3928 -121019 -132132 -212125 -231031 -131564 -59383 -134981 -234334 -176659 -19703 40277 -15101
3917 -15101 -38531 -3378 -32010 -131995 -151369 -53364 -4168 -89772 -155154 -60629 78761 75103
3905 75103 -43333 -101466 -48913 10303 11190 -6411 -8019 -9909 -17458 -18926 -30332 -60346 -56693
3892 -56693 19751 98650 83155 3482 -28431 -1387 -11205 -78329 -97432 -10604 91158 103115
3880 103115 45372 -3382 -28066 -55602 -75403 -63184 -42889 -51640 -71130 -57731 -19615 -6278
3868 -6278 -34388 -71286 -82117 -57398 -7288 41884 62472 58839 59960 63506 33680 -20565 -29382
3855 -29382 27522 62591 6983 -66710 -48826 26843 32827 -39028 -58030 26112 87253 19244
3843 19244 -88635 -81798 27331 79852 -576 -110524 -115808 -18271 65187 50822 -24199 -63040
3831 -63040 -40720 -42629 -141199 -262072 -250717 -84465 72499 77436 -10931 -42380 4066 22050
3819 22050 -35060 -94245 -94778 -67802 -55316 -44062 -21110 -17003 -45448 -61575 -28217 23269
3807 23269 38824 7943 -47182 -106538 -146983 -144033 -106761 -72838 -53083 -29362 -16093 -51792
3795 -51792 -107704 -92981 1681 53225 -29430 -163697 -200218 -114464 -5528 47525 37994 -18697
3783 -18697 -91519 -115693 -57435 20979 36773 -1363 -32244 -47105 -60269 -26076 89435 188058
3771 188058 134799 -34560 -145388 -126533 -70791 -43271 -1286 54918 34013 -64760 -94364
3760 -94364 7410 87229 10393 -121526 -147264 -109458 -147200 -221274 -170491 -3596 87067
3749 87067 16756 -82691 -86292 -36120 -17075 -22421 -21472 -39009 -82694 -88461 -21226 46858 34528
3736 34528 -35849 -90221 -108221 -112070 -104121 -82105 -75494 -106297 -145144 -154195 -140377 -123722 -90633
3723 -90633 -24519 48420 84257 64424 -11419 -130549 -233878 -233762 -115958 19549 68990
3712 68990 35600 -13864 -48879 -70150 -58257 -9060 15370 -40090 -119091 -113379 -22347 38804
3700 38804 3060 -65610 -86118 -75903 -95975 -137322 -133947 -68671 -1779 13317 -1926 8869
3688 8869 52436 73830 32275 -38659 -70834 -46937 -10984 3408 8700 11957 -20475 -103775
3676 -103775 -175422 -153557 -48200 33466 2046 -119784 -221226 -207455 -88495 25191 36799
3665 36799 -18479 -12896 92014 169268 99143 -38741 -55822 76992 174835 90033 -87913
3654 -87913 -159002 -71289 38304 35550 -64776 -155079 -172386 -140228 -101128 -56941 4517 52590
3642 52590 35143 -32861 -59522 -912 52846 -6608 -133564 -174480 -89084 -9452 -37684 -100008
3630 -100008 -84408 -24813 -27713 -77943 -61168 35780 91746 46063 -3022 42787 128928 139818
3618 139818 69687 4419 -22120 -51352 -95093 -105655 -64454 -20514 -12684 -16112 1506 23225
3606 23225 19673 448 -9568 -10856 -10470 3015 27845 28885 -5056 -20521 25931 84745 77003
3593 77003 18535 -3732 30043 54077 44295 56422 102978 105494 37184 7308 99609 208573
3581 208573 167794 -3431 -121526 -95775 -24516 -13192 -30573 -5015 45989 66188 64837
3570 64837 81063 90786 37908 -59557 -110841 -64206 34646 102438 97697 33808 -52002 -121589
3558 -121589 -140945 -87689 24786 128700 139443 43520 -70434 -107875 -77478 -54529 -57843
3547 -57843 -41592 -6015 -16185 -77677 -91675 -90 103145 91084 -19049 -97432 -77683
3536 -77683 -12339 32505 52309 68588 86917 103609 107175 71667 -6891 -73148 -61582 17502
3524 17502 86347 92938 55632 21747 22161 55554 78329 33637 -61535 -95277 338 124378
3512 124378 122022 6449 -58289 -6256 40999 -11800 -73558 -28110 58991 44645 -46814 -53174
3500 -53174 60787 136935 67098 -45070 -54936 4997 2395 -68762 -85652 -8158 49612 -339
3488 -339 -84692 -88007 -22645 12347 -11695 -36115 -28499 -16804 -17684 -19587 -35490 -82870 -111322
3475 -111322 -53139 42355 42257 -70200 -155031 -128008 -77460 -84614 -71194 41874 151439 121691
3463 121691 22233 16642 75819 30064 -110904 -138160 11009 126743 49013 -90625 -94274
3452 -94274 1582 23302 -58183 -122603 -109267 -64910 -19381 37921 73368 33037 -47986 -71901
3440 -71901 -20985 21382 1971 -34943 -27659 22785 68929 67991 15173 -40107 -31643 32586 56515
3427 56515 -11692 -79155 -19271 147078 268176 247517 134556 35984 10494 50774 103484
3416 103484 104969 49825 14194 60755 144380 171538 123668 52046 -16748 -86029 -126983 -105470
3404 -105470 -55116 -32472 -17462 42421 108772 92110 11334 -14808 48102 102777 88506 67323
3392 67323 89408 95734 31091 -48006 -64346 -39161 -36084 -51193 -41981 -17294 -21799 -62114 -104375
3379 -104375 -116130 -76519 9755 80507 61905 -19748 -49446 8619 47493 -7103 -55771 25729
3367 25729 165519 167685 -8124 -175157 -161442 -19191 69241 27996 -50186 -60696 -23476
3356 -23476 -22225 -60987 -67174 -32269 -39634 -104024 -102655 26080 125682 33016 -131297 -108155
3344 -108155 87508 160214 -11923 -185903 -137680 12869 41061 -33538 -59885 -43958 -75153
3333 -75153 -96612 -13631 65698 -24877 -188506 -178141 -5265 61114 -77346 -213587 -188960
3322 -188960 -103095 -72917 -40891 45104 88797 32423 -10515 39047 72645 6880 -34114 62500
3310 62500 162767 89543 -68871 -93871 10103 49523 -16812 -29154 68849 120054 16091
3299 16091 -130076 -174072 -148643 -164225 -208955 -176718 -45245 83841 117220 68362 12443
3288 12443 -9400 -13302 -18217 -6933 34745 64751 24907 -61067 -90475 -12294 95329 115684
3276 115684 22777 -108741 -180521 -136756 -10589 74709 24834 -80406 -60243 105601 215307
3265 215307 130572 -10317 -3892 108519 128207 25208 -38293 1736 14090 -88156 -199183
3254 -199183 -195549 -112102 -47248 -10055 37213 76601 78670 82685 132139 172924 110241 -48093
3242 -48093 -178902 -177511 -62319 55045 81114 23875 -31183 -32240 -19950 -41190 -48589 31544
3230 31544 152588 178439 78230 -16291 7450 95063 117030 33357 -94725 -193700 -215748
3219 -215748 -142333 -14871 75702 81838 49196 40296 57262 76142 98111 118461 101981 42676
3207 42676 -5618 -10185 -11923 -40001 -42464 20120 73827 23208 -94417 -149274 -96855 -17712
3195 -17712 18271 32688 64779 98385 103140 96805 119948 164934 164964 69370 -74434 -145719 -90331
3182 -90331 -5635 -18058 -97724 -103492 -19005 3289 -101099 -162427 -20603 203508 255327
3171 255327 96630 -74813 -122292 -98470 -77015 -47909 -22771 -69077 -164520 -165073 -10343
3160 -10343 157705 175162 58295 -62260 -118523 -124641 -100419 -72613 -89082 -143864 -149665 -68194
3148 -68194 3048 -28647 -95112 -72025 15519 33844 -35142 -58205 41074 165807 184409 91441
3136 91441 -20060 -75364 -60270 -2699 45025 44955 21709 34214 86265 115923 89837 48683
3124 48683 32190 20302 -11322 -33745 -15488 12246 -837 -43707 -63010 -43444 -16484 -2159
3112 -2159 5358 -91 -36118 -86775 -102186 -57023 20075 81745 99277 66947 7598 -21257
3100 -21257 28569 126746 177296 126766 28874 -26335 -18798 -450 -15332 -58155 -98720 -107106
3088 -107106 -61203 30751 114307 131663 84788 24713 -21100 -69961 -125853 -148142 -105902 -30166
3076 -30166 20431 26856 15870 14312 21706 19364 -9909 -61674 -100959 -92360 -49269 -27697 -54834
3063 -54834 -91748 -90784 -63109 -56855 -86072 -114555 -102323 -44202 29119 71287 55891 7209
3051 7209 -23249 -22264 -26855 -55722 -71740 -44191 -6371 -7326 -39388 -59479 -54597 -42831 -36475
3038 -36475 -41063 -55560 -42686 40249 137185 108476 -66448 -195584 -112449 70775 117340
3027 117340 21484 -1030 121218 194275 80204 -75569 -73473 52969 139003 144164 128440
3016 128440 75240 -61489 -186524 -144413 27977 113069 14573 -108251 -75644 66157 125127
3005 125127 17072 -152692 -236217 -200768 -129330 -101895 -111902 -108965 -87721 -80975 -80410 -45729
2993 -45729 -2634 -31942 -124077 -156378 -82582 -26982 -89385 -172022 -135717 -25006 27424 31612
2981 31612 77915 111156 5409 -154214 -125896 106388 256136 139849 -65701 -108628 -6046
2970 -6046 68600 79484 106222 135538 85715 -9533 -28117 42141 85846 42143 -24312 -44501
2958 -44501 -31155 -27914 -49010 -76177 -66429 12999 111796 115185 1286 -91903 -48078 53898
2946 53898 65226 -4691 -31928 1337 217 -47533 -47548 15696 42233 3789 1008 72864 109248
2933 109248 41823 -22607 27926 127455 147240 99680 86560 107675 69771 -36618 -105628
2922 -105628 -73053 1845 37211 30771 30298 58859 99631 122237 106984 63116 25244 15671
2910 15671 20132 15837 1734 -17048 -42529 -58303 -33966 11454 4601 -71269 -118778 -57596
2898 -57596 37953 35811 -51367 -84891 -18141 40419 16097 -15902 23001 70533 34164 -39869
2886 -39869 -34796 49317 105056 91406 69831 67285 33181 -37681 -61012 791 60503 38822
2874 38822 -7321 22758 112975 158641 121774 65853 45893 43910 20952 -24034 -57381 -41632
2862 -41632 26956 91139 80998 19764 18059 106429 152980 46061 -111137 -124025 17495
2851 17495 140636 151203 125252 127795 120227 96959 135737 229552 235470 99008 -23401 6858
2839 6858 101311 110621 68197 92010 149554 119421 20843 -16562 23048 33853 -14204 -45165
2827 -45165 -34692 -32076 -31950 13524 62263 27103 -55129 -69440 -24148 -19026 -26571 72819 226957
2814 226957 231524 65184 -47381 7435 66779 3417 -52752 25350 114396 62458 -37676
2803 -37676 -24427 49054 46310 19715 94581 192788 142232 -9082 -55516 27236 62136 -20832
2791 -20832 -98409 -89169 -55640 -47235 -34966 -21403 -37935 -32430 58775 145084 93755 -13585
2779 -13585 23852 177903 206987 48061 -92508 -102146 -114563 -192966 -172332 14117 144215
2768 144215 61834 -39196 56120 202619 143900 -40566 -72273 61698 125061 53691 20271
2757 20271 80928 81518 -33798 -111364 -67262 -19876 -43277 -25445 101129 196763 132887 5703
2745 5703 -20579 51865 120955 161613 186300 138111 -13115 -148031 -134439 -30786 3982
2734 3982 -40608 -34312 56607 114760 77024 34691 70054 123877 105217 34220 -11861 -22641
2722 -22641 -35552 -43791 -13589 34585 46554 25224 25150 58614 80653 74957 78688 98056 74782
2709 74782 -16316 -99141 -90752 -21527 11166 -16910 -41951 -29236 -20754 -46745 -64617 -28167
2697 -28167 33897 56808 27444 -8871 -13600 5835 17198 6255 -1031 34714 101899 121619
2685 121619 40746 -71629 -88127 7061 85577 43603 -65337 -115229 -69149 3030 29476
2674 29476 -10 -51715 -80081 -56277 3131 52448 74376 85309 78337 26480 -38171 -33521
2662 -33521 42066 79752 22854 -36247 -6102 54907 52119 25024 59709 104334 46729 -63416
2650 -63416 -63085 51615 98909 3092 -74671 11765 167078 202217 98549 -3974 -14198
2639 -14198 32602 68847 70463 51465 42451 57165 50391 -41991 -184050 -231364 -110200 53354
2627 53354 74360 -49095 -130100 -37965 130003 167313 13838 -165350 -175719 -27091 91656
2616 91656 66162 -11453 -11340 40733 46355 20911 40459 59379 -25423 -142847 -99095 101014
2604 101014 209154 98836 -41713 -16857 80016 62327 -28612 -26789 50910 45931 -53010
2593 -53010 -99207 -47346 -4217 -14141 -969 46762 29369 -70212 -122156 -53579 34003 33412
2581 33412 -12449 -12124 27500 48005 44509 36099 3912 -59523 -100762 -81936 -53026 -72874 -104822
2568 -104822 -72144 10125 41021 -25035 -104803 -82449 46402 159674 148948 53077 10923
2557 10923 80142 163387 144001 30358 -85633 -148196 -147917 -80946 12491 33050 -46986 -98274
2545 -98274 -5372 134668 137743 13105 -61534 -27638 -7856 -61251 -83892 -14547 53428 52327
2533 52327 56183 115293 139144 62217 -22270 -21908 -2113 -47149 -88816 -23236 102065 161761
2521 161761 127071 40225 -84620 -201450 -186412 -11144 142194 114810 21434 68020 208405
2510 208405 219478 70621 -37615 -7919 30996 -13336 -43706 22381 87391 37192 -69465
2499 -69465 -99109 -37238 22548 21312 -13064 -15788 54417 162396 198084 99428 -33222 -44223
2487 -44223 56301 100444 9965 -99093 -104667 -38986 10772 45839 108384 174804 185928 133384
2475 133384 57654 6391 22312 105860 171950 130853 28866 721 60463 73864 -17528
2464 -17528 -97470 -77530 -44756 -94296 -154733 -121637 -47374 -36617 -45833 35406 164026 188529
2452 188529 90564 6419 1848 -11717 -99489 -180001 -144203 -8485 111980 134505 78049
2441 78049 28404 43134 79260 46456 -48355 -79216 20656 138390 129338 15477 -74269 -100399
2429 -100399 -118480 -134675 -103120 -45331 -24111 -9132 77412 182854 163477 27429 -40086
2418 -40086 46082 139297 96108 -12262 -41190 3730 22254 4312 15434 55205 62346 28763
2406 28763 -1408 -18826 -37410 -27030 41953 111677 96949 18542 -24079 -6617 -2468 -43662
2394 -43662 -66092 -27287 15680 2481 -27655 -712 65977 79458 8291 -62154 -40288 44690
2382 44690 75626 3869 -81613 -75868 -5155 15081 -46866 -95110 -54455 24519 58134 51505
2370 51505 57048 72043 63134 48463 60101 55273 -27391 -133221 -130131 -2561 102718 70019
2358 70019 -39626 -94513 -61775 1571 58762 106129 119184 77632 26465 31162 77797 88253
2346 88253 31442 -47056 -100286 -112118 -60528 58867 159592 120339 -39923 -142531 -75004
2335 -75004 56184 92605 54278 66558 118262 72482 -78895 -156412 -54481 94162 116463
2324 116463 34517 -20387 -24182 -38710 -44003 36118 161754 196226 114149 43274 64625 109004
2312 109004 104357 91739 114424 109175 13632 -105170 -143147 -117716 -118287 -142759 -109724 -20672
2300 -20672 16890 -44661 -108184 -67776 39129 81679 7248 -96066 -110815 -25011 67548
2289 67548 88742 63692 68011 116793 154308 146846 124763 115619 96721 50695 15412 28624
2277 28624 61099 57906 21070 3523 37811 105974 159635 145946 51311 -52291 -56153 48307
2265 48307 137405 111674 23274 -17784 2477 27454 44332 65971 54272 -12546 -42016 54280
2253 54280 172832 124672 -63607 -148605 -25148 109189 52940 -102434 -128696 3478 118357
2242 118357 101772 9997 -63075 -83900 -47730 27495 68953 17191 -66631 -63857 22781 62044
2230 62044 -7760 -81931 -45972 57065 90366 5500 -107294 -130149 -32467 110837 183606
2219 183606 124837 -11917 -102724 -71628 41855 133405 132002 47545 -49898 -87947 -51643
2208 -51643 5460 24220 6722 -5373 -4338 -20589 -55962 -70780 -51948 -35750 -36396 -11792
2196 -11792 56021 102276 65991 -3593 -4766 68670 119971 97773 69171 106713 170043 164582
2184 164582 81699 7379 -4153 3851 -23950 -58483 -27428 68046 136039 107759 26910 -6985
2172 -6985 37244 93420 88603 23942 -44704 -71731 -46820 12940 64026 56891 -387 -20506
2160 -20506 58315 152649 104481 -96786 -250924 -182649 23240 131304 68925 -3952 43286
2149 43286 123730 91412 -22325 -62901 8797 74628 58440 33839 82516 150104 132160 47329
2137 47329 22344 105177 180515 119144 -34941 -101523 2162 136709 112877 -54453 -167452
2126 -167452 -121958 -36346 -43340 -78967 -6372 137051 186479 113071 60050 97905 122422 58654
2114 58654 -707 35902 92666 61437 -4874 15797 101967 124299 56583 1317 15187 45876
2102 45876 49370 44537 31268 -29278 -118700 -147910 -84707 -12661 -16914 -76035 -106327 -59833
2090 -59833 48837 159844 193534 117902 8308 -23015 27688 53304 -2106 -66226 -63705
2079 -63705 -30078 -33984 -56667 -31987 37115 84015 78304 48964 18415 -21670 -65690 -78541
2067 -78541 -40419 22654 62739 47875 -20762 -108862 -165981 -160736 -107174 -53735 -43894 -79739
2055 -79739 -114494 -88444 11183 127855 184875 152927 65229 -15365 -37430 -1038 28990 -9810
2043 -9810 -82424 -90186 -25473 -635 -62230 -88196 16166 127363 79208 -48890 -36854 111909
2031 111909 160490 26285 -79892 -4699 99869 44441 -82269 -75344 49391 102200 20838
2020 20838 -78745 -103806 -59592 33629 132220 122653 -46732 -224974 -221769 -79209 -1183 -40401
2008 -40401 -58878 1445 28476 -33331 -68648 13393 134290 185825 176134 151207 98007 15826
1996 15826 -25928 10211 62033 74240 78794 101807 93079 27855 -17819 18244 77495 76395
1984 76395 36242 30895 67242 99613 110981 106829 73631 5176 -67996 -113282 -113408 -38996 111603
1971 111603 232030 188099 19405 -71590 4037 96626 57375 -44858 -71301 -41240 -51923
1960 -51923 -76671 -22991 74497 96198 36470 1035 28916 61591 69227 70104 43080 -45102
1948 -45102 -140955 -161070 -128687 -126266 -138649 -84211 18600 66592 45393 37372 58745 42997
1936 42997 -7607 -11458 35448 46760 9136 1455 30299 13623 -43079 -34975 34629 29407 -69238
1923 -69238 -90365 42040 149883 70937 -83188 -110020 -19350 31125 907 -18917 10305
1912 10305 47264 82137 126913 137253 80936 35975 81513 141796 90199 -33097 -71367 2628
1900 2628 59080 32158 4987 45254 102449 116376 107817 109672 104198 73846 36624 805 -44663
1887 -44663 -80603 -72177 -36133 -15253 3618 51612 78047 14852 -65613 -12176 156365 227384
1875 227384 90141 -93723 -117239 -640 85895 75924 46508 61194 102117 134989 140661
1864 140661 100223 30323 6016 66722 129351 85037 -37488 -97495 -26122 99112 165639
1853 165639 137257 52461 -15967 4609 120388 229745 217500 101680 14454 22092 47406
1842 47406 8541 -47998 -23107 79974 159394 155332 112348 94095 96169 72293 12765 -37445
1830 -37445 -31353 30185 101661 132899 101940 20212 -78166 -149446 -160033 -111209 -40492 15414
1818 15414 54898 93517 120551 104782 50213 10844 24148 55291 44094 -7760 -42093 -35166
1806 -35166 -29667 -56588 -78473 -54339 -20798 -46624 -125501 -181195 -176757 -147831 -115389 -42825
$$ [...]
##END NTUPLES=NMR SPECTRUM
##END=
