##TITLE=c13 ikalashn
CA-9300-2
20.11.2024
##JCAMPDX= 6.0         $$ Bruker NMR JCAMP-DX V2.0
##DATA TYPE= NMR SPECTRUM
##DATA CLASS= NTUPLES
##ORIGIN= UXNMR, Bruker Analytische Messtechnik GmbH
##OWNER= root
$$ TOPSPIN		Version 1.3
$$ 2024-11-20 10:42:26.171 +0400  Irina@DPX200
$$ Compression mode = diff/dup
##.OBSERVE FREQUENCY= 50.3282639994
##.OBSERVE NUCLEUS= ^13C
##.ACQUISITION MODE= SIMULTANEOUS
##.ACQUISITION SCHEME= undefined
##.AVERAGES= 96
##.DIGITISER RES= 17
##SPECTROMETER/DATA SYSTEM= spect
##.PULSE SEQUENCE= zgpg
##.SOLVENT NAME= CDCl3
##.SHIFT REFERENCE= INTERNAL, CDCl3, 1, 234.9338
##AUDIT TRAIL= $$ (NUMBER, WHEN, WHO, WHERE, WHAT)
$$ ##TITLE= Audit trail, TOPSPIN		Version 1.3
$$ ##JCAMPDX= 5.01
$$ ##ORIGIN= Bruker BioSpin GmbH
$$ ##OWNER= Irina
$$ $$ F:/spectra/data/iren/nmr/c13zvl/1/pdata/1/auditp.txt
$$ ##AUDIT TRAIL=  $$ (NUMBER, WHEN, WHO, WHERE, VERSION, WHAT)
(   1,<2024-11-20 10:30:18.375 +0400>,<Irina>,<DPX200>,<TOPSPIN 1.3>,
      <created by zg
	started at 2024-11-20 10:24:42.046 +0400,
	POWCHK disabled, PULCHK disabled
       terminated by command 'halt'
       configuration hash MD5:
       BE 6D 3F 07 2A EA 11 49 91 17 2B D3 AF B3 58 0D
       data hash MD5: 32K
       DB E0 1C 39 A4 36 E2 51 A9 55 08 90 15 E4 30 27>)
(   2,<2024-11-20 10:30:35.984 +0400>,<Irina>,<DPX200>,<TOPSPIN 1.3>,
      <Start of raw data processing
       efp BC_mod = 2 LB = 1.5 FT_mod = 6 PKNL = 1 PHC0 = 149.5838 PHC1 = 9.949522 SI = 32K 
       data hash MD5: 32K
       84 0F 73 55 7F A8 FA D4 1F 9C 0E 1E C1 B4 56 C3>)
(   3,<2024-11-20 10:30:41.265 +0400>,<Irina>,<DPX200>,<TOPSPIN 1.3>,
      <abs n ABSG = 5 
       data hash MD5: 32K
       F9 CE 7B 6D FB 07 CB 1A B6 A6 56 D8 65 DD 08 38>)
$$ ##END=
$$ 
$$ $$ hash MD5
$$ $$ CF 90 38 BA 8F 45 D8 80 C5 C4 33 FC 6F 59 97 76
##$RELAX= 
##$RELAX= 
##$RELAX= 
##$RELAX= 
##$RELAX= 
##$RELAX= 
##$RELAX= 
##$RELAX= 
##$RELAX= 
$$ Bruker specific parameters
$$ --------------------------
##$DU= <F:/spectra>
##$EXPNO= 1
##$NAME= <c13zvl>
##$PROCNO= 1
##$TYPE= <nmr>
##$USER= <iren>
##$AMP= (0..31)
100 100 100 100 100 100 100 100 100 100 100 100 100 100 100 100 100 100 
100 100 100 100 100 100 100 100 100 100 100 100 100 100 
##$ANAVPT= -1
##$AQSEQ= 0
##$AQ_mod= 1
##$AUNM= <au_zg>
##$AUTOPOS= <>
##$BF1= 50.322709
##$BF2= 200.13
##$BF3= 200.13
##$BF4= 200.13
##$BF5= 200.13
##$BF6= 200.13
##$BF7= 200.13
##$BF8= 200.13
##$BYTORDA= 1
##$CFDGTYP= 0
##$CFRGTYP= 5
##$CHEMSTR= <none>
##$CNST= (0..63)
1 1 145 1 1 1 1 1 1 1 1 1 1 1 1 1 1 1 1 1 1 1 1 1 1 1 1 1 1 1 1 1 1 1 
1 1 1 1 1 1 1 1 1 1 1 1 1 1 1 1 1 1 1 1 1 1 1 1 1 1 1 1 1 1 
##$CPDPRG= <waltz16>
##$CPDPRG1= <>
##$CPDPRG2= <waltz16>
##$CPDPRG3= <>
##$CPDPRG4= <mlev>
##$CPDPRG5= <mlev>
##$CPDPRG6= <mlev>
##$CPDPRG7= <mlev>
##$CPDPRG8= <mlev>
##$CPDPRGB= <>
##$CPDPRGT= <>
##$D= (0..63)
0 2 0.00345 0 0 0 0 0 0 0 0 0.03 2e-005 3e-006 0 0 0 0 0 0 0 0 0 0 0 0 
0 0 0 0 0 0 0 0 0 0 0 0 0 0 0 0 0 0 0 0 0 0 0 0 0 0 0 0 0 0 0 0 0 0 0 
0 0 0 
##$DATE= 1732084214
$$ [...]
##$SW= 249.617472808154
##$SWIBOX= (0..15)
0 1 3 0 0 0 0 0 0 0 0 0 0 0 0 0 
##$SW_h= 12562.8140703518
##$TD= 32768
##$TD0= 1
##$TE= 300
##$TE2= 300
##$TE3= 300
##$TEG= 300
##$TL= (0..7)
120 120 120 120 120 120 120 120 
##$TP= (0..7)
150 150 150 150 150 150 150 150 
##$TP07= 0
##$TPNAME0= <>
##$TPNAME1= <>
##$TPNAME2= <>
##$TPNAME3= <>
##$TPNAME4= <>
##$TPNAME5= <>
##$TPNAME6= <>
##$TPNAME7= <>
##$TPOAL= (0..7)
0.5 0.5 0.5 0.5 0.5 0.5 0.5 0.5 
##$TPOFFS= (0..7)
0 0 0 0 0 0 0 0 
##$TUNHIN= 0
##$TUNHOUT= 0
##$TUNXOUT= 0
##$USERA1= <user>
##$USERA2= <user>
##$USERA3= <user>
##$USERA4= <user>
##$USERA5= <user>
##$V9= 5
##$VALIST= <valist>
##$VCLIST= <CCCCCCCCCCCCCCC>
##$VD= 0
##$VDLIST= <DDDDDDDDDDDDDDD>
##$VPLIST= <PPPPPPPPPPPPPPP>
##$VTLIST= <TTTTTTTTTTTTTTT>
##$WBST= 1024
##$WBSW= 4
##$XGAIN= (0..3)
0 0 0 0 
##$XL= 0
##$YL= 0
##$YMAX_a= 16347
##$YMIN_a= -110945
##$ZGOPTNS= <>
##$ZL1= 120
##$ZL2= 120
##$ZL3= 120
##$ZL4= 120
##$ABSF1= 234.9338
##$ABSF2= -14.71115
##$ABSG= 5
##$ABSL= 3
##$ALPHA= 0
##$AQORDER= 0
##$ASSFAC= 0
##$ASSFACI= 0
##$ASSFACX= 0
##$ASSWID= 0
##$AUNMP= <proc_1d>
##$AXLEFT= 0
##$AXRIGHT= 0
##$AXTYPE= 0
##$AXUNIT= <>
##$AZFE= 0.1
##$AZFW= 0.5
##$BCFW= 0
##$BC_mod= 2
##$BYTORDP= 0
##$COROFFS= 0
##$CY= -3
##$DATMOD= 1
##$DC= 0
##$DFILT= <>
##$DTYPP= 0
##$F1P= 0
##$F2P= 0
##$FCOR= 0.5
##$FTSIZE= 32768
##$FT_mod= 6
##$GAMMA= 0
##$GB= 0
##$INTBC= 1
##$INTSCL= 1.406111e-010
##$ISEN= 30
##$LB= 1.5
##$LEV0= 0
##$LPBIN= 0
##$MAXI= 7.640843
##$MC2= 0
##$MEAN= 0
##$ME_mod= 0
##$MI= 1.154659
##$NCOEF= 0
##$NC_proc= -8
##$NLEV= 6
##$NOISF1= 0
##$NOISF2= 0
##$NSP= 0
##$NTH_PI= 0
##$NZP= 0
##$OFFSET= 234.9338
##$PC= 1.4
##$PHC0= 149.5838
##$PHC1= 9.949522
##$PH_mod= 1
##$PKNL= yes
##$PPARMOD= 0
##$PPDIAG= 0
##$PPIPTYP= 0
##$PPMPNUM= 100
##$PPRESOL= 1
##$PSCAL= 0
##$PSIGN= 0
##$REVERSE= no
##$SF= 50.3227228988183
##$SI= 32768
##$SIGF1= 0
##$SIGF2= 0
##$SINO= 80
##$SIOLD= 32768
##$SREGLST= <13C.CDCl3>
##$SSB= 0
##$STSI= 32768
##$STSR= 0
##$SW_p= 12562.8140703518
##$SYMM= 0
##$S_DEV= 0
##$TDeff= 32768
##$TDoff= 0
##$TI= <>
##$TILT= no
##$TM1= 0
##$TM2= 0
##$TOPLEV= 0
##$USERP1= <user>
##$USERP2= <user>
##$USERP3= <user>
##$USERP4= <user>
##$USERP5= <user>
##$WDW= 1
##$XDIM= 32768
##$YMAX_p= 286789997
##$YMIN_p= -3005529
$$ End of Bruker specific parameters
$$ ---------------------------------
##NTUPLES= NMR SPECTRUM
##VAR_NAME=  FREQUENCY,     SPECTRUM/REAL,   SPECTRUM/IMAG
##SYMBOL=    X,             R,               I
##VAR_TYPE=  INDEPENDENT,   DEPENDENT,       DEPENDENT
##VAR_FORM=  AFFN,          ASDF,            ASDF
##VAR_DIM=   32768,         32768,           32768
##UNITS=     HZ,            ARBITRARY UNITS, ARBITRARY UNITS
##FACTOR=    0.383398360251222, 1,           1
##FIRST=     12562.8140703518, 300948,       13461203
##LAST=      0,             -183096,         -11539138
##MIN=       0,             -3005529,        0
##MAX=       12562.8140703518, 286789997,    0
$$ Real data points
##PAGE= N=1
##DATA TABLE= (X++(R..R)), XYDATA
$$ [...]
21876b94173n6354J46862K76496Q6125N0170P0598O0719O6127P3883l0617J35875
21865E85711K97691P1519k90421l31237k55541j16265P9836Q2657j7274q9432
21855A7244o5064n0763o0460j8381o6863j20261l1204M0788k3618q3662l8229
21844e00473l8564j06668M5270J69344J12327M1865J66897L68255K18092q1321
21834C95024j60755j86437j84829j24641n6646j68341k12585j82876q6008K72644
21824f95450M11509K15506J35444K24853Q4660o1261k01409p1040J93395J60050
21814C96257J15802R3933m0560j77216k54438j05572J63060J98627j51431l55572
21804a17110m14028m29234k06448K19930K87424j19335k71958k207K53772L00701
$$ y = [-294173, -350527, -203665, 72831, 158956, 209126, 279724, 340443, 406570, 480453, 449836, 585711, 883402, 954921, 664500, 333263, 77722, -38543, 41293, 123950, 106676, 17244, -47820, -98583, -159043, -177424, -244287, -364548, -395752, -354964, -378582, -462244, -500473, -539037, -645705, -600435, -431091, -318764, -276899, -110002, 258253, 476345, 395024, 234269, 47832, -136997, -261638, -318284, -486625, -699210, -882086, -968094, -695450, -283941, -68435, 67009, 291862, 376522, 315261, 113852, 42812, 236207, 396257, 512059, 605992, 565432, 388216, 133778, 28206, 191266, 389893, 238462, -117110, -531138, -960372, -1166820, -946890, -659466, -778801, -1050759, -1052966, -799194, -498493]
21794d98493J36799K18094K12732j58109k48492p0481M5747m5533j29048j52254
21784f89038n2919O3696Q1902K53861K84322M4539k05535l36928l43655j42537
21774a042292j7977k3997R6770K15788L08325O03527O74870M59489L7967l92995
21764I19475n16391k47067m3015J5269j1085j19496j36947j07363o7111j49310
21754d63041l8388J35560P1090l7172l5782q1019j08718j8220J34813J22555J70933
21743a47389K04748N9258q1977k65853k35980j2913N0582P2728J12583K18544
21733b5669L27182J42642m7446p4265p6883j23052j04988j74931k25711p9921
21723d63042L29166N64495K56720q0767k49632k73674o2887J2534o0491M3498
$$ y = [-498493, -361694, -143600, 69132, -88977, -337469, -407950, -362203, -407736, -536784, -689038, -741957, -678261, -596359, -342498, -58176, -13637, -219172, -556100, -899755, -1042292, -1060269, -1084266, -987496, -771708, -463383, 140144, 815014, 1274503, 1312470, 919475, 403084, 156017, 113002, 128271, 117186, -2310, -139257, -246620, -313731, -463041, -501429, -365869, -294779, -331951, -367733, -448752, -557470, -575690, -440877, -318322, -147389, 57359, 116617, 34640, -231213, -467193, -480106, -429524, -356796, -244213, -25669, 301513, 444155, 396709, 322444, 245561, 122509, 17521, -157410, -383121, -463042, -133876, 430619, 687339, 606572, 356940, 83266, 20379, 32913, -27578, 15920]
21713A5920P7506J62869O9757j99195j88513m3731o3706n6321J05483P0488J4548
21702c4895j52190k05812j51143L9374J87672K52270L57805K69904k0713l53552
21692A88720m48310l1345L27282K59954q413N411J75570K47183K34111m2435j93720
21681G14008j14974m4004j02094j66297l31148k68437j2484L6054J70103L75244
21671B55971M63163L47369J1487l11282l40571l5456K39863K63421J61327N1668
21661A106960j07298l51860l08214N3185J48308q1276j76559j02140j44471j58267
21651a21632J2078J20855L4139P7906K54391K10341J36571L0169o9481j48513
21641E36824j15578o7554r1509j6007Q8794K18037N1707k73167k89648j23398
$$ y = [15920, 93426, 256295, 326052, 126857, -61656, -105387, -169093, -225414, -119931, -49443, -34895, -187085, -392897, -544040, -504666, -316994, -64724, 293081, 562985, 542272, 188720, -259590, -290935, 36347, 296301, 287888, 293299, 468869, 716052, 950163, 907728, 714008, 599034, 555030, 452936, 286639, -44509, -312946, -325430, -289376, -119273, 255971, 719134, 1066503, 1077990, 766708, 426137, 390681, 630544, 893965, 1055292, 1106960, 999662, 647802, 339588, 392773, 541081, 459805, 283246, 181106, 36635, -121632, -109554, 11301, 45440, 123346, 377737, 588078, 724649, 754818, 685337, 536824, 421246, 353692, 262183, 246176, 334970, 553007, 604714, 331547, 41899, -81499]
21631h1499j82719k39616j1607Q3142j17344k23277q0555K5459J31188K04655
21621d92173J94043P3078j54699l35137k29806J61621L51869J81969O5076J4364
21611a69795j67566k54977q5004J39530L91545P05330O07910J42848o212j63859
21601A139750k77784k60004l04226m24829l60039k3552M1361o7879p9982M4050
21591e73134K71533L88559K91788K95162K03593J9328j07279m9405R075q4617
21581F64603k7771J29270P9483N2475P1557n6483j41784j34732j44223k49063
21571B43332n16047m26956j03449N6429m676J5596K11326J84644J02208K87797
21561E0204M96404M08020L3336k13226k27590o5132J69419O2736j64049j81485
$$ y = [-81499, -264218, -503834, -515441, -432299, -549643, -772920, -853475, -828016, -696828, -492173, -298130, -225052, -379751, -714888, -944694, -783073, -431204, -249235, -184159, -169795, -337361, -592338, -677342, -537812, -146267, 559063, 1166973, 1309821, 1303609, 1139750, 861966, 601962, 297736, -127093, -487132, -510684, -469323, -537202, -617184, -573134, -301601, 86958, 378746, 673908, 877501, 896829, 789550, 740145, 749220, 664603, 636832, 766102, 845585, 898060, 969617, 913134, 771350, 636618, 492395, 243332, -272715, -699671, -803120, -746691, -751367, -735771, -524445, -339801, -237593, 50204, 546608, 954628, 987964, 774738, 547148, 482016, 651435, 714171, 550122, 368637]
21551C68637j99757j77427j23767O1755K29318J53877P4429j1012J21858L03801
21541H01712J34647j4922o0853k5710k2974P858L009r1906j38445r4727j2904
21530D84785k9484j66648l12370k52272l0854K79042L00596P8609o8243j23383
21520A59778J3182J05846R1368R7950o6920l10382l57177k47862j15884j36302
21510g66403k45552j93858Q837J70568J43004Q345J4765Q5131R500J26019J27816
21499e11828K0093q0173k67896j23818K91588L73884K39316J84583J21444o2848
21489A84345j05578J6085R3655J28423M0464k19769k92107p3480l6539r7728j01910
21478d64139l2145J479Q3505K60472K43999Q6332J42256O5863r475K306m8188
$$ y = [368637, 168880, -8547, -132314, -70559, 158759, 312636, 387065, 376053, 497911, 801712, 936359, 921437, 860584, 834874, 811900, 819758, 822767, 730861, 592416, 497689, 484785, 455301, 288653, -23717, -275989, -306843, -27801, 272795, 351404, 283161, 159778, 172960, 278806, 370174, 468124, 401204, 90822, -266355, -514217, -630101, -766403, -1011955, -1205813, -1196976, -1026408, -883404, -875059, -860294, -775163, -765663, -639644, -511828, -491735, -571908, -839804, -963622, -672034, -298150, -58834, 125749, 247193, 184345, 78767, 94852, 188507, 316930, 357394, 137625, -154482, -227962, -264501, -362229, -464139, -496284, -494805, -411300, -150828, 93171, 179503, 321759, 387622, 378147, 380453, 332265]
21467C32265p8041O9643J45372p837o9365K8271r7458j87717l645j11627k95801
21456b75940k95771m0001K67855L61709J08040j08921r4922L0965P1853K5914
21446E0781j3419j49799n9936N7163j99851l80564m1549K19708J39410J1648J6940
21435c49468k0653P1575K94448K83184L8865r0513j9769l1969j94043l90960l82199
21424g91502j25965R0959K56870L24390J56740N0735J80152K47980J63379L6450
21414E90188J4259m6925r5932o2072n6739j08421j24102k13703j96932J27402
21404a72977K20952K53029K28296O4326j51694k71035j83261k10K10733O7785
21394B65944k479K4096j72763j94829j12385j9978q0622r8804K8967N3317K00746
$$ y = [332265, 254224, 323867, 469239, 461402, 392037, 420308, 322850, 135133, 131488, 19861, -275940, -571711, -611712, -343857, 17852, 125892, 16971, -77951, -46986, 24867, 50781, 37362, -112437, -172373, -115210, -315061, -695625, -737174, -517466, -378056, -366408, -349468, -370121, -298546, -4098, 279086, 317951, 227438, 207669, 175700, -18343, -409303, -791502, -917467, -826508, -569638, -245248, -88508, -37773, 142379, 390359, 553738, 590188, 604447, 557522, 461590, 399518, 342779, 234358, 110256, -103447, -300379, -172977, 47975, 301004, 529300, 593626, 441932, 170897, -12364, -12574, 198159, 265944, 263465, 287561, 114798, -80031, -192416, -212394, -293016, -391820, -362853, -309536, -108790]
21383a08790K71825j6260k06026o6616l1977p0977J46640J96032o5478r5557J82094
21372A34910Q0960k19919p5926J28921P0959Q2119K19649J32626J13587K45936
21362I13822o0760l47916l97012l22717K8641L34683K12482j20824j32482Q4339
21352A92256J87539J51754M9l7955j6663q8883j31730j87069k09626q2845J57357
21341f5816L13689J97890K2797m6253j32041r9999Q3564K6079k06338k80237j98975
21330c85640n8377k8827M2584L2739j98886k05090j45262k42426j63710Q6988
21320a265907L04701L66594K33873r7237k77630j33035o7453j4026K12097K32852
21310e05171J16283J53111j7368k05234j75405j55673q9777j4737p1518M1286
$$ y = [-108790, 163035, 146775, -59251, -125867, -157844, -228821, -82181, 113851, 48373, -47184, 134910, 215870, -4049, -79975, 48946, 119905, 202024, 421673, 554299, 667886, 913822, 853062, 505146, 108134, -214583, -185942, 148741, 361223, 240399, 107917, 192256, 379795, 531549, 531598, 493643, 476980, 388097, 256367, 69298, -140328, -223173, -65816, 247873, 445763, 468560, 422307, 290266, 190267, 273831, 299910, 93572, -186665, -385640, -444017, -472844, -430260, -397521, -596407, -801497, -946759, -1189185, -1352895, -1265907, -961206, -594612, -360739, -457976, -735606, -868641, -936094, -950120, -738023, -505171, -388888, -235777, -253145, -458379, -633784, -789457, -879234, -893971, -965489, -924203]
21300i24203M27422N22468J87722q9472j22026r3318k95307l01389K5222J68240
21290d94641J33837K51524K87765Q3701q0019j26881k07706l98406l72377R0689
21280h32514L78477K78947R2723L2037J76778J60199J23215q8312l02188m8241
21270b8879J62554J19944Q8838J25099L0854l4559j1498k1465l4083j64235l13541
21259h0971m51728l88884j99139K12809N38386L13591q2501j44230K334N4741
21249b25592R0281R2608N8664J19726K49626J95965o56j53675k36332j4795J85741
21238C61561J70861J10725j4528r2156j77897k57957j05824O6356m9006l05865
21228b93730l08758j38890J541J12692J96774K56220J83861J39883M925j27236
$$ y = [-924203, -496781, 25687, 213409, 123937, 1911, -91407, -386714, -688103, -662881, -494641, -360804, -109280, 178485, 262186, 182167, 55286, -152420, -550826, -923203, -832514, -454037, -175090, -82367, -50330, 126448, 286647, 409862, 321550, 19362, -28879, 133675, 253619, 342457, 467556, 498410, 463851, 452353, 430888, 396805, 232570, -80971, -532699, -921583, -1120722, -907913, -369527, -55936, -138437, -282667, -280333, -225592, -135311, -42703, 15961, 135687, 385313, 581278, 580622, 426947, 190615, 175820, 361561, 532422, 643147, 628619, 536463, 358566, 100609, -5215, 61141, 12135, -293730, -602488, -741378, -739837, -627145, -430371, -174151, 9710, 149593, 154518, 27282]
21218B7282J9465K08205L3966q1994M6093P962j26294k46883j16331K41663L06589
21207C19723O0749J15658L07725J64656M4630j9888k63108m60152m25290l43376
21197d98673q1483M8148j06087j65931r2648L1234K63628K50994J53171J49996
21187d7651J34147R0816j29428k78513p8389J3653N9961J96388K68588J26368
21177C55940q7953j75181p9587J9450j04028j88685k53097k00010K51677M37832
21167b3642J36190j5879N6989J1586m8861l0623l325M9052L0783m4827k7056K35468
21155C25855K31853K07330L81521K49217j19693m03948m59638k51416j1074P8439
21145B28446n5695k84789l34255q0540j2337o3805O6440J15288M9717p4975p0450
$$ y = [27282, 46747, 254952, 288918, 206924, 253017, 260979, 134685, -112198, -228529, 13134, 319723, 380472, 496130, 803855, 968511, 1013141, 993253, 730145, 269993, -155297, -498673, -580156, -532008, -638095, -804026, -896674, -865440, -601812, -350818, -197647, -47651, 86496, 177312, 47884, -230629, -309018, -295365, -235404, -39016, 229572, 355940, 267987, 92806, 13219, 32669, -71359, -260044, -513141, -713151, -461474, -23642, 112548, 96669, 153658, 165244, 116383, 85760, 82435, 131487, 162270, 117443, 90387, 325855, 557708, 765038, 1146559, 1395776, 1276083, 872135, 412497, 161081, 150007, 228446, 172751, -112038, -446293, -526833, -539170, -602975, -536535, -421247, -371530, -446505, -516955]
21134e16955O5299P9194O8344J20037K02008O4706J0257j3753l3758J26009K07393
21123C78781J14387N2195Q4406n527j1221M1912l906r2943j03021l0881Q4084
21112E08266O9758p5764k12240l62100j90523j772k34653l67847k98161R500K48838
21101i06698L15179K82252K77487K81936K11181M4357m0380n9946p0202p3068
21091B62098q1897Q1140J69721J1087n8767p3176k72797k14338J34975N6615k89420
21080b74759j99107j27854k73443k66759R280K57895L29968K60762N7376o9437
21070b96078q3449l4871o326J08552L19305J64983j22109j48720N9971J01119
21060F2377l3909j37368j16608R2388K86445J63794L5448o4449r9049j85117j84596
$$ y = [-516955, -451656, -372462, -304118, -184081, 17927, 82633, 92890, 79137, 45379, 171388, 378781, 493168, 545363, 629769, 624242, 613021, 654933, 651027, 558084, 455063, 424182, 508266, 578024, 502260, 290020, -72080, -262603, -264375, -499028, -866875, -1165036, -1155536, -906698, -591519, -309267, -31780, 250156, 461337, 505694, 465314, 405368, 335166, 262098, 180201, 261341, 431062, 442149, 383382, 310206, 37409, -176929, -41954, 14661, -274759, -473866, -601720, -875163, -1141922, -1132642, -874747, -544779, -284017, -226641, -296078, -379527, -414398, -420724, -312172, 7133, 172116, 50007, -98713, -38742, 62377, 28468, -108900, -225508, -133120, 153325, 317119, 352567, 288118, 189069, 3952, -180644]
21049a80644q6929r219J05352p739j29667k14963j26590j25205j93207j2196K38618
21038g42389K32374J29488P9660M4410J52384P3186o5061p6469R4239L55463L07325
21027E84610l9640j56963r244o7857k09969j59259K63R3787k823J16656L80391
21016E29952M18627R8058m28368o15323l78747L8388J58077J34685K18570L01044
21006D74963K02231J50413K14995J25209m1178j88006k10237k14616o0655J55273
20996F08392L02428L30201L35974L01969O2070j92737l62367m23918m14403k58980
20986B88629q3401o1818J14702L50293M20357K70584k306k52061k59512j28352
20976F57115j72229m44063n58521l44405k44270k69022l0662L19076M74342N18437
$$ y = [-180644, -267573, -276792, -171440, -179179, -308846, -523809, -650399, -775604, -968811, -981007, -742389, -510015, -380527, -300867, -256457, -104073, -30887, -95948, -172417, -78178, 277285, 584610, 544970, 388007, 378763, 310906, 100937, -58322, -58059, 35728, 32905, 149561, 529952, 948579, 1046637, 618269, 2946, -375801, -337413, -179336, -44651, 173919, 474963, 677194, 827607, 1042602, 1167811, 1126633, 938627, 728390, 513774, 453119, 608392, 910820, 1241021, 1576995, 1878964, 1941034, 1748297, 1385930, 962012, 547609, 288629, 205228, 143410, 258112, 608405, 1028762, 1299346, 1297040, 1044979, 785467, 657115, 484886, 40823, -517698, -862103, -1106373, -1375395, -1406057, -1086981, -612639, -94202]
20966i4202N21565L24887j13549j22298J43496J18547J23542P9988r2190j77890
20956G11896j75478k6420n7963k2653N6255J15271p3212m17072k54758O5028L7930
20945d1176P8462L39137M06926J76308j02981k33720k31011k15114k21893k24721
20935b69783j41908o7260j6029K9578n6583j67171r5333R7874K47602K30635J51690
20924e6688J24201P3124N1469j1051j10505j01978r0571j74240j22922J45740
20914b73421L72652K23598p7151j95662O46J21353M4310M2357J50911J37056O0138
20903F06787m9137l12234n25256l46469q7551n7666J30311K86156K72352K68380
20893A85673K24290L3693k33979m25822k62744r5044J4973L09220L53710K44705
$$ y = [-94202, 427363, 752250, 638701, 516403, 659899, 778446, 901988, 981976, 889786, 711896, 536418, 509998, 452035, 429382, 485637, 600908, 527696, 110624, -144134, -79106, -41176, 37286, 376423, 783349, 959657, 856676, 622956, 391945, 176831, -45062, -269783, -411691, -478951, -494980, -465402, -521985, -689156, -784489, -686615, -439013, -208378, -56688, 67513, 140637, 192106, 181055, 70550, -31428, -121999, -296239, -419161, -273421, 99231, 322829, 245678, 50016, 50662, 172015, 216325, 258682, 409593, 546649, 606787, 557650, 245416, -279840, -626309, -713860, -771526, -641215, -355059, -82707, 185673, 409963, 443656, 209677, -216145, -478889, -573933, -558960, -249740, 103970, 348675]
20883C48675J13552M897m0481l23543m42388j86718j90858j93089k4589p2956
20873a007498k01357J7237M12696N40158M04970O8037k73224j92112O718L7930
20863a86445o7242k09457n4459N3105j06342l7673k3237j48053o149L15728L68039
20852a02185K40281J96550J32816O395k43219k91897k51390o0732R2090k0846
20842c02137o3611N7688K41692L92203L69024P2571j45122p7866N5199Q5159K9945
20831G14745q2943n9069k5671j42397l20210k47191J4305J71796J74647R12j09187
20820H9737j17302J038L4993j73022k85735k66315k20354j96961j24391L9295
20810a219017K11515L58944L61897K32018J1923n5864k7208J10378K58898K59608
$$ y = [348675, 462227, 467124, 426643, 103100, -339288, -526006, -716864, -909953, -934542, -1007498, -1208855, -1191618, -778922, -238764, 166206, 234243, -38981, -231093, -224375, -186445, -253687, -463144, -517603, -464498, -570840, -608513, -631750, -779803, -785952, -470224, -102185, 138096, 334646, 467462, 473857, 230638, -61259, -312649, -373381, -281291, -302137, -365748, -308060, -66368, 325835, 694859, 767430, 622308, 544442, 599641, 684800, 714745, 631802, 572733, 547062, 404665, 84455, -162736, -148431, 23365, 198012, 198924, 89737, -27565, -26527, 8466, -164556, -450291, -716606, -936960, -1133921, -1258312, -1219017, -1007502, -648558, -286661, -54643, -42720, -98584, -125792, -15414, 243484, 503092]
20800E03092J31825q1565l34264m69428k71516O7303K27161L2537k6725R2946
20790a28634J56932J48460R3590Q283r0111J01709K44938P9047n2717n0074q1027
20779D30396j56709k09623k75037k15633p7057J09924L37035K66153K9106R5344
20769C33899K29454K36811L72111J85829k28690j16210O5684m8912j49957k83804
20759E96215k30041M9490N8619n9873N3021K21274L42528J74628j39071k57889
20749H08901j13430j13852k05920k34948j94832j23062N9065J33856k324r0377
20739g6923P1967K16337N0815o8797q042K1452R3382J22941P3553N4189J2259
20728E63133J08657K2180j04012j13541j15094k8655K31395K35503j27726k84205
$$ y = [503092, 634917, 553352, 219088, -250340, -521856, -454553, -227392, -194855, -221580, -128634, 28298, 176758, 270348, 278631, 188520, 290229, 535167, 614214, 561497, 511423, 430396, 273687, 64064, -210973, -426606, -503663, -393739, -56704, 209449, 238555, 333899, 563353, 800164, 1172275, 1358104, 1129414, 1013204, 1078888, 1029976, 880019, 596215, 366174, 415664, 474283, 414410, 467431, 688705, 1031233, 1205861, 1066790, 808901, 695471, 581619, 375699, 140751, -54081, -177143, -118078, 15778, 13454, -76923, -4956, 211381, 262196, 193399, 185357, 206809, 300191, 423132, 496685, 550874, 563133, 671790, 693970, 589958, 476417, 361323, 332668, 564063, 799566, 671840, 387635]
20718C87635r8313K27499L19012K13938J59103l738k24964k88809k89262j97082
20708B05019L3311p257k11092k81375j88380r421J18065R5166n858r9944p0644
20697d22410K48839L83910J45200k43251l69811k20352O999K62494L02276K17412
20687C11306r484j27990l2674N0512J91410K72257R6482k12948j51325N1413j44232
20676B94727m76847n87340k63388J6761J49625K17531J66818K92690L96946L15941
20666E23464K06708J4651j84212j03255J07310Q8910n5353j72094m68J79096R3220
20655F97977m6543q364J89526L1990j88100l09331l76506m30769m37435j10212
20645i87767J84857K01380J29745L0742Q5091K59567L66090K70755J8890j08172
$$ y = [387635, 289322, 516821, 835833, 1049771, 1208874, 1205136, 980172, 691363, 402101, 205019, 238330, 231073, 19981, -261394, -449774, -459195, -341130, -245964, -251822, -351766, -422410, -173571, 210339, 355539, 112288, -257523, -477875, -470876, -208382, 93894, 311306, 301822, 173832, 141158, 191670, 383080, 655337, 751819, 538871, 387546, 438959, 294727, -182120, -769460, -1032848, -1016087, -866462, -648931, -482113, -189423, 207523, 523464, 730172, 744823, 560611, 457356, 564666, 653576, 598223, 426129, 425661, 604757, 697977, 651434, 643070, 832596, 864586, 676486, 367155, -9351, -440120, -877555, -987767, -802910, -601530, -471785, -441043, -355952, -96385, 269705, 540460, 559350, 451178]
20635D51178p4531P4673J70055P2367k75711k82457K26256M32708L15734P9346
20625A189618j11642l71798o68437m92884J06744L83442J66493m6929j07944r3515
20615d6852o9063o2009j50289m8363K39782L12577R4661k49062l41610l38965
20605f59193l02945j78525j06420M6240K28775K68465L4851j23284Q0343L43052
20595c68641L90310O8114q3035M6338R3603N8287J3592M9215J46210K42015L7913
20584F93921j12740r8595q672J54117J63831J3267j53992q7168j23927k00772
20574B39270j05342j41303j39667L1163J07325j18536k34207q2859J86522M10355
20564A52721J24738k27546l03121j32877Q327O3536J77825K91264K42704J84793
$$ y = [451178, 376647, 451320, 621375, 693742, 418031, 135574, 361830, 794538, 1110272, 1189618, 1077976, 706178, 37741, -455143, -348399, 35043, 201536, 154607, 46663, -46852, -115915, -177924, -328213, -376576, -136794, 175783, 270444, 21382, -320228, -659193, -962138, -1140663, -1247083, -1200843, -972068, -703603, -668752, -792036, -711693, -368641, 21669, 89783, 6748, 53086, 146689, 204976, 218568, 267783, 413993, 656008, 693921, 581181, 482586, 473914, 628031, 791862, 805129, 651137, 563969, 440042, 239270, 133928, -7375, -147042, -115879, -8554, -127090, -361297, -444156, -257634, 152721, 277459, 49913, -253208, -386085, -377758, -314222, -136397, 154867, 397571, 582364]
20554E82364J50053l9054p3327L3751J15623j1159j91972j23997Q9622J2870k58924
20543B85850j70371L0777J54524K68674Q8193k33298l07121k94687m46049l66469
20533i89977p7731J35255J73830R0788L239K15695M89246N38498K08459j83881
20523F03421k45048j61254j55811l58336l65236p5333J87886L22436J73230J02371
20513B8326K59885J42714q8285k40220j26944Q3760J55011J35044l6432k35560
20503G7299l56162l65097j84801N1703K33792J97046O9145J24139L23583K89415
20493D60062K9742l8822j06505j34369j88387k70419k31721l0945J13112L8746
20483c59506K8144J36620K66028O4069k14463k29262k9890J86041J46760J42808
$$ y = [582364, 732417, 693363, 620036, 653787, 769410, 758251, 566279, 442282, 531904, 544774, 285850, 115479, 146256, 300780, 569454, 657647, 424349, 117228, -177459, -623508, -989977, -1067708, -932453, -758623, -667835, -664596, -448901, 40345, 578843, 787302, 603421, 358373, 197119, 41308, -317028, -682264, -757597, -569711, -247275, -74045, 28326, 288211, 430925, 342640, 102420, -24524, 59236, 214247, 349291, 312859, 77299, -278863, -643960, -828761, -777058, -543266, -346220, -277075, -152936, 170647, 460062, 489804, 450982, 344477, 210108, 21721, -248698, -480419, -511364, -398252, -359506, -331362, -194742, 71286, 135355, -79108, -308370, -338260, -152219, -5459, 137349]
20473A37349K60259K36164K7144q1415l8054Q7149K9505J6901j6037q3435j73173
20462D02357j14214j3622l7602o9597j91423j82251j16228m2611P7470J59562
20452a28159J31405J94197L44143L45082M2128j14343k32097m43239l69608j84733
20442d15224N305O9138N4387J14695J36886J15389q3331j34294O2865J39595Q945
20431G4356j49808k27824k74773j16904J54182J88221J39055R1497L4779l8352
20421a25571K2692K51703L23142J94874J37034J00472m3793j45893l69974n19950
20411a75264k64147R04N9615J5065k5024J4276J09146K15388L4542l14944m15655
20400g46098j8M36958M23479L26124L10563l1756k42848k42440o7478J77734N8099
$$ y = [137349, 397608, 633772, 660916, 579501, 541447, 628596, 658101, 675002, 658965, 575530, 402357, 288143, 274521, 236919, 167322, -24101, -206352, -322580, -365191, -287721, -128159, 3246, 197443, 541586, 886668, 928796, 814453, 582356, 139117, -230491, -415224, -409919, -340781, -286394, -171699, -34813, 80576, -2755, -137049, -74184, 65411, 74356, -75452, -303276, -578049, -694953, -540771, -352550, -213495, -121998, -87219, -125571, -102879, 148824, 471966, 666840, 803874, 904346, 860553, 714660, 344686, -175264, -439411, -438507, -378892, -363827, -388851, -374575, -265429, -50041, -15499, -330443, -746098, -746116, -309158, 114321, 440445, 751008, 719252, 476404, 233964, 166486, 344220, 402319]
20389D02319j45572j17899o222J1m9091j34582k7406L01017K68280k7575k57840
20378B05440l61448l38324j25041k9961j47196J7889M53878N81325L07538M8840
20368F12940l20051l95257Q7649M28934K12544n5441o7571K63922L22622R7280
20358A187571j24633l20951l05607j30971n1098O4368K54893K68789K47314p62
20348A088913l81825l46957K4061L56284L26625N3761j27659k60361k94720k49288
20338A88834m4618K10781L56767K13127J30988K58366K59097J1086j28149j00342
20328A355937q6297k6180J4578J25124L30246M11406L16034M12953O65591P50702
20318D270094Q78237J143287J246920J435798J965408K754443L511745L469309
$$ y = [402319, 256747, 138848, 132626, 132637, 83546, -51036, -78442, 222575, 490855, 463280, 205440, -156008, -494332, -619373, -649334, -796530, -778641, -324763, 256562, 564100, 612940, 292889, -102368, -14719, 414215, 626759, 571318, 503747, 767669, 1090291, 1187571, 1062938, 741987, 436380, 305409, 254311, 318679, 573572, 842361, 1089675, 1088913, 707088, 360131, 384192, 740476, 1067101, 1120862, 993203, 732842, 438122, 188834, 144216, 354997, 711764, 924891, 1055879, 1314245, 1573342, 1584428, 1456279, 1355937, 1269640, 1243460, 1258038, 1383162, 1713408, 2124814, 2440848, 2853801, 3519392, 4270094, 5148331, 6291618, 7538538, 8974336, 10939744, 13694187, 17205932, 20675241]
20310B0675241J105997k183781l400563l105286k459087j710013j397214j283569
20302F241725r50273o89642n80949n54501l96469o5280J11360o3665l59577k42685
20292B450044l9988n1060j47068j95505k36597j75941q6586k74483m09126j54882
20282F78808J6996o7723j48180q3084K0115O5336o9814k60346l09969k44793Q938
20271c93716L01524L49895L9549j50093o8803J44013L14892M6013l36444m64662
20261b17832n41767l08177M0862J73033J26154J64234J79796Q8878j4832J0114
20251b99537Q6561K16597K17287J6335O6143K93230L62110J09318l9149q8134
20241I40761j35027k25883k41078k16339j35357J40223K12928M3929j2035P2615
$$ y = [20675241, 21781238, 19597457, 16196894, 13091608, 10632521, 8922508, 7525294, 6241725, 5291452, 4601810, 4020861, 3466360, 3069891, 3004611, 3115971, 3052306, 2692729, 2450044, 2410056, 2358996, 2211928, 2016423, 1779826, 1603885, 1517299, 1242816, 833690, 678808, 695804, 628081, 479901, 396817, 416932, 482268, 412454, 152108, -157861, -402654, -393716, -92192, 257703, 297252, 147159, 78356, 222369, 537261, 583274, 246830, -217832, -759599, -1067776, -1026914, -853881, -727727, -563493, -383697, -294819, -309651, -299537, -212976, 3621, 220908, 237243, 303386, 596616, 958726, 1068044, 1028895, 940761, 805734, 579851, 338773, 122434, -12923, 127300, 340228, 384157, 372122, 444737]
20231D44737J59613j03696k99466l00455j98036j00090m3740O8446K5956j26409
20221d73140k26071k05024j05864M9095J75296K75546K20401L6723j5482j5251
20211b83771K0112J15259J94152Q1537R526J01070J26248j8259m4354L6869J15891
20200D54280K66072K93245L061k53373m65243n48809k33437L2839Q2437N4079
20190c14849J90811K10866J34558K00835J67055j4819k22185k61231k71137l10465
20180d90561k47831j10511K4764J57028J86886N6386q5452r5380L4720J52484
20170d17467K77450K86934J47245J9747m5717j22630j52571q8617j28883j54653
20160c79162o0191k64723l31735o9391N4533K83921L42906J78938J87873R5213
$$ y = [444737, 604350, 500654, 201188, -99267, -297303, -397393, -441133, -372687, -346731, -473140, -699211, -904235, -1010099, -961004, -785708, -510162, -289761, -253038, -268520, -283771, -263659, -148400, 45752, 127289, 136815, 237885, 364133, 345874, 301520, 338389, 454280, 720352, 1013597, 1016658, 763285, 298042, -250767, -484204, -451365, -368928, -314849, -124038, 86828, 221386, 422221, 589276, 574457, 352272, 91041, -180096, -490561, -738392, -848903, -824139, -667111, -480225, -423839, -509291, -604671, -569951, -417467, -140017, 146917, 294162, 313909, 268192, 145562, -7009, -95626, -224509, -379162, -439353, -704076, -1035811, -1105202, -1050669, -766748, -423842, -244904, -57031, 38182]
20150C8182j50052j73401j30244r3219j2956K46343L50210K33445j6050j79997
20140A12261l10975k60971k5456O477k6447r1441r9607k2957K46801K79340r2970
20129b85945m55798m93175k81062J75359M97874M23493K51440J21715J2422R9076
20119F5399Q7452L8068J91493K84727N5296l20107l71027j80580k07986j12818
20109d70083N9263J24483j5377n5919J99633J58345p2029j92166j77066k21681
20099f62597l54890k93922j37603o2577N1441K52647M04683L86831K95971M30303
20089C10287M26409J87623k9525k73772k35104n7893p7729j62214l33731k60475
20079e06124O2981O2837q4513K8659L35000N92521M21727L51122K28525k01532
$$ y = [38182, -111870, -285271, -415515, -508734, -521690, -275347, 74863, 308308, 292258, 112261, -198714, -459685, -485141, -478664, -505111, -596552, -696159, -719116, -472315, -192975, -285945, -741743, -1234918, -1515980, -1340621, -842747, -419254, -167814, -46099, -33677, 65399, 152851, 190919, 382412, 667139, 722435, 402328, 31301, -149279, -357265, -470083, -410820, -286337, -301714, -357633, -158000, 345, -71684, -263850, -440916, -662597, -1017487, -1311409, -1449012, -1511589, -1460148, -1207501, -802818, -415987, -120016, 310287, 736696, 924319, 894794, 621022, 385918, 328025, 250296, 88082, -245649, -506124, -443143, -380306, -464819, -436160, -101160, 491361, 913088, 1264210, 1492735, 1291203]
20069A291203l77392l17718j27520j00146q0126M2766J77824p1082k07929j35781
20059I4099j30495r9286M9053K73427K60745K474j05561k36992m22764l30617
20049f45917j14300n0021q2630j18984q6570j44049k0864J85722J79303J90222
20039g08088K33181P9911r5721P8389J4555j62225j10226J0909K33192M52695
20029B6572L43541l2439k48601j42356Q0448K17033J48702J28033J59512k1561
20019F58884k65625k53829m2123N0082j8298n0914L4983K27729J85030k5085n2582
20008D48252R2672K80474K54925L8508O0437J45112P8634j15653k02960k64206
19998H16195j55283k7809p8126j36024j22516q4011J26597K30746O8598q0790
$$ y = [1291203, 913811, 596093, 468573, 368427, 288301, 331067, 508891, 437809, 229880, 94099, -36396, -135682, -86629, 186798, 447543, 450017, 344456, 107464, -315300, -645917, -760217, -810238, -892868, -1011852, -1098422, -1242471, -1263335, -1077613, -898310, -708088, -474907, -394996, -490717, -412328, -397773, -559998, -670224, -659315, -426123, 26572, 370113, 337674, 89073, -53283, 27165, 244198, 392900, 520933, 680445, 658884, 393259, 139430, 97307, 147389, 129091, 78177, 113160, 340889, 525919, 500834, 448252, 540924, 821398, 1076323, 1114831, 1175268, 1320380, 1399014, 1283361, 1080401, 816195, 660912, 633103, 554977, 418953, 296437, 212426, 339023, 569769, 638367, 557577]
19988E57577j03500k06346j83340N2045Q6178j47669k79490j54281R294K03896
19978a65636J9846j96897k25811k30249j21316L0745M4240m8238n7630J30317
19968h20629L50537K80158P3394j44715k76991k55738k21206j27807k8001J26465
19958a044533K56388K39782J91522J40737J27652N4787K7935N3495N5961J02225
19948B05951R1142j1143L2031J66257K05294K27082K37365J61455M3343j54612
19938A204165l97264n15423m48514l03447q7730Q861O5398J34541R5122l6534
19928b80825j42749j94116o1913L27726M97063K36271J6047o4339o9037j58409
19918A05719j48377O8240J53757m2338j92404j12138N1077P8168p2316j73494
$$ y = [557577, 454077, 247731, 64391, 116436, 202614, 54945, -224545, -378826, -369532, -165636, -145790, -342687, -568498, -798747, -920063, -889318, -845078, -893316, -950946, -820629, -470092, -189934, -116540, -261255, -538246, -793984, -1015190, -1142997, -1170998, -1044533, -788145, -548363, -356841, -216104, -88452, -33665, -5730, 47765, 103726, 205951, 297093, 285950, 317981, 484238, 689532, 916614, 1153979, 1315434, 1358777, 1204165, 806901, 291478, -157036, -460483, -548213, -539352, -473954, -339413, -244291, -280825, -423574, -617690, -679603, -351877, 145186, 381457, 397504, 333165, 264128, 105719, -42658, 25582, 179339, 137001, -55403, -167541, -116464, -38296, -110612, -284106]
19908b84106j70691j01565J8317L6059N7513R8373j29792k42548j54359j97234
19898a070033k94288k29068k3279Q3466N2204J49092K44158J18104l8070k1653
19888a029367j14271j17257J6903K21296K16182J6153M4958M4721L7488j3801
19878f76995j36101j42107J10421K71170J30906n0125r0304J5414P6802J15904
19868c75015K22261J25741J21872J96600Q4681J23335L7362R7187L7228k79157
19858C92095l13549j82270k05777l33801l08059k08056j14330J31341L24629J84944
19848f32833N8655M13m0969k9433J9792J40811K94730L44562L64472L84194J77756
19837A082150o9641k86101l38834l59458l10942r6998K57760K50561L7863j7978
$$ y = [-284106, -454797, -556362, -538045, -501986, -444473, -346100, -475892, -718440, -872799, -1070033, -1364321, -1593389, -1616668, -1533202, -1480998, -1331906, -1087748, -969644, -1007714, -1029367, -1143638, -1260895, -1243992, -1022696, -806514, -790361, -745403, -700682, -663194, -676995, -813096, -955203, -844782, -573612, -442706, -492831, -583135, -567721, -490919, -375015, -152754, -27013, 94859, 291459, 376140, 499475, 536837, 634024, 671252, 392095, 78546, -103724, -309501, -643302, -951361, -1159417, -1273747, -1142406, -817777, -632833, -574178, -573765, -614734, -644167, -624375, -483564, -188834, 155728, 520200, 904394, 1082150, 1012509, 726408, 387574, 28116, -282826, -379824, -122064, 128497, 166360, 148382]
19827A48382R9861J50339m4738k00631j06409L2407n2134p2242m5514L3070L8053
19816a9556j7700j9565M3273k3722k70627k06577L5435L00082K21193p5685j67413
19805b00862J6394K08500K56313J69252O230k70052l81990l64722k67042r9295
19795i27274J00671M30887M50274K12605J88173J79842m6346j54548K0657J34360
19785E89301J23083j12061k48626m3276q7269l15295l64523l08675k90960k23240
19775a281541J3356L11930L20644J24927J58112J63055R0354P9173l2373j95489
19765b47852k23612o1197K71061M56076L98231J24030j05711j00460j02884m5495
19755C62187m7977k03552k55130l4829M08507N15075J75358r8111k47642k57773
$$ y = [148382, 248243, 398582, 353844, 153213, 46804, 79211, 27077, -45165, -90679, -57609, -19556, -37256, -56821, -13548, -37270, -307897, -514474, -479039, -178957, 42236, -33449, -200862, -184468, 24032, 280345, 449597, 455827, 185775, -196215, -560937, -827979, -927274, -826603, -395716, 54558, 267163, 455336, 635178, 588832, 434284, 454941, 589301, 712384, 600323, 351697, 308421, 221152, -94143, -458666, -767341, -1058301, -1281541, -1268185, -956255, -635611, -510684, -352572, -189517, -99163, -19990, -52363, -247852, -471464, -532661, -261600, 194476, 592707, 716737, 611026, 510566, 407682, 362187, 314210, 110658, -144472, -179301, 229206, 744281, 919639, 821528, 573886, 316113]
19745C16113j98414j084R7268r2934k50483q1935J38772L4779j58060j2627L31932
19734A23327M06681K22008j11105k02070N8687J5043j43669j57192q8603j3139
19724A09968J31k7019O2629j68225m43619l65505j97858m8815j7393J18807L14732
19713f62167M24356K01616O5533O1652l0149j01226j50658k10199j99501k5921
19703f26664j4999k1034l4916J00587K62351J77720Q2656J68981K34578P4252
19693D03512K2805J77111K33624R8433o4603k34101l45214l12893k26644k40238
19683d88208k48931O1019L76698J86929r6376j71438N988L37751M74878J26499
19673E64809k92893j83184J59746M08851M64955K71351o0321k44274k38500k14449
$$ y = [316113, 117699, 116615, 213883, 120949, -129534, -211469, -72697, -37918, -195978, -208605, 123327, 530008, 752016, 640911, 438841, 497528, 512571, 368902, 211710, 123107, 109968, 110099, 83080, 145709, -22516, -466135, -831640, -1029498, -1078313, -1095706, -976899, -662167, -237811, -36195, 29338, 90990, 60841, -40385, -191043, -401242, -600743, -626664, -641663, -662697, -697613, -597026, -334675, -156955, -74299, 94682, 329260, 403512, 426317, 603428, 837052, 935485, 870882, 636781, 291567, -21326, -247970, -488208, -737139, -676120, -299422, -112493, -208869, -380307, -374319, -36568, 438310, 564809, 271916, 88732, 248478, 657329, 1122284, 1393635, 1333314, 1089040, 850540, 636091]
19663F36091L8612J0962l36212k91814j36190j6032O6018o8531j79214j25609
19653d01919k3745l007K4153k533j30981q727L1215j53522j75614m649J79311
19642f70018J83883R0803m250j23995r4249o8994j98750j17576Q2521J31185K18971
19631e70469K75765J05297o6237J1705J03560J46908K92897M73469K68154j0449
19621A030600j82407m79522m24225j3050L11757K50810p8951l00568k61230j13088
19611b59874k1966K6433P6812J2215R8896K27936J46879L6069n1255q813L992
19600B87324J14509J81938J04579o6695j92317j07574j03159j54504q393K7245
19590H2953L3107J0494k24544k83002l2842J01044L4105M3365N4834j65087j30244
$$ y = [636091, 674703, 685665, 349453, 57639, -78551, -94583, -28565, -97096, -276310, -401919, -425664, -428671, -404518, -407051, -538032, -546759, -515544, -669066, -844680, -849329, -670018, -486135, -395332, -399582, -523577, -617826, -686820, -885570, -1003146, -920625, -789440, -570469, -294704, -189407, -255644, -243939, -140379, 6529, 299426, 772895, 1041049, 1030600, 848193, 368671, -55554, -68604, 243153, 493963, 415012, 114444, -146786, -259874, -281840, -255407, -178595, -166380, -67484, 160452, 307331, 343400, 292145, 283332, 287324, 401833, 583771, 688350, 621655, 429338, 321764, 218605, 64101, 55708, 82953, 116060, 126554, -97990, -380992, -413834, -312790, -278685, -235320, -180486, -345573, -475817]
19579d75817J58126J97698J26890M5655K1768k9206o3277o6503K426K18513K40429
19568C76702n7675j90691P3239J00484L7841m0778k36362k10673p6267J1531j9769
19557b32418o1980p1885M9805P3772j48789j43323J84926K28063J70079M4686
19547I2936k18572j77814j64698k83475j20422K3675r8407j31262J74976M05132
19537d97931K60747J37143L1323m7629j8230N3520p4517l04183m22949k30073
19527a112779J09523J41352P1418M8161J27043K82814J24609r8343j77058r7221
19517e80481J44575K43209J21238M1217K163j27479k68943k61088j09080J34891
19507f59778K17839K06309R7247R3560K09419k3427l25853l65326j20563J24868
$$ y = [-475817, -317691, -119993, 6897, 52552, 74320, 45114, -18163, -84666, -82240, 136273, 376702, 319027, 128336, 201575, 302059, 339900, 299122, 62760, -147913, -224180, -212649, -232418, -294398, -366283, -316478, -242706, -391495, -534818, -349892, -121829, 48250, 92936, -125636, -303450, -468148, -751623, -872045, -848370, -946777, -1078039, -903063, -497931, -237184, -100041, -68718, -116347, -134577, -81057, -155574, -459757, -882706, -1112779, -1003256, -861904, -790486, -742325, -615282, -332468, -207859, -306202, -483260, -580481, -435906, -192697, -71459, -30242, -28079, -155558, -424501, -685589, -794669, -659778, -441939, -235630, -138383, -44823, 164596, 141169, -184684, -550010, -670573, -545705]
19497e45705J95264O0976j15241p2934J13989J49936M6668J01247J43536O8315
19487A46051p0025j7435J474k7168J27731K8874j87057k08358k25612r5723N5175
19476d72073J977q2226k6861L416K137k3749j5764J71472K64312J26068K930L9016
19464i345L0256J4385j4524P7029J43966J18925J51807J71624K06687k9103k86657
19453E75050l24280k94180j79891P3312K45516J76123M5367j08687j30208j84515
19443a06393p3129Q4719J2551J6522J1917J54829J74035l8588j77928q758J06770
19432A56547P5843J01194J39446N2240L1516J0094n6759j29013j50475j27455
19422A03178k31425j88098J5164K16705L37299J17325k00139m09185m91653n30058
$$ y = [-545705, -350441, -289465, -404706, -477640, -363651, -213715, -167047, -65800, 77736, 146051, 76026, 58591, 60065, 32897, 160628, 189502, 2445, -205913, -431525, -527248, -472073, -470096, -552322, -579183, -575767, -573630, -597379, -613143, -441671, -177359, -51291, -48361, -9345, 20911, 35296, 20772, 97801, 241767, 360692, 512499, 684123, 890810, 861707, 575050, 250770, -43410, -223301, -149989, 95527, 271650, 317017, 208330, 78122, -106393, -179522, -94803, -82252, -65730, -53813, 101016, 275051, 236463, 58535, 49777, 156547, 232390, 333584, 473030, 525270, 556786, 566880, 510121, 381108, 230633, 103178, -128247, -316345, -301181, -84476, 252823, 370148, 170009, -239176, -730829, -1260887]
19412a260887m12808J51769M40410K78320K9348j37908n1254J22455O4101j98947
19402i75401l00541k05544n09K43918J53147K999K11840L37554J37454J80070
19392b15013L10475K11169O1788j6606n5559l0901j08709k61126j96767J33771
19382a67478R0226k12386k70658j04516K4115o5428j66795J68462L22475L02527
19372g9456N54667M89011L0841j12141j6779j20360k83170k46455j85899j53625
19362a23366N3549J28603J2881O4434K25920M8417j97767k31124k11533j31909
19352c61895N891K05392J89960Q8120o7818j01770K5209J05749Q4537J50927K90009
19341F14311J34421j7017P6485P3622P9531Q786j54852j81706k8461M3157L0015
$$ y = [-1260887, -1673695, -1521926, -1081516, -803196, -773848, -911756, -963010, -840555, -776454, -975401, -1275942, -1481486, -1481995, -1238077, -1084930, -1081931, -870091, -532537, -395083, -215013, 95462, 306631, 368419, 351813, 296254, 265353, 156644, -104482, -301249, -167478, -77252, -289638, -560296, -664812, -640697, -706125, -872920, -704458, -381983, -79456, 475211, 964222, 995063, 882922, 866143, 745783, 462613, 216158, 30259, -123366, -69817, 58786, 71667, 136101, 362021, 410438, 212671, -18453, -229986, -361895, -356004, -150612, 39348, 127468, 59650, -42120, -16911, 88838, 173375, 324302, 614311, 748732, 731715, 808200, 881822, 961353, 970139, 815287, 633581, 605120, 648277, 678292]
19330F78292n7678j78623k77252j60721j9931r3386j66497q0896p8669n0997J33326
19319c53032J98613O9035k4919J7704Q7664J78233K81230L11559M13646M10876
19309A590609J91755j03656j06673r2223j22778j71103k86715j03079J58109R4216
19299A048462j00722k53310j69274j13818j68915o2395K8873P0938o2019o1130
19289A56690Q9686k2835M1289K16336R9966k1015J91223K24517r3154k50938j95407
19278D36358J22600J89176r8271j45352P1737N5492j22741k11626j62379O302
19268A41296J55703N0271k19852l45629j96488O4446K90746L50835R7484k18535
19258A70277j18509L05926L95876M6202n9413O2555r554j25958j26747o9789q8194
$$ y = [678292, 620614, 441991, 164739, 4018, -15913, -109299, -275796, -356692, -435361, -486358, -353032, -154419, -85384, -110303, -92599, -4935, 173298, 454528, 766087, 1179733, 1590609, 1782364, 1678708, 1572035, 1479812, 1357034, 1185931, 899216, 796137, 954246, 1048462, 947740, 694430, 525156, 411338, 242423, 180028, 208901, 279839, 217820, 156690, 246376, 223541, 264830, 481166, 581132, 560117, 751340, 975857, 882703, 631765, 436358, 558958, 748134, 649863, 504511, 576248, 631740, 508999, 297373, 134994, 141296, 296999, 347270, 127418, -218211, -414699, -350253, -59507, 291328, 388812, 170277, 51768, 357694, 753570, 799772, 740359, 802914, 793360, 667402, 540655, 470866, 382672]
19247C82672q5564M5448J78197J79652J28181J95878K25753J03021Q5802K06527
19237A645567J44983L7201j77756l69100l27619j65023J3807K36056K23855J8766
19227A280737k24414k73414o8570R0027J3400Q5675l0811k91634k52569k08849
19217A19578m6328R4144N6827J5286p9280r8249M268J75226K62469J18709q3501
19206E39149Q9003K10511q0618k86982k26152k33044l66495k50817J33249M11448
19196f0748K55310p1435l26570k94712m4141Q1859K7127k1030n3756j919Q8797
19185d21218J61804K66953J46367o2575R9594K74214M18884N40807K74044K9225
19175A728099k8748k07762n11551l90837k13476k28588J929K46605J06571j34499
$$ y = [382672, 297108, 342556, 520753, 700405, 828586, 1024464, 1250217, 1353238, 1439040, 1645567, 1790550, 1827751, 1649995, 1280895, 953276, 788253, 802060, 1038116, 1261971, 1280737, 1056323, 782909, 714339, 804366, 817766, 903441, 872630, 580996, 328427, 119578, 73250, 167394, 224221, 239507, 160227, 61978, 66246, 241472, 503941, 622650, 539149, 628152, 838663, 758045, 471063, 244911, 11867, -354628, -605445, -472196, -60748, 194562, 123127, -203443, -498155, -542296, -460437, -433310, -454340, -508096, -510015, -421218, -259414, 7539, 153906, 91331, 190925, 465139, 884023, 1424830, 1698874, 1728099, 1699351, 1491589, 980038, 589201, 375725, 147137, 149066, 395671, 502242, 367743]
19165C67743k09524p1353J73103K02599p7881k08874j78896j02138Q5419J89783
19155A69981J09539J55523K01621l5110k83793j31183J11964O0341O2232J54520
19145E75635J15114l6326q0675M2423R5425o3319k65454l74542m06641k18954
19135f17314P4205K78418K80440J25265J46749R5720r8260n3247P7914J40631
19125D50521J24983J3555k61230l53634q0109J30315J45068K262r813J24722M9618
19114C36258L0266J48329K1041k65402k53485n5606K8253J01392J26883P1357
19104B89286o2306j77395n8501R2102L44258M28521K69354J92291J19214r7837
19094A338987k58211j96440n9724j2090j48007l06901k45959o2994R5441J17732
$$ y = [367743, 158219, 86866, 259969, 462568, 384687, 175813, -3083, -105221, -19802, 169981, 279520, 435043, 636664, 601554, 317761, 186578, 298542, 358883, 421115, 575635, 690749, 654423, 573748, 616171, 711596, 648277, 382823, 8281, -398360, -617314, -543109, -264691, 15749, 141014, 287763, 383483, 285223, 231976, 309890, 450521, 575504, 589059, 327829, -25805, -105914, 24401, 169469, 171731, 161918, 286640, 336258, 366524, 514853, 535894, 270492, 17007, -38599, -10346, 91046, 217929, 289286, 226980, 49585, -8916, 83186, 427444, 855965, 1125319, 1317610, 1436824, 1338987, 1080776, 884336, 824612, 812522, 664515, 357614, 111655, 48661, 144102, 261834]
19084B61834m6677k2657K11723L80764K92945P8287j29391j64691n0367n4298
19074G57472l8698m9493k85951l56141k59965O3261L82308M14558J75570o390
19064G96531l8789j71878k18126k60508q0588J81589K04551l1943k66175k27104
19054a12440j10822j37230r5731J41086K65733J31341J23413R9666R035L4829
19044C48880R3703N3099k64754n73377k71007K17474L04493K31774J18578j4194
19034B44669J06677O3037q7172o2186k6198K2173J00879K89495M41893J60114
19024A253381r6835m8706o3537j9802j32459j68559j54629k79923k64802j13922
19014h9793J70329M3373j29310O7535K56313J66635j83318l64377k62853j79859
$$ y = [261834, 215157, 192500, 404223, 784987, 1077932, 1156219, 1026828, 862137, 811770, 757472, 718774, 669281, 383330, 27189, -232776, -169515, 212793, 627351, 802921, 796531, 757742, 585864, 367738, 107230, 26642, 208231, 412782, 380839, 114664, -112440, -223262, -360492, -456223, -315137, -49404, 81937, 205350, 305016, 314051, 348880, 442583, 495682, 230928, -342449, -613456, -395982, -91489, 140285, 258863, 244669, 351346, 414383, 327211, 265025, 238827, 261000, 361879, 651374, 1093267, 1253381, 1156546, 1107840, 1044303, 1024501, 892042, 723483, 568854, 288931, 24129, -89793, 80536, 123909, -5401, 62134, 318447, 485082, 301764, -62613, -325466, -505325]
19004e05325o1344J04145K52356L13250K19056J49053J36105J15571P2614n4664
18994G40817j61547j23620j90093l05860j77203L8564J39413n608k27041k56713
18984e28891j63116o6452k24305j38036J17747J75054K31531K09683K19490K48148
18974H0853J23405Q6665J03185O4066j20790l23411j47962R9548P3842O762Q3385
18963A29548K03288K69458K38026R5547j49982k75573j28027K8387K02487J28855
18953G42014k00859k86570k84704k03341p4534R945r3378k29308j08545L3087
18943f96193J13602J73416K39588J46344r2987L1670K28044K28061K14502J29288
18933G15335o1886k04884k68041k18584o0792K22576O03709P11931M99949K91028
$$ y = [-505325, -566669, -462524, -210168, 103082, 322138, 471191, 607296, 722867, 795481, 740817, 579270, 455650, 265557, -40303, -217506, -178942, -39529, -45137, -272178, -528891, -692007, -758459, -982764, -1120800, -1003053, -827999, -596468, -386785, -167295, 80853, 204258, 290923, 394108, 458174, 337384, 13973, -133989, -34441, 39401, 46163, 129548, 332836, 602294, 840320, 935867, 785885, 510312, 382285, 410672, 613159, 742014, 541155, 254585, -30119, -233460, -307994, -298049, -391427, -620735, -729280, -696193, -582591, -409175, -169587, -23243, -116230, -84560, 143484, 371545, 586047, 715335, 653449, 448565, 180524, -38060, -98852, 123724, 727433, 1439364, 1939313, 2230341]
18923B230341P5783k04419l98208m42197l06247m26784m78431l35241k83417j83617
18913g52437Q6029L42764L87713J25298p4975j25562m302J15517r2403k37573
18903b29931k23994j45164M0694K37278L46932L08759J32319L1837K38789L55128
18893A092647K28015K11791M10875K27430j27794j38558l2545j67722r2114K57853
18883A869878L75087K59111L63119N30152O49900N76302P32582Q92690R74822
18874G223643J005069J202744J382615J611865J919621K260994K627387L267529
18866B2501467M230891N675181P286408Q931477J0877455J4033091J8284241K3716191
18858A15536402L0729896M0031086M8382725M0965922K406294l8749140m9047725
$$ y = [2230341, 2306124, 2101705, 1703497, 1261300, 955053, 528269, 49838, -285403, -568820, -752437, -666408, -323644, 64069, 189367, 114392, -11170, -15472, 100045, 7642, -229931, -453925, -599089, -558395, -321117, 25815, 334574, 466893, 498730, 737519, 1092647, 1320662, 1532453, 1943328, 2170758, 2042964, 1904406, 1871861, 1704139, 1612025, 1869878, 2244965, 2504076, 2867195, 3397347, 4047247, 4623549, 5356131, 6248821, 7223643, 8228712, 9431456, 10814071, 12425936, 14345557, 16606551, 19233938, 22501467, 26732358, 32407539, 39693947, 48625424, 59502879, 73535970, 91820211, 115536402, 146266298, 186297384, 234680109, 275646031, 278052325, 239303185, 190255460]
18851A90255460m1165381l1007693k2870255j6805157j2601396r780530p920129
18844D8104919o720102n698247m597547l577261l010668k632003k123291j635719
18836A8110081j308852j068653p82324l95778j65208j32116l1253j64293n58417
18827A3503187o81596l11788M1995K07179M62389J010688J135701O45315M15545
18818A6428615N76536R30944J507350K235437L149928M185473N301615O392424
18810D0708322P230773Q485965J0671313J4063277J8567485K4329356L1934892
18803A55991383M2298382N0247114L8253118o081775m5194786n0326567m0302981
18796A44883888k9652909k1982679j6443551j2345928r389642p621617o203408
$$ y = [190255460, 149090079, 118082386, 95212131, 78406974, 65805578, 56025048, 48104919, 41384817, 35686570, 31089023, 27511762, 24501094, 21869091, 19745800, 18110081, 16801229, 15732576, 14950252, 14554474, 14389266, 14257150, 14225897, 14061604, 13503187, 12821591, 12509803, 12551798, 12758977, 13221366, 14232054, 15367755, 16013070, 16428615, 17005151, 17936095, 19443445, 21678882, 24828810, 29014283, 34315898, 40708322, 47939095, 56425060, 67096373, 81159650, 99727135, 124056491, 155991383, 198289765, 248536879, 286789997, 280708222, 235513436, 185186869, 144883888, 115230979, 93248300, 76804749, 64458821, 55069179, 47447562, 41244154]
18789D1244154n023292m222585l811723l200610k497643j967844j756113j541251
18781A7223093j432708j276213r98069n76596k89785l61673q24767r71845q23430
18772I668007p69280p72582n09667l60844l19516k81082l52546m63576l99546
18763E439368m04949m15592l70282k07988n2710K2490O2536N8931J3793J86118
18753D331715K65086P3660j96349m16883m85349j77905K07870L06913K65324L19253
18743D493335L42500K14891j93497m43579m32832m57651m70115m15922k56823
18734B380307R2063O0507l15105k38134J22973L99372K66672n4337j67569K0369
18724B567118K83233L82600L38565k1832n12885n74996k80430J21462K13373N2186
$$ y = [41244154, 36220862, 31998277, 28186554, 24985944, 22488301, 20520457, 18764344, 17223093, 15790385, 14514172, 13516103, 12939507, 12649722, 12288049, 11463282, 10491437, 9668007, 8898727, 8126145, 7616478, 7255634, 6936118, 6655036, 6302490, 5838914, 5439368, 5034419, 4618827, 4248545, 4040557, 3987847, 4010337, 4072873, 4131804, 4145597, 4331715, 4596801, 4670461, 4474112, 4057229, 3571880, 3393975, 3601845, 3908758, 4174082, 4493335, 4835835, 5050726, 4857229, 4413650, 3980818, 3523167, 3053052, 2637130, 2380307, 2472370, 2532877, 2217772, 1979638, 2102611, 2501983, 2768655, 2714318, 2546749, 2567118, 2850351, 3232951, 3571516, 3549684, 3036799, 2461803, 2181373, 2302835, 2516208, 2568394]
18714B568394O4931K24031J13198j07567k36754k95433j86864k4512J59949R2137
18704B371510n2986j62147r9358l7040o2458r8211q696N7194J96498L08732L6737
18693B449775k27498n9542m486j95546l20752l67813n7887K00801J44902L514
18683A565468j83238l24711k52260L5085K44416K87167M28981L95180J08269p2377
18673B231980j21412j15871n0205k175j44423l39386m45513l52944k36158k3885
18663D00008K05093J26962j58336o848K66576L21532L69852K57357K23179J96206
18653B201581n7785k71982m26041m12220k52632q0454n2430j41701q9942o3748
18643C52646q249J20789K98110K92961J41085O1231j0958j18295j1027J51179
$$ y = [2568394, 2633325, 2857356, 2970554, 2862987, 2626233, 2330800, 2143936, 2119424, 2279373, 2371510, 2318524, 2156377, 2057019, 2019979, 1957521, 1859310, 1850614, 1907808, 2104306, 2413038, 2449775, 2222277, 2162735, 2158249, 1962703, 1641951, 1274138, 1216251, 1417052, 1561954, 1565468, 1382230, 1057519, 805259, 840344, 1084760, 1371927, 1800908, 2196088, 2304357, 2231980, 2110568, 1994697, 1944492, 1942317, 1797894, 1458508, 1012995, 660051, 423893, 400008, 605101, 732063, 573727, 566879, 833455, 1154987, 1524839, 1782196, 2005375, 2201581, 2143796, 1871814, 1445773, 1033553, 780921, 700467, 648037, 506336, 416394, 352646, 344397, 465186, 763296, 1056257, 1197342, 1258573, 1247615, 1129320, 1118293, 1269472]
18633A269472K03965K18300K09984J13853p2562k60291k45184k55879m10134l81134
18623C90390j59616Q4046L39480K64484o3083m5045J19374p6903j2634J02104
18613I42597M7134n5898J6539M31575N25363L27825K46868K1233k00191k56878
18603B046167k58770m44710l23558j70138o8219k630J0288J48611J53525m3998
18593A046568j48609R5317L03262J50879q3855q5965J15095K09754Q0545o5052
18583A617939j22101o1184O0798Q9340J15548M2894k49371l85763j04961m8132
18573I55007M4416K57407L13255J20658l8335K2758O1133K2061n9724j16358n8984
18562A523294j66683k03616j99284q1067J21387K61662J81489R1878K11146K64256
$$ y = [1269472, 1473437, 1691737, 1901721, 2015574, 1943012, 1682721, 1437537, 1181658, 771524, 390390, 230774, 314820, 654300, 918784, 855701, 810656, 930030, 853127, 840493, 942597, 989731, 933833, 950372, 1381947, 1907310, 2235135, 2482003, 2503236, 2303045, 2046167, 1787397, 1342687, 1019129, 848991, 780772, 778142, 788430, 937041, 1090566, 1046568, 897959, 993276, 1296538, 1447417, 1363562, 1277597, 1392692, 1602446, 1682991, 1617939, 1495838, 1434654, 1495452, 1584792, 1700340, 1743234, 1493863, 1108100, 1003139, 955007, 999423, 1256830, 1570085, 1690743, 1652408, 1675166, 1736299, 1758360, 1698636, 1582278, 1523294, 1356611, 1152995, 953711, 872644, 994031, 1255693, 1437182, 1529060, 1740206, 2004462]
18552B004462M74398N77293K81713j16789k90364l35875m54392m56571m35192
18543A248683l90273k83472k3101K32689J62186j5622l6749j10666J5803K62936
18533A062414K30096O3476J8439J41809K51098K68425K48126L23307K43475J08705
18523B959370K60835L67775K40299Q1256J8371j0059P2950L42266O58345Q66164
18513E857572J136846J316767J609438K196906K562813K929413L801355M903706
18505B6314816O217390P619887R630947J2288010J5776247K0596154K7323109
18498A25766560L3037097K7655713J003408k7111235l3671489k8023230k1009925
18491G7646899j5262191j1323587q738267o685708n320363m245036l294156k695796
$$ y = [2004462, 2478860, 3056153, 3337866, 3221077, 2930713, 2594838, 2140446, 1683875, 1248683, 858410, 574938, 551837, 784526, 946712, 931090, 894341, 783675, 799478, 1062414, 1292510, 1355986, 1374425, 1516234, 1767332, 2035757, 2283883, 2607190, 2850665, 2959370, 3220205, 3587980, 3828279, 3909535, 3927906, 3917847, 3990797, 4333063, 4991408, 5857572, 6994418, 8311185, 9920623, 12117529, 14680342, 17609755, 21411110, 26314816, 32532206, 40152093, 49783040, 62071050, 77847297, 98443451, 125766560, 158803657, 186459370, 187462778, 160351543, 126680054, 98656824, 77646899, 62384708, 51061121, 42322854, 35637146, 30316783, 26071747, 22777591, 20081795]
18483B0081795k424745j926453j486409j202847j104925j246804j203369q25225
18475H661018n62559n34754p17979o75829l80761k81635k21811j22061p1666k47513
18465D844450k84709j00552j80436m51555m82303k59471j00101J46671J45994
18456C277988l262j37609j59517k44460k27888m0883N9673j04171k75738n1408
18446B092725k5519l15658k32897R1945K89827J13493j87994l09484j6648J52172
18436A651962L480j52699j537K35821J27591j14182k03009l8307J12614J00542
18426A722276J17163k0489m17184m11383q498K00563J50050n6986p8345O8570
18416A265737l4452j45213l09867m18346j64637K21807M09929L38023K32637K46272
$$ y = [20081795, 17657050, 15730597, 14244188, 13041341, 11936416, 10689612, 9486243, 8661018, 8098459, 7563705, 6845726, 6169897, 5789136, 5507501, 5285690, 5163629, 5091963, 4844450, 4559741, 4459189, 4278753, 3827198, 3344895, 3085424, 2985323, 3131994, 3277988, 3274726, 3137117, 2977600, 2733140, 2505252, 2464369, 2524042, 2419871, 2144133, 2092725, 2067206, 1751548, 1518651, 1610596, 1900423, 2013916, 1825922, 1516438, 1499790, 1651962, 1655442, 1502743, 1501206, 1737027, 1864618, 1750436, 1547427, 1509120, 1621734, 1722276, 1839439, 1818950, 1401766, 990383, 981885, 1182448, 1332498, 1275512, 1197167, 1265737, 1231285, 1086072, 776205, 357859, 193222, 415029, 824958, 1162981, 1395618, 1641890]
18406A641890P6841n04j15429k84875k20258j7453l4028k19005k01771P0003K39639
18395I35050K094j72819j194J61706K22102M4237N7138K00778M0132k09617k37452
18384A042155l7807J65789J70091K51647J35137k41270l14604k53569k75116k80673
18374C61780j18474K4343J67041J83194J22471J07054O0854J14698j15018l69731
18364E38212l36063j68458N0253K93259K63253O1734J61011K65324J02292N0182
18354A280999J66133J9836m00723o89979o57855l63886J9613K99040N20410M46187
18344F39775J63804J2604J0110J19272O1688r9787j61210k72725k88042j12115
18334G3374J07600Q6566p8006p8362J09188K70764K66415K63737K05879j59982
$$ y = [1641890, 1718731, 1718227, 1602798, 1317923, 1097665, 1080212, 1046184, 827179, 625408, 695411, 935050, 937144, 764325, 763131, 924837, 1146939, 1191176, 1248314, 1449092, 1489224, 1279607, 1042155, 1004348, 1170137, 1340228, 1591875, 1727012, 1485742, 1171138, 917569, 642453, 361780, 243306, 267649, 434690, 617884, 740355, 847409, 908263, 1022961, 907943, 538212, 202149, 33691, 83944, 377203, 640456, 702190, 863201, 1128525, 1230817, 1280999, 1447132, 1466968, 1066245, 376266, -281589, -645475, -625862, -326822, 193588, 639775, 803579, 816183, 826293, 945565, 1007253, 907466, 746256, 473531, 185489, 73374, 180974, 267540, 189534, 111172, 220360, 491124, 757539, 1021276, 1227155, 1067173]
18324A067173k90073j57171j59383k53072l00960k04516K1243J98980J88539J20525
18314B31285k3982j47849q6091o8730L7805K19106K40679J70587J15942K25630
18304I14382K60779J03182M2533K5306j35860j00815J26480J43294n489j17294
18294A256498k30795l12432k12824j64181j29985j56698j08448l2160r2353j90059
18284c73437j06305J98098L61742M41579L56265k4456l76986m85445k31769P1736
18274a68978K27408J24589J04856J91476J46546J4877j14479k8085J88403J79330
18264H65943J56865K82730L54599K29872J4725k2669k6532K2584n4048n6362n1946
18253A715761l283n0680k77940l14333k28912j92477k57509k90323o0215M2062
$$ y = [1067173, 777100, 619929, 460546, 207474, -93486, -298002, -276759, -77779, 110760, 231285, 207303, 59454, -26637, -95367, -57562, 161544, 402223, 572810, 688752, 914382, 1175161, 1278343, 1320876, 1346182, 1210322, 1109507, 1235987, 1379281, 1373792, 1256498, 1025703, 713271, 500447, 336266, 206281, 49583, -58865, -91025, -183378, -373437, -479742, -281644, 80098, 521677, 877942, 853486, 476500, -8945, -240714, -168978, 58430, 183019, 287875, 479351, 625897, 640774, 526295, 498210, 686613, 865943, 1022808, 1305538, 1660137, 1890009, 1904734, 1882065, 1855533, 1878117, 1824069, 1767707, 1715761, 1712478, 1661798, 1383858, 1069525, 840613, 648136, 390627, 100304, 40089, 82151]
18243H2151r1615j396Q0495O4070J85535K94423M15757L97947O2237j09365k87509
18232A092730m45920l74561k99371k51732j43134J8492J66795K59653J35242q5173
18222G3021j86836j64649m4865N9795J15625R0762P3406J00213K25264K66558
18212F08294L6859J9117Q0553j03551k51020j75563O128Q1654j5845j06321n1669
18201A28636P7411N444k25037j40112j7352j1022J6363Q979J3519q1567L1176
18190a93562K79306K94145J10369J5225J22668K19622k7194l04647k25887P2480
18180C62525N6194j52635j79894k10896k12211q2289K65360M91385J82664q8268
18170D31935O0251J96297R4488j64001l19751r8942M3025j27077k05371j28605
$$ y = [82151, -9464, -10860, 69635, 133705, 319240, 613663, 1029420, 1427367, 1489604, 1380239, 1092730, 646810, 272249, -27122, -278854, -421988, -403496, -236701, 22952, 158194, 73021, -113815, -278464, -323329, -263534, -147909, -57147, 16259, 116472, 341736, 608294, 645153, 664270, 744823, 641272, 390252, 214689, 220817, 302471, 286626, 180305, 128636, 206047, 211491, -13546, -153658, -171010, -182032, -165669, -156690, -143171, -224738, -193562, 85744, 379889, 490258, 505483, 628151, 847773, 820579, 515932, 290045, 362525, 418719, 266084, 86190, -124706, -336917, -419206, -153846, 337539, 520203, 431935, 492186, 688483, 782971, 618970, 299219, 200277, 243302, 116225, -89146, -217751]
18160b17751k2030k038J05144K22564J72281J7511m1771K15188L82604K07506
18150A039208o3761j76822k1610L3474o2332M1876L2799j78226j95149P983k4445
18139D32995j40364j03611o379J59075J69116Q0336N807l5955j89100k07769O490
18128A70641Q5371J33372L8089k08222k12788l7709J99792L26359K34566l1412
18118F98059k05861j85825j47591M0870J23784M8264j3465l7975P8652J02889
18108E01801r1250p6586r6188o9567m0869r6510m4087P1336M1962j30518j3668
18097d4144K53139K35117J39825J62298O6351j52481j06312O3633O9103q2829
18087F03700k13983j54773N7612J24676j27664k06785j80018k69823j66856J7059
$$ y = [-217751, -239781, -241819, -136675, 85889, 258170, 275681, 233910, 449098, 831702, 1039208, 975447, 798625, 777015, 810489, 748157, 790033, 822832, 644606, 449457, 457440, 432995, 292631, 189020, 182641, 341716, 510832, 591168, 596975, 561020, 371920, 164151, 170641, 256012, 389384, 427473, 219251, 6463, -31246, 168546, 494905, 729471, 698059, 492198, 306373, 158782, 199652, 323436, 371700, 358235, 320260, 398912, 501801, 410551, 333965, 237777, 168210, 127341, 30831, -13256, 58080, 100042, -30476, -44144, 208995, 444112, 583937, 746235, 812586, 660105, 553793, 617426, 686529, 603700, 389717, 234944, 292556, 417232, 289568, 82783, -97235, -367058, -533914, -516855]
18077e16855M5699N4305Q3890J38252K47610K98599J25587J14796J06126k04875
18067D93134l09524j05558j9505q2920j23021r7336L5276J32290N8616j96862
18057b15410j12619n357p5404j14931p720N4479j6528m825J04109J61846K33907
18046A547J96232r9417k6861K20753J68518n3468n8071j14147j17001l0558j25864
18035c8337q1652n2162j37870K1456K51915J60327J25446O1549j83271l15796
18025a88395k56399n1383O1733K61806K76987n227j28295k2682j07910l23598
18015d83363k12678l7204J37340K63690K43015J79143Q8389j5985k4578O4339
18005B02108l9026N0644L31204L85834M98l67063j79054J96174J33776l9079l20423
$$ y = [-516855, -471156, -416851, -332961, -194709, 52901, 351500, 477087, 591883, 698009, 493134, 183610, 78052, 58547, -24373, -147394, -244730, -209454, -77164, -18548, -215410, -328029, -333386, -408790, -523721, -531441, -476962, -493490, -498315, -394206, -232360, 1547, 197779, 98362, 71501, 292254, 460772, 407304, 349233, 235086, 118085, 87527, -38337, -119989, -172151, -310021, -288565, -36650, 123677, 249123, 310672, 127401, -188395, -444794, -496177, -434444, -172638, 104349, 99122, -29173, -51855, -159765, -483363, -696041, -733245, -595905, -332215, -89200, 89943, 178332, 162347, 137769, 202108, 163082, 213726, 544930, 930764, 931262, 564199, 385145, 581319, 715095, 676016, 355593]
17994C55593l34063p4821K01874K26170L4416j176k0330k11323l29109j80332
17984c33101n6902J09626K11879K6226j23848o4856J10593K04594K8232j18105
17974e662k4102P4533R8820J0880l1377Q7423J4911j17720k38648k67325j22623
17963e20890K3171J19773K56349K54848L7690j14638j92759r9595J44691J97552
17953A06192Q7485m5511Q0995J45351j45731j88810Q0520Q4397r9718j79373p186
17942h1389K02665K20872J22597K5569k88199m47251j14518K14770Q5595k67424
17932c26713m16158k82199M5191K57246K79206J47427J99116K47866J36888J72767
17922D60637J03281k7955o0399n4118r4361M4388L01598K86553o2975k58921r3079
$$ y = [355593, 21530, -53291, 148583, 374753, 409169, 407993, 387663, 176340, -152769, -333101, -390003, -280377, -68498, -42272, -166120, -230976, -120383, 84211, 112443, -5662, -29764, 44769, 143589, 154469, 123092, 210515, 225426, 107706, -130942, -398267, -520890, -497719, -377946, -121597, 133251, 170941, 56303, -136456, -236051, -91360, 106192, 193677, 148166, 229161, 374512, 228781, 39971, 120491, 204888, 105170, -74203, -81389, 121276, 342148, 464745, 490314, 202115, -245136, -359654, -144884, -59289, -326713, -742871, -1025070, -979879, -722633, -443427, -296000, -96884, 150982, 287870, 460637, 563918, 535963, 475564, 421446, 327085, 371473, 673071, 959624, 896649, 637728, 544649]
17911E44649k08248k09446k1281O5970J49889Q2628r5795j03254O9524J57020
17901D31656J0558j24217l03188m10820l05550p4510K47941L47010J99933p0029
17891e1216l47078l67926j64450Q4371K31061J66755M4630K4866J07563K24502
17881d6922K15196m0778j44272J28429L08883K36879Q3715j68816m43057m83834
17871c54577j52679J15121K62255K74306j00558k94958q1440L3456j10099k88422
17861f97595j79456J03509J98000K63194K57139K34360J97936p7690j39971j3560
17851A45866J84285K29171j8864k38725k72578l80422l89378k15041j03104L4220
17841a024570K12306K40826J10543J25426P7012q1337r8985J6907J07358K3383
$$ y = [544649, 336401, 126955, 105674, 171644, 321533, 404161, 308366, 205112, 274636, 431656, 442214, 317997, 14809, -396011, -701561, -776071, -528130, -181120, 18813, -51216, -398294, -766220, -930670, -846299, -615238, -448483, -403853, -378987, -271424, -46922, 168274, 127496, -16776, 111653, 420536, 657415, 741130, 572314, 129257, -354577, -507256, -392135, -129880, 144426, 43868, -251090, -332530, -299074, -409173, -697595, -877051, -773542, -575542, -312348, -55209, 179151, 377087, 299397, 159426, 145866, 330151, 559322, 540458, 301733, 29155, -351267, -740645, -955686, -1058790, -1024570, -812264, -571438, -460895, -335469, -258457, -339794, -438779, -421872, -314514, -291131]
17831b91131p0238j06622j80186m9849K69435L62374K72462K16422K89487J38082
17821H50236n3995q7599l6043L0405l9491j27517j3400R3307P1476j11567m43752
17810A32060n35491l01232M5211K62799L38036L38665K37299J59123J63056O6506
17800I06032j41931j75899k00849n19599m60267J6103K56594J35893j47167l31058
17790f62148l71687l05430l7370J83380K18813J96592k5513j92976j59001M7326
17780a108014J30772K16765J67184p6888j79857k50204k07037R8286K74891L2648
17770i01454N5185K49976L24906K94534J22147j24379j16560j08965j09562L3194
17760b80978N3158j4681j488J81857K40002K10809J24272p4992j31292L4540J44198
$$ y = [-291131, -361369, -467991, -648177, -698026, -428591, -66217, 206245, 422667, 712154, 850236, 796241, 708642, 672599, 703004, 663513, 535996, 522596, 615903, 687379, 575812, 132060, -403431, -704663, -659452, -396653, -58617, 280048, 517347, 676470, 839526, 906032, 764101, 588202, 387353, -132246, -592513, -576410, -319816, -183923, -331090, -662148, -1033835, -1339265, -1376635, -1193255, -974442, -777850, -803363, -996339, -1155340, -1108014, -977242, -760477, -593293, -670181, -850038, -1100242, -1307279, -1208993, -934102, -901454, -846269, -596293, -271387, 23147, 145294, 20915, -95645, -204610, -314172, -280978, -227820, -242501, -243989, -62132, 177870, 388679, 512951, 437959, 306667, 341207, 485405]
17749D85405J2221p9622j09509k39002j66546J20370L08152J61789k42444m78391
17739b27577k40916K02910K49880N7202k1122q953Q9217J55962P3457q4236j44360
17728A01464j16549J898L4866n7044j69713j63221K6020J17004J35805J02918
17718A3448l0125O4586L01779K99866O6915j35416k61234j14347J75421J221k15685
17707A66429k70971k26127j7113R8007j03173k27887j9067L40716M45274L40369
17697E26457R3968o5826r8754k05166k10624q4713p8863j09103k8406k9474k4743
17686c15247l3833k13717k53898Q342K53233M09364M62735J72817j21856p1292
17676B96648L4983Q7348k851P3046L26061N10069M37678K52453K3795k62876m43088
$$ y = [485405, 497626, 418004, 308495, 69493, -97053, 23317, 331469, 493258, 250814, -227577, -468493, -265583, -15703, 41499, 20377, 11424, 100641, 256603, 330060, 245824, 101464, -15085, -13187, 21679, -35365, -205078, -368299, -342279, -225275, -89470, 13448, -16677, 47909, 349688, 649554, 716469, 581053, 319819, 205472, 380893, 382114, 166429, -104542, -330669, -347782, -249775, -352948, -580835, -599902, -259186, 186088, 526457, 620425, 554599, 455845, 250679, 40055, -44658, -123521, -232624, -261030, -290504, -315247, -349080, -562797, -816695, -808353, -555120, -145756, 316979, 489796, 367940, 296648, 331631, 418979, 416128, 489174, 815235, 1325304, 1762982, 2015435, 2039230, 1776354, 1333266]
17665A333266n70212n38055l33580p8806Q9614Q4014O402l3527M9703J59200M7772
17654B15791o3491j4307j42545k53022k4956J78180J84904R4898M6471M0504J592
17643B64019j24237k00465k02260M5106L43597M09159L46501K61632n0367k61281
17633H31404j21061k0953o5J7168q1192j03491j9734l0018j90472j62926J38416
17622B57076K02821n9600k37461j09843L3292j5962k2054Q0432Q6383L17273N20804
17611A053161L48954j52250l98982k72619k23519k70165q9252M4293j48940k75048
17601c84367k34633o0989M6727o3700j38992j77085j23360Q2828K92876K46270
17591e14425j3389j66122k26887k27230L315K81288M18013K86475J66294J27365
$$ y = [1333266, 763054, 224999, -108581, -187387, -97773, -13759, -7357, -40884, 8819, 168019, 215791, 152300, 137993, -4552, -257574, -282530, -104350, 80554, 175452, 221923, 262427, 264019, 139782, -60683, -262943, -217837, 125760, 534919, 881420, 1143052, 1092685, 831404, 710343, 689390, 689325, 706493, 625301, 521810, 502076, 472058, 281586, 118660, 257076, 459897, 400297, 162836, 52993, 86285, 70323, 48269, 128701, 215084, 532357, 1053161, 1402115, 1249865, 850883, 578264, 354745, 84580, -4672, 39621, -109319, -384367, -619000, -679989, -633262, -696962, -835954, -1013039, -1136399, -1053571, -760695, -514425, -527814, -693936, -920823, -1148053, -1144738, -863450, -445437, -158962, 7332, 134697]
17581A34697p5706J7537J28637r5030k43061j24038j23522k98324j17797J51234
17571f45373K35958L10732J82330J6272j9066n4923L3301J40110J12593k6077
17561B85857n7023q9911p575J69704M9528o9768Q1540O7183q6424j46401k00419
17550c709k15295j00415J29252J84510J29072J67684J50092J52430J74929K12930
17540I81480K56703N0122j67997j43524k6103J66091J68029K669p7127j06051
17530A104292q2573l6797j26519k89382k63156l13417j78374J60665K77255L80239
17520F32233K87285n5433j37237j11826n9523r1469o5474J0258o5401o2887J0201
17509B90727j30813k01154l07635l47757j2316J64455O6026R9482K93701K15679
$$ y = [134697, 58991, 76528, 205165, 110135, -132926, -256964, -380486, -678810, -796607, -645373, -409415, -98683, 83647, 99919, 80853, 25930, 59231, 199341, 311934, 285857, 228834, 138923, 131348, 301052, 350580, 280812, 362352, 429535, 343111, 196710, -3709, -219004, -319419, -190167, -5657, 123415, 291099, 441191, 593621, 768550, 981480, 1238183, 1288305, 1120308, 976784, 950681, 1116772, 1284801, 1287470, 1210343, 1104292, 1021719, 984922, 858403, 569021, 305865, -7552, -185926, -25261, 251994, 632233, 919518, 864085, 726848, 615022, 555499, 464030, 398556, 408814, 343413, 280526, 290727, 159914, -41240, -348875, -696632, -708948, -544493, -478467, -378985, -85284, 130395]
17499A30395L3470R9265j01620l99627k42243J1333k5440J17151J91487l1991
17489b17820k7302Q5819K68289L11085o6411k84317k59575k54630l39601k70325
17479a054788N2603K39289K66376R148k68483k68541L885K79281L24301J92423
17469b24506R729P4679K69988K31247l6210j9074m7552k98698l11687j38240j64659
17458f54983j77765R1219M02958L02091L2323L0426m985j61535k49994j06512
17448d96757R3823J22312P6156J35392J16690M7085j0510q7598p2287N8704K4475
17437G485q3597j79165o3257K08856K11679K8498j40658k02640O4935L06033K14929
17426C73098r7500q9299N1826q1397j27330j5737J6597J3747R0677J48023J18527
$$ y = [130395, 163865, 263130, 161510, -238117, -480360, -469027, -494467, -377316, -185829, -217820, -245122, -159303, 108986, 420071, 353660, 69343, -190232, -444862, -784463, -1054788, -1002185, -762896, -496520, -487372, -755855, -1024396, -1020511, -741230, -416929, -224506, -214777, -140098, 129890, 361137, 324927, 305853, 258301, -40397, -352084, -490324, -654983, -832748, -741529, -338571, -36480, -4157, 26269, 21284, -140251, -390245, -496757, -402934, -280622, -204466, -69074, 47616, 94701, 84191, -3407, -75694, -16990, 7485, -76112, -255277, -318534, -109678, 102001, 130499, -10159, -212799, -147864, 158169, 373098, 275598, 186299, 238125, 156728, 29398, 13661, 30258, 44005, 134682, 282705, 401232]
17415D01232r5379l23855r8144N5963j04845j30177m6664O6219K11068L24154
17405B59572K52882p1542j61335j21411k30532j65997k6661P0804Q5388k424q8091
17394a99347K5518j5858k01958l0993K26859N8187j49429r1976k65252l09041
17384i53290k2288K57494J59160J55727L39841L45089K02692J87183K54049J71588
17374A097245n4386j42062j56435k77839l67231j85212J0795j11053n393J88562
17364c009K86104L51874J25959k63653k32575J90968L24808J37051k8847j54393
17354G34287k10769r1043J0231j26212k03421j02226K267r915j31858j8780M921
17343a42518q7017o1M3583q8817k5110J52822K4173j18268J1112J26309R6544
$$ y = [401232, 305853, -18002, -116146, -60183, -165028, -295205, -341869, -275650, -64582, 259572, 512454, 440912, 279577, 158166, -72366, -238363, -265024, -194220, -108832, -111256, -199347, -173829, -189687, -391645, -422638, -195779, -137592, -287021, -378997, -644249, -953290, -975578, -718084, -558924, -403197, -63356, 281733, 484425, 671608, 925657, 1097245, 1042859, 900797, 744362, 466523, 99292, -85920, -75125, -186178, -191571, -3009, 283095, 634969, 760928, 497275, 264700, 455668, 780476, 917527, 888680, 734287, 523518, 432475, 442706, 316494, 113073, 10847, 13114, 3199, -128659, -147439, -142518, -229535, -229596, -186013, -274830, -299940, -147118, -122945, -241213, -230101, -103792, -7248]
17332g248J31497J45704P7063k856m2576j00321p4575K36637J52284k73912l30203
17321h8506Q901J66152M6395j19386j60177o3934p6554Q190J72904J39690o4888
17310c1213j59745J26587M09582L51060R2233q6680k55236m78099j89833L22136
17300A00792K38320q2483j2780l5364l02183m65416l15548R3024M97066O52032
17290C67460N39867K49541K5402r2760L429J7069j50673k38541k77732k45303
17280A97759n1546j48253k9586J32342k9749o6853L9875o0058l04607k33542J0556
17269e43662R6819M2094p2838j52100r6101J16754J64247L44924M73029L79862
17259G53028J93785m3568j47439k30407l16978k84121n7524O7119J42181l1934
$$ y = [-7248, 124249, 269953, 347016, 344160, 301584, 201263, 126688, 363325, 515609, 241697, -88506, -79605, 86547, 132942, 13556, -146621, -210555, -287109, -278919, -106015, 33675, -31213, -190958, -64371, 345211, 696271, 788504, 701824, 446588, -31511, -221344, 100792, 339112, 256629, 243849, 208485, -93698, -559114, -874662, -781638, -284572, 367460, 907327, 1156868, 1182270, 1089510, 1092939, 1110008, 959335, 720794, 443062, 197759, 146213, -2040, -31626, 100716, 70967, 4114, 43989, -16069, -320676, -554218, -543662, -446843, -404749, -477587, -629687, -725788, -609034, -444787, -99863, 373166, 753028, 946813, 903245, 755806, 525399, 208421, -75700, -133224, -66105, 76076, 44142]
17249D4142k56056j76459k6645K4705j8427p8477J4860P2292J06104K60772M15043
17238C81854M47204J27535k19255j94332L5726J082k59228l20112j07468j35692
17228b42686k12253p671K99549J17039k04793P121K25428Q5568j26460k5226K27065
17217A42681K21716J60009m6771k36232k16518m0035O0027J6914q1135k87547
17207c06891n25592m95339j08104L73500O63538N07148K33256K04397L42945J95983
17197A084841j53802j12231Q0363P7970r6281l07110l01610k06050r9437m6603
17187g9950J9288J34944P3977J10665R2660q1018j19864r9881j53848k19267j18025
17176d40319Q1681J70086J61276o1760l49482m15419j93403L9901Q8775N4753
$$ y = [44142, -211914, -388373, -415018, -390313, -408740, -487217, -472357, -400065, -293961, -33189, 381854, 829058, 956593, 737338, 543006, 578732, 579814, 320586, 474, -106994, -242686, -454939, -462610, -163061, -46022, -250815, -243694, -18266, 67302, -59158, -84384, 142681, 364397, 524406, 477635, 241403, 24885, -15150, 44877, 61791, -19344, -306891, -832483, -1327822, -1435926, -1062426, -398888, 108260, 341516, 545913, 888858, 1084841, 931039, 818808, 899171, 977141, 880860, 573750, 272140, 66090, -33347, -79950, -60662, 74282, 148259, 258924, 351584, 270566, 150702, 50821, -103027, -322294, -440319, -358638, -188552, -27276, -89036, -438518, -853937, -1047340, -1007439, -918664, -863911]
17166h63911r2299j12493j33753j66588p3241K14521J66833p7562K06188M97559
17156d34746K07310q8422L835J2921r3674q3394k9165J3656q7876O8855L59312
17145a51388J60240j19970j37896j02354n3096K19379M93433N29047K92143j57822
17135I71716l41324k71667j71994j8968j02634k11228k6057J15192N5183l3187
17125c4968l6801R4883K46936J90490J72031J61582K0654k89222n22564m74316
17115d71295k28336L7745K64955K94687O1752l6604m6308p1815J3418K466p0962
17104b50297M0591J55086J09401r896p0022k38439j15884J50411K1259j20800
17094c28590K0762K72920K38762O7558j24331o1726Q2972J15200k024k15899j70040
$$ y = [-863911, -956210, -1068703, -1202456, -1369044, -1442285, -1227764, -1060931, -1138493, -932305, -434746, -227436, -315858, -312023, -299102, -392776, -476170, -505335, -491679, -579555, -510700, -151388, 8852, -111118, -249014, -351368, -404464, -185085, 308348, 837395, 1129538, 971716, 630392, 358725, 186731, 167763, 65129, -146099, -172156, -56964, -1781, -34968, -71769, 23114, 270050, 460540, 632571, 794153, 814807, 525585, 3021, -471295, -699631, -661886, -396931, -102244, -40492, -77096, -123404, -195219, -181801, -179335, -250297, -209706, -54620, 54781, 44885, -25137, -263576, -379460, -229049, -207790, -328590, -307828, -34908, 203854, 271412, 147081, 85355, 168327, 283527, 281503, 65604, -104436]
17083a04436J28299O4840o0838Q7880K78511J54226r3957j55751j01268L3541
17073B31047K06211L46358J13533k11800l50624m33563l36557k16303p6097J02414
17063f25381J25422J38825L27339L63635n3338k48187q1120M6518R1146l3878
17053E0981j42353j32700L7112K05345J17015R979m3352n6496J4685Q0727J38113
17042B79056K57954L38759J83697k13904n14433m88163l21452o4690k079j85600
17032g30855j76193j07946P1775J87909J80434k8836j26952l9067L7028O9766
17022f62937j12639l04954j72747J6319l8026j56103r9442K72358M13269L34624
17012e10278K81583J44495q489K578o1031j0154m8534j71045j53647O2453L21356
$$ y = [-104436, 23863, 88703, 27865, 115745, 394256, 548482, 454525, 298774, 197506, 231047, 437258, 783616, 897149, 685349, 334725, -98838, -435395, -651698, -727795, -625381, -499959, -361134, -33795, 329840, 276502, 28315, -52805, -6287, 84859, 50981, -91372, -224072, -186960, 18385, 135400, 145379, 102027, 45531, 60216, 140943, 279056, 537010, 875769, 1059466, 845562, 331129, -157034, -478486, -543176, -545255, -730855, -907048, -1014994, -943219, -755310, -574876, -603712, -730664, -769731, -732703, -662937, -775576, -1080530, -1253277, -1236958, -1274984, -1431087, -1530529, -1258171, -844902, -510278, -228695, -84200, -92689, -90111, -151142, -161296, -209830, -380875, -534522, -472069, -150713]
17001a50713M53694L90775J17815j82712k66026j52722j2195J66873J24963o9975
16991D19777j8690Q8983J05956o9840j91808l9842P5432O3273o4315j03804L4728
16980B99850o7578p0249p8155j94394k10351R7959M32596K95563j15413k16553
16970A73275r0360J06821K35634M5304j14471p5538l2668K9780J54362J29411
16960E61550q1482r3943N7046j11382k21368j47544j41992j90482k69106k87235
16950i25938r7979K22903M41124L67603R7552k42192k53383p5104O0047L0746
16940c74621L0060R3608K62699J58636j59156k69276k26326p7257o2304j23331
16930g47268J327P0438J57216J61258Q1876Q5217R8798j26799k71055j7896L61686
$$ y = [-150713, 302981, 693756, 811571, 628859, 362833, 210111, 197916, 364789, 489752, 419777, 401087, 490070, 596026, 526186, 334378, 294536, 369968, 433241, 368926, 265122, 299850, 232272, 162023, 83868, -110526, -320877, -222918, 209678, 505241, 389828, 173275, 82915, 189736, 425370, 470674, 356203, 280665, 247997, 277777, 432139, 561550, 480068, 386125, 443171, 331789, 110421, -37123, -179115, -369597, -638703, -925938, -1023917, -801014, -359890, 7713, 105265, -136927, -390310, -465414, -405367, -374621, -344561, -250953, 11746, 170382, 11226, -258050, -484376, -561633, -623937, -747268, -745941, -675503, -518287, -357029, -275153, -189936, -91138, -217937, -488992, -506888, -145202]
16919a45202L44937J56994R2796K25263J84957o9238l02148n13086m90656r4369
16909f09752J53260J97743K28330P4624o9177j17604n1921K338R0279O2777l7016
16898g6119l83582l73204L6J84411K22149L11548L29987J67572k0023n7495r564
16887B95716j08265j74706m2428Q4616J09263N4722R5840J06305J9369N4493R4685
16876E89610K24655K83868K54504o738j67695k06195j28317q4666j29285r2418
16866E37323p9816j76733l41117l32138q3681M1153j48419k01292K8400J44265
16856f12055Q9009p1853J5701K43616L80650M62746L38058O5238p6849j26657
16846G07604j82902q1873p1128j32012m7349j2438j30983j29507j83618j57103
$$ y = [-145202, 199735, 356729, 449525, 674788, 859745, 790507, 488359, -24727, -515383, -609752, -456492, -258749, -30419, 44205, -24972, -142576, -194497, -192159, -101880, -39103, -76119, -459701, -832905, -832869, -648458, -426309, -114761, 215226, 382798, 362775, 305280, 295716, 187451, 12745, -29683, 54933, 164196, 218918, 314758, 421063, 440432, 494925, 589610, 814265, 1098133, 1352637, 1345899, 1178204, 972009, 843692, 759026, 629741, 537323, 457507, 280774, -60343, -392481, -476162, -435009, -583428, -784720, -756320, -612055, -523046, -594899, -579198, -335582, 45068, 507814, 845872, 911110, 834261, 707604, 524702, 442829, 371701, 239689, 192340, 179902, 48919, -80588, -264206, -421309]
16836d21309j44346l50270k66758J14572K14730J66802J41657J32284J15770Q9399
16826b07469J94060O8420k04684j47222J18923K70135L71931K76003j7437k76325
16816D46335k66564N2734K38469O870r6028o4260j5331L6016j1020O6752m9438
16805C44535m29556m27118j00826J31055L00096L08151K03457m1829k83691k46715
16795b42441r0908l238r4603k70814j82033m0470o3341p0794M6058J42070J73606
16784f96908L59644K16385r2510j13064j5141L2871j32932r2142K49886M48892
16774A64981K55926P3030K5673j507K2228j53908k25426j72371j26331j72509
16764c10214l37948l07396j12421N7886J46300L24094M19978L70301J75428j22821
$$ y = [-421309, -565655, -915925, -1182683, -1068111, -853381, -686579, -544922, -412638, -296868, -207469, -13409, 55011, -149673, -296895, -177972, 92163, 464094, 740097, 722660, 446335, 179771, 232505, 470974, 477844, 381816, 317556, 302225, 338241, 327221, 393973, 344535, -85021, -512139, -612965, -481910, -181814, 126337, 329794, 287965, 4274, -242441, -333349, -336587, -431190, -702004, -884037, -924507, -987848, -1058642, -1012584, -870514, -696908, -337264, -120879, -213389, -326453, -341594, -308723, -441655, -533797, -283911, 164981, 420907, 493937, 519610, 518103, 540331, 386423, 160997, -11374, -137705, -310214, -648162, -955558, -1067979, -1010093, -863793, -539699, -119721, 250580, 426008, 303187]
16754C03187k62434k3134l5133q4744j939j85850k59496k00801j12625J03330
16744g59639J65321P2588P1472J45217J14964N6981J46587O4767J60803J39959
16734C79020l91694o36259m67171j69179J06051K45783J94144K54567K88528J79825
16724a6385J87466K12396J03687n4972k3214j21830k14079n7393k7228k81129
16714b92681k97508K6949O6038O8530J63822K86451J32649q7455o6678k2514q8543
16703a10940k06519k31964r6383N6453K21453L74068L25042L1385l10255l77804
16693c25464k01991J57676L68977L93207L38546K31690q8444l72033m08773k10041
16683a16650J64036L96071K58916Q6010Q6105J52325k3076k59660l27075j90374
$$ y = [303187, 40753, 17619, -17514, -102258, -104197, -290047, -549543, -750344, -862969, -759639, -594318, -521730, -450258, -305041, -190077, -133096, 13491, 78258, 239061, 379020, -12674, -648933, -1116104, -1285283, -1179232, -933449, -739305, -484738, -196210, -16385, 171081, 383477, 487164, 432192, 408978, 287148, 73069, 15676, -11552, -292681, -590189, -563240, -497202, -428672, -264850, 21601, 154250, 66795, 117, -22397, -110940, -317459, -549423, -645806, -589353, -367900, 6168, 331210, 362595, 52340, -325464, -527455, -369779, -802, 392405, 730951, 962641, 874197, 502164, 93391, -116650, 47386, 443457, 702373, 788383, 874488, 1026813, 1003737, 744077, 417002, 226628]
16673B26628J8729K3350o6551p3290o4765k6491J78793K20308N5075l5335r0850
16662C65601o7537n9548j98690j58851o445J76481L21671K92440J29240J7370
16652H11732j34585l40937k78968l8056P3456l1513k13980l47662l36210j70452
16642a007175m2427r6303k2626K49367K08844M9388O2625J71471L19431K30607
16632A23202l975j09844L1326m5397r7565m877j04978j38625l586P6462M0395
16621b37462J5914K2511L04484L07565P1835r8759j72423r4053J35319J66682
16611D21613m4732k13841j22764K59213L77198J15038k63846l13696J61293L33001
16601G08477N1419j61440j12128K00307M01692L26443K57692J24873k06469l84458
$$ y = [226628, 245357, 268707, 202156, 128866, 64101, 37610, 216403, 436711, 491786, 456451, 365601, 298064, 238516, 39826, -119025, -125470, 51011, 372682, 665122, 794362, 811732, 677147, 336210, 57242, 19186, 92642, 61129, -152851, -500513, -836723, -1007175, -1049602, -1145905, -1168531, -919164, -710320, -660932, -598307, -426836, -107405, 123202, 119227, 9383, 40709, -4688, -102253, -107130, -212108, -350733, -354319, -277857, -237462, -221548, -199037, 105447, 413012, 484847, 386088, 213665, 119612, 254931, 421613, 376881, 163040, 40276, 299489, 676687, 791725, 527879, 214183, 375476, 708477, 759896, 598456, 486328, 686635, 1088327, 1414770, 1672462, 1797335, 1590866, 1206408]
16591A206408l09698k19100k26916k90049k47859k3903K16650L19266K43788O1444
16581G30031o6147j29718k40938k03689p1788m8269o3233n0668L4878J03361J62046
16570A55866L59321M13658J88847k56595l97692k66563j85607j97039l80409n59883
16560a126096m68805j70060o512Q8263J63304K32512K56108K76580M58889L30649
16550C4832j0067j85598r0671j4747j9839J33425Q1593Q3921K9119j24382j52320
16539b34734r649J37428M2553k07311k97875k36088j08816P130J42843K43914
16529e20605M50383M34237K87588K37356J19421j08956l61727k92626j34409k58692
16519a48030k41762j49520o1384J90219J42441j9313o023N4083J96933L26842
$$ y = [1206408, 896710, 677610, 450694, 160645, -87214, -111117, 105533, 424799, 668587, 730031, 663884, 534166, 293228, 89539, 17751, -30518, -93751, -144419, -109541, -6180, 155866, 515187, 928845, 1117692, 861097, 463405, 196842, 11235, -185804, -566213, -1126096, -1594901, -1764961, -1771473, -1683210, -1519906, -1287394, -1031286, -754706, -295817, 34832, 24765, -160833, -251504, -266251, -286090, -152665, -71072, 12849, 41968, -82414, -234734, -244383, -106955, -64402, -271713, -569588, -805676, -914492, -907362, -764519, -520605, -70222, 364015, 651603, 888959, 1008380, 899424, 537697, 245071, 110662, -148030, -389792, -539312, -600696, -410477, -268036, -287349, -293372, -239289, -42356, 284486]
16509B84486J85568M360r2387r2929J804J38559N4453j92044j29267j9684j54327
16498a1408p8567J12763J25546P0765K4903P308N4311J98300K70127J19865k05366
16487F88547n18273n24370j24920K27184R4366M3845R1747K19576J9776j43557
16477G3921l8396l2235J8168m082M1581N6897R93J2124N4722J80571J0272j60703
16465B13833j7381J7533o0229o6045J0460M0099J39490M1120j04422n0955j14408
16454D9095j76247l7193J61957P9660J24798L88304L99027N2819l86659o00218
16444E5343o24104l93166l9123K72872L29772K08712J05593J85535L82077M60598
16434I44109K90731N6748r678n3244k32810k70636k25942k00518j35948N7821
$$ y = [284486, 470054, 474414, 382027, 289098, 290902, 429461, 483914, 291870, 162603, 142919, -11408, -89975, 22788, 148334, 219099, 244002, 251310, 305621, 503921, 774048, 893913, 688547, 170274, -354096, -479016, -251832, -157466, -113621, -21874, 197702, 217478, 73921, 35525, 3290, 21458, 17376, 58957, 115854, 116847, 128971, 183693, 364264, 374536, 213833, 196452, 213985, 153756, 87711, 98171, 138270, 277760, 318880, 214458, 163503, 49095, -127152, -164345, -2388, 77272, 202070, 590374, 989401, 1042220, 655561, 55343, -568761, -961927, -1001050, -728178, -398406, -189694, -84101, 101434, 483511, 944109, 1234840, 1291588, 1281910, 1228666, 995856, 725220, 499278, 298760, 162812, 220633]
16424B20633J09442J900k26634m37638l59275k2458J50361m5157j67276j03778
16414h79880R0761K79167K96398K02841N2947j67977k63971k48822q674K95607
16404c51603L64656J88888l0952j01331N1195J84672O4301K7114r6786m26656
16394a26502m12323K3502J82568J99133M46189L73288L5390q2400K1326J00178
16384G60349P3516j34822l10384k06950r8374j79522j29498K9703R3100P6371
16374b6511K1941J09385J11613k19832n24274l86655j97202j15917J27864K25824
16364h73764J76441J73258K57761M21408M67664L26641J89419P7947p9067l43800
16354G93908p06803o37315k03898Q472R3531J91504J17663k00402j46265J42199
$$ y = [220633, 330075, 331975, 105341, -332297, -691572, -714030, -563669, -608826, -776102, -879880, -789119, -509952, -213554, -10713, 42234, -125743, -389714, -638536, -647210, -351603, 13053, 201941, 170989, 69658, 120853, 305525, 369826, 396940, 300154, -126502, -538825, -515323, -332755, -133622, 312567, 685855, 721245, 638845, 660171, 760349, 833865, 699043, 388659, 181709, 83335, -96187, -225685, -195982, -102882, -26511, -4570, 104815, 216428, -3404, -527678, -914333, -1111535, -1227452, -1099588, -873764, -697323, -524065, -266304, 155104, 622768, 949409, 1138828, 1216775, 1137708, 793908, 87105, -550210, -754108, -745636, -652105, -460601, -342938, -543340, -689605, -547406]
16344e47406K10922K3128k33251l22285k41450l1091Q8687K54677M51324L99620
16334E2875J00942J12226K41017O0355k47985m03128k47604j883J423q4198N933
16323d10027J79715L23452K47867J46337j5614q6673j05371k42644j49321K23339
16313A11060L62866J83239j9337j40448l83465m95716l47304k01420J38400L61196
16303d30929K94912J10057n3560j22463n5258K42366K39723P9113n2274k4456
16293B27231J79069J81159K1916j39460o7651O9183K06932L58253L52408K55900
16283A644940J09805o4086k20972j86988r5627j90353k95199j90661O943J88811
16273G06613K51920J61214R2855O4211Q8950R3368m1913m0722P478k50698m08319
$$ y = [-547406, -336484, -313356, -546607, -868892, -1110342, -1141433, -1052746, -798069, -346745, 52875, 153817, 266043, 507060, 567415, 319430, -83698, -331302, -333185, -331762, -415960, -410027, -230312, 93140, 341007, 487344, 471730, 385057, 279686, 37042, -112279, 111060, 473926, 657165, 637828, 497380, 113915, -381801, -729105, -930525, -792125, -430929, -136017, -25960, -79520, -201983, -257241, -14875, 224848, 303961, 251687, 227231, 406300, 587459, 609375, 469915, 402264, 471447, 678379, 1036632, 1389040, 1644940, 1754745, 1690659, 1469687, 1282699, 1187072, 996719, 701520, 510859, 517802, 706613, 958533, 1119747, 1212602, 1276813, 1365763, 1459131, 1417218, 1376496, 1383974, 1133276, 724957]
16262G24957l30328j61906j0070k294j15117r7098p0497k13324m06345l47628
16252a029650j4007L57884M40466K29098j24106j64669M7765J23836J46078R5509
16242A08204o0511j05537L2829J03468k2626j51660j02831l5467m8327l13352
16232e95810l91107j33945J4516Q0311P7314m1539J06359K05820Q2634J69303
16222d26144K08371m9219k75070j17233K1579M2959n2782k08231r1508J01870
16212h45408J55065m0969j22178p6307p8470P3210K95494K65161M4454n4837j12077
16201d96862j31813j98643j21999J41654K67184K61158J28018P0704J07571Q3439
16191A10411J06861m5501j89204j29892J10895M57297M32233l654l01517k11429
$$ y = [724957, 394629, 232723, 222653, 220359, 105242, 8144, -62353, -275677, -682022, -1029650, -1043657, -685773, -245307, -16209, -140315, -304984, -257219, -133383, 12695, 108204, 47693, -57844, -25015, 78453, 55827, -95833, -198664, -234131, -282458, -595810, -986917, -1120862, -1106346, -1026035, -948721, -990260, -883901, -678081, -595447, -426144, -217773, -266992, -542062, -659295, -637716, -594757, -647539, -855770, -947278, -845408, -690343, -731312, -853490, -929797, -1008267, -935057, -639563, -374402, -329948, -384785, -496862, -628675, -827318, -949317, -807663, -540479, -279321, -151303, -80599, 26972, 110411, 217272, 171771, -17433, -147325, -36430, 420867, 853100, 849446, 547929, 336500]
16181C36500j88383l10122l13250k2637K91694M28459M15435K29140k5086r0393
16171G51357q4049j70634j61282j8225K67985P46289J186251P93412l74386r25221
16161B011497m69995j39269o4784l08844n51950m07200k40101j57203j8256J42279
16151b03826K05995K17567Q5435J04346J79985n5222k54307k12209j54112j76818
16141b63166j78814j3842J28q8810n5237p2455j09771j56357j52733q5033K29550
16130i46540M14116L55861J37721j11207m10155n07348m15978N0602N01798K59230
16120f71900l7314J4805L41785M15612J67379J5478N3877o1843K364J55922p3553
16109C22612m19311m34312k44358o1587o483k310J42696K41759K08176J48759
$$ y = [336500, 148117, -162005, -475255, -497892, -206198, 222261, 637696, 866836, 841750, 751357, 667308, 496674, 335392, 317167, 585152, 1331441, 2517692, 3311104, 2936718, 2011497, 1541502, 1402233, 1337449, 1028605, 476655, 69455, -170646, -327849, -346105, -203826, 2169, 219736, 305171, 409517, 589502, 534280, 279973, 67764, -86348, -263166, -441980, -455822, -455694, -544504, -599741, -672196, -781967, -938324, -1091057, -1176090, -946540, -532424, -176563, -38842, -150049, -560204, -1067552, -1483530, -1432928, -931130, -671900, -709214, -694409, -352624, 62988, 230367, 245845, 299722, 237879, 240243, 396165, 322612, -96699, -531011, -775369, -836956, -843439, -845749, -703053, -461294, -253118, -104359]
16099a04359J59602J39948N1721Q4536M6361p0556j33717k42097l85976l23315
16089g77852n0592J62917K03110J65650J77311J89708j8050k16722J2422K70245
16079A18147J4760l05442k97064j47725n2635M6399L6673J22411K84741L59361
16069A79626K41390N7477k4639o1860j58947j07074J15173k0442k70790k01041
16059b51127P078L4696J12024n2294r4215L3869N4986n506k8567p3466j18024
16048c80546k36003m34299l77534j63497l0609N7648J46624L27943N03320K99594
16038b87359k15256n43424l58065l6112R7386o895j17121N1165R1286j22670j10098
16027a557163O2437J51726O3766j17644q2193M9836K44833K67380N9930M3097
$$ y = [-104359, 55243, 195191, 246912, 331448, 377809, 307253, 173536, -68561, -454537, -777852, -828444, -665527, -462417, -296767, -119456, 70252, 52202, -164520, -152098, 118147, 132907, -172535, -469599, -617324, -669959, -623560, -586887, -464476, -179735, 179626, 421016, 478493, 453854, 391994, 233047, 125973, 241146, 220704, -50086, -251127, -244049, -209353, -97329, -149623, -243838, -209969, -154983, -160489, -189056, -262522, -380546, -616549, -1050848, -1428382, -1591879, -1622488, -1564840, -1418216, -1090273, -586953, -287359, -502615, -1046039, -1404104, -1440216, -1342830, -1349725, -1466846, -1415681, -1324395, -1447065, -1557163, -1494726, -1343000, -1279234, -1396878, -1479071, -1429235, -1184402, -917022, -857092, -813995]
16017h13995N9454N8402K95747N23998M37889K67838R6058l7451j28814j9423
16007G39703Q4906L341k03043k69903k42760l03489l23498j78264j50748j63785
15997a007540N2335K08295K43683J07069m9005Q8015L45233L73632J73875k4689
15987E10903j70799j79998j4228N8959o518r1461l2038n27k12638m85338l03386
15976i27069M0587K2479n8937L7652J96643L36143K31204J36958L20525J79804
15966E15989j34938j84606r5247j21937j29461o4990K6896L7408N2876J21648
15956B3638M1739k659J14026P6053k1780l4919l6336j7415M3480Q0987J6738p5390
15944B08162p6519J0717l0620q04J32899K42892K04373J3204m1207J223j05884
$$ y = [-813995, -754541, -696139, -400392, 123606, 561495, 829333, 925391, 887940, 759126, 739703, 824609, 827950, 624907, 355004, 112244, -191245, -514743, -693007, -843755, -1007540, -955205, -746910, -503227, -396158, -445163, -357148, -11915, 361717, 535592, 510903, 340104, 160106, 145878, 204837, 198319, 106858, 74820, 74293, -138345, -623683, -927069, -886482, -864003, -922940, -885288, -688645, -352502, -121298, 15660, 336185, 515989, 381051, 196445, 101198, -20739, -150200, -215190, -188294, -150886, -98010, 23638, 65377, 62718, 176744, 252797, 231017, 196098, 159762, 142347, 185827, 266814, 283552, 208162, 131643, 142360, 111740, 110936, 243835, 486727, 691100, 704304, 663097, 664320, 558436]
15933E58436j39906l11690n23314m16493j20181J37073K12924L37832L25241J11214
15923A71136r2184j54089k83940k48733k5638J30898K71652K77214P8665k4378
15913A00603o6563l9176O8155K7370j84469l32383r9128N9330J2656n0546j50108
15902f54259n2650J44190J33991L1391O5236L02582M57906L04471J08583N9218
15892I00659N0967K4791p4406j91823o9810Q5363m9695m8187j6762J1909K16418
15881H39424K62755P5871j53787k82840l28053k55734o9932J07353J67342J22541
15871D84940M1501R2307j0729j25909p1227j13789j94259k09985k72409k12570
15861e92129P418j4006r90O4483N1543j84695l42205r5940K10645L83014K65715
$$ y = [558436, 418530, 106840, -416474, -832967, -953148, -816075, -603151, -265319, 59922, 171136, 78952, -75137, -359077, -607810, -633448, -502550, -230898, 46316, 124981, 100603, 34040, -5136, 63019, 90389, -94080, -426463, -525591, -466261, -453605, -504151, -654259, -706909, -562719, -428728, -397337, -332101, -29519, 428387, 732858, 841441, 900659, 951626, 976417, 902011, 710188, 640378, 725741, 676046, 627859, 611097, 623006, 839424, 1102179, 1178050, 1024263, 741423, 413370, 157636, 87704, 195057, 362399, 484940, 526441, 618748, 608019, 482110, 410883, 297094, 102835, -107150, -379559, -592129, -584711, -598717, -599707, -535224, -483681, -668376, -1010581, -1106521, -895876, -512862, -247147]
15850b47147R166k6100j27045k78826j29292R9911K86670J95631K258K5488J71373
$$ y = [-247147, -237981, -264081, -391126, -669952, -799244, -699333, -412663, -217032, -214774, -189286, -17913]
$$ [...]
##END NTUPLES=NMR SPECTRUM
##END=
