##TITLE=1H ikalashn
CA-9310-2
20.12.2024
##JCAMPDX= 6.0         $$ Bruker NMR JCAMP-DX V2.0
##DATA TYPE= NMR SPECTRUM
##DATA CLASS= NTUPLES
##ORIGIN= UXNMR, Bruker Analytische Messtechnik GmbH
##OWNER= root
$$ TOPSPIN		Version 1.3
$$ 2024-12-20 14:10:17.703 +0400  Irina@DPX200
$$ Compression mode = diff/dup
##.OBSERVE FREQUENCY= 200.131300845
##.OBSERVE NUCLEUS= ^1H
##.ACQUISITION MODE= SIMULTANEOUS
##.ACQUISITION SCHEME= undefined
##.AVERAGES= 16
##.DIGITISER RES= 18
##SPECTROMETER/DATA SYSTEM= spect
##.PULSE SEQUENCE= zg
##.SOLVENT NAME= DMSO
##.SHIFT REFERENCE= INTERNAL, DMSO, 1, 17.49637
##AUDIT TRAIL= $$ (NUMBER, WHEN, WHO, WHERE, WHAT)
$$ ##TITLE= Audit trail, TOPSPIN		Version 1.3
$$ ##JCAMPDX= 5.01
$$ ##ORIGIN= Bruker BioSpin GmbH
$$ ##OWNER= Irina
$$ $$ F:/spectra/data/iren/nmr/1H/4/pdata/1/auditp.txt
$$ ##AUDIT TRAIL=  $$ (NUMBER, WHEN, WHO, WHERE, VERSION, WHAT)
(   1,<2024-12-20 14:08:55.843 +0400>,<Irina>,<DPX200>,<TOPSPIN 1.3>,
      <acquisition in progress>)
(   2,<2024-12-20 14:10:02.406 +0400>,<Irina>,<DPX200>,<TOPSPIN 1.3>,
      <Start of raw data processing
       efp BC_mod = 2 LB = 0.02 FT_mod = 6 PKNL = 1 PHC0 = 254.3757 PHC1 = -1.979401 SI = 32K 
       data hash MD5: 32K
       87 0A BE 01 D7 2D 34 99 34 39 E3 70 6E B5 76 AF>)
(   3,<2024-12-20 14:10:05.250 +0400>,<Irina>,<DPX200>,<TOPSPIN 1.3>,
      <apk 
       data hash MD5: 32K
       5A CD 82 98 A8 1D 06 64 2D EE 08 4F 1C 2E 58 6B>)
(   4,<2024-12-20 14:10:07.875 +0400>,<Irina>,<DPX200>,<TOPSPIN 1.3>,
      <abs n ABSG = 5 
       data hash MD5: 32K
       8A 9E B2 DC FF DF 98 DD 44 5E D9 B4 6E 84 B8 A2>)
$$ ##END=
$$ 
$$ $$ hash MD5
$$ $$ FC 76 15 E1 1E 7A F0 81 4A A2 CE 9B 8A 99 2F 7C
##$RELAX= 
##$RELAX= 
##$RELAX= 
##$RELAX= 
##$RELAX= 
##$RELAX= 
##$RELAX= 
##$RELAX= 
##$RELAX= 
$$ Bruker specific parameters
$$ --------------------------
##$DU= <F:/spectra>
##$EXPNO= 4
##$NAME= <1H>
##$PROCNO= 1
##$TYPE= <nmr>
##$USER= <iren>
##$AMP= (0..31)
100 100 100 100 100 100 100 100 100 100 100 100 100 100 100 100 100 100 
100 100 100 100 100 100 100 100 100 100 100 100 100 100 
##$ANAVPT= -1
##$AQSEQ= 0
##$AQ_mod= 1
##$AUNM= <au_zg>
##$AUTOPOS= <>
##$BF1= 200.13
##$BF2= 200.13
##$BF3= 200.13
##$BF4= 200.13
##$BF5= 200.13
##$BF6= 200.13
##$BF7= 200.13
##$BF8= 200.13
##$BYTORDA= 1
##$CFDGTYP= 0
##$CFRGTYP= 5
##$CHEMSTR= <none>
##$CNST= (0..63)
1 1 145 1 1 1 1 1 1 1 1 1 1 1 1 1 1 1 1 1 1 1 1 1 1 1 1 1 1 1 1 1 1 1 
1 1 1 1 1 1 1 1 1 1 1 1 1 1 1 1 1 1 1 1 1 1 1 1 1 1 1 1 1 1 
##$CPDPRG= <>
##$CPDPRG1= <>
##$CPDPRG2= <>
##$CPDPRG3= <>
##$CPDPRG4= <mlev>
##$CPDPRG5= <mlev>
##$CPDPRG6= <mlev>
##$CPDPRG7= <mlev>
##$CPDPRG8= <mlev>
##$CPDPRGB= <>
##$CPDPRGT= <>
##$D= (0..63)
0 2 0 0 0 0 0 0 0 0.06 0 0.03 0 0 0 0 0.0002 0 0 0 0 0 0 0 0 0 0 0 0 0 
0 0 0 0 0 0 0 0 0 0 0 0 0 0 0 0 0 0 0 0 0 0 0 0 0 0 0 0 0 0 0 0 0 0 
##$DATE= 1734689400
##$DBL= (0..7)
120 120 120 120 120 120 120 120 
##$DBP= (0..7)
150 150 150 150 150 150 150 150 
##$DBP07= 0
##$DBPNAM0= <>
##$DBPNAM1= <>
$$ [...]
##$SW_h= 4401.40845070422
##$TD= 16384
##$TD0= 1
##$TE= 300
##$TE2= 300
##$TE3= 300
##$TEG= 300
##$TL= (0..7)
0 120 120 120 120 120 120 120 
##$TP= (0..7)
150 150 150 150 150 150 150 150 
##$TP07= 0
##$TPNAME0= <>
##$TPNAME1= <>
##$TPNAME2= <>
##$TPNAME3= <>
##$TPNAME4= <>
##$TPNAME5= <>
##$TPNAME6= <>
##$TPNAME7= <>
##$TPOAL= (0..7)
0.5 0.5 0.5 0.5 0.5 0.5 0.5 0.5 
##$TPOFFS= (0..7)
0 0 0 0 0 0 0 0 
##$TUNHIN= 0
##$TUNHOUT= 0
##$TUNXOUT= 0
##$USERA1= <user>
##$USERA2= <user>
##$USERA3= <user>
##$USERA4= <user>
##$USERA5= <user>
##$V9= 5
##$VALIST= <valist>
##$VCLIST= <CCCCCCCCCCCCCCC>
##$VD= 0
##$VDLIST= <DDDDDDDDDDDDDDD>
##$VPLIST= <PPPPPPPPPPPPPPP>
##$VTLIST= <TTTTTTTTTTTTTTT>
##$WBST= 1024
##$WBSW= 25
##$XGAIN= (0..3)
0 0 0 0 
##$XL= 0
##$YL= 0
##$YMAX_a= 1405551
##$YMIN_a= -1355929
##$ZGOPTNS= <>
##$ZL1= 120
##$ZL2= 120
##$ZL3= 120
##$ZL4= 120
##$ABSF1= 17.49637
##$ABSF2= -4.496376
##$ABSG= 5
##$ABSL= 3
##$ALPHA= 0
##$AQORDER= 0
##$ASSFAC= 0
##$ASSFACI= 0
##$ASSFACX= 0
##$ASSWID= 0
##$AUNMP= <proc_1d>
##$AXLEFT= 0
##$AXRIGHT= 0
##$AXTYPE= 0
##$AXUNIT= <>
##$AZFE= 0.1
##$AZFW= 0.1
##$BCFW= 0
##$BC_mod= 2
##$BYTORDP= 0
##$COROFFS= 0
##$CY= 7568.61572265625
##$DATMOD= 1
##$DC= 0
##$DFILT= <>
##$DTYPP= 0
##$F1P= 17.9538593292236
##$F2P= -4.03888763876832
##$FCOR= 0.5
##$FTSIZE= 32768
##$FT_mod= 6
##$GAMMA= 0
##$GB= 0
##$INTBC= 0
##$INTSCL= 5.656564e-011
##$ISEN= 128
##$LB= 0.02
##$LEV0= 0
##$LPBIN= 0
##$MAXI= 945.577
##$MC2= 0
##$MEAN= 0
##$ME_mod= 0
##$MI= -402.1523
##$NCOEF= 0
##$NC_proc= -5
##$NLEV= 6
##$NOISF1= 8.587773
##$NOISF2= 6.764455
##$NSP= 0
##$NTH_PI= 0
##$NZP= 0
##$OFFSET= 17.49637
##$PC= 1
##$PHC0= 121.6012
##$PHC1= -38.53415
##$PH_mod= 1
##$PKNL= yes
##$PPARMOD= 0
##$PPDIAG= 0
##$PPIPTYP= 0
##$PPMPNUM= 100
##$PPRESOL= 1
##$PSCAL= 0
##$PSIGN= 0
##$REVERSE= no
##$SF= 200.13
##$SI= 32768
##$SIGF1= 16.12182
##$SIGF2= -4.496377
##$SINO= 3.521527
##$SIOLD= 32768
##$SREGLST= <1H.CDCl3>
##$SSB= 0
##$STSI= 32768
##$STSR= 0
##$SW_p= 4401.40845070422
##$SYMM= 0
##$S_DEV= 0
##$TDeff= 16384
##$TDoff= 0
##$TI= <>
##$TILT= no
##$TM1= 0
##$TM2= 0
##$TOPLEV= 0
##$USERP1= <user>
##$USERP2= <user>
##$USERP3= <user>
##$USERP4= <user>
##$USERP5= <user>
##$WDW= 1
##$XDIM= 32768
##$YMAX_p= 432799916
##$YMIN_p= -602171
$$ End of Bruker specific parameters
$$ ---------------------------------
##NTUPLES= NMR SPECTRUM
##VAR_NAME=  FREQUENCY,     SPECTRUM/REAL,   SPECTRUM/IMAG
##SYMBOL=    X,             R,               I
##VAR_TYPE=  INDEPENDENT,   DEPENDENT,       DEPENDENT
##VAR_FORM=  AFFN,          ASDF,            ASDF
##VAR_DIM=   32768,         32768,           32768
##UNITS=     HZ,            ARBITRARY UNITS, ARBITRARY UNITS
##FACTOR=    0.134324425510551, 1,           1
##FIRST=     4401.40845070422, 143240,       -2241182
##LAST=      0,             -334822,         -1817474
##MIN=       0,             -602171,         0
##MAX=       4401.40845070422, 432799916,    0
$$ Real data points
##PAGE= N=1
##DATA TABLE= (X++(R..R)), XYDATA
$$ [...]
12160A6112458L916M8207J41327J31668N0506M4933J28692J70524J14628N5462
$$ 16112458 16116374 16164581 16305908 16437576 16488082 16533015 16661707 16832231 16946859 17002321
12150A7002321O7773R4137N6716j8143n7435n8461p4783j18485j43398j20504
$$ 17002321 17070094 17164231 17220947 17202804 17145369 17086908 17012125 16893640 16750242 16629738
12140A6629738q0275o7386q1671q4305n4559j9206j2462k0322L714O2642R5509
$$ 16629738 16549463 16482077 16400406 16316101 16261542 16242336 16229874 16209552 16213266 16275908 16371417
12129A6371417O1526J0768K2686R1798J34278J11020Q0179J00093J39050J35798
$$ 16371417 16432943 16443711 16466397 16558195 16692473 16803493 16883672 16983765 17122815 17258613
12119A7258613J10135J37966K23512K76341K41605J81752J75655J95293J63573
$$ 17258613 17368748 17506714 17730226 18006567 18248172 18429924 18605579 18800872 18964445
12110A8964445R9019R7510J67228J94256J16470L0218M6818J22277J28289L9803
$$ 18964445 19063464 19160974 19328202 19522458 19638928 19669146 19715964 19838241 19966530 20006333
12100B0006333n3443q8714p5830k3442O4515J25649R3547K3272L6778J23795J38282
$$ 20006333 19952890 19864176 19788346 19764904 19829419 19955068 20048615 20071887 20108665 20232460 20370742
12089B0370742L9200j7934Q0725K18312K26259J42314J32225K22710K83016K51363
$$ 20370742 20409942 20392008 20472733 20691045 20917304 21059618 21191843 21414553 21697569 21948932
12079B1948932K16868K53215L04973K89489K17683J59207J45486J47483J15524
$$ 21948932 22165800 22419015 22723988 23013477 23231160 23390367 23535853 23683336 23798860
12070B3798860K5187q9237j53899j40643j11028j34097j94662k38314k64223k96875
$$ 23798860 23824047 23734810 23580911 23440268 23329240 23195143 23000481 22762167 22497944 22201069
12060B2201069l06291k53539j89634k00855k63149k60670j59331o0818o2698j48257
$$ 22201069 21894778 21641239 21451605 21250750 20987601 20726931 20567600 20506782 20444084 20295827
12050B0295827k29944k29827j22753J9558N0368q2693k19688j72478j122O2116
$$ 20295827 20065883 19836056 19713303 19732861 19783229 19700536 19480848 19308370 19307248 19369364
12040A9369364l9777j21237p3502k8836j07033k06898j98247j46679j73230k32089
$$ 19369364 19329587 19208350 19134848 19106012 18998979 18792081 18593834 18447155 18273925 18041836
12030A8041836k15909j69634k03683k79250k76869k17345k20435k85925l04620
$$ 18041836 17825927 17656293 17452610 17173360 16896491 16679146 16458711 16172786 15868166
12021A5868166k59477k33090k34998k03409j65552k09066k93554k80956j70052
$$ 15868166 15608689 15375599 15140601 14937192 14771640 14562574 14269020 13988064 13818012
12012A3818012j11766j61051k02297j66307j32378j51012j50101j00812j00452
$$ 13818012 13706246 13545195 13342898 13176591 13044213 12893201 12743100 12642288 12541836
12003A2541836j88266k41595j72223p9362q0437j22954j03220n5767p3603j30022
$$ 12541836 12353570 12111975 11939752 11860390 11779953 11656999 11553779 11498012 11424409 11294387
11993A1294387j32062q8393q2124j19438j31180r4967n0866k4614k1563n8239
$$ 11294387 11162325 11073932 10991808 10872370 10741190 10646223 10595357 10570743 10549180 10490941
11983A0490941j21717j45712j01515n5572o5392r0084q0503p1266r2423q5419
$$ 10490941 10369224 10223512 10121997 10066425 10001033 9910949 9830446 9759180 9666757 9581338
11973I581338j6151K5734l2635j02986p6386j6826n0215j39912j54412r4866o3968
$$ 9581338 9565187 9590921 9558286 9455300 9378914 9362088 9311873 9171961 9017549 8922683 8858715
11962H858715o1444j5214K6243m2967j52798j27343P870M1389o8586j20209k3108
$$ 8858715 8797271 8782057 8808300 8765333 8612535 8485192 8493062 8534451 8465865 8345656 8322548
11951H322548M2788m9876j46035p6566N4851N7284m0141p9948n0200n2483q3715
$$ 8322548 8365336 8315460 8169425 8092859 8147710 8204994 8164853 8084905 8034705 7982222 7898507
11940G898507n6025J8765M7250J9301m933l1532r8790j44910p4043O3156J11587
$$ 7898507 7842482 7861247 7908497 7927798 7922865 7891333 7792543 7647633 7573590 7636746 7748333
11929G748333L3890m8855m3900J1975M7686M2293L970m1230m0824J9014N8991
$$ 7748333 7782223 7733368 7689468 7701443 7749129 7791422 7795392 7754162 7713338 7732352 7791343
11918G791343O649q1514r9676n7100m5819p7883q4918n7184m8902o0229m7302
$$ 7791343 7797992 7716478 7616802 7559702 7513883 7436000 7351082 7293898 7244996 7184767 7137465
11907G137465l3086o7874r8441l3098P5122Q2905o264m6227l386j981p4293q6006
$$ 7137465 7104379 7036505 6938064 6904966 6980088 7062993 7056729 7010502 7007116 7005135 6930842 6844836
11895F844836R827O2802j4946q4205k1145O3781K5918n8079l6452M6963M5800
$$ 6844836 6854663 6917465 6902519 6818314 6797169 6860950 6886868 6828789 6792337 6839300 6885100
11884F885100k1595k2568L4898K4316n0928n3136M0594R3145M5370R602O6453
$$ 6885100 6863505 6840937 6875835 6900151 6849223 6796087 6836681 6929826 6975196 6984798 7051251
11873G051251J34023J18681O1227M4808O0608N1505J4733j5128l3837n9430r2874
$$ 7051251 7185274 7303955 7365182 7409990 7470598 7522103 7536836 7521708 7487871 7428441 7335567
11862G335567j23708j44267j43648j22846j12375j27297j20822m9396L2986L0787
$$ 7335567 7211859 7067592 6923944 6801098 6688723 6561426 6440604 6391208 6424194 6454981
11852F454981m8431r8363o7366j2283J2589K1121K7492R077l1435n2609m8744
$$ 6454981 6406550 6308187 6240821 6228538 6241127 6262248 6289740 6298817 6267382 6214773 6166029
11841F166029n3650n6146j2092M4499K3412n9103p4933P869N6805p163p1764k6314
$$ 6166029 6112379 6056233 6044141 6088640 6112052 6052949 5978016 5985885 6042690 6035527 5963763 5937449
11829E937449M6364K0192m5388o400J08182J33166L6838l1845J7703R5926R7269
$$ 5937449 5983813 6004005 5958617 5952217 6060399 6193565 6230403 6198558 6216261 6312187 6409456
11818F409456N0900M0260P0355Q5968O0140Q326m5679q1935r2994r8038j19119
$$ 6409456 6460356 6500616 6570971 6656939 6717079 6725405 6679726 6597791 6504797 6406759 6287640
11807F287640j40650j26876p6442k4653j164j6447o4060r9596o1959L0656O2689
$$ 6287640 6146990 6020114 5943672 5919019 5917855 5901408 5837348 5737752 5675793 5706449 5769138
11796E769138k3437j14913p7626L7029O9830J570l7839QJ9908k0334l1924K2420
$$ 5769138 5745701 5630788 5553162 5590191 5660021 5661591 5623752 5623760 5643668 5623334 5591410 5613830
11784E613830M0320l2679q6227l2486L4561N786m7062m865P7128O6006q240q389
$$ 5613830 5654150 5621471 5535244 5502758 5537319 5543105 5496043 5491178 5568306 5634312 5626072 5617683
11772E617683N8661N4872l2603n8541K4917Q0549K2917l9688k311N5532J8413
$$ 5617683 5676344 5731216 5698613 5640072 5664989 5745538 5768455 5728767 5726456 5781988 5800401
11761E800401n8632m7778K5984K1178q6629j60688j08205m859K9502j2575n2703
$$ 5800401 5741769 5693991 5719975 5741153 5654524 5493836 5385631 5380772 5410274 5397699 5344996
11750E344996n0652l6656m2345n4079m1035O47M5166O4706M7138m141o6377r3372
$$ 5344996 5294344 5257688 5215343 5161264 5120229 5120876 5166042 5230748 5277886 5273745 5207368 5113996
11738E113996m7633M2369Q7088L6448m5938o0031p693J3239m0075q7375m6606
$$ 5113996 5066363 5108732 5195820 5232268 5186330 5126299 5118606 5131845 5091770 5004395 4957789
11727D957789M2019P5949L3959j1781j2916k883k3492m9822k7266L9551P7103
$$ 4957789 4999808 5075757 5109716 5097935 5085019 5082136 5058644 5008822 4981556 5021107 5098210
11716E098210L2769n1350q4858m4094J786l243k2118P09L3054P060m8565l6433
$$ 5098210 5130979 5079629 4994771 4950677 4952463 4949220 4927102 4927811 4960865 4967925 4919360 4882927
11704D882927M2220O6063j7848r7944o4830K5404N2837J8455J0131L8838L5375
$$ 4882927 4925147 4991210 4973362 4875418 4810588 4835992 4888829 4907284 4917415 4956253 4991628
11693D991628j4595n1357m9020l6245j5174L5118P6783M3602m0127p6632l8846
$$ 4991628 4977033 4925676 4876656 4840411 4825237 4860355 4937138 4980740 4940613 4863981 4825135
11682D825135Q181L2743O1688P2459M355r2903q0206M3542R9766L561q9182l3748
$$ 4825135 4833316 4866059 4927747 5000206 5004561 4911658 4831452 4874994 4974760 4978321 4889139 4855391
11670D855391O5924M2277m9901m3726L7581K6937p8020r7754K0999J09586N1789
$$ 4855391 4921315 4963592 4913691 4869965 4907546 4934483 4856463 4758709 4779708 4889294 4941083
11659D941083m6952n4610n526Q970l50J2098J7628j0323j0690N5157R7272K9445
$$ 4941083 4894131 4839521 4833995 4842965 4842615 4854713 4872341 4862018 4851328 4906485 5003757 5033202
11647E033202o7019n2864M6350P6395m243o5950j1843Q5269J00573K3249n7005
$$ 5033202 4966183 4913319 4959669 5036064 5031821 4965871 4954028 5039297 5139870 5163119 5106114
11636E106114p7328n4711k7874M663O4759J25118J05566j8148j34084j06995K8904
$$ 5106114 5028786 4974075 4946201 4950864 5015623 5140741 5246307 5228159 5094075 4987080 5015984
11625E015984R5703K1684n6317j2624P1123N2896l0454l5046M1691O8171J3765
$$ 5015984 5111687 5133371 5077054 5064430 5135553 5188449 5157995 5122949 5164640 5232811 5246576
11614E246576j1592K8358K7975n5486r9383j4657R2304P8228j7382m1881M1047
$$ 5246576 5234984 5263342 5291317 5235831 5136448 5121791 5214095 5292323 5274941 5233060 5274107
11603E274107J15881Q8351m471o1083l2671L2495M0766l4900r9382m7307P4025
$$ 5274107 5389988 5478339 5473868 5412785 5380114 5412609 5453375 5418475 5319093 5271786 5345811
11592E345811J09133K1920m2994J4616R3015N9330l5511n1629J1116L4963j1421
$$ 5345811 5454944 5476864 5433870 5448486 5541501 5600831 5565320 5513691 5524807 5559770 5548349
11581E548349m5602k8051M3K7517P9020J10456M6905o0534o8694L3761R1623K6611
$$ 5548349 5502747 5474696 5474739 5502256 5581276 5691732 5738637 5678103 5609409 5643170 5734793 5761404
11569E761404m2270p061N1964K0637m3143j1794Q6867J11868L6239k6347j5273
$$ 5761404 5719134 5712073 5764037 5784674 5741531 5729737 5816604 5928472 5964711 5938364 5923091
11558E923091L932j7703k8824J2768N1996K5611l3777n2381k5305n517j2178j2874
$$ 5923091 5927023 5909320 5880496 5893264 5945260 5970871 5937094 5884713 5859408 5853891 5841713 5828839
11546E828839J1884L8415M0030K1749M240m197q930j5513k2914k3199o388K5127
$$ 5828839 5840723 5879138 5919168 5940917 5945157 5940960 5932030 5916517 5893603 5870404 5864016 5889143
11534E889143M7325L5360n14j8180K973L0328K3373o589j8355r798j3581k5571
$$ 5889143 5936468 5971828 5971314 5953134 5956107 5986435 6009808 6003219 5984864 5975066 5961485 5935914
11522E935914m679L7844K6910n3932j08208o6547n796k7626q4028n8542K0034
$$ 5935914 5931235 5969079 5995989 5942057 5833849 5767302 5761506 5733880 5649852 5591310 5611344
11511E611344J1547q8084j16054r537P6144J4785q5198o2465L6886M9869l5770
$$ 5611344 5622891 5534807 5418753 5409216 5485360 5500145 5414947 5352482 5389368 5439237 5403467
11500E403467q4335m1910R189J5930J5593K2236j44k8936J1625J00627J11670
$$ 5403467 5319132 5277222 5286411 5302341 5317934 5340170 5340026 5311090 5322715 5423342 5535012
11489E535012O366q8474o4802J7274M3963J4594J294J6145J6527k529p078J1163
$$ 5535012 5541378 5452904 5388102 5405376 5449339 5463933 5465227 5481372 5497899 5495370 5488292 5499455
11477E499455L2526M6767M7374K3314n955M245M4438L9658l1248p6578k4076N6018
$$ 5499455 5531981 5578748 5626122 5649436 5643481 5647726 5692164 5731822 5700574 5623996 5599920 5655938
11465E655938N3064j3294l3159J5424M3819K196n6556p5967o5936n1325l0296
$$ 5655938 5709002 5695708 5662549 5677973 5721792 5723988 5667432 5591465 5525529 5474204 5443908
11454E443908q682o698r802K0550O7123N9139j7228q0314o3778m368K5148J6234
$$ 5443908 5435226 5428528 5418726 5439276 5506399 5565538 5548310 5467996 5404218 5399850 5424998 5441232
11442E441232Q505J8422L4402M8138M6632R011m4864m5178L1877R8437N8276m9887
$$ 5441232 5449737 5468159 5502561 5550699 5597331 5606342 5561478 5516300 5548177 5646614 5704890 5655003
11430E655003r7187m6512L726k1564o5373m4347J2593J5824l7822o5781l8331
$$ 5655003 5557816 5511304 5515030 5493466 5428093 5383746 5396339 5412163 5374341 5308560 5270229
11419E270229k0146n1510p5461l3860L1149L8383j4169o1308o8403m6164L460
$$ 5270229 5250083 5198573 5123112 5089252 5120401 5158784 5144615 5083307 5014904 4968740 4972200
11408D972200P2729R9106L0175o4424n7369M1416P8382p424p5849n542J03309
$$ 4972200 5044929 5144035 5174210 5109786 5052417 5093833 5172215 5164791 5088942 5083400 5186709
11397E186709Q6168j9770m3518L1745M5520o3961j53931j13971l9954o1577j28165
$$ 5186709 5272877 5253107 5209589 5241334 5286854 5222893 5068962 4954991 4915037 4853460 4725295
11386D725295j07528j4313J4406n9544j22146q6989r944J6215p107j7142J995
$$ 4725295 4617767 4603454 4617860 4558316 4436170 4349181 4339237 4355452 4348345 4331203 4333198
11375D333198R866j1487k8183j4296P91k3226o4593n6560J3647P0040M6664j8105
$$ 4333198 4343064 4331577 4303394 4289098 4289889 4266663 4202070 4145510 4159157 4229197 4275861 4257756
11363D257756l9300p421J8049J9859L8229O8111M0340n5382j17738o6433M0205
$$ 4257756 4218456 4211035 4229084 4248943 4287172 4355283 4395623 4340241 4222503 4156070 4196275
11352D196275Q6910M6436k2251o9129p6322l3060L5324N1299k3015j09389j08380
$$ 4196275 4283185 4329621 4307370 4238241 4161919 4128859 4164183 4215482 4192467 4083078 3974698
11341C974698l9863j751j5211j2437K9615M9474J0915l9843n3010l4774m637L3883
$$ 3974698 3934835 3933084 3917873 3905436 3935051 3984525 3995440 3955597 3902587 3867813 3863176 3897059
11329C897059N5648J9188n8739r6557m9334L2711P0050L3900m5329r7315m9649
$$ 3897059 3952707 3971895 3913156 3816599 3767265 3799976 3870026 3903926 3858597 3761282 3711633
11318C711633P9026J40547K1532j56634j48961O4480K08605Q8227j27105j50332
$$ 3711633 3790659 3931206 3952738 3796104 3647143 3711623 3920228 4008455 3881350 3731018
11308C731018J3090J08183K6233o8653l0922N4910M5171l2919n1460L259K1826
$$ 3731018 3744108 3852291 3878524 3809871 3778949 3833859 3879030 3846111 3794651 3797910 3819736
11297C819736m2297r1225k1862J15693J59501L7024j22112j26331L3094J54360
$$ 3819736 3777439 3686214 3664352 3780045 3939546 3976570 3854458 3728127 3761221 3915581
11287C915581Q2591q2355j25083j0692Q4179L4513p1465q4828l372N8671M4252
$$ 3915581 3998172 3915817 3790734 3780042 3864221 3898734 3827269 3742441 3739069 3797740 3841992
11276C841992M106m602P675J364k5090l1362O923N0419L2836m0558p4396j1389
$$ 3841992 3846098 3841496 3849171 3850535 3825445 3794083 3801006 3851425 3884261 3843703 3769307 3757918
11264C757918O6241M7802k8290k9668M5159N2094m8627r7420R938J28268P6791
$$ 3757918 3824159 3871961 3843671 3814003 3859162 3911256 3862629 3765209 3775147 3903415 3980206
11253C980206p2947j11473j6778M4309R160o365N3401Q3298K0325m0823k5493
$$ 3980206 3907259 3795786 3779008 3823317 3832477 3826112 3879513 3962811 3983136 3942313 3916820
11242C916820m036l2304k7057O5960J25455M0123p8711n7453N6235P6665r435
$$ 3916820 3912784 3880480 3853423 3919383 4044838 4084961 4006250 3948797 4005032 4081697 4072262
11231D072262l9766K9419N7613j5133o0000K934O0735J8099k6809L2801J01797
$$ 4072262 4032496 4061915 4119528 4104395 4044395 4047329 4108064 4126163 4099354 4132155 4233952
11220D233952M0436p6552o4298O6476J20926L1955m4932N091Q1336M9727m1297
$$ 4233952 4274388 4197836 4133538 4200014 4320940 4352895 4307963 4313054 4394390 4444117 4402820
11209D402820n2151K6699P6233L8360j2558K319N3182N5730m443m7772l885Q6908
$$ 4402820 4350669 4377368 4453601 4491961 4479403 4481722 4534904 4590634 4586191 4538419 4534534 4621442
11197D621442J07978J3025r7962r3523J9296J03770P3798p791l9118j5210M642
$$ 4621442 4729420 4742445 4644483 4550960 4570256 4674026 4747824 4740033 4700915 4685705 4690347
11186D690347J2276N0188J10364J17319L6903n6898o7646J483N8386M5124M9j6530
$$ 4690347 4702623 4752811 4863175 4980494 5017397 4960499 4892853 4894336 4952722 4997846 4997895 4981365
11174D981365q636j2970j7297J8295O7016M8445m0523r6468o1928j7760m2888
$$ 4981365 4972729 4959759 4942462 4960757 5027773 5076218 5035695 4939227 4877299 4859539 4816651
11163D816651o9665j07J00378Q2513m0929j01438l8106K3504J995j2031N2212
$$ 4816651 4746986 4746879 4847257 4929770 4888841 4787403 4749297 4772801 4774796 4762765 4814977
11152D814977R6783K8942n7055k8218O6020Q7046L6548J7841L1683l121o1988
$$ 4814977 4911760 4940702 4883647 4855429 4921449 5008495 5045043 5062884 5094567 5091446 5029458
11141E029458l8539N1392P5025N789l7075j786J9365k3208m3821J0744N6672K5799
$$ 5029458 4990919 5042311 5117336 5123125 5086050 5084264 5103629 5080421 5036600 5047344 5104016 5129815
11129E129815j5348K825K7507l798l7165m157M5090K9396k0188k0610K2818M4336
$$ 5129815 5114467 5117292 5144799 5141001 5103836 5099679 5144769 5174165 5153977 5133367 5156185 5200521
11117E200521L1382J2995r312k8954J704Q0437J03186J1463q4035n1829N8232
$$ 5200521 5231903 5244898 5235586 5206632 5208336 5288773 5391959 5403422 5319387 5267558 5325790
11106E325790J00158N6481K2359J5353k4412p0124k9347O7546Q2515m66l9206
$$ 5325790 5425948 5482429 5504788 5520141 5495729 5425605 5396258 5463804 5546319 5545853 5506647
11095E506647K7553Q1415L6370j8216J3381O8085M8953l609K360M3070L1656k3011
$$ 5506647 5534200 5615615 5651985 5633769 5647150 5715235 5764188 5760579 5762939 5806009 5837665 5814654
11083E814654l7399L876L7854L3289J7394J0106R079J9597L3689J1394n0396p2517
$$ 5814654 5777255 5781131 5818985 5852274 5869668 5879774 5888853 5908450 5942139 5953533 5903137 5830620
11071E830620K864J02082J05651J7988m5533k8538Q228L540k2834k8072j0278
$$ 5830620 5833484 5935566 6041217 6059205 6013672 5985134 5993362 5996902 5974068 5945996 5935718
11060E935718J4424M1533O0346N1642K0923k599o825j995Q583K1402R887l7607
$$ 5935718 5950142 5991675 6052021 6103663 6124586 6121987 6115162 6113167 6121750 6143152 6153039 6115432
11048F115432p0742l3578M0297O3182K1056j8340k8979n5939r6851p0993L0884
$$ 6115432 6044690 6011112 6051409 6114591 6135647 6117307 6088328 6032389 5935538 5864545 5895429
11037E895429P9082j0479j14916o4060R1683J32525j2897j60874j34946K939P3786
$$ 5895429 5974511 5964032 5849116 5785056 5876739 6009264 5996367 5835493 5700547 5703486 5777272
11026E777272K8462m3396q2481j05159j06137m8418L5965N0033k6521r4264p6528
$$ 5777272 5805734 5762338 5679857 5574698 5468561 5420143 5456108 5506141 5479620 5385356 5308828
11015E308828j9077M223J159R041R436k1681m1243q056K7703J663m5376l5026
$$ 5308828 5289751 5293974 5295133 5304174 5313610 5291929 5250686 5242630 5270333 5271996 5226620 5191594
11003E191594K601k0572p8274n6245M3937Q2400R78q0842n4071K7682O4383N8312
$$ 5191594 5194195 5173623 5095349 5039104 5083041 5165441 5166419 5085577 5031506 5059188 5123571 5181883
10991E181883N2491K6290l9008p5098j9754O7895Q8348M4388R755R228J9132L2968
$$ 5181883 5234374 5260664 5221656 5146558 5126804 5194699 5283047 5327435 5337190 5346418 5365550 5398518
10979E398518M2298J3137l8978k9720N0054P3029k4749r6446J968J52286J32482
$$ 5398518 5440816 5453953 5414975 5385255 5435309 5508338 5483589 5387143 5389111 5541397 5673879
10968E673879l1474j02678k693R1940M9370m2866o5546l7505j7928j56J9807P092
$$ 5673879 5642405 5539727 5537034 5628974 5678344 5635478 5569932 5532427 5514499 5514343 5534150 5541242
10956E541242k0620K58M3307J4945n8299m7107L9853M5932m4409n1992O3375Q6272
$$ 5541242 5520622 5520880 5564187 5579132 5520833 5473726 5513579 5559511 5515102 5463110 5526485 5612757
10944E612757p8495j86780l9864J59405J22790n5675q2418L7191N5651m6346m1626
$$ 5612757 5534262 5347482 5307618 5467023 5589813 5534138 5451720 5488911 5544562 5498216 5456590
10933E456590R6750J20941m7332j57057m4829J03510Q1333j8962j8901L7658J7871
$$ 5456590 5553340 5674281 5626949 5469892 5425063 5528573 5609906 5590944 5572043 5609701 5627572
10922E627572l0766J4234R4402O0976m6174m2387R5609J77594Q5174o2025r1172
$$ 5627572 5596806 5611040 5705442 5766418 5720244 5677857 5773466 5951060 6036234 5974209 5883037
10911E883037n051N7938K4758l6079k8945L8449P3190K9188l2440m1145j8279
$$ 5883037 5877986 5935924 5960682 5924603 5895658 5934107 6007297 6036485 6004045 5962900 5944621
10900E944621j6853j2418M4127R9035N4297n0703o7077K7741Q3486K4380k6312
$$ 5944621 5927768 5915350 5959477 6058512 6112809 6062106 5995029 6022770 6106256 6130636 6104324
10889F104324L1514R1384K5277q1396o0058O3587J13401M0267k9620j5854J8955
$$ 6104324 6135838 6227222 6252499 6171103 6111045 6174632 6288033 6328300 6298680 6282826 6301781
10878F301781J5928J3392M6083O9180L9870r103k5409n626K3711M2713L8925J8014
$$ 6301781 6317709 6331101 6377184 6446364 6486234 6477131 6451722 6446096 6469807 6512520 6551445 6569459
10866F569459J5852N1205P8193M7031m670J172N4951O8504J8333j4704K4455Q1602
$$ 6569459 6585311 6636516 6714709 6761740 6757070 6758242 6813193 6881697 6900030 6885326 6909781 6991383
10854F991383Q3982M5821K9819M9224O2142M2834J6857K3871O2773Q5172N5653
$$ 6991383 7075365 7121186 7151005 7200229 7262371 7305205 7322062 7345933 7408706 7493878 7549531
10843G549531J0996J9753P5725R2763L5914j6030L596L8770J3192k8000M337P5487
$$ 7549531 7560527 7580280 7656005 7748768 7784682 7768652 7772248 7811018 7824210 7796210 7800547 7876034
10831G876034P2977l236l8877O664N0800M3586L5625N6481N6398J6501l752J8819
$$ 7876034 7949011 7945775 7906898 7913562 7964362 8007948 8043573 8100054 8156452 8172953 8169201 8188020
10819H188020K5927J683J9562R6985J25938L9887n8621m2187N8202J20318J05985
$$ 8188020 8213947 8215630 8235192 8332177 8458115 8498002 8439381 8397194 8455396 8575714 8681699
10808H681699O4318K6484K487K3967Q5968J01450K0711n7582j1633J11271J54264
$$ 8681699 8746017 8772501 8774988 8798955 8884923 8986373 9007084 8949502 8937869 9049140 9203404
10797I203404P6506r219j7877J2904K2453J1297j086j4447j8064N735L4377K8844
$$ 9203404 9279910 9270691 9252814 9265718 9288171 9299468 9298382 9283935 9265871 9271606 9305983 9334827
10785I334827O616J5708L8392J2099m5377l5589O1726J29065P0770m4734p6280
$$ 9334827 9341443 9357151 9395543 9407642 9362265 9326676 9388402 9517467 9588237 9543503 9467223
10774I467223N234R6895J06575N2184J5910L9895Q4056Q0532K1244k7545j2074
$$ 9467223 9472457 9569352 9675927 9728111 9744021 9783916 9867972 9948504 9969748 9942203 9930129
10763I930129L5248M7464K5060K6655O4134P8495L8537l890L272K8301R861l7344
$$ 9930129 9965377 10012841 10037901 10064556 10128690 10207185 10245722 10241832 10245104 10273405 10283266 10245922
10751A0245922l5503L9170J08741Q9972N466m3623r114M8515N6088K8921K3225
$$ 10245922 10210419 10249589 10358330 10448302 10453768 10410145 10401031 10449546 10505634 10534555 10557780
10740A0557780K7653j0349o2646l5224O9374J19955M8392l5866j4216N7875N6749
$$ 10557780 10585433 10575084 10512438 10477214 10546588 10666543 10714935 10679069 10664853 10722728 10779477
10729A0779477j839p651M5256O6033M7026O6290J10310P2651l6869o0483N7745
$$ 10779477 10777638 10769987 10815243 10881276 10928302 10994592 11104902 11177553 11140684 11080201 11137946
10718A1137946J54292Q5316n2151p0231L6104J07827O0220l0345o0683j6766M6444
$$ 11137946 11292238 11377554 11325403 11255172 11291276 11399103 11459323 11428978 11368295 11351529 11397973
10707A1397973O9544L2944j9418j8231L6051N6003j1828r7414r8087j9040M3510
$$ 11397973 11467517 11500461 11481043 11462812 11498863 11554866 11543038 11445624 11347537 11328497 11372007
10696A1372007L4089j0574l0707j2300J4792J9706R084J8551M9099M2974k2600
$$ 11372007 11406096 11395522 11364815 11352515 11367307 11387013 11396097 11414648 11463747 11506721 11484121
10685A1484121n8707J7396J18360Q7770l5735m1840J15922K17630J19230j3216
$$ 11484121 11425414 11442810 11561170 11648940 11613205 11571365 11687287 11904917 12024147 12010931
10675A2010931J7010J17036R6427K2713R4130K48176K22965L160j15788K2332
$$ 12010931 12027941 12144977 12241404 12264117 12358247 12606423 12829388 12832548 12716760 12739092
10665A2739092K06942K02943P5371J5633M1112M7550K0830K1603M9677O7107Q3050
$$ 12739092 12946034 13148977 13224348 13239981 13281093 13328643 13349473 13371076 13420753 13487860 13570910
10654A3570910J02800P4708p515m3281K3688R1834O2164J0313N3756J39962J36403
$$ 13570910 13673710 13748418 13740903 13697622 13721310 13813144 13875308 13885621 13939377 14079339 14215742
10643A4215742O3877N6102J23369J43185Q0335L7142O4608Q7956N6462J8122J961
$$ 14215742 14279619 14335721 14459090 14602275 14682610 14719752 14784360 14872316 14928778 14946900 14948861
10632A4948861l1199p0109k9854Q4237J30788M2840m6291l900R0498P9186j4831
$$ 14948861 14917662 14847553 14817699 14901936 15032724 15075564 15029273 15025373 15115871 15195057 15180226
10621A5180226l4231M7031Q4112J063r4105r2429m6478n8282j02655p5870K8638
$$ 15180226 15145995 15193026 15277138 15278201 15184096 15091667 15045189 14986907 14884252 14808382 14837020
10610A4837020J03603P8751N91m8193m1365n164K3999J9839j3424l0595K271M4056
$$ 14837020 14940623 15019374 15019965 14971772 14930407 14925243 14949242 14969081 14955657 14925062 14927333 14971389
10598A4971389K4945l7553m6079K6983Q5047N6323R951L9689J08498J20348Q9397
$$ 14971389 14996334 14958781 14912702 14939685 15024732 15081055 15091006 15130695 15239193 15359541 15448938
10587A5448938J03063J48009J25955M6287M1848J49422K27668J72450P9207Q4848
$$ 15448938 15552001 15700010 15825965 15872252 15914100 16063522 16291190 16463640 16542847 16627695
10577A6627695J58354J76575J31122J22607J87405K55412K68735K40737K00827
$$ 16627695 16786049 16962624 17093746 17216353 17403758 17659170 17927905 18168642 18369469
10568A8369469J63964J51329J71686J91534J82791J77022K11240K53303K51825
$$ 18369469 18533433 18684762 18856448 19047982 19230773 19407795 19619035 19872338 20124163
10559B0124163K24675K20052K26678K08672J91284K14095K34754J90497J27785
$$ 20124163 20348838 20568890 20795568 21004240 21195524 21409619 21644373 21834870 21962655
10550B1962655J47275K33283K66816K09493J47536J44511J76893K25826K97573
$$ 21962655 22109930 22343213 22610029 22819522 22967058 23111569 23288462 23514288 23811861
10541B3811861L36505K65292J41736J19129K05284K29064J14566J0360M3618J21507
$$ 23811861 24148366 24413658 24555394 24674523 24879807 25108871 25223437 25233797 25277415 25398922
10531B5398922J16016Q4140J30913J91309J50406P5324J07601J97629J81285Q2995
$$ 25398922 25514938 25599078 25729991 25921300 26071706 26147030 26254631 26452260 26633545 26716540
10521B6716540R2797K31829K91084J66939K9482N1133J63159K14820K11184K38109
$$ 26716540 26809337 27041166 27332250 27499189 27528671 27579804 27742963 27957783 28168967 28407076
10511B8407076K77681K66017K47677L06859M00998M20884L80235L89221M56995
$$ 28407076 28684757 28950774 29198451 29505310 29906308 30327192 30707427 31096648 31553643
10502C1553643M82542M54426M97772O69085Q45023R00235Q88543R48586J106521
$$ 31553643 32036185 32490611 32988383 33657468 34502491 35402726 36291269 37239855 38346376
10493C8346376J276609J406711J518461J628154J722927J805607J881551J911963
$$ 38346376 39622985 41029696 42548157 44176311 45899238 47704845 49586396 51498359
10485E1498359J860941J772737J709321J631845J471862J321053J384174J684808
$$ 51498359 53359300 55132037 56841358 58473203 59945065 61266118 62650292 64335100
10477F4335100J985655K109753K178099K362949K549683K480959K158405J830137
$$ 64335100 66320755 68430508 70608607 72971556 75521239 78002198 80160603 81990740
10469H1990740J589795J276662Q39273N14574M99410O80339Q72343J112083J476846
$$ 81990740 83580535 84857197 85696470 86211044 86710454 87390793 88263136 89375219 90852065
10460I0852065J781715J749104J398468R85056N85859L3212p17210j427375j867279
$$ 90852065 92633780 94382884 95781352 96766408 97352267 97385479 96668269 95240894 93373615
10451I3373615k037537k011371j776821j372011r92451p98360p42511p32902q39768
$$ 93373615 91336078 89324707 87547886 86175875 85183424 84385064 83642553 82909651 82069883
10442H2069883j173910j654940k078529k360346k552365k659021k607355k397344
$$ 82069883 80895973 79241033 77162504 74802158 72249793 69590772 66983417 64586073
10434F4586073k132817j884570j647085j449254j381569j466698j603727j696315
$$ 64586073 62453256 60568686 58921601 57472347 56090778 54624080 53020353 51324038
10426E1324038j758851j841700j920222j927029j852962j746466j627557j466232
$$ 51324038 49565187 47723487 45803265 43876236 42023274 40276808 38649251 37183019
10418C7183019j258003j069706r69346r31283q64143p40315o36878o09580n92115
$$ 37183019 35925016 34855310 33885964 32954681 32090538 31350223 30713345 30103765 29511650
10409B9511650n02352l96990l96193m71127m60697l31161k52805l32002m24561
$$ 29511650 29009298 28612308 28216115 27744988 27284291 26953130 26700325 26368323 25943762
10400B5943762l54809j94285j45025k27696k81069k33796j77923j70308j54375
$$ 25943762 25588953 25394668 25249643 25021947 24740878 24507082 24329159 24158851 24004476
10391B4004476j16964j42203k39057k74702j75635o4325q3891j87070k19481j45255
$$ 24004476 23887512 23745309 23506252 23231550 23055915 22991590 22907699 22720629 22501148 22355893
10381B2355893p0789p6025j24212j37640r5165m5825n3344j21002j71897j39719
$$ 22355893 22285104 22209079 22084867 21947227 21852062 21806237 21752893 21631891 21459994 21320275
10371B1320275p0329o5581j26914j48274q4457j9655k5895o3131p9925r9959j31129
$$ 21320275 21249946 21184365 21057451 20909177 20824720 20805065 20779170 20716039 20636114 20536155 20405026
10360B0405026j08206k8819k4605j58978k65349j64004M1611R2300m4790j47661
$$ 20405026 20296820 20268001 20243396 20084418 19819069 19655065 19696676 19788976 19744186 19596525
10350A9596525j00346m7064j14739j97003j46209j9701K1737m3084j04274j04897
$$ 19596525 19496179 19449115 19334376 19137373 18991164 18971463 18993200 18950116 18845842 18740945
10340A8740945p9971n6037l5226m8433j10904j49954q9656R768J6154p1820j10755
$$ 18740945 18660974 18604937 18569711 18521278 18410374 18260420 18170764 18180532 18196686 18124866 18014111
10329A8014111k9112O0832K8645q9382j52717j06324k3447J3597k820l8746o9959
$$ 18014111 17984999 18045831 18074476 17985094 17832377 17726053 17702606 17716203 17713383 17674637 17604678
10318A7604678q1284n8612r585K8622K5566p111l3255l8609m0023m7581m2352
$$ 17604678 17523394 17464782 17455197 17483819 17509385 17502274 17469019 17430410 17390387 17342806 17300454
10307A7300454r619K3615J4853l4115p6144q1165o4593m4811j7255O331j4898
$$ 17300454 17290835 17314450 17329303 17295188 17219044 17137879 17073286 17028475 17011220 17017551 17002653
10296A7002653p7532r5839j0167R6549Q3959m5286j32038p8385K0725K7571m2425
$$ 17002653 16925121 16829282 16819115 16915664 16999623 16954337 16822299 16743914 16764639 16792210 16749785
10285A6749785p0981k7105Q747o905k4842j2251j0647m1669m7847P417N5205J9489
$$ 16749785 16678804 16651699 16660446 16653541 16628699 16616448 16605801 16564132 16516285 16523702 16578907 16598396
10273A6598396n0510m1487N2368J14395O7749l1616q6731p2104k1984K8692M7881
$$ 16598396 16547886 16506399 16558767 16673162 16740911 16709295 16622564 16550460 16528476 16557168 16605049
10262A6605049O694p0098r8519m0308K4574O40p8691r8041l9533p923n3173q0959
$$ 16605049 16611743 16541645 16443126 16402818 16427392 16428032 16349341 16251300 16211767 16203844 16150671 16069712
10250A6069712r446P9953N6951n1825j01746n4787k2933o4377q2300k722P3793
$$ 16069712 16060266 16140219 16197170 16145345 16043599 15988812 15965879 15901502 15819202 15816480 15890273
10239A5890273K2292r0030r0311L1449J00555J9576r6758j03972k0234M4540N2506
$$ 15890273 15912565 15822535 15732224 15763673 15864228 15883804 15787046 15683074 15662840 15707380 15759886
10228A5759886L4990O70m8717o1708n47P1062O3358j87k0205J7361K6343k9724
$$ 15759886 15794876 15795546 15746829 15685121 15684574 15755636 15818994 15818807 15798602 15815963 15842306 15812582
10216A5812582q0134o3790j1155K0892J7649j3582n4299n0037L3912J14399N9955
$$ 15812582 15732448 15668658 15657503 15678395 15696044 15682462 15628163 15578126 15612038 15726437 15786392
10205A5786392j04630j88357r4434L6630M0741l5495m6989N932J3163k9019k0563
$$ 15786392 15681762 15493405 15398971 15435601 15476342 15440847 15393858 15399790 15412953 15383934 15363371
10194A5363371M4111O0998J2519M442O4598P2305l3177j21509n9563Q0440J27216
$$ 15363371 15407482 15468480 15480999 15485441 15550039 15622344 15589167 15467658 15408095 15488535 15615751
10183A5615751N2383j9821n623N2715Q5224Q0564O2996N1987N8618P8545Q7369
$$ 15615751 15668134 15648313 15642690 15695405 15780629 15861193 15924189 15976176 16034794 16113339 16200708
10172A6200708P6107P6347J12042J48752J39922J04744J02942J41419J65650J46652
$$ 16200708 16276815 16353162 16465204 16613956 16753878 16858622 16961564 17102983 17268633 17415285
10162A7415285J19296J19450J32069J26602J08669J06479J22541J24215Q3253
$$ 17415285 17534581 17654031 17786100 17912702 18021371 18127850 18250391 18374606 18457859
10153A8457859J5600k6895j5010J3355m438o3293q3656k4909M1124K4791m6282
$$ 18457859 18473459 18446564 18431554 18444909 18440471 18377178 18293522 18268613 18309737 18334528 18288246
10142A8288246o0940J5649R7692J11866R4895J11774J42313J23664P3210Q2719
$$ 18288246 18227306 18242955 18340647 18452513 18547408 18659182 18801495 18925159 18998369 19081088
10132A9081088J79705K65990K36580J20217M9544J00387K07475K53737K09316
$$ 19081088 19260793 19526783 19763363 19883580 19933124 20033511 20240986 20494723 20704039
10123B0704039J51429J58352K17158K48763K07723J35897J10103J46542J78724
$$ 20704039 20855468 21013820 21230978 21479741 21687464 21823361 21933464 22080006 22258730
10114B2258730J43202O7435L7107P9452J26277J10230M8603m457m0713p5388q1337
$$ 22258730 22401932 22469367 22506474 22585926 22712203 22822433 22871036 22866579 22825866 22750478 22669141
10103B2669141k4133N3616O7875J6385j6096J0103L7607K2306J0835N6535J26746
$$ 22669141 22645008 22698624 22766499 22782884 22766788 22776891 22814498 22836804 22847639 22904174 23030920
10092B3030920J53867J29078R3261P9114J04902J74363K41073K32830J57111J12438
$$ 23030920 23184787 23313865 23407126 23486240 23591142 23765505 24006578 24239408 24396519 24508957
10082B4508957J42145J62525J11281P1782J37812K37472K34428J49164J20285
$$ 24508957 24651102 24813627 24924908 24996690 25134502 25371974 25606402 25755566 25875851
10073B5875851J72833J94194J44788J22503J80476K39235K40283K42794K90118
$$ 25875851 26048684 26242878 26387666 26510169 26690645 26929880 27170163 27412957 27703075
10064B7703075L11888K54497J94682K13586K51831K09746J19264Q7515J13789
$$ 27703075 28014963 28269460 28464142 28677728 28929559 29139305 29258569 29346084 29459873
10055B9459873R2254j3233j10157j09978l8666J0158j6895q8979j28855r3426
$$ 29459873 29552127 29538894 29428737 29318759 29280093 29290251 29273356 29184377 29055522 28962096
10045B8962096k5702l304l0513l3561J8577O1820M9252L6997Q5340J42468J22061
$$ 28962096 28936394 28933090 28902577 28869016 28887593 28949413 28998665 29035662 29121002 29263470 29385531
10034B9385531N0260L0677Q5679J34611J26257J00139J05853J39601J75486J96484
$$ 29385531 29435791 29466468 29552147 29686758 29813015 29913154 30019007 30158608 30334094 30530578
10024C0530578J84910J39090J02343J18358J59077J57351J08591P2608P1925O1102
$$ 30530578 30715488 30854578 30956921 31075279 31234356 31391707 31500298 31572906 31644831 31705933
10014C1705933J1692m2374o9755r0794j28789j60078j48065r7033m7013l4149
$$ 31705933 31717625 31675251 31605496 31514702 31385913 31225835 31077770 30980737 30933724 30899575
10004C0899575o3767j01381r4845l4000K3081J9645k0937l3843j2683p295k8793
$$ 30899575 30835808 30734427 30639582 30605582 30628663 30648308 30627371 30593528 30580845 30573550 30544757
9993C0544757l0261M652K2090k2513r3330j15257o0759K1756N3482M308o1400
$$ 30544757 30514496 30519148 30541238 30518725 30425395 30310138 30249379 30271135 30324617 30328925 30267525
9982C0267525m7856M1850R4423N0383J925M1375R5210M6311m1856p284J25151
$$ 30267525 30219669 30261519 30355942 30406325 30408250 30449625 30544835 30591146 30549290 30542006 30667157
9971C0667157J54512L5953k1128J14878K75573K55879J26333Q8328J47971J58779
$$ 30667157 30821669 30857622 30836494 30951372 31226945 31482824 31609157 31697485 31845456 32004235
9961C2004235J11805J41156K54287K88490J77878O3195O0964R5121N9397K828
$$ 32004235 32116040 32257196 32511483 32799973 32977851 33041046 33102010 33197131 33256528 33259356
9951C3259356K4631Q8569Q6730K9788K8555J02092J41291Q9243M0094R3931J96908
$$ 33259356 33283987 33372556 33459286 33489074 33517629 33619721 33761012 33850255 33890349 33984280 34181188
9940C4181188K17798J44446J01321J62720K42992K25058J31196Q6640J45589K39223
$$ 34181188 34398986 34543432 34644753 34807473 35050465 35275523 35406719 35493359 35638948 35878171
9930C5878171K91529L00905K89509K54293K09341K08619K71879L36044L33818
$$ 35878171 36169700 36470605 36760114 37014407 37223748 37432367 37704246 38040290 38374108
9921C8374108K82034K40748K21275J93655J60632J61335K04378K45771K43401
$$ 38374108 38656142 38896890 39118165 39311820 39472452 39633787 39838165 40083936 40327337
9912D0327337K09238J98808K48810L20230L24560K39405J68585K20109L45083
$$ 40327337 40536575 40735383 40984193 41304423 41628983 41868388 42036973 42257082 42602165
9903D2602165L95352L39695K99663L41839L74932L24343K72472L16081L99305
$$ 42602165 42997517 43337212 43636875 43978714 44353646 44677989 44950461 45266542 45665847
9894D5665847M18667L99284M23611M63533M39209L86844M06309M80736N08899
$$ 45665847 46084514 46483798 46907409 47370942 47810151 48196995 48603304 49084040 49592939
9885D9592939M89070N06868N57798N53185N02687N17891O15047O81925O74105
$$ 49592939 50082009 50588877 51146675 51699860 52202547 52720438 53335485 54017410 54691515
9876E4691515O82486P59468Q30198Q32873Q09617Q04367Q01498Q13438Q94869
$$ 54691515 55374001 56133469 56963667 57796540 58606157 59410524 60212022 61025460 61920329
9867F1920329J022223J095172J101268J133890J208370J230838J201914J257442
$$ 61920329 62942552 64037724 65138992 66272882 67481252 68712090 69914004 71171446
9859G1171446J424154J537186J513294J500430J609928J705488J648342J565183
$$ 71171446 72595600 74132786 75646080 77146510 78756438 80461926 82110268 83675451
9851H3675451J640614J793155J815946J732584J740257J859636J916354J859084
$$ 83675451 85316065 87109220 88925166 90657750 92398007 94257643 96173997 98033081
9843I8033081J836108J924246K010392K001420J962227J977819K030839K075488
$$ 98033081 99869189 101793435 103803827 105805247 107767474 109745293 111776132 113851620
9835A13851620K107881K122971K112804K123381K199531K278929K272044K231975
$$ 113851620 115959501 118082472 120195276 122318657 124518188 126797117 129069161 131301136
9827A31301136K287213K413154K451421K370644K315246K354490K378239K310429
$$ 131301136 133588349 136001503 138452924 140823568 143138814 145493304 147871543 150181972
9819A50181972K238006K232584K213174K098894J954225J866940J806138J712742
$$ 150181972 152419978 154652562 156865736 158964630 160918855 162785795 164591933 166304675
9811A66304675J616340J553052J474731J346961J233022J173462J087453R10135
$$ 166304675 167921015 169474067 170948798 172295759 173528781 174702243 175789696 176699831
9803A76699831P27492O45773O11359M94142K84436P9540p1451j89649k81654l47539
$$ 176699831 177427323 178073096 178684455 179178597 179463033 179542573 179471122 179281473 178999819 178652280
9793A78652280m33141n70821p08423p90519q58253r69577j079304j113264j112034
$$ 178652280 178219139 177648318 176939895 176149376 175291123 174321546 173242242 172128978 171016944
9784A71016944j176489j303180j395573j418877j429730j466171j515843j583609
$$ 171016944 169840455 168537275 167141702 165722825 164293095 162826924 161311081 159727472
9776A59727472j687942j794413j846527j859401j899284j979161k054514k108112
$$ 159727472 158039530 156245117 154398590 152539189 150639905 148660744 146606230 144498118
9768A44498118k158893k202821k221859k231454k247969k243575k209149k209819
$$ 144498118 142339225 140136404 137914545 135683091 133435122 131191547 128982398 126772579
9760A26772579k281119k326256k240559k095628k058683k149424k222789k191807
$$ 126772579 124491460 122165204 119924645 117829017 115770334 113620910 111398121 109206314
9752A09206314k122605k090831k081437k064607k050513k031059j971195j887022
$$ 109206314 107083709 104992878 102911441 100846834 98796321 96765262 94794067 92907045
9744I2907045j834505j804016j731255j624892j565931j562586j530551j442304
$$ 92907045 91072540 89268524 87537269 85912377 84346446 82783860 81253309 79811005
9736G9811005j365692j322930j250818j146113j104232j147694j158615j065082
$$ 79811005 78445313 77122383 75871565 74725452 73621220 72473526 71314911 70249829
9728G0249829r59993r37988r42946q91640q31449q40552q65016q01756o82315
$$ 70249829 69289836 68351848 67408902 66517262 65685813 64845261 63980245 63178489 62496174
9719F2496174o31865o77336p20203o84767n92330m99403m44803m44251m71562
$$ 62496174 61864309 61186973 60466770 59782003 59189673 58690270 58245467 57801216 57329654
9710E7329654m68263m24057m02831m33804m43574l74064k97542l11374l75232
$$ 57329654 56861391 56437334 56034503 55600699 55157125 54783061 54485519 54174145 53798913
9701E3798913l71870k94212k46977k73656l02069k73531k22434k01646k09999
$$ 53798913 53427043 53132831 52885854 52612198 52310129 52036598 51814164 51612518 51402519
9692E1402519k20971k20860j97661j43772q6233p2667j14141j69165j85633j42536
$$ 51402519 51181548 50960688 50763027 50619255 50533022 50460355 50346214 50177049 49991416 49848880
9682D9848880o6544k0804m5584r8119j00466n7668n2232r9131j11266o0753n2237
$$ 49848880 49782336 49761532 49715948 49617829 49517363 49459695 49407463 49308332 49197066 49136313 49084076
9671D9084076j44063k18065j59444o2344r2471k20192k73363k13364j68736k04548
$$ 49084076 48940013 48721948 48562504 48500160 48407689 48187497 47914134 47700770 47532034 47327486
9661D7327486k43897k34794k22823k26397j98236j47537j49851j98411j97816
$$ 47327486 47083589 46848795 46625972 46399575 46201339 46053802 45903951 45705540 45507724
9652D5507724j44868j51686k33160k44667j18078L851j8133j13270j35996q7196
$$ 45507724 45362856 45211170 44978010 44733343 44615265 44619116 44600983 44487713 44351717 44264521
9642D4264521o3522q0991q7110p8829q2391p2789k5141R750j4428m4347j7698
$$ 44264521 44200999 44120008 44032898 43954069 43871678 43798889 43773748 43783498 43769070 43724723 43707025
9631D3707025J5218k3147q8660p8761k086M1938K3543J496N137J5631M4139J09145
$$ 43707025 43722243 43699096 43610436 43531675 43529589 43571527 43595070 43596566 43601703 43617334 43661473 43770618
9619D3770618J52662J03987J8831K4780J24145J85833J53993J25177J69653K09337
$$ 43770618 43923280 44027267 44046098 44070878 44195023 44380856 44534849 44660026 44829679 45039016
9609D5039016J56770P1854P5285J66381K30470K05330J51659J48362J81603J73154
$$ 45039016 45195786 45267640 45342925 45509306 45739776 45945106 46096765 46245127 46426730 46599884
9599D6599884R4617J2232J359M2987N0890j892m7491l6684j5285l5554o1347l9074
$$ 46599884 46694501 46706733 46708092 46751079 46801969 46800077 46752586 46715902 46700617 46665063 46603716 46564642
9587D6564642m629k3447o8180o5446l4643n9089j31051j54948j13636r9642j50990
$$ 46564642 46560013 46536566 46468386 46402940 46368297 46309208 46178157 46023209 45909573 45809931 45658941
9576D5658941j85883j51256j12979j27844j37750p9564m765J1123N53L5010Q3252
$$ 45658941 45473058 45321802 45208823 45080979 44943229 44863665 44858900 44870023 44870576 44905586 44988838
9565D4988838N9523j7269l4030M5691J28180J30967R0284Q5460J19675J31628
$$ 44988838 45048361 45031092 44997062 45042753 45170933 45301900 45392184 45477644 45597319 45728947
9555D5728947R6316N9709O7487R4488P5644K478n0213k1338M4500N3212p043n7335
$$ 45728947 45825263 45884972 45952459 46046947 46122591 46125069 46074856 46053518 46098018 46151230 46144187 46086852
9543D6086852n1980l2732l5133k2681L3741Q0369N6428j867j0874L4732O3108
$$ 46086852 46034872 46002140 45967007 45944326 45978067 46058436 46114864 46112997 46102123 46136855 46199963
9532D6199963M2171K3011N6738J23762J66804J62138J39514J42097J72214J82492
$$ 46199963 46242134 46265145 46321883 46445645 46612449 46774587 46914101 47056198 47228412 47410904
9522D7410904J39214Q5842R8259J71766K14140J74309J08685P9863O6630L7592
$$ 47410904 47550118 47635960 47734219 47905985 48120125 48294434 48403119 48482982 48549612 48587204
9512D8587204L5665R7149J51964J18320N1086O8086J55544J87994J37929J13275
$$ 48587204 48622869 48720018 48871982 48990302 49041388 49109474 49265018 49453012 49590941 49704216
9502D9704216J61109J91005J51593J28633J73417J77574N3534p5513l3984J27564
$$ 49704216 49865325 50056330 50207923 50336556 50509973 50687547 50741081 50665568 50631584 50759148
9492E0759148J92311R0599k4658k9582J3305J014n4282r2829j09534j02254k4686
$$ 50759148 50951459 51042058 51017400 50987818 51001123 51002137 50947855 50855026 50745492 50643238 50618552
9481E0618552J10381J76513R8813m338K5019J51384K14265J86688J92322K69082
$$ 50618552 50728933 50905446 51004259 50999921 51024940 51176324 51390589 51577277 51769599 52038681
9471E2038681L02782K43953K13301K97770L92881L74157L05602L28452M25947
$$ 52038681 52341463 52585416 52798717 53096487 53489368 53863525 54169127 54497579 54923526
9462E4923526M60316M00822L57211L93930M50173M58120M25486L83738L51218
$$ 54923526 55383842 55784664 56141875 56535805 56985978 57444098 57869584 58253322 58604540
9453E8604540L56582M08632M46147M12800L67178M05472M91737N02379M33358
$$ 58604540 58961122 59369754 59815901 60228701 60595879 61001351 61493088 61995467 62428825
9444F2428825M03679M41428M48101M14098M66125O16948O75745N41785L98789
$$ 62428825 62832504 63273932 63722033 64136131 64602256 65219204 65894949 66436734 66835523
9435F6835523M45344N94905O42336N88362N71768N92340N58698N38014O74631
$$ 66835523 67280867 67875772 68518108 69106470 69678238 70270578 70829276 71367290 72041921
9426G2041921Q77621Q80112O56072N07320O38043Q78168R60446Q72512P77168
$$ 72041921 72919542 73799654 74455726 74963046 75601089 76479257 77439703 78312215 79089383
9417G9089383P43476P34038P52131Q27761R12072R25040Q75540Q31396Q10416
$$ 79089383 79832859 80566897 81319028 82146789 83058861 83983901 84859441 85690837 86501253
9408H6501253P92913P98255Q56106R35345R84111J010968J055213J109531J140971
$$ 86501253 87294166 88092421 88948527 89883872 90867983 91878951 92934164 94043695 95184666
9399I5184666J159336J201584J272089J346586J407445J442524J453177J488978
$$ 95184666 96344002 97545586 98817675 100164261 101571706 103014230 104467407 105956385
9391A05956385J608005J770894J860328J852431J868605J989764K128849K184340
$$ 105956385 107564390 109335284 111195612 113048043 114916648 116906412 119035261 121219601
9383A21219601K213162K323940K489345K614316K721536K901337L118110L245219
$$ 121219601 123432763 125756703 128246048 130860364 133581900 136483237 139601347 142846566
9375A42846566L288212L401935L660853L965510M215978M437147M681656M940968
$$ 142846566 146134778 149536713 153197566 157163076 161379054 165816201 170497857 175438825
9367A75438825N217476N565881N988419O395624O753352P168326P726531Q330415
$$ 175438825 180656301 186222182 192210601 198606225 205359577 212527903 220254434 228584849
9359B28584849Q819977R207011R657539J0245811J0844263J1292060J1582020
$$ 228584849 237404826 246611837 256269376 266515187 277359450 288651510 300233530
9352C00233530J1816804J2029186J2120774J1978493J1595863J1052961J0410203
$$ 300233530 312050334 324079520 336200294 348178787 359774650 370827611 381237814
9345C81237814R660776Q774265P746460O608830N431013M315825L342304K500580
$$ 381237814 390898590 399672855 407419315 414028145 419459158 423774983 427117287 429617867
9337D29617867J728640J019948M33461j3210l77922o92012r18694j066208j243823
$$ 429617867 431346507 432366455 432799916 432786706 432408784 431716772 430798078 429731870 428488047
9328D28488047j526162j853577k162958k528438l055922l718157m427044n196830
$$ 428488047 426961885 425108308 422945350 420416912 417360990 413642833 409215789 404018959
9320D04018959o082701p016128p871419q656529r458322j0224382j0793675j1138829
$$ 404018959 397936258 390920130 383048711 374392182 364933860 354709478 343915803 332776974
9312C32776974j1374556j1513793j1436734j1146511j0825972j0553740j0181153
$$ 332776974 321402418 309888625 298451891 287305380 276479408 265925668 255744515
9305B55744515r609137q985293q477672q029030p505242o943305o472336o096363
$$ 255744515 246135378 237150085 228672413 220643383 213138141 206194836 199722500 193626137
9297A93626137n724764n333784m950671m562139m174582l871896l678259l468742
$$ 193626137 187901373 182567589 177616918 173054779 168880197 165008301 161330042 157861300
9289A57861300l160516k872827k726467k609253k352857k038991j882711j872764
$$ 157861300 154700784 151827957 149101490 146492237 144139380 142100389 140217678 138344914
9281A38344914j788407j557709j344562j257676j210005j115385j010469r18632
$$ 138344914 136556507 134998798 133654236 132396560 131186555 130071170 129060701 128142069
9273A28142069p86696o24824n30684n07435m32699k78147j79633k00700k03882
$$ 128142069 127355373 126730549 126199865 125692430 125259731 124981584 124801951 124601251 124397369
9264A24397369p1545J03470J79868J88005K45115L50195M06372L86654L56952
$$ 124397369 124325824 124429294 124609162 124797167 125042282 125392477 125798849 126185503 126542455
9255A26542455L69899M19707M68456M65596L90560L06521K99728L46059L38274
$$ 126542455 126912354 127332061 127800517 128266113 128656673 128963194 129262922 129608981 129947255
9246A29947255K64916K28217K48718K16517J06675O1026J40022J74773L2927j27144
$$ 129947255 130212171 130440388 130689106 130905623 131012298 131073324 131213346 131388119 131421046 131293902
9236A31293902q1196R3651J16775p9790k69434k72654j70089j24228j61197k11475
$$ 131293902 131212706 131306357 131423132 131343342 131073908 130801254 130631165 130506937 130345740 130134265
9226A30134265k48238k95852l60715m15997m34786m21595m22284m78564n51083
$$ 130134265 129886027 129590175 129229460 128813463 128378677 127957082 127534798 127056234 126505151
9217A26505151n41660m34400l44228l59910m15990m07199l49690l17552k93215
$$ 126505151 125963491 125529091 125184863 124824953 124408963 124001764 123652074 123334522 123041307
9208A23041307k16841j30823j28860j92104k17265j85227j61828j49998q8663
$$ 123041307 122824466 122693643 122564783 122372679 122155414 121970187 121808359 121658361 121569698
9199A21569698O393M7114K5885K8484Q8673J61401K39865L58363M77990N20031
$$ 121569698 121576091 121623205 121649090 121677574 121766247 121927648 122167513 122525876 123003866 123523897
9189A23523897N19714N90134P25421Q11231Q44315R45698J118457J206634J169721
$$ 123523897 124043611 124633745 125359166 126170397 127014712 127960410 129078867 130285501 131455222
9180A31455222J182502J350242J530722J585946J621358J791717K024321K143097
$$ 131455222 132637724 133987966 135518688 137104634 138725992 140517709 142542030 144685127
9172A44685127K158892K227063K386476K539484K649723K774182K916032L011169
$$ 144685127 146844019 149071082 151457558 153997042 156646765 159420947 162336979 165348148
9164A65348148L059334L126583L217289L269704L275485L284926L297221L259832
$$ 165348148 168407482 171534065 174751354 178021058 181296543 184581469 187878690 191138522
9156A91138522L175721L104488L058637K999264K929887K895133K891055K872067
$$ 191138522 194314243 197418731 200477368 203476632 206406519 209301652 212192707 215064774
9148B15064774K838042K819642K792582K710886K612603K579689K595106K553421
$$ 215064774 217902816 220722458 223515040 226225926 228838529 231418218 234013324 236566745
9140B36566745K419773K266560K139544J999107J817925J631502J459067J267649
$$ 236566745 238986518 241253078 243392622 245391729 247209654 248841156 250300223 251567872
9132B51567872J048279Q44627O75994N09758L36855J99730J19790O7111K3967
$$ 251567872 252616151 253460778 254136772 254646530 254983385 255183115 255302905 255370016 255393983
9123B55393983J2147L9208P8698J14051J46384J64232J65301J86498K40329K57034
$$ 255393983 255406130 255445338 255524036 255638087 255784471 255948703 256114004 256300502 256540831 256797865
9113B56797865J82104Q8023P1040P9256j0119j73316k72415k93880l61498m95857
$$ 256797865 256979969 257067992 257139032 257218288 257208169 257034853 256762438 256468558 256107060 255611203
9103B55611203n68623n42479n43336o18976o41714n54307m94980n42305n52004
$$ 255611203 255042580 254500101 253956765 253337789 252696075 252141768 251646788 251104483 250552479
9094B50552479m22487l17277m03945n48799n28942m13564m52437o69559q57183
$$ 250552479 250129992 249812715 249408770 248859971 248331029 247917465 247465028 246795469 245938286
9085B45938286r37478j045005j241988j420760j533600j676029j876696k026135
$$ 245938286 245000808 243955803 242713815 241293055 239759455 238083426 236206730 234180595
9077B34180595k091704k195567k387160k534638k553108k560313k673370k805562
$$ 234180595 232088891 229893324 227506164 224971526 222418418 219858105 217184735 214379173
9069B14379173k812564k720401k660846k670690k693387k711637k750258k792874
$$ 214379173 211566609 208846208 206185362 203514672 200821285 198109648 195359390 192566516
9061A92566516k801902k787771k782712k790500k819860k899585k999565l022823
$$ 192566516 189764614 186976843 184194131 181403631 178583771 175684186 172684621 169661798
9053A69661798k951170k904149k959169l010582k927380k763885k668436k644096
$$ 169661798 166710628 163806479 160847310 157836728 154909348 152145463 149477027 146832931
9045A46832931k560706k379166k204921k108396k031343j905926j756911j642007
$$ 146832931 144272225 141893059 139688138 137579742 135548399 133642473 131885562 130243555
9037A30243555j568328j503079j413461j282757j134608j033624j005387r73877
$$ 130243555 128675227 127172148 125758687 124475930 123341322 122307698 121302311 120328434
9029A20328434q48384o56643n14159m71615m70390m40150l62528k49736j42251
$$ 120328434 119480050 118823407 118309248 117837633 117367243 116927093 116564565 116314829 116172578
9020A16172578j13215j85623k60825k29002j34387j14688j87029k32448k03565
$$ 116172578 116059363 115873740 115612915 115383913 115249526 115134838 114947809 114715361 114511796
9011A14511796j94323k59820l16030k89068k30350k01289j68874j08374q8236
$$ 114511796 114317473 114057653 113741623 113452555 113222205 113020916 112852042 112743668 112655432
9002A12655432j45022j87907j48037j13137j75612k53110k27527j72592k44201
$$ 112655432 112510410 112322503 112174466 112061329 111885717 111632607 111405080 111232488 110988287
8993A10988287m01087m56332l92664l93593n27267o33410o11626o01828p33910
$$ 110988287 110587200 110130868 109738204 109344611 108817344 108183934 107572308 106970480 106236570
8984A06236570q81871q57985p24717o99577q17195r03441q71383q29277q52898
$$ 106236570 105354699 104496714 103771997 103072420 102255225 101351784 100480401 99651124 98798226
8975I8798226q48101p40568o46401p07871q53348q83410p62551o66498p19818
$$ 98798226 97950125 97209557 96563156 95855285 95001937 94118527 93355976 92689478 91969660
8966I1969660q30474q54453q10186q16812q86928r17238q73295q46160q87334
$$ 91969660 91139186 90284733 89474547 88657735 87770807 86853569 85980274 85134114 84246780
8957H4246780r09056q28209p14820o88476p27814p09243o10651n43095n65756
$$ 84246780 83337724 82509515 81794695 81106219 80378405 79669162 79058511 78515416 77949660
8948G7949660n95314n48073m68060m45415m85579n32195n60244n75430n69070
$$ 77949660 77354346 76806273 76338213 75892798 75407219 74875024 74314780 73739350 73170280
8939G3170280n40768n24405n31272n14228m51112m07559m38071m81974m57412
$$ 73170280 72629512 72105107 71573835 71059607 70608495 70200936 69762865 69280891 68823479
8930F8823479m07933m30277m88392m50731l19274k60138l51719m49414l96387
$$ 68823479 68415546 67985269 67496877 67046146 66726872 66466734 66115015 65665601 65269214
8921F5269214k52311j90052k42964k90416k59623k09649k07117k26897k12366
$$ 65269214 65016903 64826851 64583887 64293471 64033848 63824199 63617082 63390185 63177819
8912F3177819j61462j11232p9969n9712m3712l7595n0154p7995r5685p4806k6311
$$ 63177819 63016357 62905125 62825156 62765444 62721732 62684137 62633983 62555988 62460303 62385497 62359186
8901F2359186l032l4341p6679o3051P385O3407M7134j8548n3564l143J01652J69537
$$ 62359186 62356154 62321813 62245134 62182083 62189468 62252875 62300009 62281461 62227897 62224754 62326406 62495943
8889F2495943J50806J02063J12436J76172K02484J57855J14883J27781J51684
$$ 62495943 62646749 62748812 62861248 63037420 63239904 63397759 63512642 63640423 63792107
8880F3792107J45284J58930K29372K73056K06906J10925J26570K32089K76170
$$ 63792107 63937391 64096321 64325693 64598749 64805655 64916580 65043150 65275239 65551409
8871F5551409K21485J85808K23923K42274J82771J26639J33567J26270L7666n8442
$$ 65551409 65772894 65958702 66182625 66424899 66607670 66734309 66867876 66994146 67031812 66973370
8861F6973370q0602q6211j54076k24798k08140j67226k30420l71084m41793m02722
$$ 66973370 66892768 66806557 66652481 66427683 66219543 66052317 65821897 65450813 65009020 64606298
8851F4606298l54909l53045l44335l08769l08443l57717l74496l10206k21749
$$ 64606298 64251389 63898344 63554009 63245240 62936797 62579080 62204584 61894378 61672629
8842F1672629j72915j62859j83893k43566k93941k52266j38853q2391j34774j95849
$$ 61672629 61499714 61336855 61152962 60909396 60615455 60363189 60224336 60141945 60007171 59811322
8832E9811322j84370j58522j80972j90708j27761p6153j38270k48474k69737k20116
$$ 59811322 59626952 59468430 59287458 59096750 58968989 58892836 58754566 58506092 58236355 58016239
8822E8016239k32947l16770l35589k46761j85446k49106l43285l36239k57728
$$ 58016239 57783292 57466522 57130933 56884172 56698726 56449620 56106335 55770096 55512368
8813E5512368k30797k74288k93449k43071j89273j92004k11646j80407j17548
$$ 55512368 55281571 55007283 54713834 54470763 54281490 54089486 53877840 53697433 53579885
8804E3579885j08752j75093k22989j61687l4538K8155j9679q8159r2109o6869
$$ 53579885 53471133 53296040 53073051 52911364 52876826 52904981 52885302 52797143 52705034 52638165
8794E2638165r0727j58947k13840k51662l05542l53056l46621l24015l72967m74219
$$ 52638165 52547438 52388491 52174651 51922989 51617447 51264391 50917770 50593755 50220788 49746569
8784D9746569n00197m09078l24173l53762m33905m38557l63304k96519k69350
$$ 49746569 49246372 48837294 48513121 48159359 47725454 47286897 46923593 46627074 46357724
8775D6357724k47554k33350k57195k85139k52686j92796k10659l08389l57311
$$ 46357724 46110170 45876820 45619625 45334486 45081800 44889004 44678345 44369956 44012645
8766D4012645k97565k48552l30517m68720m96779m02980l38033l84703m53148
$$ 44012645 43715080 43466528 43136011 42667291 42170512 41767532 41429499 41044796 40591648
8757D0591648m42119l88084l79901m08076l93941l24856k66214k54559k63487
$$ 40591648 40149529 39761445 39381544 38973468 38579527 38254671 37988457 37733898 37470411
8748C7470411k73728k95565l10829k73208j92834j46093j63829j80976j45220
$$ 37470411 37196683 36901118 36590289 36317081 36124247 35978154 35814325 35633349 35488129
8739C5488129j03562j12999j31775r2395l5532n8435j46661j76663j02986l0687
$$ 35488129 35384567 35271568 35139793 35047398 35011866 34953431 34806770 34630107 34527121 34496434
8729C4496434n5239j25897j37317q6734n7911q8108j31259j41852j29436j22385
$$ 34496434 34441195 34315298 34177981 34091247 34033336 33945228 33813969 33672117 33542681 33420296
8719C3420296j21934j07245o7446k2408j2800n5658j09068j10214n7959k2054
$$ 33420296 33298362 33191117 33123671 33101263 33088463 33032805 32923737 32813523 32755564 32733510
8709C2733510n1438j09893j29790r7680n5912m6470q1935j45499j92292j79231
$$ 32733510 32682072 32572179 32442389 32344709 32288797 32242327 32160392 32014893 31822601 31643370
8699C1643370j21667r0054j22411j75283j92576j80566j72554j61445j22641p3420
$$ 31643370 31521703 31431649 31309238 31133955 30941379 30760813 30588259 30426814 30304173 30230753
8689C0230753n4068p1009j03072j35913j50134j20253p6289j06513k25130l03231
$$ 30230753 30176685 30105676 30002604 29866691 29716557 29596304 29520015 29413502 29188372 28885141
8679B8885141k38286j36086j81694l55692m45277l55389k37137k42671l10913
$$ 28885141 28646855 28510769 28329075 27973383 27528106 27172717 26935580 26692909 26381996
8670B6381996l03798k29191j94209k20387k42043k38981k43170k42720j98877
$$ 26381996 26078198 25849007 25654798 25434411 25192368 24953387 24710217 24467497 24268620
8661B4268620j44070j49734j98889j99763j36016r6949j31141j68562j34698o2108
$$ 24268620 24124550 23974816 23775927 23576164 23440148 23343199 23212058 23043496 22908798 22846690
8651B2846690l1578n9719j00451j17047j03301o4803k3055j2683l6128m5702q547
$$ 22846690 22815112 22755393 22654942 22537895 22434594 22369791 22346736 22334053 22297925 22252223 22243676
8640B2243676L5565K5808k8490n9466l9269j4308k9071o5397q8644j14904j80110
$$ 22243676 22279241 22305049 22276559 22217093 22177824 22163516 22134445 22069048 21980404 21865500 21685390
8629B1685390k57282k68074j95410j28647j50436k17528k20404j45738r8260j43571
$$ 21685390 21428108 21160034 20964624 20835977 20685541 20468013 20247609 20101871 20003611 19860040
8619A9860040k08903j91310j05410n4073q5097j48985j85877j85664j59448j14035
$$ 19860040 19651137 19459827 19354417 19300344 19215247 19066262 18880385 18694721 18535273 18421238
8609A8421238p1714o7659j06850j54891j81947j86274j72180j41528j12353j08796
$$ 18421238 18349524 18281865 18175015 18020124 17838177 17651903 17479723 17338195 17225842 17117046
8599A7117046j25808j38711j47799j69574j83432j45112o7839k8087n9210r6117
$$ 17117046 16991238 16852527 16704728 16535154 16351722 16206610 16138771 16110684 16051474 15955357
8589A5955357o9857r582M371m4303r8118j13739j04399r7833r7732r4227q3786
$$ 15955357 15885500 15875918 15880289 15835986 15737868 15624129 15519730 15421897 15324165 15229938 15146152
8578A5146152p2695p2612q4032p8153k5293M1725L7739n9453j46504j11880J0125
$$ 15146152 15073457 15000845 14916813 14838660 14813367 14855092 14892831 14833378 14686874 14574994 14585119
8567A4585119P9320L5500l9642n8765l7911k7867j8082J8638M1965m248q0299
$$ 14585119 14664439 14699939 14660297 14601532 14563621 14535754 14517672 14536310 14578275 14574027 14493728
8556A4493728q7353k3390q233j11001k32414k33827j33567p9552j37860k10549
$$ 14493728 14406375 14382985 14374752 14263751 14031337 13797510 13663943 13584391 13446531 13235982
8546A3235982j95042j33872j33650j94431k16353j60356j06882j32493k02166
$$ 13235982 13040940 12907068 12773418 12578987 12362634 12202278 12095396 11962903 11760737
8537A1760737k24812j68170q0840l4078o8266j60486k23283j83152q7171o9710
$$ 11760737 11535925 11367755 11286915 11252837 11184571 11024085 10800802 10617650 10530479 10460769
8527A0460769j68197k45102j72495k9003M224r1852j57705j11649o5319j16883
$$ 10460769 10292572 10047470 9874975 9845972 9850196 9758344 9600639 9488990 9423671 9306788
8517I306788j74026j09175R977J0691j03562j40633j6430J01064L6493j27163
$$ 9306788 9132762 9023587 9033564 9044255 8940693 8800060 8783630 8884694 8921187 8794024
8507H794024j65426l5129P3623J6456j12866j34856l1292N9880N0108p248l3272
$$ 8794024 8628598 8593469 8667092 8683548 8570682 8435826 8404534 8464414 8514522 8507274 8474002
8496H474002l7682p1593j24831j33107p2205M066K8543l019l4607k1105J7475
$$ 8474002 8436320 8364727 8239896 8106789 8034584 8038650 8067193 8064174 8029567 8008462 8025937
8485H025937K5089j0630l7430j7273P758k3291q5594r5602m2079q187m0349q1665
$$ 8025937 8051026 8040396 8002966 7985693 7993451 7970160 7884566 7788964 7746885 7738698 7698349 7616684
8473G616684q0985p8516j10853j17962m9463Q450n1871j61304j49445j2075O6807
$$ 7616684 7535699 7457183 7346330 7228368 7178905 7187355 7135484 6974180 6824735 6812660 6879467
8462F879467m457r2917o8450o070l6698j20574j25568n2669j8325n0732o5566
$$ 6879467 6875010 6782093 6713643 6707573 6670875 6550301 6424733 6372064 6353739 6303007 6237441
8451F237441l7991m3254j02613j30973q5277l9838n0007n4238K654M5354k0483
$$ 6237441 6199450 6156196 6053583 5922610 5837333 5797495 5747488 5693250 5695904 5741258 5720775
8440E720775j33633j40525j8391Q2766M7106n4020p4388L758O0040J5295o1974
$$ 5720775 5587142 5446617 5428226 5510992 5558098 5504078 5429690 5433448 5493488 5508783 5446809
8429E446809o4276k308J8582l8454q9027o3643j3636j8127n1831l8708L882j0670
$$ 5446809 5382533 5380225 5398807 5360353 5271326 5207683 5194047 5175920 5124089 5085381 5089263 5078593
8417E078593p7720q8455p082N5447P196q1456q3757L539P5980P0622J3113n1607
$$ 5078593 5000873 4912418 4905336 4960783 4967979 4886523 4802766 4806305 4882285 4952907 4966020 4914413
8405D914413r2243p5861R63P5156P8267K4328k1077l6613m3457l6103J000K6513
$$ 4914413 4822170 4746309 4747272 4822428 4900695 4925023 4903946 4867333 4823876 4787773 4788773 4815286
8393D815286j3437q0135q1201j8854O649m1604q5181p3125n8637p7117o5978R216
$$ 4815286 4801849 4721714 4640513 4621659 4628308 4586704 4501523 4428398 4369761 4292644 4226666 4235882
8381D235882N5721p941r8561q1706J8034N6255j0502p8182o6324j1140K6906L7638
$$ 4235882 4291603 4283662 4185101 4103395 4121429 4177684 4167182 4089000 4022676 4011536 4038442 4076080
8369D076080K1502k3405n1530n820P2119P1512j6532o9291j9733M4605L8243J3611
$$ 4076080 4097582 4074177 4022647 4016827 4088946 4160458 4143926 4074635 4054902 4099507 4137750 4151361
8357D151361M2700P2211K5366l6262k485Q7084R4812J4923j2350O9041J43476
$$ 4151361 4194061 4266272 4291638 4255376 4252891 4339975 4434787 4449710 4437360 4506401 4649877
8346D649877J14236M3661L1215O4746P8127O7992O2801M2727k1231r6969j38285
$$ 4649877 4764113 4807774 4838989 4903735 4981862 5049854 5112655 5155382 5134151 5037182 4898897
8335D898897j58594j85389j88474j34940p4370p7948j20024j14476n3598j3015
$$ 4898897 4740303 4554914 4366440 4231500 4157130 4079182 3959158 3844682 3791084 3778069
8325C778069j8846j1313L6094N4442j4564j15712j40860o0633M6046Q0019J9520
$$ 3778069 3759223 3747910 3784004 3838446 3823882 3708170 3567310 3506677 3552723 3632742 3652262
8314C652262o0233o5975J565L9590j9029j00884r4269k0447K629m2829m5970L3740
$$ 3652262 3592029 3526054 3527619 3567209 3548180 3447296 3353027 3332580 3335209 3292380 3246410 3280150
8302C280150Q0193J2432o3481j4801J01695J30974O7269M5427J04231J31270P2921
$$ 3280150 3360343 3372775 3309294 3294493 3396188 3527162 3594431 3639858 3744089 3875359 3948280
8291C948280L5451J00484J73831J27490j005p3554o0383n9911j30592k19088k63955
$$ 3948280 3983731 4084215 4258046 4385536 4384531 4310977 4250594 4190683 4060091 3841003 3577048
8280C577048k69192k47784j81340q1551k0902m4167r8830j10901q8226q3816r1391
$$ 3577048 3307856 3060072 2878732 2797181 2776279 2732112 2633282 2522381 2434155 2350339 2258948
8269B258948o0247k944L613n5713r2746m6052J9706R799n9962r7453p2281l2360
$$ 2258948 2198701 2195757 2199370 2143657 2050911 2004859 2024565 2034364 1974402 1876949 1804668 1772308
8257A772308l759K9196M6432O04p4919p3818J9945P9356J6938p4264o0172L1829
$$ 1772308 1768549 1797745 1844177 1844781 1769862 1696044 1715989 1795345 1812283 1738019 1677847 1709676
8245A709676P1628L4220R866L0309L3665J1720M1243J24835J44346M8982l9396
$$ 1709676 1781304 1815524 1825390 1855699 1889364 1901084 1942327 2067162 2211508 2260490 2221094
8234B221094j3196L9991k1035j49917j76757p9320j6144o9269j20579n8966K7547
$$ 2221094 2207898 2247889 2226854 2076937 1900180 1820860 1804716 1735447 1614868 1555902 1583449
8223A583449j0041j35386j67081m8135O6862L7545o2270o3386M3729R6749P516
$$ 1583449 1573408 1438022 1270941 1222806 1289668 1327213 1264943 1201557 1245286 1342035 1349551
8212A349551j02300q0784K8283N5274l7285j06041n6389J9136Q304l5765l600
$$ 1349551 1247251 1166467 1194750 1250024 1212739 1106698 1050309 1069445 1077749 1041984 1038384
8201A038384N9693J8801j02609j19432K8669J57074R6840n9446j04858j7248M6378
$$ 1038384 1098077 1116878 1014269 894837 923506 1080580 1177420 1117974 1013116 995868 1042246
8190A042246Q662m1697k7803N565M802n18J4369O95o1153q6791j7107N8575K9757
$$ 1042246 1050908 1009211 981408 986973 991775 991257 1005626 1006321 945168 858377 841270 899845 929602
8177I29602m6823l0567O3004P1385m9981j38567o7068O8977J07256M8097L315
$$ 929602 882779 852212 915216 986601 936620 798053 730985 799962 907218 955315 958630
8166I58630p30k6455p5664p9798l1788j844j3068j4013R674O563l0573l2658K5469
$$ 958630 957900 931445 855781 775983 744195 742351 729283 715270 724944 731507 700934 668276 693745
8153F93745O8251L5137k7765m5470j4479K2856M0474K5937j7216l5727K1293R1096
$$ 693745 761996 797133 769368 723898 709419 732275 772749 798686 781470 745743 767036 858132
8141H58132N0505p7666j12712R442J05579K0498j15185q7893N4707R0459j3008
$$ 858132 908637 830971 718259 727701 833280 853778 738593 650700 705407 795866 782858
8130G82858p1661j1336L3249j3071l9491K3376O6199P043n4216k1934K2314j6881
$$ 782858 711197 699861 733110 720039 680548 703924 770123 777166 722950 701016 723330 706449
8118G06449o1485n603P6053M9425m4552o5812j3591K930k0140M431N3269J2093
$$ 706449 644964 639361 715414 764839 720287 654475 640884 643814 623674 628105 681374 693467
8106F93467r6746j09923J3336J11622P1730j2357k0632N885k2887o7740l2866
$$ 693467 596721 486798 500134 611756 683486 671129 650497 656382 633495 565755 532889
8095E32889N5381P9034J1497m4728j0711O1152O3129k3022r3780m7849P3010J17778
$$ 532889 588270 667304 678801 634073 623362 684514 747643 724621 630841 582992 656002 773780
8083G73780K5526p9183o1674K3792L0882l7245m8744J2611K0697m6884m9027N3829
$$ 773780 799306 720123 658449 682241 713123 675878 627134 639745 660442 613558 564531 618360
8071F18360R2531k0926j06288n841J25183O2650r8879r5011N9897R9268l5411
$$ 618360 710891 689965 583677 577836 703019 765669 666790 571779 631676 730944 695533
8060F95533r9647K3899J25725L9781p5867k9633P1064K5641r7570q1430O3424
$$ 695533 595886 619785 745510 785291 709424 679791 750855 776496 678926 597496 660920
8049F60920J20573K4557o5058m9524j1351j1352J4826Q6785R8785L878q1440n8722
$$ 660920 781493 806050 740992 691468 680117 668765 683591 770376 869161 873039 791599 732877
8037G32877L782Q585j2013J0233M0542K3525O848M6091P0984k596r4625o1456
$$ 732877 736659 745244 733231 743464 784006 807531 814379 860470 931454 928858 834233 772777
8025G72777O5557J15266L8836l6554k8958l938j6120j6267J7115J0811n0078n0471
$$ 772777 838334 953600 992436 955882 926924 922986 906866 890599 907714 918525 868447 817976
8013H17976O0032J37783N4276p9258o8147O4313J21801M2771l3729j5374K1177
$$ 817976 878008 1015791 1070067 990809 922662 986975 1108776 1151547 1117818 1102444 1123621
8002A123621L177j3311K6792O1217K3814l1089k1868K3093K4991r008j1480K3855
$$ 1123621 1126798 1113487 1140279 1201496 1225310 1194221 1172353 1195446 1220437 1211429 1199949 1223804
7990A223804M2990K9989J9398K4367K4902J7263J3345M857j5501j8169J7988M8680
$$ 1223804 1266794 1296783 1316181 1340548 1365450 1382713 1396058 1400915 1385414 1367245 1385233 1433913
7978A433913K0493l6428m6793o749J8772R369J2440M4657N8748L4475K0765M6533
$$ 1433913 1454406 1417978 1371185 1364436 1383208 1392577 1405017 1449674 1508422 1542897 1563662 1610195
7966A610195O0415J2354n7696o9737j0155N9527Q0009M5795j744r004L9364Q8590
$$ 1610195 1670610 1682964 1625268 1555531 1545376 1604903 1684912 1730707 1728963 1719959 1759323 1847913
7954A847913O6541j3770n1568R281R5316J03437M5354K1771P0045J15003Q4873
$$ 1847913 1914454 1900684 1849116 1858397 1953713 2057150 2102504 2124275 2194320 2309323 2394196
7943B394196J1435k0981J4281O9225R5876R5632R0791Q1386N4056J9861J3153
$$ 2394196 2405631 2384650 2398931 2468156 2564032 2659664 2750455 2831841 2885897 2905758 2918911
7932B918911M6644R0615J10505J04993Q8754O0930K2510O840M8139J21869J59594
$$ 2918911 2965555 3056170 3166675 3271668 3360422 3421352 3443862 3450702 3498841 3620710 3780304
7921C780304J29787O6743J5324j0750r857J6356L6243P616m7797m6240L7941J08257
$$ 3780304 3910091 3976834 3992158 3981408 3971551 3987907 4024150 4031766 3983969 3937729 3975670 4083927
7909D083927O6674l9980p3002J2574J16953J41197J07380R5202J17233J18172
$$ 4083927 4150601 4110621 4037619 4050193 4167146 4308343 4415723 4510925 4628158 4746330
7899D746330P4266L0058K6263L8797J9786l0013p2373j03017j56864k29697k55928
$$ 4746330 4820596 4850654 4876917 4915714 4935500 4905487 4833114 4730097 4573233 4343536 4087608
7888D087608k07704j62202j98598k65190k44797j41732r1271j57343k33853k08565
$$ 4087608 3879904 3717702 3519104 3253914 3009117 2867385 2776114 2618771 2384918 2176353
7878B176353j25529r4669j17469j13115p0190n4733q4931j07398r8515q8717p7064
$$ 2176353 2050824 1956155 1838686 1725571 1655381 1600648 1515717 1408319 1309804 1221087 1144023
7867A144023k1907N9620P9456O894p5021r0538p1198p4685p6584k7450L1519J0945
$$ 1144023 1122116 1181736 1261192 1268086 1193065 1102527 1031329 956644 880060 852610 884129 895074
7855H95074p9276j20428m6391O0141P7829K652o3567n5238r635J0727Q02j0184
$$ 895074 815798 695370 648979 709120 786949 789601 726034 670796 661161 671888 672690 662506
7843F62506j6279k5339k6153j4276k0139n3803n6320J3559P5368K2788q7417q7057
$$ 662506 646227 620888 594735 580459 560320 506517 450197 463756 539124 561912 474495 387438
7831C87438L6283Q9293l2398j66618j31534j00M6595J6865M4477J10433P3360
$$ 387438 423721 513014 480616 313998 182464 182364 228959 245824 290301 400734 474094
7820D74094n0910q8510k859M7042j1360n5648j2417J8343j9692k0370O1375Q2430
$$ 474094 423184 334674 331815 378857 367497 311849 299432 317775 298083 277713 339088 421518
7808D21518l6739j34384o4232N3626M4474k6519n571N0828n425j07034p2094N4298
$$ 421518 384779 250395 186163 239789 284263 257744 252173 303001 297576 190542 118448 172746
7796A72746N8489o3314q7527M9061J36253M1499q8280q6285m475L2038K2069J3973
$$ 172746 231235 167921 80394 129455 265708 307207 218927 132642 128167 160205 182274 196247
7784A96247p261m1376k2144N0924O7705j0822p0327l8789r259n6329q9659k5169
$$ 196247 188986 147610 125466 176390 244095 233273 162946 124157 114898 58569 -31090 -56259
7772e6259M8506K8096j6319K1662Q1272M7667l3510m0840O114K048l9347k3158
$$ -56259 -7753 20343 4024 25686 106958 154625 121115 80275 86389 88437 49090 25932
7760B5932L7253N1791K7584K9215J6021q0925j62922p3022J12163J44879j2039
$$ 25932 63185 114976 142560 171775 187796 106871 -56051 -129073 -16910 127969 115930
7749A15930j14157j8769J00444M7480r2835j14761r676N7187P638p1579p8768
$$ 115930 1773 -16996 83448 130928 38093 -76668 -86344 -29157 -21519 -93098 -171866
7738a71866p597P8642J08723N7072k3506n6164m1096l7731m2777O104Q2661O7368
$$ -171866 -179463 -100821 7902 64974 41468 -14696 -55792 -93523 -136300 -130196 -47535 19833
7726A9833m8634j02481k973J04966N6982o9841q4139J7208O7445J1147l2124N410
$$ 19833 -28801 -131282 -134255 -29289 27693 -42148 -126287 -109079 -41634 -30487 -62611 -57201
7714e7201L5457j0047n4252j3211N5970M6231k9947o3189j1329M6266K8030l6976
$$ -57201 -21744 -31791 -86043 -99254 -43284 2947 -27000 -90189 -101518 -55252 -27222 -64198
7702f4198n3865K387M8768J5653m1754k2775N2212O1252j6609m6404M5249J24118
$$ -64198 -118063 -115676 -66908 -51255 -93009 -115784 -63572 -2320 -18929 -65333 -20084 104034
7690A04034M4218j08370j31618j3053O5051J8221l3035P097N0194r918j06454
$$ 104034 148252 39882 -91736 -104789 -39738 -21517 -54552 -47455 2739 -7179 -113633
7679a13633j01097L354P4578M1616k6877l3979K4105O5027K4285n8464p3812J5156
$$ -113633 -214730 -211376 -136798 -95182 -122059 -156038 -131933 -66906 -42621 -101085 -174897 -159741
7667a59741J01579O8369m0600q2179k9848L119k9591l1701M4630Q7632J3023p2354
$$ -159741 -58162 10207 -30393 -112572 -142420 -139301 -168892 -200593 -155963 -68331 -55308 -127662
7655a27662l5572N8758N4016m0203p2104K454O7966M7798m031k9219l8997l1881
$$ -127662 -163234 -104476 -50460 -90663 -162767 -160313 -92347 -44549 -48580 -77799 -116796 -148677
7643a48677K5322R3707P1137m1391j05645m4066M3353L8184k5201m0280M907M0781
$$ -148677 -123355 -29648 41489 98 -105547 -149613 -106260 -68076 -93277 -133557 -128650 -87869
7631h7869L4347M198l3179n6026k7887L4962M8241j4830n6121r94O4119K1059
$$ -87869 -53522 -49324 -82503 -138529 -166416 -131454 -83213 -98043 -154164 -155158 -91039 -69980
7619f9980p8786q6344R976P5579M7722P445J5364K3971l803k2555q015j2323n0764
$$ -69980 -148766 -235110 -225134 -149555 -101833 -94388 -79024 -55053 -58856 -81411 -89426 -101749 -152513
7606a52513m6182L6365J01851O1351l0432o6475m1541j9498j2174P817K4443Q044
$$ -152513 -198695 -162330 -60479 872 -29560 -96035 -137576 -157074 -169248 -161431 -136988 -128944
7594a28944j1764N814L1064J7646p395q00J793m3149p3422j0648P6815N4912m9539
$$ -128944 -140708 -134894 -103830 -86184 -93579 -94379 -92586 -135735 -209157 -219805 -142990 -88078 -137617
7581a37617p3625J7922P3020N277o9609l8428K7099J2781m1936l1000K8887M1506
$$ -137617 -211242 -193320 -120300 -115023 -184632 -223060 -195961 -183180 -225116 -256116 -227229 -185723
7569a85723J153j9369p666o836l653M6231R8612O0102m8868r7106l2317M6070
$$ -185723 -184570 -203939 -211605 -218441 -222094 -175863 -77251 -17149 -66017 -163123 -195440 -149370
7557a49370M1261j3931l5641j3375N096n26r518l998J2568K4989J7314r319k7836
$$ -149370 -108109 -122040 -157681 -171056 -165960 -166486 -176004 -180002 -167434 -142445 -125131 -134450 -162286
7544a62286j5804J2745L1038L6346L1854L136m2222n0958j544L7835P715l3115
$$ -162286 -178090 -165345 -134307 -97961 -66107 -62971 -105193 -156151 -157695 -119860 -112145 -145260
7532a45260j482N0303Q286q9458q2521M7050J19535L4598o8955l9678N1814M9186
$$ -145260 -146742 -96439 -88153 -177611 -260132 -213082 -93547 -58949 -127904 -167582 -115768 -66582
7520f6582l5687p0317k6228J0741R884J5288J9334k8649r0736o6430L3110P6681
$$ -66582 -102269 -172586 -198814 -188073 -178189 -162901 -143567 -172216 -262952 -329382 -296272 -219591
7508b19591J3419m6669n737P8390Q9793J3822o8642q8989l9045M2044Q7715N3911
$$ -219591 -206172 -252841 -258578 -180188 -90395 -76573 -145215 -234204 -273249 -231205 -143490 -89579
7496h9579j9810m4216J558M1080J6941k6428j8835L0371N5226K5950k7542o1039
$$ -89579 -109389 -153605 -152047 -110967 -94026 -120454 -139289 -108918 -53692 -27742 -55284 -116323
7484a16323n0264j645M4529M3191l654m5754m5117j1050K6342M0854J2482m4544
$$ -116323 -166587 -168232 -123703 -80512 -84166 -129920 -175037 -186087 -159745 -118891 -106409 -150953
7472a50953o1574Q132R1984O6083n8328j19074k5885J00698R6698j9570r3929
$$ -150953 -212527 -204395 -112411 -46328 -104656 -223730 -249615 -148917 -52219 -71789 -165718
7461a65718n6410J7580M5154K9712J0905L467K971j472k4997n7505n3903r54L8306
$$ -165718 -222128 -204548 -159394 -129682 -118777 -115310 -112339 -113811 -138808 -196313 -250216 -251170 -212864
7448b12864J1846k6029N695O9345N6785k3282m0207M3823R1789M275j05473p2439
$$ -212864 -201018 -227047 -221352 -152007 -95222 -118504 -158711 -114888 -23099 -18824 -124297 -196736
7436a96736O1825J02476q436j08967o1617N1748O6768k1765p5415l3605J1583
$$ -196736 -134911 -32435 -40871 -149838 -211455 -159707 -92939 -114704 -190119 -223724 -212141
7425b12141j5462m9883o693O2592M6568l5833n3264K6632P9062K3687m2787q405
$$ -212141 -227603 -277486 -284179 -221587 -175019 -210852 -264116 -237484 -158422 -134735 -177522 -185927
7413a85927O3490L6155p1920j10346k9794N7670O6683M4286M3233K4797l5624
$$ -185927 -122437 -86282 -158202 -268548 -298342 -240672 -173989 -129703 -86470 -61673 -97297
7402i7297o3175o104M9141N171p3702n4295M0383N5536m2130r6777p306J03494
$$ -97297 -160472 -166576 -117435 -112264 -185966 -240261 -199878 -144342 -186472 -283249 -290555 -187061
7390a87061P2174n3443q7992J0441Q7332L5070n4068m8717J9176K5019l8720n6589
$$ -187061 -114887 -168330 -256322 -245881 -158549 -123479 -177547 -226264 -207088 -182069 -220789 -277378
7378b77378J5407P9003N3347n015r316J7917L589l7877l1908J8289L0733j5649
$$ -277378 -261971 -182968 -129621 -134636 -143952 -126035 -122446 -160323 -192231 -173942 -143209 -158858
7366a58858m2511r49M8716L2484k8228n6783k6284K5109N3316M1740r04m2361
$$ -158858 -201369 -202318 -153602 -121118 -149346 -206129 -232413 -207304 -153988 -112248 -113152 -155513
7354a55513m5991j2813J6281J6087M688M31p783k2960j7038J8976M1592J4744
$$ -155513 -201504 -214317 -198036 -181949 -177261 -176830 -184613 -207573 -224611 -205635 -164043 -149299
7342a49299k8381k8902J4946N0864M1621l277m6811m7613R025P4416O7642j8596
$$ -149299 -177680 -206582 -191636 -140772 -99151 -102428 -149239 -196852 -187827 -113411 -45769 -64365
7330f4365q5542n3357K3829L7002j6794l9646J0783O2624M7959O6j0131J8754
$$ -64365 -149907 -203264 -179435 -142433 -159227 -198873 -188090 -125466 -77507 -77441 -87572 -68818
7318f8818K5442k3267q8467j04861n3060J9263N1077L7021K0942K2106J3062j2321
$$ -68818 -43376 -66643 -155110 -259971 -313031 -293768 -242691 -205670 -184728 -162622 -149560 -161881
7306a61881r463L4760N2645l172o4962m5438J8082K3907k2771k9275N357j8067
$$ -161881 -171344 -136584 -83939 -87111 -152073 -197511 -179429 -155522 -178293 -207568 -202211 -220278
7294b20278j02484j07961K6471J53823J18365k1866r1036l7591M1942O9206N2645
$$ -220278 -322762 -430723 -404252 -250429 -132064 -153930 -244966 -282557 -240615 -171409 -118764
7283a18764J6981k6013m5166j7269K1707K5342J3675K6497L4745q834o1727m3396
$$ -118764 -101783 -127796 -172962 -190231 -168524 -143182 -129507 -103010 -68265 -77099 -138826 -182222
7271a82222K2848L7799p193j8910K6643L5844l4439q7345l8906M4610N3010l838
$$ -182222 -159374 -121575 -128768 -147678 -121035 -85191 -119630 -206975 -245881 -201271 -148261 -152099
7259a52099l5076j5768J798p840j4217N673L7755N5640L5319k9094r0238p4221
$$ -152099 -187175 -202943 -201145 -208985 -223202 -217529 -179774 -124134 -88815 -117909 -208147 -282368
7247b82368J2902O3893J8246l4118J2048R7700Q0255l4792q9787j9125M9191J124
$$ -282368 -269466 -205573 -187327 -221445 -209397 -111697 -31442 -66234 -156021 -175146 -125955 -124831
7235a24831p9876m6219P6081J16269R260j06207q0450M2145R0017M998p8098k6734
$$ -124831 -204707 -250926 -174845 -58576 -49316 -155523 -235973 -193828 -103811 -98813 -176911 -203645
7223b03645R0762R5645l7300j31581o4039N6338O1744k4610n5183p542R670k2017
$$ -203645 -112883 -17238 -54538 -186119 -250158 -193820 -132076 -156686 -211869 -219411 -209741 -231758
7211b31758P11Q6440R8506p330q2981l1754K8285j5736o2690P923Q9644K9009
$$ -231758 -231047 -144607 -46101 -53431 -136412 -168166 -139881 -155617 -218307 -210384 -120740 -91731
7199i1731p1277n012J54562J35301p6060j81525m5440R4601K8523j00841p3630
$$ -91731 -163008 -168020 -13458 121843 45783 -135742 -181182 -86581 -58058 -158899 -232529
7188b32529M3143N3411k1206j8192N5665N5049k5050m9731K828J8363k7110l3577
$$ -232529 -189386 -135975 -157181 -175373 -119708 -64659 -89709 -139440 -136612 -118249 -145359 -178936
7176a78936J4788J2361o0084p9148J2583J05014R2408J0966n1370o3060k5966
$$ -178936 -164148 -151787 -211871 -291019 -278436 -173422 -81014 -70048 -121418 -184478 -210444
7165b10444M0747O8053O442o4466l0921N6828N0642l4810l7877N1713N6355o1434
$$ -210444 -169697 -101644 -95202 -159668 -190589 -133761 -83119 -117929 -155806 -104093 -47738 -109172
7153a09172j01069K4662J08541k080j27306n7115Q8238P4230m8742o4187K3282
$$ -109172 -210241 -185579 -77038 -79118 -206424 -263539 -175301 -101071 -149813 -214000 -190718
7142a90718L6721k4071n382P4635M5831p7003r3309K4866Q0528L638m5810O202
$$ -190718 -153997 -178068 -183450 -108815 -62984 -139987 -233296 -208430 -127902 -124264 -170074 -163872
7130a63872K8513k7559k1970P4360P5899o9279j30048J4152J26713Q927j35067
$$ -163872 -135359 -162918 -184888 -110528 -34629 -103908 -233956 -219804 -93091 -84164 -219231
7119b19231l8523J53255J15117j05488j63833J8312J51538N9995q6113r8402l2842
$$ -219231 -257754 -104499 10618 -94870 -258703 -240391 -88853 -28858 -114971 -213373 -246215
7108b46215p712MM2810P1153L8130m900j3911k5733n0272k3493N5388P5739q979
$$ -246215 -253927 -253923 -211113 -139960 -101830 -106730 -120641 -146374 -196646 -220139 -164751 -89012 -97991
7095i7991q5840n5738J8601L7814K4140L9944M9058r108p9274n9085L1899P5380
$$ -97991 -183831 -239569 -220968 -183154 -159014 -119070 -70012 -79120 -158394 -217479 -185580 -110200
7083a10200K9054l0133l6277j3601p896j3054K91K6358L2229J2629M918L1893
$$ -110200 -81146 -111279 -147556 -161157 -169053 -182107 -181816 -155458 -123229 -110600 -105682 -73789
7071g3789M9602O42p7254p2980K5373P4365j4817j03566j6650J56649J56981n0679
$$ -73789 -24187 -23545 -100799 -173779 -148406 -74041 -88858 -192424 -209074 -52425 104556 53877
7059E3877j99763j04480Q6957J35642L3328o2800p7079m1732J7063O9304M4989
$$ 53877 -145886 -250366 -163409 -27767 5561 -57239 -134318 -176050 -158987 -89683 -44694
7048d4694n4178r5443l725R0900M8829m3067k0092P0299N4017n4590p5024J6846
$$ -44694 -98872 -194315 -198040 -107140 -58311 -101378 -121470 -51171 2846 -51744 -126768 -109922
7036a09922M8156l7812q2996l961N9627p5p0064k6840M8497L1646k1191O859O9480
$$ -109922 -61766 -99578 -182574 -186535 -126908 -126983 -197047 -223887 -175390 -143744 -164935 -158076 -88596
7023h8596M5175l5465m4043J5599K0808m7007p1825m298O5282O2700K2039j0951
$$ -88596 -43421 -78886 -122929 -107330 -86522 -133529 -205354 -209652 -144370 -81670 -59631 -70582
7011g0582m2997o0603j1455Q5757J16545K4716q9894r9597j2792N8877M9333j1425
$$ -70582 -113579 -174182 -185637 -99880 16665 41381 -48513 -148110 -160902 -102025 -52692 -64117
6999f4117o0327n5972K857O3511N1616l4935r4557m2142O4338Q8396K46p9676
$$ -64117 -124444 -180416 -177559 -114048 -62432 -97367 -191924 -234066 -169728 -81332 -81086 -160762
6987a60762m5119N5071R0233K1438o0944o5360n672M1074L9672J7765J495j7729
$$ -160762 -205881 -150810 -60577 -39139 -100083 -165443 -171115 -130041 -90369 -72604 -71109 -88838
6975h8838m2853m4473p066K9946K2180p306n49L5614L0870k8525n6422L666P2014
$$ -88838 -131691 -176164 -183230 -153284 -131104 -138410 -138959 -103345 -72475 -101000 -157422 -153756 -81742
6962h1742M1743m8347o1901K1878O9643L191p7738n8274J5621L4338R281J9963
$$ -81742 -39999 -88346 -150247 -128369 -58726 -55535 -133273 -191547 -175926 -141588 -132307 -112344
6950a12344L8789k1304j07721o8280Q3194J37561N208j24912o7955P6229R5011
$$ -112344 -73555 -94859 -202580 -270860 -187666 -50105 -44897 -169809 -237764 -161535 -66524
6939f6524q224n9140j0941J8474j6514k6640J9311L2573j6844l2645K9817P2288
$$ -66524 -74748 -133888 -144829 -126355 -142869 -169509 -150198 -117625 -134469 -167114 -137297 -65009
6927f5009K0480n2430n4907j1790J3089J7853O927m9518j16415p9871O5829J46711
$$ -65009 -44529 -96959 -151866 -163656 -150567 -132714 -125787 -175305 -291720 -371591 -305762 -159051
6915a59051N1382p9412n9246N9140Q7835O515m4552k3672k1827m8915n530J01608
$$ -159051 -107669 -187081 -246327 -187187 -99352 -92837 -137389 -161061 -182888 -231803 -237333 -135725
6903a35725J23318J1648q5479n9568k508k2844n4103R665J02647Q0232l7354q2115
$$ -135725 -12407 -759 -86238 -145806 -148314 -171158 -225261 -215596 -112949 -32717 -70071 -152186
6891a52186P609R6799N5870n8144r5021k3509M0587J4009l4022J378Q1611P0238
$$ -152186 -144577 -47778 8092 -50052 -145073 -168582 -127995 -113986 -148008 -146630 -65019 5219
6879E219m4890j07011k5830P3145M5418m3712m5662J0166j3572q6178m5010R3462
$$ 5219 -39671 -146682 -172512 -99367 -53949 -97661 -143323 -133157 -146729 -232907 -277917 -184455
6867a84455J19276j7682j01881j0342P8151r93j06915m1939R8845R1745l5480
$$ -184455 -65179 -82861 -184742 -195084 -116933 -117926 -224841 -266780 -167935 -76190 -111670
6856a11670p0938J3590M8770j0094k8487K8473L1755m8241o5510L3400R4814J8651
$$ -111670 -182608 -169018 -120248 -130342 -158829 -130356 -98601 -146842 -212352 -178952 -84138 -65487
6844f5487p0976m2674L4507M1664J2773L1974N6677P283o3762n4916L821P998
$$ -65487 -136463 -179137 -144630 -102966 -90193 -58219 -1542 5741 -58021 -112937 -109116 -101118
6832a01118l6788l7663J3159L3737N752j206L6908N7073J9264l3883m7807j9230
$$ -101118 -137906 -175569 -162410 -128673 -122921 -124127 -87219 -30146 -10882 -44765 -92572 -111802
6820a11802K0271L2226p010o4431o1416J5879O5828J1900o0955k3981Q2187R5889
$$ -111802 -91531 -59305 -66315 -130746 -192162 -176283 -110455 -98555 -159510 -183491 -101304 -5415
6808e415j0515q1343k0046O8939N6646j9685m7898k6249l0499n3271j4051Q0040
$$ -5415 -15930 -97273 -117319 -48380 8266 -11419 -59317 -85566 -116065 -169336 -183387 -103347
6796a03347J11839K7101o9364n4521L9318P1932p444r4969q3191m789L1348K755
$$ -103347 8492 35593 -33771 -88292 -48974 22958 15514 -79455 -162646 -167435 -136087 -133332
6784a33332j1165K9963O2308K8408k4987k2101K3539L9584Q835k2099k6955k0673
$$ -133332 -144497 -114534 -52226 -23818 -48805 -70906 -47367 -7783 1052 -21047 -48002 -68675
6772f8675j0718M177K223k5159k7928K9075P3585J5737q2834o5726P2938J48742
$$ -68675 -79393 -75216 -72993 -98152 -126080 -97005 -23420 -7683 -90517 -156243 -83305 65437
6760F5437N3286q2403q9471k437L2439l974j1962L0566L9632j3792n4805l4233
$$ 65437 118723 36320 -53151 -55588 -23149 -27123 -39085 -8519 31113 17321 -37484 -71717
6748g1717Q467L3549M8471M4839q195p6638p1560R417N1325o532o3565o671J10635
$$ -71717 -63250 -29701 18770 63609 55414 -21224 -92784 -83367 -32042 -38574 -102139 -108810 1825
6735A825J41962N6481l3823m2964q070k182k9606m4517k4515J2235L9410M6080
$$ 1825 143787 200268 166445 123481 115411 113229 83623 39106 14591 26826 66236 112316
6723A12316L9181L4919L8989L3557j042m8987o1676r600P6397J27476J04265L9316
$$ 112316 151497 186416 225405 258962 257920 208933 147257 137657 214054 341530 445795 485111
6711D85111L895K7846O5352N5492N50m7985p0551r6198j30354j25853o0751O693
$$ 485111 489006 516852 582204 637696 638246 590261 519710 423512 293158 167305 106554 113247
6699A13247J3398j7137k2056p559k9442p4493n5865M5170J18420O5584n7232j12196
$$ 113247 126645 109508 87452 79893 50451 -24042 -79907 -34737 83683 149267 92035 -20161
6687b0161o1553M283J1888p157K236K4132J3762j3718p556K4383K0570k7667m8235
$$ -20161 -81714 -77431 -65543 -72700 -70464 -46332 -32570 -46288 -53844 -29461 -8891 -36558 -84793
6674h4793o44M9180K5329l5670l8122K2364N3373J2815l3391k9096j1474k3160
$$ -84793 -85437 -36257 -10928 -46598 -84720 -62356 -8983 3832 -29559 -58655 -70129 -93289
6662i3289k4270K8252P7526M1362m6777p4372j4618M3686L4350j0824l9151m2321
$$ -93289 -117559 -89307 -11781 29581 -17196 -91568 -106186 -62500 -28150 -38974 -78125 -120446
6650a20446k2103K6278O8421M9163j1830k6576K1885L9395k4870q0622l5152N4782
$$ -120446 -142549 -116271 -47850 1313 -10517 -37093 -15208 24187 -683 -81305 -116457 -61675
6638f1675P3024K1455q018M853j512l8116m5312r609J0042r927k2377l315J1719
$$ -61675 11349 32804 24786 29639 28127 -9989 -55301 -64910 -54868 -64795 -87172 -90487 -78768
6625g8768R063K2229M6455K2934n0194q4192l1193L6860M4019K2156L0024L6906
$$ -78768 -69705 -47476 -1021 21913 -28281 -112473 -143666 -106806 -62787 -40631 -10607 26299
6613B6299j5187q6557q4487q718M7112L4367J129k532P801N28j4833j0073J6591
$$ 26299 11112 -75445 -159932 -168650 -121538 -87171 -86042 -88574 -80773 -80245 -95078 -105151 -88560
6600h8560L8163K5870k0962n9778m1497J6815L4430j8862n8828l933Q4263P3271
$$ -88560 -50397 -24527 -45489 -105267 -146764 -129949 -95519 -114381 -173209 -177142 -92879 -19608
6588a9608m0365j10474m4291P0809R5184J8244n4329m9819K800L7262K8660K053
$$ -19608 -59973 -170447 -214738 -143929 -48745 -30501 -84830 -134649 -131849 -94587 -65927 -63874
6576f3874q689O95N946o586j8185j3072j2019l3224m2586L0N8643N6823m472m4501
$$ -63874 -72563 -71868 -65922 -72508 -90693 -103765 -115784 -149008 -191594 -191564 -132921 -76098 -80570 -125071
6562a25071l0251j6794l2006k0951L8713O4979J523o5223l0017N4071N3457k8232
$$ -125071 -155322 -172116 -204122 -225073 -186360 -121381 -119858 -185081 -215098 -161027 -107570 -135802
6550a35802n6924R375N7392J6987k1941K8234R3442N5891m8355q0933j3127M4504
$$ -135802 -192726 -183351 -125959 -108972 -130913 -102679 -9237 46654 -1701 -82634 -95761 -51257
6538e1257K3799j3199j593J9326q175m7694k7766L2738M9403N187l0866k3164
$$ -51257 -27458 -40657 -42250 -22924 -31099 -78793 -106559 -73821 -24418 -19231 -50097 -73261
6526g3261j9528n0417o0435j202O9628O3248k845l2545k256J4379j5070k3134
$$ -73261 -92789 -143206 -203641 -204843 -135215 -71967 -74812 -107357 -109613 -95234 -110304 -133438
6514a33438K9937O5118N649p9347o2190M3145Q8456R623p7732n1531M2490P2540
$$ -133438 -103501 -38383 -32734 -112081 -174271 -131126 -42670 -33047 -110779 -162310 -119820 -47280
6502d7280J4994l5322k6568j3641l9926n1951P376Q6331Q8200J7726k4546M942
$$ -47280 -32286 -67608 -94176 -107817 -147743 -199694 -192318 -105987 -17787 -61 -24607 -19665
6490a9665L3649k003n2397l8864J3786J3748m9303p9258j1762R0522J14630L0899
$$ -19665 13984 11981 -40416 -79280 -65494 -51746 -101049 -180307 -192069 -101547 13083 43982
6478D3982p9367j10940l6619O4328Q4031Q824n9579l8309K0624J3824m8604o0205
$$ 43982 -35385 -146325 -182944 -118616 -34585 -25761 -85340 -123649 -103025 -89201 -137805 -198010
6466a98010Q355O7378N8946L1604K2819j0817p7789q6376P274R1060N4364l5495
$$ -198010 -189655 -122277 -63331 -31727 -8908 -19725 -97514 -183890 -176616 -85556 -31192 -66687
6454f6687m5090J3253K8561r055j6442J2616J1986m584K9971O7144o643j34921
$$ -66687 -111777 -98524 -69963 -79018 -95460 -82844 -70858 -75442 -45471 21673 15030 -119891
6442a19891j18096O4570J72114N0513j27345j21497L1194J12418N1212l2586n0678
$$ -119891 -237987 -173417 -1303 49210 -78135 -199632 -168438 -56020 -4808 -37394 -88072
6431h8072l2196j2725Q509R004l1057n4159M991R1444R2435J3933l2314j2000
$$ -88072 -120268 -132993 -124484 -115480 -146537 -200696 -195705 -104261 -11826 2107 -30207 -42207
6419d2207k827l5255l9298J2911M3025M020l2572n16M5897K5581l4187m7850p635
$$ -42207 -45034 -80289 -119587 -106676 -63651 -59631 -92203 -92719 -46822 -21241 -55428 -103278 -110913
6406a10913K0816J2650Q346K6873K8385j4658n9726m4223K6589P7320N3336j3481
$$ -110913 -90097 -77447 -69101 -42228 -13843 -28501 -88227 -132450 -105861 -28541 24795 11314
6394A1314n1971m3717k6726j7759O699L9765K8449l2162o2172j4483M0699K7603
$$ 11314 -40657 -84374 -111100 -128859 -122160 -82395 -53946 -86108 -148280 -162763 -122064 -94461
6382i4461p246J7071N8908J8941o9094o5831M6304J13483L4231r5819j28172m8732
$$ -94461 -101707 -84636 -25728 -6787 -75881 -141712 -95408 18075 52306 -43513 -171685 -220417
6370b20417M6464Q0810M2354l0070n8795M335Q8911P1365m0152r6699l1276L8685
$$ -220417 -173953 -93143 -50789 -80859 -139654 -135319 -46408 24957 -15195 -111894 -143170 -104485
6358a04485J0416l6931N765P5545M3832n4355p0327J5899P2887L5833j0565M366
$$ -104485 -94069 -131000 -125235 -49690 -5858 -60213 -130540 -114641 -41754 -5921 -16486 -12120
6346a2120K9302O4n1778o4264m2376k8016k4737p130K5661M7112L9470J1246j2760
$$ -12120 17182 17246 -34532 -98796 -141172 -169188 -193925 -201055 -175394 -128282 -88812 -77566 -90326
6333i0326j4605l728l479j0099M905L6137L4496j2597m5085k1465J1555L178p787
$$ -90326 -104931 -108659 -112138 -122237 -117332 -81195 -46699 -59296 -104381 -125846 -114291 -111113 -118900
$$ [...]
##END NTUPLES=NMR SPECTRUM
##END=
