##TITLE=1H ikalashn
CA-9310-1
18.12.2024
##JCAMPDX= 6.0         $$ Bruker NMR JCAMP-DX V2.0
##DATA TYPE= NMR SPECTRUM
##DATA CLASS= NTUPLES
##ORIGIN= UXNMR, Bruker Analytische Messtechnik GmbH
##OWNER= root
$$ TOPSPIN		Version 1.3
$$ 2024-12-18 11:09:45.015 +0400  Irina@DPX200
$$ Compression mode = diff/dup
##.OBSERVE FREQUENCY= 200.131300845
##.OBSERVE NUCLEUS= ^1H
##.ACQUISITION MODE= SIMULTANEOUS
##.ACQUISITION SCHEME= undefined
##.AVERAGES= 8
##.DIGITISER RES= 18
##SPECTROMETER/DATA SYSTEM= spect
##.PULSE SEQUENCE= zg
##.SOLVENT NAME= DMSO
##.SHIFT REFERENCE= INTERNAL, DMSO, 1, 17.49637
##AUDIT TRAIL= $$ (NUMBER, WHEN, WHO, WHERE, WHAT)
$$ ##TITLE= Audit trail, TOPSPIN		Version 1.3
$$ ##JCAMPDX= 5.01
$$ ##ORIGIN= Bruker BioSpin GmbH
$$ ##OWNER= Irina
$$ $$ F:/spectra/data/iren/nmr/1H/4/pdata/1/auditp.txt
$$ ##AUDIT TRAIL=  $$ (NUMBER, WHEN, WHO, WHERE, VERSION, WHAT)
(   1,<2024-12-18 11:09:21.687 +0400>,<Irina>,<DPX200>,<TOPSPIN 1.3>,
      <created by zg
	started at 2024-12-18 11:08:44.828 +0400,
	POWCHK disabled, PULCHK disabled
       terminated by command 'halt'
       configuration hash MD5:
       BE 6D 3F 07 2A EA 11 49 91 17 2B D3 AF B3 58 0D
       data hash MD5: 16K
       3F 75 DC 67 C4 BF 2D 8D 39 53 86 B2 70 ED 95 93>)
(   2,<2024-12-18 11:09:22.843 +0400>,<Irina>,<DPX200>,<TOPSPIN 1.3>,
      <Start of raw data processing
       fp BC_mod = 2 FT_mod = 6 PKNL = 1 PHC0 = 94.71922 PHC1 = 4.797655 SI = 32K 
       data hash MD5: 32K
       D4 BF 10 51 7C E6 50 77 A9 1B C8 16 83 95 31 3B>)
(   3,<2024-12-18 11:09:25.328 +0400>,<Irina>,<DPX200>,<TOPSPIN 1.3>,
      <apk 
       data hash MD5: 32K
       01 D7 79 DD BB 6E 09 29 80 36 38 E9 66 77 4D 59>)
(   4,<2024-12-18 11:09:34.781 +0400>,<Irina>,<DPX200>,<TOPSPIN 1.3>,
      <pk fgphup PHC0 = 5.685791 PHC1 = -8.8 
       data hash MD5: 32K
       F7 56 7A 04 7F 63 BC E6 87 C3 29 C9 29 A5 CF 1F>)
(   5,<2024-12-18 11:09:36.328 +0400>,<Irina>,<DPX200>,<TOPSPIN 1.3>,
      <abs n ABSG = 5 
       data hash MD5: 32K
       36 03 E3 AD 93 3C 5D A9 17 7E 6F 4A 56 5F C3 14>)
$$ ##END=
$$ 
$$ $$ hash MD5
$$ $$ AE 5B 62 C6 C0 5B DF 07 05 AF CB DD AD 5D 12 FA
##$RELAX= 
##$RELAX= 
##$RELAX= 
##$RELAX= 
##$RELAX= 
##$RELAX= 
##$RELAX= 
##$RELAX= 
##$RELAX= 
$$ Bruker specific parameters
$$ --------------------------
##$DU= <F:/spectra>
##$EXPNO= 4
##$NAME= <1H>
##$PROCNO= 1
##$TYPE= <nmr>
##$USER= <iren>
##$AMP= (0..31)
100 100 100 100 100 100 100 100 100 100 100 100 100 100 100 100 100 100 
100 100 100 100 100 100 100 100 100 100 100 100 100 100 
##$ANAVPT= -1
##$AQSEQ= 0
##$AQ_mod= 1
##$AUNM= <au_zg>
##$AUTOPOS= <>
##$BF1= 200.13
##$BF2= 200.13
##$BF3= 200.13
##$BF4= 200.13
##$BF5= 200.13
##$BF6= 200.13
##$BF7= 200.13
##$BF8= 200.13
##$BYTORDA= 1
##$CFDGTYP= 0
##$CFRGTYP= 5
##$CHEMSTR= <none>
##$CNST= (0..63)
1 1 145 1 1 1 1 1 1 1 1 1 1 1 1 1 1 1 1 1 1 1 1 1 1 1 1 1 1 1 1 1 1 1 
1 1 1 1 1 1 1 1 1 1 1 1 1 1 1 1 1 1 1 1 1 1 1 1 1 1 1 1 1 1 
##$CPDPRG= <>
##$CPDPRG1= <>
##$CPDPRG2= <>
$$ [...]
##$SW_h= 4401.40845070422
##$TD= 16384
##$TD0= 1
##$TE= 300
##$TE2= 300
##$TE3= 300
##$TEG= 300
##$TL= (0..7)
0 120 120 120 120 120 120 120 
##$TP= (0..7)
150 150 150 150 150 150 150 150 
##$TP07= 0
##$TPNAME0= <>
##$TPNAME1= <>
##$TPNAME2= <>
##$TPNAME3= <>
##$TPNAME4= <>
##$TPNAME5= <>
##$TPNAME6= <>
##$TPNAME7= <>
##$TPOAL= (0..7)
0.5 0.5 0.5 0.5 0.5 0.5 0.5 0.5 
##$TPOFFS= (0..7)
0 0 0 0 0 0 0 0 
##$TUNHIN= 0
##$TUNHOUT= 0
##$TUNXOUT= 0
##$USERA1= <user>
##$USERA2= <user>
##$USERA3= <user>
##$USERA4= <user>
##$USERA5= <user>
##$V9= 5
##$VALIST= <valist>
##$VCLIST= <CCCCCCCCCCCCCCC>
##$VD= 0
##$VDLIST= <DDDDDDDDDDDDDDD>
##$VPLIST= <PPPPPPPPPPPPPPP>
##$VTLIST= <TTTTTTTTTTTTTTT>
##$WBST= 1024
##$WBSW= 25
##$XGAIN= (0..3)
0 0 0 0 
##$XL= 0
##$YL= 0
##$YMAX_a= 346722
##$YMIN_a= -342103
##$ZGOPTNS= <>
##$ZL1= 120
##$ZL2= 120
##$ZL3= 120
##$ZL4= 120
##$ABSF1= 17.49637
##$ABSF2= -4.496376
##$ABSG= 5
##$ABSL= 3
##$ALPHA= 0
##$AQORDER= 0
##$ASSFAC= 0
##$ASSFACI= 0
##$ASSFACX= 0
##$ASSWID= 0
##$AUNMP= <proc_1d>
##$AXLEFT= 0
##$AXRIGHT= 0
##$AXTYPE= 0
##$AXUNIT= <>
##$AZFE= 0.1
##$AZFW= 0.1
##$BCFW= 0
##$BC_mod= 2
##$BYTORDP= 0
##$COROFFS= 0
##$CY= 7568.61572265625
##$DATMOD= 1
##$DC= 0
##$DFILT= <>
##$DTYPP= 0
##$F1P= 17.9538593292236
##$F2P= -4.03888763876832
##$FCOR= 0.5
##$FTSIZE= 32768
##$FT_mod= 6
##$GAMMA= 0
##$GB= 0
##$INTBC= 0
##$INTSCL= 5.656564e-011
##$ISEN= 128
##$LB= 0
##$LEV0= 0
##$LPBIN= 0
##$MAXI= 945.577
##$MC2= 0
##$MEAN= 0
##$ME_mod= 0
##$MI= -402.1523
##$NCOEF= 0
##$NC_proc= -6
##$NLEV= 6
##$NOISF1= 8.587773
##$NOISF2= 6.764455
##$NSP= 0
##$NTH_PI= 0
##$NZP= 0
##$OFFSET= 17.49637
##$PC= 1
##$PHC0= 85.86363
##$PHC1= 12.23222
##$PH_mod= 1
##$PKNL= yes
##$PPARMOD= 0
##$PPDIAG= 0
##$PPIPTYP= 0
##$PPMPNUM= 100
##$PPRESOL= 1
##$PSCAL= 0
##$PSIGN= 0
##$REVERSE= no
##$SF= 200.13
##$SI= 32768
##$SIGF1= 16.12182
##$SIGF2= -4.496377
##$SINO= 3.521527
##$SIOLD= 32768
##$SREGLST= <1H.CDCl3>
##$SSB= 0
##$STSI= 32768
##$STSR= 0
##$SW_p= 4401.40845070422
##$SYMM= 0
##$S_DEV= 0
##$TDeff= 16384
##$TDoff= 0
##$TI= <>
##$TILT= no
##$TM1= 0
##$TM2= 0
##$TOPLEV= 0
##$USERP1= <user>
##$USERP2= <user>
##$USERP3= <user>
##$USERP4= <user>
##$USERP5= <user>
##$WDW= 0
##$XDIM= 32768
##$YMAX_p= 301359186
##$YMIN_p= -218644
$$ End of Bruker specific parameters
$$ ---------------------------------
##NTUPLES= NMR SPECTRUM
##VAR_NAME=  FREQUENCY,     SPECTRUM/REAL,   SPECTRUM/IMAG
##SYMBOL=    X,             R,               I
##VAR_TYPE=  INDEPENDENT,   DEPENDENT,       DEPENDENT
##VAR_FORM=  AFFN,          ASDF,            ASDF
##VAR_DIM=   32768,         32768,           32768
##UNITS=     HZ,            ARBITRARY UNITS, ARBITRARY UNITS
##FACTOR=    0.134324425510551, 1,           1
##FIRST=     4401.40845070422, -6083,        -744265
##LAST=      0,             62700,           -925806
##MIN=       0,             -218644,         0
##MAX=       4401.40845070422, 301359186,    0
$$ Real data points
##PAGE= N=1
##DATA TABLE= (X++(R..R)), XYDATA
$$ [...]
12430A5959396N42054N92218N99199N82400O00118O49578O90914P26242P65962
12421B1708081P70175P26663P30066Q56685J006034J016067R15291Q98675J042282
12412B9670019J203739J248662J224785J240233J297503J338626J358350J381653
12404C9963570J399313J402643J421790J463963J473081J411268J322678J261763
12396E1120069J218823J167399J117004J065607R75157Q51976P67707P35542O62117
12387E9681401N04908L69815L39181L08843J44340r0409k38800l20199m84829
12378F0214251p27275q74829q88476r46073j146020j339353j378994j351692j404335
12369E0157204j490916j478592j396742j378779j419988j394955j289573j220705
$$ plain form
12430 15959396 16501450 17093668 17692867 18275267 18875385 19524963 20215877 20942119 21708081
12421 21708081 22478256 23204919 23934985 24791670 25797704 26813771 27729062 28627737 29670019
12412 29670019 30873758 32122420 33347205 34587438 35884941 37223567 38581917 39963570
12404 39963570 41362883 42765526 44187316 45651279 47124360 48535628 49858306 51120069
12396 51120069 52338892 53506291 54623295 55688902 56664059 57516035 58283742 59019284 59681401
12387 59681401 60186309 60556124 60895305 61204148 61348488 61258079 61019279 60699080 60214251
12378 60214251 59486976 58612147 57723671 56777598 55631578 54292225 52913231 51561539 50157204
12369 50157204 48666288 47187696 45790954 44412175 42992187 41597232 40307659 39086954
12361C9086954j221040j191774j099606j040569j050557j023903r07255q17657
12353C0734593q52517r17339q80801p88516p62738p78012p22909o32988o53428
12344B3745345p68147p78147o09845m53949m89426o24774o54043n54652m68872
12335A8343490m60857m61440m29871m11564m21157m02237l38019k94627l14102
12326A4809616l51156l52543l23684k87832k53703k47092k93372l44160l12029
12317A2044045k10192j58665k07903k63404k45751k11158k26826k39010j81754
12308A0099382j21585j55859k38249k51710k00614j76987j78910j31676o5765
12299H578027q9535j80296j92394j05563p2224j55596k14185j45940o4697r7353
$$ plain form
12361 39086954 37865914 36674140 35574534 34533965 33483408 32459505 31552250 30734593
12353 30734593 29882076 28964737 28083936 27295420 26532682 25754670 25031761 24398773 23745345
12344 23745345 22977198 22199051 21589206 21135257 20645831 20021057 19367014 18812362 18343490
12335 18343490 17882633 17421193 16991322 16579758 16158601 15756364 15418345 15123718 14809616
12326 14809616 14458460 14105917 13782233 13494401 13240698 12993606 12700234 12356074 12044045
12317 12044045 11833853 11675188 11467285 11203881 10958130 10746972 10520146 10281136 10099382
12308 10099382 9977797 9821938 9583689 9331979 9131365 8954378 8775468 8643792 8578027
12299 8578027 8488492 8308196 8115802 8010239 7938015 7782419 7568234 7422294 7357597 7260244
12289G260244j64792j32002m9867n8298j35217j39625n9390k4296q1728j33635
12279F281394j12072o7049n4077o3266q3511j19611j30388o9216L064k3676j22738
12268E438854j48140o7485j6484o5334j01165l8288J8548m2044j29847r8148L466
12257D753933R823q5051j28466o7914j9921n6609r6276o4289j6264k1494m3159
12246D164313k7392j6699o9776j34367j11145j2726M3790p29p7789r7842n8625
12235C601013j9795j6658l3652m1615l3064k4420l5650o6095q7939p0524j6682
12224C154919K9618K1864l6760q6645p3408j6794P401l2328p3353m4736K4052
12213B873830L8386k3657p7897n8410p937m03l0772m6378m6832p0764r9790o7793
$$ plain form
12289 7260244 7095452 6963450 6913583 6855285 6720068 6580443 6521053 6496757 6415029 6281394
12279 6281394 6169322 6102273 6048196 5984930 5901419 5781808 5651420 5582204 5585268 5561592 5438854
12268 5438854 5290714 5223229 5206745 5141411 5040246 5001958 5020506 4978462 4848615 4750467 4753933
12257 4753933 4763756 4678705 4550239 4482325 4462404 4405795 4309519 4245230 4228966 4207472 4164313
12246 4164313 4136921 4120222 4050446 3916079 3804934 3792208 3835998 3835269 3757480 3659638 3601013
12235 3601013 3581218 3564560 3530908 3489293 3456229 3431809 3396159 3330064 3242125 3171601 3154919
12224 3154919 3184537 3206401 3169641 3082996 3009588 2992794 3000195 2967867 2894514 2849778 2873830
12213 2873830 2912216 2888559 2810662 2752252 2744315 2743912 2713140 2666762 2619930 2549166 2449376 2381583
12201B381583J8804N8610j259p3050n0419K9494L8294m9026j14609p3498O784
12190B171708J9157k4972l4913M784J8300k7598o8247m6476K263J2291k0850n5363
12178A950084o5450m7755o854K6695Q755m6398o0057o590K7387k4134q2632m3007
12166A630044L9082K2245p9603j00092R526Q6800J1922j01353q8874J3929N2945
12155A496571J409l4584j1402P783q373j7932r282k0855m3995k3524K7257K7365
12143A390438l2465o6354l9106j6461k9224j4070M7752N9726l0684j14067p3514
12132A081971L1647O1530Q227k0736J0581L2671R967j3312j4813k9656o3414o5651
12120A029012j9167K3059J8740j0980l1032l5397k5107q73J1545j2863m1365j7331
$$ plain form
12201 2381583 2400387 2458997 2457738 2384688 2334269 2363763 2402057 2353031 2238422 2164924 2171708
12190 2171708 2190865 2165893 2130980 2135764 2154064 2126466 2058219 2011743 2014006 2026297 2005447 1950084
12178 1950084 1884634 1836879 1830025 1856720 1865475 1819077 1759020 1752430 1779817 1755683 1673051 1630044
12166 1630044 1669126 1691371 1611768 1511676 1521202 1608002 1619924 1518571 1429697 1443626 1496571
12155 1496571 1497980 1463396 1451994 1459777 1451404 1433472 1424190 1403335 1359340 1335816 1363073 1390438
12143 1390438 1357973 1291619 1252513 1236052 1206828 1192758 1240510 1300236 1269552 1155485 1081971
12132 1081971 1113618 1175148 1183375 1162639 1173220 1205891 1215858 1202546 1187733 1158077 1094663 1029012
12120 1029012 1009845 1032904 1051644 1040664 1009632 974235 949128 948255 959800 946937 905572 888241
12108H88241M2432N6428j091o0842o0143j5363K7155M4549K4477k9048o1700k1551
12096H33544M0334J9520p0170r3087m123O7086K1270n2426l4380K8261K3036k5868
12084G52997j9579K2226O602l9939j1894O1980M4509o0331q9092M633O1715j0963
12072G22864q0527k5311N1012J0869o3936j7265R0193O9510o6370j05766J5381
12061F00654J04338K1726j02042q2091M3871J03067N0661j0591j9579j6465k6944
12050F66605j9092Q129K294m3363n7250j010N7536L8852l1320o0105j3729N1660
12038E99207P2602M1147j2286n3810n8031k4141Q984k395m4055n0601M979O4134
12026E45734N7713o34l9234k8310m042K435M285J4430J3329j1698l5653l4950
$$ plain form
12108 888241 930673 987101 986010 925168 865025 849662 876817 921366 945843 916795 855095 833544
12096 833544 873878 893398 823228 730141 726018 793104 814374 761948 727568 755829 778865 752997
12084 752997 733418 755644 762246 722307 710413 772393 816902 756571 667479 672112 733827 722864
12072 722864 642337 617026 668038 678907 614971 597706 687899 757409 691039 585273 600654
12061 600654 704992 726718 624676 542585 586456 689523 740184 729593 710014 693549 666605
12050 666605 647513 655642 657936 614573 557323 556313 613849 652701 621381 561276 547547 599207
12038 599207 671809 712956 700670 646860 588829 564688 573672 571277 527222 476621 481600 545734
12026 545734 603447 602813 563579 535269 531227 533662 537947 552377 565706 554008 518355 483405
12014D83405k1754q159K2877O7136O3205k4623j15356r1225L0818J00971L9569
12003E46864n2745m8293K3332L8612k1087n1666l440M2234J3106l7854k8296J6074
11991D36841J3881k6027j8869M3542O3509r611r1325q3713j3113K6039J3282L436
11979C57872J4768P613k5491l3958M581M2435L7216J0060n428j6765l3756k8244
11967C30903J4283M5485J8046l1764l1682J5507L8817J1683j4474j724J5758n742
11955D05096m8405o0975k6915K5326N8537N3316J9510n600N412K7905J4438k6765
11943D40880l2634J3737M1120n090o7803n5060K1732O5480L7430L28P301K7987
11931D95408J8455l461k229O584j1310m0501l6742K042L5863M1102K4385o534
$$ plain form
12014 483405 461651 453492 476369 543505 606710 582087 466731 375506 406324 507295 546864
12003 546864 494119 445826 469158 507770 486683 435017 431577 473811 486917 449063 420767 436841
11991 436841 450722 424695 405826 449368 512877 503266 411941 328228 315115 341154 354436 357872
11979 357872 372640 380253 354762 320804 325385 367820 405036 415096 409668 392903 359147 330903
11967 330903 345186 390671 408717 376953 345271 360778 399595 411278 396804 395080 410838 405096
11955 405096 356691 295716 268801 294127 352664 405980 425490 419890 425302 453207 467645 440880
11943 440880 408246 421983 463103 458013 390210 335150 356882 422362 459792 460120 467421 495408
11931 495408 513863 510402 508173 514757 503447 462946 426204 428246 464109 505211 529596 523062
11919E23062l7905l2792K3513P2660M5309k8576m8898N432M4647J4633k0480O80
11907E61285K7139m303l8763R418R1746Q4293q367n1614M378N1206Q901m7845
11895F87474k6652L1707L7863M523M131L3257K8388j4057l2659l426L3426M1732
11883H25707K0330k0222n5400m3694J8331O7324N5425K0986J5362J3600k0603
11872H97146m0561N892N6313J9418n6405m6640L5933N3628k2983o5283q651M4401
11860H72208J1095l8396k5682j050k6762m6477N373O3371L0066n9228r3575n0988
11848F39955M353L6302M5497J7049m0359n5644P078O7041L9727k9649m7604k1084
11836F62662j2035j0563K0570L7551j1457o1583k5426M0554K2089m6040l3456
$$ plain form
11919 523062 485157 452365 475878 548538 593847 565271 516373 521805 566452 581085 560605 561285
11907 561285 588424 584121 545358 554776 646522 730815 722448 670834 675212 726418 735319 687474
11895 687474 660822 692529 730392 734915 739046 772303 800691 786634 753975 750549 783975 825707
11883 825707 846037 825815 770415 726721 745052 812376 867801 888787 904149 917749 897146
11872 897146 856585 862477 918790 938208 881803 835163 871096 924724 901741 836458 827807 872208
11860 872208 883303 844907 819225 818175 791413 744936 750309 813680 843746 784518 690943 639955
11848 639955 644308 680610 726107 743156 702797 647153 654231 721272 760999 731350 683746 662662
11836 662662 650627 640064 660634 698185 686728 625145 599719 640273 662362 616322 582866
11825E82866N5346Q7994L0249k0393k6627m6716o8929j1925Q2820O7742n4255
11814F78172j02201j3333N0441j3604p6567j8057O4120M0993k8381l4497j6512
11803E30574m6384n8898J3654O8772k132r4129n0051N8600M7394n8132o7611M0697
11791C82354Q7850N294o4903k8849J8005j3734n5203j9493M8360N9600J7300j7898
11779D18683k1399n293J4457J7891O35l038K4798L2374k0559o9537l9880J2359
11767C61491j1643o8380l8979M8561N4193k3148l7581L8171N9274k3164o3519
11756B95276J6086P7515O640q9346p2541K866J7142q672L164K1233j1194l5885
11744B22284J1672N4022Q05o7827k5986O9238O3350l7322q3473k7082L3177L7129
$$ plain form
11825 582866 638212 726206 756455 736062 709435 662719 593790 581865 664685 732427 678172
11814 678172 575971 562638 613079 599475 522908 504851 568971 609964 581583 547086 530574
11803 530574 484190 425292 438946 507718 505586 411457 361406 420006 467400 409268 341657 382354
11791 382354 470204 475498 410595 381746 399751 386017 330814 311321 359681 419281 436581 418683
11779 418683 397284 391991 406448 424339 424974 421936 446734 479108 458549 389012 349132 361491
11767 361491 349848 281468 242489 291050 345243 322095 284514 322685 381959 358795 295276
11756 295276 311362 388877 395517 306171 233630 236496 253638 244966 248130 269363 258169 222284
11744 222284 233956 287978 288783 220956 194970 264208 327558 290236 206763 179681 212858 249987
11732B49987K5681J9762r949m6172l3559J1159J8243j1557j8083O83M23n013K4105
11719B25710M6748J452n8831l8451K6042K2544l3227k8034L2598L1694l5069m5695
11707A47481J8049L5944j7529k0908N3800O8390k8092r0209l1099K4947k0759
11696A40015n8226J3362P7575P116q8451m2341P5653Q0094j5972n0109m045p77
11684A33894m6145k2926N8728N0346o0034r4527K0889J20091O0944n2891n0093
11673A18276M2534O5445k1345r8322p3707O501M6875K4112r080q603M887j2951
11661H4622m6495k6970N2534R1798J9619p8496o7408L5067Q1707J8304m6246k2471
11649I5565K9699J6579m1539n9559k0232K1496K9918J9119J1455J1496J1264l68
$$ plain form
11732 249987 275668 295430 285481 239309 205750 216909 235152 223595 205512 206195 206618 201605 225710
11719 225710 272458 273910 215079 176628 202670 225214 191987 163953 196551 228245 193176 147481
11707 147481 165530 201474 183945 163037 216837 285227 257135 166926 135827 160774 140015
11696 140015 81789 95151 172726 179842 91391 49050 124703 204797 188825 138716 134671 133894
11684 133894 87749 64823 123551 173897 113863 19336 40225 160316 221260 168369 118276
11673 118276 160810 226255 204910 106588 32881 39382 86257 110369 101289 92686 97573 84622
11661 84622 38127 11157 63691 155489 175108 96612 29204 64271 145978 164282 118036 95565
11649 95565 125264 141843 100304 40745 20513 42009 71927 91046 102501 113997 125261 124893
11637A24893j9055j5766K1646M6998R859n4603o0901l573L0006l312m0372k2960
11625A2860J5115K3292J7264K5143K1738j4078l8016j0113K6925J5031j9888j5770
11613E9503J6424J5537k2396m1425j8610J2385K4278K0713N637j5591j6151J6480
11601E6784M0441J2396l7021m2452j988K9555L0030K1522O173k9520n2572j3759
11589A9589N4085N9974m080m0248K028M4980J1427n0544n0140K777K6536P89j9227
11576E7946m189J6293J9352J3978k804m3510p3192l0159O7587J08713L2801o9284
11564I3532o9156K1357P0341J6050n3897m3471J2318J6207l2642l8656L6257J04637
11552A32877P3736k6087q5462n6087P440L4093J3896j7209k9173j6335J0425L0539
$$ plain form
11637 124893 105838 90072 111718 158716 168575 113972 53071 49498 79504 76192 35820 12860
11625 12860 27975 51267 68531 93674 115412 101334 63318 53205 80130 95161 75273 59503
11613 59503 75927 91464 69068 27643 9033 21418 45696 66409 72046 56455 40304 56784
11601 56784 97225 109621 72600 30148 28160 57715 87745 109267 115440 85920 33348 19589
11589 19589 73674 133648 129568 89320 91348 136328 147755 97211 47071 49848 76384 77173 57946
11576 57946 53757 70050 89402 103380 100576 57066 -16126 -46285 21302 130015 162816 93532
11564 93532 24376 45733 116074 132124 78227 34756 47074 63281 30639 -8017 28240 132877
11552 132877 206613 180526 95064 38977 46417 80510 94406 77197 48024 31689 42114 72653
11540G2653K6240K646j3758o551J0610J5313O131l805j3127k9023l8919j4750
11528A3660L8878O6652K4900m9883p4495k4174L6273M1547N429j6401o566J0707
11516F6527J9294J9511N746j9657k7194j092J9906l474l6406j7051L4921L8309
11504I9340j8640n4204j9816L3049M3329J9705n622k6793l1815J529M0507J5512
11492I6081n5524o3815J4171N7779J802l7857L7318J12663L7545r9792q8631O0684
11480G2424J21202N966j05890o1168M9159O4742q422n4509k8970K4449N8974M6704
11468A84661j4378o1872k1297O3991O4701k8745o9581Q095P0038O864p4585l3213
11456I4679O3838O0126k5785m9903N059K6317r662r393M5450O0622P023k8575
$$ plain form
11540 72653 98893 101539 87781 81230 91840 107153 113284 109479 96352 67329 28410 13660
11528 13660 52538 119190 144090 94207 19712 -4462 31811 73358 78787 62386 55820 66527
11516 66527 85821 105332 111078 91421 64227 63135 83041 79567 43161 26110 61031 99340
11504 99340 80700 26496 6680 39729 83058 102763 97141 70348 38533 40062 80569 96081
11492 96081 40557 -23258 -9087 48692 50494 12637 49955 162618 200163 100371 11740 72424
11480 72424 193626 199592 93702 32534 81693 146435 138013 83504 54534 78983 137957 184661
11468 184661 170283 108411 87114 151105 215806 187061 117480 125575 195613 202477 127892 94679
11456 94679 158517 218643 192858 142955 148014 174331 164669 155276 200726 261348 268371 239796
11444B39796n596P462k5104l9639K089M5816N1375N0305N2143J1941n9404p2576
11432B58608o012M2170J2513k2621K205L2098Q109j4262K8290P5993M2064l3095
11420D26060m5568P664M3487L0689N369j6698m0719l7675J2784N4661K7508k6331
11408D41231k5310J6339K5479O335J6875L7520L103m7781j0916Q6364R2811k0394
11396F21656q9634j3145Q3791N3306m1019m3453L6993N7494j7493p0496k4892
11385E53108N4582P9026M5144r30k4850p069M2413O2125P181o0579m2505L4421
11373G42067M1937l8209o5186L1858J14776M4067q7940q9088L7997J11282N4683
11362H98244j6174j2696K885k4729k8262L7670P5730R02r1445o2681M1225O3333
$$ plain form
11444 239796 234200 241662 216558 176919 179008 224824 276199 326504 378647 390588 331184 258608
11432 258608 252596 294766 307279 284658 286863 318961 327070 312808 341098 417091 459155 426060
11420 426060 380492 388156 431643 462332 467701 451003 410284 372609 385393 440054 467562 441231
11408 441231 415921 432260 457739 464074 480949 518469 521572 473791 462875 549239 642050 621656
11396 621656 532022 518877 602668 655974 614955 571502 608495 665989 648496 578000 553108
11385 553108 607690 686716 731860 730930 706080 699011 741424 803549 810730 750151 707646 742067
11373 742067 784004 745795 680609 712467 827243 871310 783370 694282 732279 843561 898244
11362 898244 882070 869374 872259 847530 819268 856938 932668 933570 842125 779444 820669 884002
11350H84002r042l9946J2420L1478l9783q6387j1419R6165R4353l435o7105m0102
11338H21199J5762L4728J3624k3006n0318m1734L795M1831L4089L054o568K641
11326H49097m579l3222n4156m6124q871M0503O0037J6226m7112l8323M0697O6243
11314H40416k3076j07243o0096M1113L1737p1293r6888k040O5819K0189l7337
11303F01301j2678K7335P5l8779j0538L3643R458m2724l4351J0341R439k0084
11291E32438n807K5825p925p5940o6152J4488L6074l5158p5218j2524N2317K0972
11279D03390l9417j8280N1643N5298j6947o5914m1468N086K1606J6613J0859j93
11267C82276j9794l6975m8243n2255k9724K5317O6923M8042R65k333L0199J4545
$$ plain form
11350 884002 874960 835014 847434 878912 839129 752742 741323 837488 931841 928406 861301 821199
11338 821199 836961 871689 885313 862307 811989 770255 774050 815881 849970 853024 846456 849097
11326 849097 844518 811296 757140 711016 702145 742648 802685 818911 771799 733476 774173 840416
11314 840416 817340 710097 650001 691114 722851 651558 554670 552630 618449 638638 601301
11303 601301 588623 615958 616033 577254 566716 600359 609817 567093 532742 543083 552522 532438
11291 532438 526631 552456 544531 468591 402439 416927 453001 417843 342625 330101 382418 403390
11279 403390 363973 345693 397336 452634 435687 369773 328305 333391 354997 371610 382469 382276
11267 382276 362482 325507 277264 225009 195285 220602 287525 335567 336532 334199 364398 378943
11255C78943o5018j07158m2824M7859N0338j2643k8346J9419L2882k4157n9436
11244A89859j0758M1092N176o1084m2574L8278N2633k2617o6908j6872L3700J801
11232A41726m0620M701Q3749P2795j5588n3019n575K1319l0335p4453k8992M9234
11220A24942N9125P161k3892q994L174j4971l3989k2064J7113N7986O9900L5065
11208B70556j9524l4653J507K2378k2085q0327p3154j6562J0739j173Q770M6975
11196A13447M3995j5994m7359L402O3762M4325k6342n4574j9117K5374M5861M8334
11184B25114K2471m2686r5556o2554L7074R4560N0903l3485p1219m7158P11L7777
11172A15952L7566j1221o5054n0012L1813P9367K8939m5978m0808K6387N4572
$$ plain form
11255 378943 313925 206767 163943 211802 262140 249497 221151 240570 273452 249295 189859
11244 189859 179101 220193 225369 164285 121711 159989 212622 190005 123097 106225 139925 141726
11232 141726 101106 105807 189556 262351 246763 193744 188169 209488 179153 104700 75708 124942
11220 124942 184067 191228 167336 158342 161516 146545 112556 90492 107605 165591 235491 270556
11208 270556 251032 216379 217886 240264 218179 137852 64698 48136 58875 57702 66472 113447
11196 113447 157442 141448 94089 97491 161253 205578 179236 124662 105545 130919 176780 225114
11184 225114 247585 204899 109343 46789 83863 178423 229326 195841 124622 77464 78175 115952
11172 115952 153518 142297 77243 27231 59044 138411 167350 121372 80564 106951 161523
11161A61523J7672j6134r481J259m575K898K5796J5752l4389n8935k4073J3458
11149I0771M806r938J5274M0070J1077l1385j6492K9353K3642k7076l5361J5870
11137A10611M3470O634k8010o184K5223R642j9242l574L2879K7024j4567l1244
11125A52662j2326n905k6831k9509J2123N6488N2595O459l6567m7950l0508K964
11113I3695L9136N7827L8409j6419o7593o5317k458O3372O4189J823n1884m3970
11101A10810J214K9770K9265K0049O687j6333k8989o827K8106K7636p924k4733
11089A68731K639L1009J3589l3074n6606l6440M109L3369L4446R982j4593r781
11077A47380J7146K2666r143l3064r505K4465P177m0237l2239M3215Q3860J7036
$$ plain form
11161 161523 179195 163061 153580 154839 150264 153162 178958 194710 160321 101386 77313 90771
11149 90771 95577 85639 100913 140983 152060 120675 104183 133536 157178 130102 94741 110611
11137 110611 154081 160715 132705 126521 151744 161386 142144 138570 171449 198473 183906 152662
11125 152662 140336 134431 107600 78091 90214 146702 199297 205756 169189 121239 90731 93695
11113 93695 132831 190658 229067 212648 145055 79738 77280 140652 204841 206664 154780 110810
11101 110810 112024 141794 171059 191108 197795 181462 152473 145646 173752 201388 193464 168731
11089 168731 171370 202379 215968 182894 126288 89848 93957 127326 161772 171754 157161 147380
11077 147380 164526 187192 178049 144985 135480 159945 167122 126885 94646 137861 221721 238757
11065B38757p9966p8582J8620Q3475M4402k8907m6675j8693j600K543K1781L5853
11053A91008M952m6835n6693k1201O530J0504K0959L1351J0n0969m0502L3254
11041H2368O4447N320m4837J372P0476M8745k9062m5002M044K1329p856p002K4049
11028A88391j701p6480p3929L4015R9682L0971n1679j4990O3675L4170o4102o7412
11016A00611L4480Q3585J6193m8758k4883J0029k4462o3813k0529N4288N3868
11005A70609r537l4647L583L3828J8084l425r45K182r017j4165j0633k3289m1042
10992H1586j5517M8129P2281K1702l2776k3307P922j1518n2235l1264L8019N8745
10980A61767J2230j2052K4390L9108k1681p3213k5514N9459O0562r626l4269J2733
$$ plain form
11065 238757 158791 80209 98829 182304 226706 197799 151124 132431 130831 133374 155155 191008
11053 191008 195960 149125 92432 71231 77761 88265 109224 140575 140585 89616 49114 82368
11041 82368 146815 152135 107298 108670 179146 227891 198829 153827 157871 179200 171344 164342 188391
11028 188391 186690 110210 36281 70296 169978 200949 149270 134280 197955 232125 168023 100611
11016 100611 135091 218676 234869 186111 161228 171257 146795 82982 62453 116741 170609
11005 170609 161072 126425 130008 163836 181920 178495 177550 179732 170715 156550 145917 122628 81586
10992 81586 66069 114198 186479 208181 175405 152098 160020 148502 96267 65003 103022 161767
10980 161767 173997 161945 186335 225443 203762 130549 105035 164494 225056 215430 181161 193894
10968A93894L7228m607l7650m908M1267L7522L827j7528l2489m5553k0525M3582
10956A94060P4007L1828j7364j5422j0936n2724p1288O272R4337N8806n2246o4841
10944A74489L8358Q1173j8272j10040n6852M6851L9400m5563n0052M1520Q4896
10933B25908J7063m9376j4883N5200M4956l2764o5470j1649M7355L0945l3665
10922B13620o1918k9654R085J2516N525K2639M2578K4594j7957l6353k5564k2988
10910A36123l0407o961M5309O1204J1743m0754l3156Q032K0251J498p182J697
10898A67397O856J1812K9475L4492l503n2757n1715k986K9251J6638k375J454
10886A84039L347k0993m6296l4288J1980N4900O2823L0468k0240n0342l5012P739
$$ plain form
10968 193894 231122 226515 188865 183957 225224 262746 266573 249045 216556 171003 150478 194060
10956 194060 268067 299895 282531 267109 256173 203449 132161 138433 232770 291576 239330 174489
10944 174489 212847 294020 275748 165708 108856 155707 195107 149544 99492 141012 225908
10933 225908 242971 193595 178712 233912 278868 246104 180634 168985 216340 247285 213620
10922 213620 151702 122048 131133 143649 149174 171813 214391 238985 221028 184675 159111 136123
10910 136123 105716 98755 144064 205268 217011 176257 143101 151133 171384 172882 165700 167397
10898 167397 174253 186065 215540 250032 246529 193772 142057 139071 168322 184960 182585 184039
10886 184039 187386 166393 120097 85809 97789 152689 215512 245980 225740 175398 140386 148125
10874A48125L5243K8334N551p331l945L096l973k6161l3497K330N1453M5063k3264
10861B21024o8567l2451K5414K0457k3989k5697J4124K4673R00O049L8107J9831
10849B19875n1613o9550J5213J02996Q9506Q159m5941n1510m0877j7365K0898
10838A79791L3080m427l8781j7987K2338K5092R589J9191K6153j3603n6725l0492
10826A53219L7185N3876P364l1278l2239k6783j5542K9006P1937M5126k5927m2355
10814B23589O643K4517k5604o1245k9137J1907J3387K0128N8317N8384j7455p5132
10802B08299k6016O0124N7633k3105o7299l5460P683J9001K0121K3411J1916p046
10790B49262p292K263k879o482J6029L5001J3150j5504O4K6807J073m6072l3510
$$ plain form
10874 148125 183368 211702 217253 209922 205977 209073 205100 178939 145442 147772 199225 244288 221024
10861 221024 152457 120006 145420 165877 141888 116191 130315 154988 155888 161937 200044 219875
10849 219875 168262 98712 113925 216921 306427 314586 268645 217135 176258 158893 179791
10838 179791 212871 208444 169663 151676 174014 199106 208695 227886 254039 240436 183711 153219
10826 153219 190404 244280 251644 220366 188127 161344 145802 174808 246745 291871 265944 223589
10814 223589 230232 254749 229145 167900 138763 150670 164057 184185 242502 300886 283431 208299
10802 208299 182283 242407 300040 276935 209636 174176 181859 200860 220981 244392 256308 249262
10790 249262 241970 244233 241354 234872 250901 285902 299052 283548 283612 310419 311492 265420 231910
10777B31910J9291J8223l2508k8904M2140O4722n309n4354l488N6388K6427l0317
10765C04221j0202M3983K5979l8591l9665J7082K0688m3553o1120J7176Q7319
10754C23317N2872l5069o5281j6859M2493N7174K7163j7366m3733l7305j4429
10743B72977J303J3888L7195N3544L3881r100l6900m3920m6342l0111K0365N8032
10731C24812K5189l7404l3979K9980M9402m071l7114q027l617o6782q8702J0749
10719A60436J17643Q6352k6189n3679J6364M9702K657k9830m239Q817k0220k4005
10707B83809J6825K3788k5950l9757K3984O6554J6077m3229j7161L6010J5193
10696C56143m3151l3899L1291M9666K154l1417j5022P500J3976K9816M8860K9140
$$ plain form
10777 231910 251201 269424 236916 208012 250152 314874 309565 255211 251723 308111 334538 304221
10765 304221 294019 338002 363981 325390 285725 302807 323495 279942 218822 235998 323317
10754 323317 376189 341120 275839 258980 301473 358647 385810 368444 324711 287406 272977
10743 272977 274280 288168 325363 378907 412788 403688 366788 322868 276526 246415 266780 324812
10731 324812 350001 312597 278618 308598 358000 353929 316815 308788 305171 238389 149687 160436
10719 160436 278079 364431 338242 284563 300927 350629 353286 323456 319217 328034 307814 283809
10707 283809 300634 324422 298472 258715 282699 349253 365330 322101 304940 340950 356143
10696 356143 312992 279093 310384 360050 362204 330787 315765 323265 337241 367057 415917 445057
10684D45057k2673n0225l7565k0738j1208R489K3958j886l6027j2621M9911O3707
10672C99179J2668k7054k2276k3697m4793k2499N3058Q9205L7076k2799j6909
10661D11159N653j7347l9124N01M6567K0043l2712j4630M8991N1223j2497m1203
10649D26624j029L3116J8040m35O810L632k2058k3238J4834M0514K8750J9122
10637E44682K5861L248n4672p3811j7721M0711L3130K805J9450N4709L3587l4858
10625E77121o8774l3367K5477N4347M0221j20l0420j4856L1919M6266P230j9638
10613F15406J7202O5016M8892o256k3720l915l779j6700J2317O2206M8968k4814
10601G90823n4808k98N1730L4642J229J0107K0362j4162l8875Q273P0592N5856
$$ plain form
10684 445057 422384 372159 334594 313856 302648 312137 336095 334209 298182 285561 335472 399179
10672 399179 411847 384793 362517 338820 294027 271528 324586 413791 450867 428068 411159
10661 411159 416812 399465 360341 360842 407409 427452 394740 380110 429101 480324 467827 426624
10649 426624 425595 458711 476751 476316 483126 486758 464700 441462 456296 496810 525560 544682
10637 544682 570543 573791 519119 445308 427587 468298 501428 504233 523683 578392 611979 577121
10625 577121 508347 474980 500457 554804 595025 594905 564485 549629 581548 627814 635044 615406
10613 615406 632608 697624 746516 740260 716540 712625 708846 692146 704463 766669 815637 790823
10601 790823 736015 735717 787447 822089 823318 833425 853787 839625 800750 809023 879615 935471
10589I35471p193j9469J5849O609n0427m8466M1803R8753L3087o5171n9927K6547
10577I07466N7644l669m5650J2843R6576Q5484r565o0617J41Q9275Q7507j106
10565A216329o1074k3246N3103P6254M2582J2836R415O221K873K9816P1322O2087
10553A498518p217n0924m782P4992R0800L8950m404l100J1661K1815M7720Q2849
10541A796878P9951L0603m743J6640N5468N5312K8030K4608N2019P2624P0154
10530B277544O5889P3251P9051P3304O4979O3742O9792Q1160R0497Q2331N8140
10519C079680N1803Q6849J29367J27204R2013Q8792J33446J59957J21522P0782
10509D141415Q5776J51708J83544J54170J28513J55759J93382J79282J33136J27630
$$ plain form
10589 935471 928278 908809 924658 931267 880840 832374 874177 972930 1006017 940846 880919 907466
10577 907466 965110 961441 915791 928634 1025210 1110694 1101129 1040512 1040653 1129928 1217435 1216329
10565 1216329 1155255 1132009 1185112 1261366 1303948 1316784 1326199 1332420 1335293 1365109 1436431 1498518
10553 1498518 1491301 1440377 1435595 1510587 1601387 1640337 1635933 1632833 1644494 1666309 1714029 1796878
10541 1796878 1876829 1907432 1902689 1919329 1974797 2030109 2058139 2082747 2134766 2207390 2277544
10530 2277544 2343433 2416684 2495735 2569039 2634018 2697760 2767552 2848712 2939209 3021540 3079680
10519 3079680 3131483 3218332 3347699 3474903 3566916 3655708 3789154 3949111 4070633 4141415
10509 4141415 4227191 4378899 4562443 4716613 4845126 5000885 5194267 5373549 5506685 5634315
10499E634315J77458K18154K02987J67832J71832K11763K36025K23808K05183
10490G449357K05085K11111K09816K17502K48382K77170K67447K28263K09578
10481I523711K35615K68009K52845J94253J58883J95732K64819K75352K03281
10472A1572500J34111J52533K19644K24382J49148R9735J42220J96545J59323
10463A3050141O4538K7662O8803R8848P2946M7384O1267O2979M534o8726q4519
10452A3405857m6834j5400k0955n1417r0213j23030j33915j31522j48694j84922
10442A2458955j91180j49481j17853j44694j87250j81351j50910j68003k28757
10433A0939476k55289k18732j81337k01094k54973k77335k35982j60952j23424
$$ plain form
10499 5634315 5811773 6029927 6232914 6400746 6572578 6784341 7020366 7244174 7449357
10490 7449357 7654442 7865553 8075369 8292871 8541253 8818423 9085870 9314133 9523711
10481 9523711 9759326 10027335 10280180 10474433 10633316 10829048 11093867 11369219 11572500
10472 11572500 11706611 11859144 12078788 12303170 12452318 12552053 12694273 12890818 13050141
10463 13050141 13114679 13142341 13211144 13309992 13382938 13430322 13491589 13554568 13559102 13490376 13405857
10452 13405857 13359023 13343623 13322668 13271251 13181038 13058008 12924093 12792571 12643877 12458955
10442 12458955 12267775 12118294 12000441 11855747 11668497 11487146 11336236 11168233 10939476
10433 10939476 10684187 10465455 10284118 10083024 9828051 9550716 9314734 9153782 9030358
10424I030358j73766k71479l06820k34571j45027j41289j93872k03911j67665
10415G191958j63243j96230j91675j44312j37766j84809j88641j16558p4254j28455
10405E666015j84842j46249p9109r7482j70490j81867j18593o4187m8702l8595
10395D535899m2671r2919j39947j04099k4891k3058j06257j50352r8544m2153
10385C711008n7021q8268o6229k7360l6885p5623q6969p1548n8669l9249r04J7395
10373C119678k1058p7402q3770l7571N540R170j8780n2240n9707k2719K4303J4391
10361B799835n5027r6827n2790J7484K5877j8294m2751k8055r540J972J8773K1499
10349B582156j1042l8314j0402L3384J2202n7668p4001q757M5080J6892m3342
$$ plain form
10424 9030358 8856592 8585113 8278293 8043722 7898695 7757406 7563534 7359623 7191958
10415 7191958 7028715 6832485 6640810 6496498 6358732 6173923 5985282 5868724 5794470 5666015
10405 5666015 5481173 5334924 5255815 5158333 4987843 4805976 4687383 4623196 4574494 4535899
10395 4535899 4493228 4400309 4260362 4156263 4131372 4108314 4002057 3851705 3753161 3711008
10385 3711008 3653987 3565719 3499490 3472130 3435245 3359622 3272653 3201105 3142436 3103187 3102283 3119678
10373 3119678 3098620 3021218 2937448 2899877 2905417 2914587 2895807 2843567 2783860 2761141 2785444 2799835
10361 2799835 2744808 2647981 2595191 2612675 2638552 2620258 2577507 2549452 2539912 2541884 2560657 2582156
10349 2582156 2571114 2532800 2522398 2555782 2567984 2510316 2436315 2427558 2472638 2489530 2446188
10338B446188n4329j4482K5563L9504K7330o903l7361k5425J7234K6837j5238
10327B428918m3029r258L3318J3914m5706p1223m5593q486K0589M5827M8213J0748
10315B378232k6922j4671J9755O859m7144o4219k1539J4470K657j1471J2834L9307
10303B288148K6609L018O385Q868k6400o2327m3335J275j036m1025m0812R446
10291B128814K9898j1510m0568n297K8422j3323p7640n8936L1036P5234K7304
10280B113434k9167k0835J0476n929n1517n6845j4891J6018M479k2598l6768m0229
10268A865628l5450j1974K1790L3521J2650j0756j2039q104k2948m0915k7037
10257A764366J5002L7433P710m7381p0872m1258N182K0205p79k2168k0358q675
$$ plain form
10338 2446188 2391859 2377377 2402940 2442444 2469774 2462871 2425510 2400085 2417319 2444156 2428918
10327 2428918 2385889 2376631 2409949 2423863 2378157 2306934 2261341 2252855 2273444 2319271 2367484 2378232
10315 2378232 2351310 2336639 2356394 2363253 2316109 2251890 2230351 2244821 2247478 2236007 2248841 2288148
10303 2288148 2314757 2317775 2324160 2333028 2306628 2244301 2200966 2202241 2201205 2160180 2119368 2128814
10291 2128814 2158712 2147202 2106634 2101337 2129759 2116436 2038796 1979860 2010896 2086130 2113434
10280 2113434 2084267 2063432 2073908 2067979 2016462 1959617 1944726 1960744 1965223 1942625 1905857 1865628
10268 1865628 1830178 1818204 1839994 1873515 1886165 1875409 1863370 1855266 1832318 1791403 1764366
10257 1764366 1779368 1816801 1824511 1777130 1706258 1665000 1670182 1690387 1689608 1667440 1647082 1638407
10245A638407n082l055N733N415j5870l1629j1852J9968J4536k0950k6910R174
10233A577885K2299k5798p2896m5864K1786L8165n291k7086P676L3641M7m1268
10221A483296k2188K6413K3901k7450m5337l05L8973J7867k1099j4746J8911J9391
10209A497627j2971k5655q996m802j7866l72N0192N7690j6004q7571o0199K9378
10197A400451N9618Q47n0058k0516M0230M9413O479k9490l0148j3234L179J5085
10185A431856J8119J4148J7630K8739K0955j6839m9519m0020l976J4813O709j494
10173A441121O099J8939K3042J2302j1499k7900q691L4877M7281P136k6931o38
10161A515138M2692K5534l2652l8375K3217N6201K470o5528n1933K8806Q4907
$$ plain form
10245 1638407 1633325 1630270 1636003 1641418 1625548 1593919 1582067 1602035 1616571 1595621 1568711 1577885
10233 1577885 1600184 1574386 1501490 1455626 1477412 1515577 1510286 1483200 1490876 1524517 1524564 1483296
10221 1483296 1461108 1487521 1511422 1483972 1438635 1438330 1477303 1495170 1474071 1459325 1478236 1497627
10209 1497627 1484656 1459001 1450005 1445203 1427337 1426965 1477157 1534847 1518843 1431272 1371073 1400451
10197 1400451 1460069 1460916 1410858 1390342 1430572 1479985 1486464 1456974 1426826 1413592 1416771 1431856
10185 1431856 1449975 1464123 1481753 1510492 1531447 1514608 1465089 1425069 1421093 1435906 1442615 1441121
10173 1441121 1447220 1466159 1489201 1501503 1490004 1462104 1453413 1488290 1535571 1542707 1515776 1515138
10161 1515138 1557830 1583364 1550712 1512337 1535554 1591755 1594225 1528697 1476764 1505570 1590477
10150A590477O9294J3209l1003l3026M700M1396K9436j7704k6620L0373P7880
10139A748412M0822l7126n1678J1015O3033M9066R925k922j32p219o209K6408
10127A843395O2370N4284Q624j8729J931L7267L8948O939j2871R021M3347L8855
10115B113381m339k8540P50M0638L1413j3184k5841J2430M7037L7194J3842K1825
10103B246606M8568N1379K7457J1988J8894K4143Q000j7398k7624j1418K6081
10092B406676O6214Q0302N0046p341m7385m0785j118L3731M0382K5579J0355P262
10080B623918J2796J6410J3605J0938J8851L7365M8601L1460q248l1535r055L3494
10068B798600M2105J3764J0209O5001J15025P7871k2376p3569k4723N0169O3230
$$ plain form
10150 1590477 1659771 1672980 1641977 1608951 1613651 1655047 1684483 1666779 1640159 1670532 1748412
10139 1748412 1789234 1752108 1700430 1711445 1774478 1823544 1833469 1830547 1830415 1823196 1816987 1843395
10127 1843395 1905765 1960049 1968673 1949944 1951875 1989142 2028090 2035029 2022158 2031179 2074526 2113381
10115 2113381 2109042 2080502 2081252 2121890 2153303 2140119 2114278 2126708 2173745 2210939 2224781 2246606
10103 2246606 2295174 2346553 2374010 2385998 2404892 2429035 2437035 2419637 2392013 2380595 2406676
10092 2406676 2472890 2553192 2603238 2595897 2548512 2507727 2506609 2540340 2580722 2606301 2616656 2623918
10080 2623918 2636714 2653124 2666729 2677667 2696518 2733883 2782484 2813944 2805696 2774161 2765106 2798600
10068 2798600 2840705 2854469 2864678 2929679 3044704 3122575 3100199 3026630 3001907 3052076 3115306
10057C115306K5649L928J2797J5605M911J3015M3205N2988K3278m933Q206L7992
10045C351947K9638j9418m9271j6333M4749O2156K2538q583J9779O4077M7969
10034C549248j3229k3242M6072J00267O6797J2778L1314P6289L5466o3276p0548
10023C747936M1662J12473L7270o1712k5878R0267J13077K6744j6851M7354J04354
10012D216696N9106j7072j4848M8666Q3092O5475L8813K2167N048k433J4834L6070
10000D555614L7211L5705N0258N3328K3359L569L7743Q5277Q1128M6237M5253
9989E054682O3261L5509j4546M497Q2720R7876J6634l0197M8584J48804J28494
9978E636318K5078j4828M0345R0801Q2447O4771P1902O8078L5266J5509L4258
$$ plain form
10057 3115306 3140955 3144883 3157680 3173285 3178196 3191211 3234416 3287404 3310682 3305749 3313955 3351947
10045 3351947 3381585 3362167 3312896 3296563 3341312 3403468 3426006 3417423 3437202 3501279 3549248
10034 3549248 3536019 3512777 3558849 3659116 3725913 3738691 3770005 3846294 3881760 3818484 3747936
10023 3747936 3789598 3902071 3939341 3877629 3851751 3942018 4055095 4081839 4064988 4112342 4216696
10012 4216696 4275802 4258730 4243882 4292548 4375640 4441115 4479928 4502095 4507143 4504710 4519544 4555614
10000 4555614 4592825 4628530 4678788 4732116 4755475 4759044 4796787 4882064 4963192 5009429 5054682
9989 5054682 5117943 5153452 5138906 5143403 5226123 5323999 5340633 5310436 5359020 5507824 5636318
9978 5636318 5661396 5646568 5686913 5777714 5860161 5924932 5996834 6064912 6100178 6115687 6149945
9967F149945O0798P2364Q6675J06868J03056P3151N6254O3197O0741M5994O2037
9956F941080J11566J34330J08288R1452J14662J18571O4597K5485P4726J53256
9946G938013J53391Q9162O6036J05476J24273R2656Q8557J55933K15806J83999
9936I213302J01949P5376J28381J90673K07407J95683J91920J95032J81381J51107
9926A0832211J37870J70979K33419K69441K46554K01315J99573K51512K96645
9917A2839519K86053K50352K56228L08987L37728K92022K24265K35725L41098
9908A5371977M35422M28195L67628L67691M36720M71617M30930M04243M57102
9899A9171525N13607M87914M44531M97526O07046O31236N63577N51666O53014
$$ plain form
9967 6149945 6210743 6283107 6369782 6476650 6579706 6652857 6709111 6772308 6833049 6879043 6941080
9956 6941080 7052646 7186976 7295264 7386716 7501378 7619949 7684546 7710031 7784757 7938013
9946 7938013 8091404 8180566 8246602 8352078 8476351 8569007 8657564 8813497 9029303 9213302
9936 9213302 9315251 9390627 9519008 9709681 9917088 10112771 10304691 10499723 10681104 10832211
9926 10832211 10970081 11141060 11374479 11643920 11890474 12091789 12291362 12542874 12839519
9917 12839519 13125572 13375924 13632152 13941139 14278867 14570889 14795154 15030879 15371977
9908 15371977 15807399 16235594 16603222 16970913 17407633 17879250 18310180 18714423 19171525
9899 19171525 19685132 20173046 20617577 21115103 21722149 22353385 22916962 23468628 24121642
9890B4121642P36085O94933O18613O42544P42538P98896P87716P82433Q13538
9881C0738938Q47123Q76327R24758R72657R76938R55970R67072J011906J050182
9872C9321871J088004J154203J206460J178778J121589J162294J300036J377121
9864D8910356J313135J236400J289447J414865J457970J406369J387120J457695
9856E9873357J536216J546854J519874J516359J541830J572952J602715J621926
9848G2332083J610968J584443J593709J649178J687134J655306J590792J566576
9840H5270189J594308J630429J649618J653199J624833J548317J468408J460300
9832I7899601J518289J542748J474464J379598J346860J355005J320217J241099
$$ plain form
9890 24121642 24857727 25552660 26171273 26813817 27556355 28355251 29142967 29925400 30738938
9881 30738938 31586061 32462388 33387146 34359803 35336741 36292711 37259783 38271689 39321871
9872 39321871 40409875 41564078 42770538 43949316 45070905 46233199 47533235 48910356
9864 48910356 50223491 51459891 52749338 54164203 55622173 57028542 58415662 59873357
9856 59873357 61409573 62956427 64476301 65992660 67534490 69107442 70710157 72332083
9848 72332083 73943051 75527494 77121203 78770381 80457515 82112821 83703613 85270189
9840 85270189 86864497 88494926 90144544 91797743 93422576 94970893 96439301 97899601
9832 97899601 99417890 100960638 102435102 103814700 105161560 106516565 107836782 109077881
9824A09077881J199987J219433J214805J124008J003230R37928R20660Q85346
9816A17583278Q19543P65360P28693O65449N62475M67585M20256L98441L54407
9807A22765487K71692J71484Q5675L0976q538o9569j60610k40889k78825l08261
9797A22258622l78429m68639n19405n40201o05381p28564q25040q37338q24069
9788A16531556q68359r57149j017813j033618j052992j104790j166718j211384
9780A08118733j235712j247892j260180j288252j331880j370396j396604j428158
9772I7559659j464306j472500j448981j442544j473766j487552j448414j422546
9764H5899050j476701j548052j530266j455951j453921j527242j531619j417527
$$ plain form
9824 109077881 110277868 111497301 112712106 113836114 114839344 115777272 116697932 117583278
9816 117583278 118402821 119168181 119896874 120562323 121124798 121592383 122012639 122411080 122765487
9807 122765487 123037179 123208663 123294338 123325314 123316776 123247207 123086597 122845708 122566883 122258622
9797 122258622 121880193 121411554 120892149 120351948 119746567 119018003 118192963 117355625 116531556
9788 116531556 115663197 114706048 113688235 112654617 111601625 110496835 109330117 108118733
9780 108118733 106883021 105635129 104374949 103086697 101754817 100384421 98987817 97559659
9772 97559659 96095353 94622853 93173872 91731328 90257562 88770010 87321596 85899050
9764 85899050 84422349 82874297 81344031 79888080 78434159 76906917 75375298 73957771
9756G3957771j335128j403142j508677j475992j341017j290921j370331j422545
9748F2810018j341215j222628j201082j254973j272409j228261j186853j169462
9740E2933135j128947j054806j009030j030485j072332j070346j022487r64354
9732D4580348r11771q71945q70907r11568r31050q66698p55562p00367p32326
9723C7028154p75423p61448p09651o64112o24670n86638n82484o21797o45155
9714C1056776o06883n54091n46615n47629m89327m08503m02318m66389m98896
9705B6536125m66796m39620m39282l96159l03119k71792l51079m17182l58051
9696B3093045k60027k71581l61140l72673k82495k29876k84671l43745l07008
$$ plain form
9756 73957771 72622643 71219501 69710824 68234832 66893815 65602894 64232563 62810018
9748 62810018 61468803 60246175 59045093 57790120 56517711 55289450 54102597 52933135
9740 52933135 51804188 50749382 49740352 48709867 47637535 46567189 45544702 44580348
9732 44580348 43668577 42796632 41925725 41014157 40083107 39216409 38460847 37760480 37028154
9723 37028154 36252731 35491283 34781632 34117520 33492850 32906212 32323728 31701931 31056776
9714 31056776 30449893 29895802 29349187 28801558 28312231 27903728 27501410 27035021 26536125
9705 26536125 26069329 25629709 25190427 24794268 24491149 24219357 23868278 23451096 23093045
9696 23093045 22833018 22561437 22200297 21827624 21545129 21315253 21030582 20686837 20379829
9687B0379829k25804k00989k28890k36312k10527k06717k45893k75596k42142
9678A8306959j64562j16887j41412j93814j96630j46720j24222j69480k09498
9669A6843734j68383r9695j14176k00541k30217j49205n5273m8097j00270j31411
9659A5546466j28937j28734j35747j30342j13520r4034o6667m2428n5616j03153
9649A4547288j28539j06848q7158j03581j10906p0828l4900o0918j04723q9767
9639A3649120m0661m3427r8669j20887p6959k4970j0254j5403k5876n7958j01535
9628A3032521j12786q5725o2324n6314l8406j1650k2518p2430r5324n6502m987
9617A2413555N426j7299m5108p0634p7054l8518J6925J9480l2811n8001k2920
$$ plain form
9687 20379829 20154025 19953036 19724146 19487834 19277307 19070590 18824697 18549101 18306959
9678 18306959 18142397 18025510 17884098 17690284 17493654 17346934 17222712 17053232 16843734
9669 16843734 16675351 16575656 16461480 16260939 16030722 15881517 15826244 15778147 15677877 15546466
9659 15546466 15417529 15288795 15153048 15022706 14909186 14815152 14748485 14706057 14650441 14547288
9649 14547288 14418749 14311901 14224743 14121162 14010256 13939428 13904528 13843610 13738887 13649120
9639 13649120 13608459 13565032 13466363 13345476 13268517 13243547 13233293 13217890 13192014 13134056 13032521
9628 13032521 12919735 12834010 12771686 12715372 12676966 12665316 12642798 12570368 12475044 12418542 12413555
9617 12413555 12418981 12401682 12356574 12285940 12208886 12170368 12187293 12206773 12173962 12115961 12093041
9606A2093041O85l3987o3568l4359p600m6461q7987m7039K6048K5532k8329l2769
9594A1763207J0292N288n2603o2304J462M2065P957l3805l2305k7849m3025k9467
9582A1548913J7450K0096l5939m8269K6679P6697J7212n6634l0454L4607K1734
9571A1592092k7059N030Q2971P2139k0547n5664j877K9421L603J6974Q9033R8618
9559A1884734L142o3084j0608N4625K4885k1848K3653R5230P1369l007M66O4040
9547A2123597O8442J7861K3657Q4701Q3207Q747r131P0352J23507P6448K1068
9536A2692456L5714N5464K5053K5650J16379J84298J11223j3236j7827Q4223J34865
9525A3434262R2074O4084R5784J09231P9788R0267J54982J59354O0916k043P9787
$$ plain form
9606 12093041 12093726 12059739 11996171 11961812 11954212 11907751 11819764 11772725 11798773 11824305 11795976 11763207
9594 11763207 11773499 11778787 11726184 11663880 11665342 11707407 11715364 11681559 11649254 11621405 11578380 11548913
9582 11548913 11566363 11586459 11550520 11502251 11528930 11605627 11622839 11566205 11535751 11570358 11592092
9571 11592092 11565033 11570063 11653034 11725173 11704626 11648962 11647085 11676506 11680109 11697083 11786116 11884734
9559 11884734 11887876 11824792 11814184 11868809 11893694 11871846 11895499 11990729 12062098 12059091 12059557 12123597
9547 12123597 12192039 12209900 12233557 12318258 12401465 12410212 12401081 12471433 12594940 12671388 12692456
9536 12692456 12728170 12783634 12808687 12834337 12950716 13135014 13246237 13233001 13215174 13299397 13434262
9525 13434262 13526336 13590420 13686204 13795435 13875223 13965490 14120472 14279826 14340742 14338699 14418486
9514A4418486J94170J69685M2996J841J02833K07804K03457J38485J06609J15790
9504A5702156J31305J52891J80756J77617J34772J17976J74558K42478K32867
9495A7247376J68282J47775J90217K12613J75909J52271K03147K74175K79150
9486A9050915K29769K04675K26460K50142K54787K64285K78862K66644K37667
9477B1264206K50171L14809L61702L42520L03965L10710L48910L64857L56864
9468B4218714L63726L91337M15529M36579M67206M83964M57735M21256M35566
9459B8091612M93208N27978N23625N33940N80257O12136O02463O02727O54074
9450C3222020P11024P15509O94053P13179P75122Q26196Q45525Q60704Q88208
$$ plain form
9514 14418486 14612656 14782341 14825337 14827178 14930011 15137815 15341272 15479757 15586366 15702156
9504 15702156 15833461 15986352 16167108 16344725 16479497 16597473 16772031 17014509 17247376
9495 17247376 17415658 17563433 17753650 17966263 18142172 18294443 18497590 18771765 19050915
9486 19050915 19280684 19485359 19711819 19961961 20216748 20481033 20759895 21026539 21264206
9477 21264206 21514377 21829186 22190888 22533408 22837373 23148083 23496993 23861850 24218714
9468 24218714 24582440 24973777 25389306 25825885 26293091 26777055 27234790 27656046 28091612
9459 28091612 28584820 29112798 29636423 30170363 30750620 31362756 31965219 32567946 33222020
9450 33222020 33933044 34648553 35342606 36055785 36830907 37657103 38502628 39363332 40251540
9441D0251540R17146R46365R86144J026704J051300J076027J130966J205371J257565
9432D9849128J278827J302740J349075J401530J444727J482351J516606J552197
9424F1177181J620166J745399J883602J950976J940216J949060K053857K203075
9416G6523532K290338K301947K329306K440623K597695K717283K776586K828719
9408I6806029K928712L071527L208318L308360L389349L487739L615853L757905
9400A23573792L895026M018741M128890M235000M352087M479128M593529M686815
9392A57963008M788592M923233N057762N136428N162117N193246N253817N300095
9384A98778298N296876N275741N283058N309055N307674N258735N173523N063064
$$ plain form
9441 40251540 41168686 42115051 43101195 44127899 45179199 46255226 47386192 48591563 49849128
9432 49849128 51127955 52430695 53779770 55181300 56626027 58108378 59624984 61177181
9424 61177181 62797347 64542746 66426348 68377324 70317540 72266600 74320457 76523532
9416 76523532 78813870 81115817 83445123 85885746 88483441 91200724 93977310 96806029
9408 96806029 99734741 102806268 106014586 109322946 112712295 116200034 119815887 123573792
9400 123573792 127468818 131487559 135616449 139851449 144203536 148682664 153276193 157963008
9392 157963008 162751600 167674833 172732595 177869023 183031140 188224386 193478203 198778298
9384 198778298 204075174 209350915 214633973 219943028 225250702 230509437 235682960 240746024
9376B40746024M939469M828926M742305M643794M486363M272021M043959L825464
9368B76528325L601561L359157L108564K855361K579597K262171J920547J601009
9360B97816292J329022J070963P61268L81641l069l17848n72340q36083j127241
9351B98502605j396430j634800j909863k242979k536623k710135k842209l066747
9343B80162819l366448l597572l710919l812602l981026m157492m277117m386628
9335B48873015m541153m679999m717625m694631m719236m794087m820891m766353
9327B11139040m705588m685480m654425m566413m460977m384189m307829m194737
9319A75179402m081622m015279l950299l805613l607068l472923l439928l398192
$$ plain form
9376 240746024 245685493 250514419 255256724 259900518 264386881 268658902 272702861 276528325
9368 276528325 280129886 283489043 286597607 289452968 292032565 294294736 296215283 297816292
9360 297816292 299145314 300216277 300977545 301359186 301356117 301038269 300465929 299629846 298502605
9351 298502605 297106175 295471375 293561512 291318533 288781910 286071775 283229566 280162819
9343 280162819 276796371 273198799 269487880 265675278 261694252 257536760 253259643 248873015
9335 248873015 244331862 239651863 234934238 230239607 225520371 220726284 215905393 211139040
9327 211139040 206433452 201747972 197093547 192527134 188066157 183681968 179374139 175179402
9319 175179402 171097780 167082501 163132202 159326589 155719521 152246598 148806670 145408478
9311A45408478l249024l051205k933662k910579k876235k768373k638808k543142
9303A22437450k452477k325715k197196k121023k075741k002199j906348j842296
9295A05514455j807519j740392j624581j513838j440492j380521j326947j307646
9287I3372519j298380j218340j069652r80150j019308j063710r66771p91996p24949
9278H4239263p85804q03012o91363n79650n85744o20004n41789m02315l68226
9269G8861356m51014m82694l74587k47676k40422l05741l02685k17651j68252
9260G6070634k03144k23883j46523m1273l0256j05911j50940j16386p1614o5289
9250G4915415m9707L585J7786o4574j48308j01420L5112R0138J0712p2380n5805
$$ plain form
9311 145408478 142159454 139108249 136174587 133264008 130387773 127619400 124980592 122437450
9303 122437450 119984973 117659258 115462062 113341039 111265298 109263099 107356751 105514455
9295 105514455 103706936 101966544 100341963 98828125 97387633 96007112 94680165 93372519
9287 93372519 92074139 90855799 89786147 88805997 87786689 86722979 85756208 84964212 84239263
9278 84239263 83453459 82650447 81959084 81379434 80793690 80173686 79631897 79229582 78861356
9269 78861356 78410342 77927648 77553061 77305385 77064963 76759222 76456537 76238886 76070634
9260 76070634 75867490 75643607 75497084 75455811 75425555 75319644 75168704 75052318 74980704 74915415
9250 74915415 74865708 74869293 74887079 74822505 74674197 74572777 74607889 74698027 74708739 74636359 74580554
9239G4580554j149K757j3369J0271K8958k4183r1922o6498K6314N4618j5025p3091
9227G4418235m6356J777n192l7228k4597L1360P7237Q3423N1653k334l1290K0851
9215G4537539J30540J88628J41694Q1046J17894K21614K74129K51630K46087L09500
9205G6500301L82780M07064M14483M57482N16399N41483N44656N82095O62256
9196H1008999P32774P63908P94552Q71058R71314J027078J018747J012518J080273
9187H9281221J203263J295984J325487J355213J441992J538474J557728J510189
9179A00509551J502264J592851J720275J798125J823272J845635J879045J901746
9171A14572764J920367J968784K041375K081001K054298K004900K003949K062288
$$ plain form
9239 74580554 74579405 74582162 74568793 74579064 74608022 74583839 74491917 74425419 74451733 74506351 74491326 74418235
9227 74418235 74371879 74373656 74368464 74331236 74306639 74337999 74415236 74498659 74550312 74547978 74516688 74537539
9215 74537539 74668079 74856707 74998401 75079447 75197341 75418955 75693084 75944714 76190801 76500301
9205 76500301 76883081 77290145 77704628 78162110 78678509 79219992 79764648 80346743 81008999
9196 81008999 81741773 82505681 83300233 84171291 85142605 86169683 87188430 88200948 89281221
9187 89281221 90484484 91780468 93105955 94461168 95903160 97441634 98999362 100509551
9179 100509551 102011815 103604666 105324941 107123066 108946338 110791973 112671018 114572764
9171 114572764 116493131 118461915 120503290 122584291 124638589 126643489 128647438 130709726
9163A30709726K118504K116844K076069K060256K086475K095892K039228J959561
9155A47262555J939783J979049J987337J917821J835942J815262J825264J787640
9147A62350653J701897J636380J613905J587783J531333J472980J427143J363463
9139A74685537J273643J204352J184585J173055J120186J038017R65820R07237
9131A83552432Q47560P95507P56833P00006O04859N17577M94144N07775M79930
9122A89256623L94596L12048K68078K32499J82956J47275J39079J13767L4726
9113A91081647o3236j25649j58041k03365k66418l14694l41452l76528m34785
9104A88797479m96357n43299n82620o27722o84873p59660q48208r20926r48317
$$ plain form
9163 130709726 132828230 134945074 137021143 139081399 141167874 143263766 145302994 147262555
9155 147262555 149202338 151181387 153168724 155086545 156922487 158737749 160563013 162350653
9147 162350653 164052550 165688930 167302835 168890618 170421951 171894931 173322074 174685537
9139 174685537 175959180 177163532 178348117 179521172 180641358 181679375 182645195 183552432
9131 183552432 184399992 185195499 185952332 186652338 187257197 187774774 188268918 188776693 189256623
9122 189256623 189651219 189963267 190231345 190463844 190646800 190794075 190933154 191046921 191081647
9113 191081647 191018411 190892762 190734721 190531356 190264938 189950244 189608792 189232264 188797479
9104 188797479 188301122 187757823 187175203 186547481 185862608 185102948 184254740 183333814 182385497
9095A82385497r50309r85569j076356j175725j232651j261780j314281j396087
9087A72992739j458191j472204j476973j527646j621642j705079j745270j766384
9079A60219350j807239j870456j930687j973455k000698k009417j996471j984716
9071A44646211k010599k071779k115295k101703k062039k061090k110904k151760
9063A27961042k126426k051176j996591k005418k044909k046513j986542j913078
9055A11790389j884669j895895j887374j826997j750356j707364j696135j673994
9047I7467605j616991j542332j480832j448644j437313j412422j335782j214881
9039H5978408j117948j106472j155534j173286j103150r80779q87169q68806r03697
$$ plain form
9095 182385497 181435188 180449619 179373263 178197538 176964887 175703107 174388826 172992739
9087 172992739 171534548 170062344 168585371 167057725 165436083 163731004 161985734 160219350
9079 160219350 158412111 156541655 154610968 152637513 150636815 148627398 146630927 144646211
9071 144646211 142635612 140563833 138448538 136346835 134284796 132223706 130112802 127961042
9063 127961042 125834616 123783440 121786849 119781431 117736522 115690009 113703467 111790389
9055 111790389 109905720 108009825 106122451 104295454 102545098 100837734 99141599 97467605
9047 97467605 95850614 94308282 92827450 91378806 89941493 88529071 87193289 85978408
9039 85978408 84860460 83753988 82598454 81425168 80322018 79341239 78454070 77585264 76681567
9030G6681567r21633q61526p37438o42042o47770p09118p11405o20342n24384
9021G0305909n07256n40047n43355n05455m77798m83505m95288m93434m86797
9012F5772974m75958m48026m15597m13613m43150m59568m36943m10745m29800
9003F1839574m85606n16245m78565m03923l75120m38155n37200n65669m99737
8994E7539354m41788m86110n79002n90406n09662m67356n37706o25359o15877
8985E2686088n49150n42199n99802o24540n90907n78425o18940o38179n95408
8976D7348538n66515o14487o73801o58846o10595o22025o71501o59572n86419
8967D1684777n55824n98269o27425o02356n94731o36472o37292n47092m76053
$$ plain form
9030 76681567 75759934 74898408 74160970 73518928 72871158 72162040 71450635 70830293 70305909
9021 70305909 69798653 69258606 68715251 68209796 67731998 67248493 66753205 66259771 65772974
9012 65772974 65297016 64848990 64433393 64019780 63576630 63117062 62680119 62269374 61839574
9003 61839574 61353968 60837723 60359158 59955235 59580115 59141960 58604760 58039091 57539354
8994 57539354 57097566 56611456 56032454 55442048 54932386 54465030 53927324 53301965 52686088
8985 52686088 52136938 51594739 50994937 50370397 49779490 49201065 48582125 47943946 47348538
8976 47348538 46782023 46167536 45493735 44834889 44224294 43602269 42930768 42271196 41684777
8967 41684777 41128953 40530684 39903259 39300903 38706172 38069700 37432408 36885316 36409263
8958C6409263n25786o03988n66010m66561m79711n97445o19656m76636l54651
8949C1718819m08744n28897n29952m36553m08305m66112m77814l91229l12528
8940B7758685l30840l97948m24785l99708l65775l49630l49525l47360l18459
8931B4474655k70757k61534l16147l56459k98980k03997k09104l11332l53573
8922B1892772k66188j77661k04883k67465k32763j42652j43249k44457l07638
8913A9905816k62349j91167j77034j91256j79589j59324j68049j85524j71527
8904A8219997j38824j32327j60255j89884j95959j79540j50262j18818j02475
8895A6851653j15241j48419j72054j63801j37690j34316j67017j87420j40534
$$ plain form
8958 36409263 35883477 35279489 34713479 34246918 33767207 33169762 32550106 32073470 31718819
8949 31718819 31310075 30781178 30251226 29814673 29406368 28940256 28462442 28071213 27758685
8940 27758685 27427845 27029897 26605112 26205404 25839629 25489999 25140474 24793114 24474655
8931 24474655 24203898 23942364 23626217 23269758 22970778 22766781 22557677 22246345 21892772
8922 21892772 21626584 21448923 21244040 20976575 20743812 20601160 20457911 20213454 19905816
8913 19905816 19643467 19452300 19275266 19084010 18904421 18745097 18577048 18391524 18219997
8904 18219997 18081173 17948846 17788591 17598707 17402748 17223208 17072946 16954128 16851653
8895 16851653 16736412 16587993 16415939 16252138 16114448 15980132 15813115 15625695 15485161
8886A5485161n6948l6281j11273j86914j68926j00141q9533j42316j62481j16167
8876A4314181q2009j13375j53179j38326j03593j11258j41501j33486r4506q5605
8866A3157343j17304j36673j17182r4789j03246j28238j43752j48999j46466j21672
8856A1899022p5999n1888q5537j45453j60821j17501q3222j10547j53282j31776
8846A0782996n9890l3004q2777j27819j06718p5438j02567j44249j23856p7064
8836I849614r0784j33189r4803L952J2535j03443j82601j15376j6817l4151j14589
8825H980348j16096n0237m1571j02528j25233p8491m7424o9777q2843n6716m4248
8814H165184o5517o7566l7681l8385q6048j08675p3553m5026o0704o4237k6594
$$ plain form
8886 15485161 15428213 15391932 15280659 15093745 14924819 14824678 14735145 14592829 14430348 14314181
8876 14314181 14232172 14118797 13965618 13827292 13723699 13612441 13470940 13337454 13242948 13157343
8866 13157343 13040039 12903366 12786184 12691395 12588149 12459911 12316159 12167160 12020694 11899022
8856 11899022 11823023 11771135 11685598 11540145 11379324 11261823 11178601 11068054 10914772 10782996
8846 10782996 10723106 10690102 10607325 10479506 10372788 10297350 10194783 10050534 9926678 9849614
8836 9849614 9758830 9625641 9530838 9534790 9547325 9443882 9261281 9145905 9129088 9094937 8980348
8825 8980348 8864252 8814015 8772444 8669916 8544683 8466192 8418768 8348991 8266148 8209432 8165184
8814 8165184 8099667 8032101 7994420 7956035 7869987 7761312 7687759 7642733 7582029 7517792 7491198
8803G491198j7421p1825j00004l5407K9866j4961j08254j10394l1101l684n8094
8792F969919q3164k7413J5896k8242r6505r8900n2579k8398l6332m0584l7493
8781F456205m6026n4985m4188l2236m3447m9111o874N1091L9949n3835j34571
8770F081972j19536m9933k4959n5243n6926L760M3274j1975r6036q7660N308M9333
8758E681379j7810r8172q6729j9223O858j6051k8081k4632m8279q2449o4519n757
8746E196535Q382m2441p3948l3105J8735J1400k5777k9217j1543k7557o9169p4914
8734D847381k9429J5712J9779m194k9082m8973o2464n6233k3545J8213M0065K6185
8722D713415j2657m5458m7973k8121j3778j4969j7941j6805j9678j7695R709M1661
$$ plain form
8803 7491198 7473777 7401952 7301948 7266541 7296407 7281446 7173192 7062798 7031697 7028013 6969919
8792 6969919 6886755 6859342 6875238 6846996 6750491 6651591 6599012 6570614 6534282 6493698 6456205
8781 6456205 6410179 6355194 6311006 6278770 6235323 6186212 6179338 6230429 6270378 6216543 6081972
8770 6081972 5962436 5912503 5887544 5832301 5775375 5779135 5822409 5810434 5714398 5626738 5632046 5681379
8758 5681379 5663569 5565397 5478668 5459445 5466303 5450252 5422171 5397539 5349260 5266811 5202292 5196535
8746 5196535 5204917 5162476 5088528 5055423 5074158 5085558 5059781 5030564 5019021 4991464 4922295 4847381
8734 4847381 4817952 4833664 4853443 4849249 4820167 4771194 4708730 4652497 4628952 4647165 4687230 4713415
8722 4713415 4700758 4655300 4607327 4579206 4565428 4550459 4532518 4515713 4496035 4478340 4488049 4529710
8710D529710J9361o0622j07791n2649L8407M3120l8027p7001r437O3639K4100
8699D372810q2822j06413l809J00132Q5339j1033o6449m2293n689l726l144K5409
8687D258312M1877P589l5395k4928J6656J7161k3775l4291N115K7401l864l0559
8675D221299k459L3389J3713l1708l2721K206Q662j5866j0925L0455L6105k8112
8663D224038r0826p0187J2409O2499L2364l1378n5294k4743R258M75l3197l9039
8651C996379r177Q413j1141k8616j0262J0922n600l1362j8949O518j1315m9004
8639C846806l0525L5098M7351k7702r0739n2125L7214O2565j924q1236j03797
8628C640986o3333j261L1803J7637m627J2547M2506J1398p3261j05175l8301K6938
$$ plain form
8710 4529710 4549071 4488449 4380658 4328009 4366416 4409536 4371509 4294508 4285071 4348710 4372810
8699 4372810 4289988 4183575 4179766 4279898 4365237 4354204 4287755 4245462 4239773 4236047 4232903 4258312
8687 4258312 4300189 4307778 4272383 4247455 4264111 4281272 4257497 4223206 4228321 4255722 4251858 4221299
8675 4221299 4218840 4252229 4265942 4234234 4201513 4203719 4212381 4196515 4185590 4216045 4252150 4224038
8663 4224038 4133212 4063025 4075434 4137933 4170297 4138919 4083625 4058882 4068140 4068615 4035418 3996379
8651 3996379 3987202 3995615 3984474 3955858 3945596 3956518 3950918 3919556 3900607 3907125 3895810 3846806
8639 3846806 3816281 3851379 3898730 3871028 3780289 3728164 3765378 3827943 3826019 3744783 3640986
8628 3640986 3577653 3576392 3608195 3625832 3621205 3633752 3676258 3687656 3614395 3509220 3470919 3497857
8616C497857m008o4459l5675M9740N2831m5206j08679n8981J5964J5932k6282
8605C289034l2094j5527l4589o5798l7669L4464N3602r822o6659m2853J0001j190
8593C080900o3794p6679o953N2853J8372o0592p2847q613L3499k01m5443l1446
8581B819056J1341J2111k7062m7198k7838M73J7877K7384K1423n207k4782j5839
8569B761739j0889m0486n8205o934O0943L7603o4152j07878l6394M2186K8414
8558B605947k2885j7784J4196j1867p1803o5499J2393N8704K2454k9258k9682
8547B464916m638o523k7549k8429o961Q323N273p304k2403l3046k4162N917K6105
8534B349519L701m4082n6967p418M8526L1335m9046q8023k6112N4176L8206m6753
$$ plain form
8616 3497857 3493849 3429390 3393715 3443455 3496286 3451080 3342401 3283420 3299384 3315316 3289034
8605 3289034 3256940 3241413 3206824 3141026 3103357 3137821 3191423 3181601 3114942 3072089 3082090 3080900
8593 3080900 3017106 2940427 2933474 2986327 3004699 2944107 2871260 2862647 2896146 2895945 2850502 2819056
8581 2819056 2830397 2842508 2815446 2768248 2740410 2740883 2758760 2786144 2807567 2802360 2777578 2761739
8569 2761739 2750850 2710364 2652159 2645225 2706168 2743771 2679619 2571741 2535347 2577533 2605947
8558 2605947 2583062 2565278 2579474 2567607 2495804 2430305 2442698 2501402 2523856 2494598 2464916
8547 2464916 2460278 2453755 2426206 2397777 2390816 2399139 2404412 2397108 2374705 2341659 2317497 2323414 2349519
8534 2349519 2353220 2309138 2252171 2244753 2293279 2324614 2275568 2187545 2161433 2215609 2253815 2207062
8522B207062o5794J6433P9398L6228l8212m4129j3897k4797m5455n663M5650R493
8510B156317p0972n7760M4507P5535k1733j02677n2831L8312L6159l6236o9859
8499A938762m1187L955M9886Q1213L9769o8757j12948j6889Q3823L1048q9390
8488A899285p3088N8773Q1660n5756j33692k0819J08841O2717o8570q6885j0987
8477A761479k560o4096m9857N3955R2285Q083o1069j5909N2333L3049k7902l4453
8465A745338o475j6475m4255k2968K3806J7120l2990l7035K5248P1636M4159j9775
8453A747334n9322n6956j8898L6804N7390k032r0773r7072k648P7558N4213j9188
8441A626410m8258l6432l7141l4572J7912P8442N5812l7241q4497l7859J7973
$$ plain form
8522 2207062 2141268 2157701 2237099 2273327 2235115 2190986 2177089 2152292 2106837 2101174 2146824 2156317
8510 2156317 2085345 2027585 2072092 2147627 2125894 2023217 1970386 2008698 2044857 2008621 1938762
8499 1938762 1897575 1901530 1951416 2032629 2072398 2003641 1890693 1873804 1957627 1988675 1899285
8488 1899285 1826197 1884970 1966630 1910874 1777182 1756363 1865204 1927921 1859351 1772466 1761479
8477 1761479 1758919 1694823 1644966 1698921 1791206 1799289 1738220 1722311 1774644 1807693 1779791 1745338
8465 1745338 1738863 1722388 1678133 1655165 1678971 1696091 1663101 1626066 1651314 1722950 1767109 1747334
8453 1747334 1688012 1631056 1612158 1648962 1706352 1704320 1613547 1516475 1513827 1591385 1645598 1626410
8441 1626410 1578152 1541720 1504579 1470007 1487919 1566361 1622173 1584932 1500435 1462576 1480549
8430A480549R046k0160k856L1270J5853l0472l2915J6125M7758K5935q382j3401
8418A518350m946j4426l2970k9469j915J6711k56l9009n6769l0252J2026K2525
8406A359600o42j1612J0710K8431R919j3328j125K0788L411l2796k4788K0383
8394A368951K6037k4123m4918J5997Q0031M5862n5685j00720m5802K3014K3135
8383A311779j7555k1938J9536M5130J7204k6573k8677J0636L7620K0760q026m443
8371A355453J9428J3739k7388m7754r402M7682N8240J8363j7723j3922J1590K3464
8359A431770J0833j1686k2136p628K1291L5140J9014o318j3270m394J372L526
8347A457514J0388R081j5281l8447k1064K5625M7196K7864J2699K8788L7989L124
$$ plain form
8430 1480549 1489595 1469435 1466579 1497849 1513702 1483230 1450315 1466440 1514198 1540133 1531751 1518350
8418 1518350 1513404 1498978 1466008 1436539 1434624 1451335 1451079 1412070 1355301 1325049 1337075 1359600
8406 1359600 1358958 1347346 1358056 1386487 1396406 1383078 1381953 1402741 1406152 1373356 1348568 1368951
8394 1368951 1394988 1370865 1325947 1341944 1421975 1467837 1412152 1311432 1265630 1288644 1311779
8383 1311779 1294224 1272286 1291822 1336952 1354156 1327583 1298906 1309542 1347162 1367922 1359896 1355453
8371 1355453 1374881 1388620 1361232 1313478 1304076 1351758 1409998 1428361 1410638 1396716 1408306 1431770
8359 1431770 1442603 1430917 1408781 1401153 1422444 1457584 1476598 1470280 1457010 1452616 1453988 1457514
8347 1457514 1467902 1476983 1461702 1423255 1402191 1427816 1475012 1502876 1515575 1544363 1582352 1585476
8335A585476m5065n2891k1001J1511L0586M1327K4915l2046p7302l8813N8148
8324A484845R5292J7182q0944p5182K1659Q2582L6212n1604p4330j2644N8821
8313A501889O5558Q583m7882n0052r932J7727Q389o440M147K1185J4321J313K0438
8300A549244N8005O1103K2757o692m808p362k7400j6470M2868P3971J2993p1536
8288A686673o3201K4249O2708O173m3565n019N5292L4659m5618q0934l7502K1806
8276A615721M0550J8429k6805p1897p1988p897N3376K5305o4547r3880k1313M8133
8264A443187K0550m8872n0510J1611M1802Q727k2202r474P064p992k4454j1564
8252A357873K266j3479k7166M25L5854J8949l1826l8785R953L6543j296l9548
$$ plain form
8335 1585476 1540411 1487520 1466519 1478030 1508616 1549943 1574858 1542812 1465510 1426697 1484845
8324 1484845 1580137 1597319 1516375 1441193 1462852 1545434 1581646 1530042 1455712 1443068 1501889
8313 1501889 1567447 1576030 1528148 1478096 1468164 1485891 1494280 1487840 1491987 1513172 1527493 1528806 1549244
8300 1549244 1607249 1668352 1691109 1684417 1679609 1672247 1644847 1628377 1671245 1745216 1758209 1686673
8288 1686673 1623472 1647721 1710429 1716602 1673037 1668018 1723310 1757969 1712351 1631417 1593915 1615721
8276 1615721 1656271 1674700 1647895 1575998 1504010 1496113 1549489 1574794 1510247 1416367 1395054 1443187
8264 1443187 1463737 1414865 1364355 1375966 1417768 1426495 1404293 1394819 1401883 1393891 1369437 1357873
8252 1357873 1360139 1346660 1319494 1319919 1355773 1374722 1342896 1304111 1314064 1350607 1349311 1309763
8240A309763j2568L7842L1028k0097l3984K978K1124p394k6970r756r782n1949
8228A230235o0488J7162R1818M9145o3650r4950j5536M6207J1215m2812l1803
8217A136543K51j8531n1837k6448K7331K2602l3432n0911p276K4298M651j6587
8205A010654l196M605k4735m5270j0252M1728M4771Q189r133j66j0485m4463m7788
8192I14459k273K9504l707n4781m2149K5682N7987J4018m2677m7074k3105k0798
8180H05086k0939J8808O0343K9144m6553n4665J9770N3419j7229p8023j9118P0528
8168H20571L6106q3140j02188J6950J02805M2279n6950n3106J9665L9817l935
8157G78874k8670r916K350j0092j6062r869j6479l0157k2456k120J103j171K1070
$$ plain form
8240 1309763 1297195 1335037 1366065 1345968 1311984 1314962 1336086 1328692 1301722 1291966 1282184 1230235
8228 1230235 1169747 1186909 1278727 1327872 1264222 1169272 1153736 1199943 1211158 1168346 1136543
8217 1136543 1136794 1118263 1066426 1039978 1067309 1089911 1056479 1005568 998292 1022590 1027241 1010654
8205 1010654 1007458 1012063 987328 942058 931806 973534 1018305 1026494 1017361 1017195 1006710 962247 914459
8192 914459 912186 941690 937983 883202 841053 866735 924722 938740 896063 848989 825884 805086
8180 805086 784147 802955 863298 892442 845889 791224 810994 864413 847184 769161 750043 820571
8168 820571 856677 773537 671349 688299 791104 833383 776433 723327 742992 782809 778874
8157 778874 750204 740288 742638 732546 716484 706615 690136 659979 637523 635403 636506 635335 656405
8144F56405M5839K7340j4867j5709K5418L6422j1663n7240m2380R647M0284K7833
8132G27329j0641m4280l8209J6033O7324N1868j5895n4572k9936N940R051N930
8120F89942K6267M0393J4336k5717l7194k7517k6945l1867k3006p677K8R475K4866
8107F25384K3794L871M989L7720M2016j9254p6827m7156L1414N0447k984l7002
8095F36412r308J7598k110k3688m723J6549k693k6689n897K8336J3620l2368l4302
8082E70737J7963M9814J6924l1177l3100l946M277r382m891J8653J7627j4943
8070E98556k6283Q818L5354L997l7908j4748M7487N0970j8994o8500m4490p000
8058E27259r162q674L1730N3115L562n1147l0688J8302Q721k4540M687N4764K1676
$$ plain form
8144 656405 702244 729584 714717 699008 724426 760848 749185 691945 649565 659212 699496 727329
8132 727329 716688 672408 634199 650232 717556 769424 753529 698957 669021 674961 684012 689942
8120 689942 716209 756602 770938 745221 708027 680510 653565 621698 598692 591015 591043 600518 625384
8107 625384 649178 653049 658038 695758 737774 718520 641693 594537 625951 676398 673414 636412
8095 636412 627104 644702 642592 618904 614181 630730 628037 601348 595451 623787 637407 605039 570737
8082 570737 588700 638514 655438 624261 591161 587215 591492 582110 577219 595872 613499 598556
8070 598556 572273 581091 616445 620442 582534 567786 615273 666243 647249 578749 534259 527259
8058 527259 518097 509423 541153 594268 597830 546683 515995 534297 543018 518478 523165 577929 599605
8045E99605m9264j8528Q1427O2330r0448j46525L021J42534O6294r0083q0438
8034D79925M8953O0345o3148j00841K3597J25063P2773k3373l3629o521k7737
8023E55407n2131j1696L9963K6562q812R677M4083J1761o0258p5301k2916J8482
8011D74821J1647n727m413L055O357J0473J3318J5050K5930L1608j245m7902k8451
7998E04521N4937P5595l1478j33726p9936O1024R9470J4612l7745M038K5913l4763
7986E22462p1164j951P6974N2186k1392k5402K3859K1653l8554o1593j1355M3642
7974E09365M5437J2857j4948k6324k0261n02R680o923k7870k4723j0885r746l600
7961D31557K7726M7739J4296l4749k9211J5407J9130k5396l6547J7241O0402L1526
$$ plain form
8045 599605 550341 531813 613240 675570 585122 438597 441618 584152 650446 560363 479925
8034 479925 528878 589223 526075 425234 448831 573894 646667 623294 589665 583144 555407
8023 555407 503276 491580 531543 558105 549293 558970 603053 614814 554556 479255 456339 474821
8011 474821 486468 480741 476328 479383 485740 496213 509531 524581 550511 582119 580874 532972 504521
7998 504521 559458 635053 603575 469849 389913 450937 550407 565019 527274 531312 557225 522462
7986 522462 451298 449347 526321 578507 557115 531713 555572 577225 538671 477078 465723 509365
7974 509365 554802 567659 552711 526387 506126 505624 515304 508381 480511 455788 444903 435157 431557
7961 431557 459283 507022 521318 486569 457358 472765 491895 466499 429952 447193 507595 539121
7949E39121k4702l9072j8543o502l203J0622J9047L082j0803O394K9560K2864
7937E27865L645K357l033m0597o7268k5264M5851N1757n789k6429K3686N4988
7925E41769P679m5071k3398K0072q161p3714o1601L1125P8361J6783o1556n5202
7913C67086M819K8505Q763L490K0215J1896k5209l6266j878K5400N308k7354k0450
7900C64325J8110M1383L2210J0347r111k3427k0403R184L9321K9835j2445l2212
7888D47117l403K6775L756m9129n7244k452M5768K7572k1533k5084J9124L6956
7876D48223o393m9465k5194L7741N4631K366n6169o0575j8496K2777L1105P388
7864C87939j9764j3964K3845L7357j3322p1494m4285M9542Q0557l135q1281l3940
$$ plain form
7949 539121 514419 475347 456804 450302 447099 457721 476768 479850 469047 475441 505001 527865
7937 527865 531510 533867 530834 490237 422969 397705 443556 495313 489524 463095 486781 541769
7925 541769 549448 504377 480979 501051 492890 419176 357575 388700 467061 483844 422288 367086
7913 367086 371905 400410 409173 412663 432878 444774 419565 383299 381421 406821 412129 384775 364325
7900 364325 382435 423818 456028 466375 457264 433837 413434 422618 461939 491774 479329 447117
7888 447117 443714 470489 474245 425116 367872 365420 411188 438760 417227 392143 411267 448223
7876 448223 441830 392365 367171 404912 459543 461909 405740 345165 326669 349446 380551 387939
7864 387939 368175 354211 378056 415413 402091 330597 286312 335854 416411 413276 331995 298055
7852B98055O9188O8087m0499r3237n781J04935R7378l273p1701o3682l4021j7327
7840C08122O358L5056K7144j9578m3945j0590L2096K5106j2008j6867J5765K9470
7828C76129l29k7752j2551J5311P784j9819j3879K6948M6075J7058k0487k8180
7816C66308j6924m551J6979L7949J5261m8650p0573m82P9527N8323l8179q5124
7804C09864m3800L443N013P101L9402M8561J053m4146l1891R27Q75j2152j190
7791B83060J0953l639j2061J1806J9826k2217m6046J3400Q2791M6727n9851r2599
7779B32150j6525N4494M3607J222j6569k9617m8089k4023M8365Q4523L2907l6285
7767C26160l7456O797K1860K68j1812k776J555o344j5071k4619l3039k1604R906
$$ plain form
7852 298055 367243 435330 394831 301594 295813 400748 498126 494853 423152 359470 325449 308122
7840 308122 314480 349536 376680 357102 313157 302567 334663 359769 347761 330894 346659 376129
7828 376129 375800 348048 335497 350808 358592 338773 324894 351842 397917 414975 394488 366308
7816 366308 349384 344833 361812 399761 415022 366372 295799 295317 374844 433167 394988 309864
7804 309864 266064 269507 274520 281621 321023 369584 370637 326491 294600 295527 296402 284250 283060
7791 283060 294013 290374 278313 290119 309945 287728 241682 255082 337873 384600 324749 232150
7779 232150 215625 270119 313726 314948 298379 268762 220673 196650 245015 329538 362445 326160
7767 326160 288704 295501 317361 317629 305817 303041 304596 298252 283181 258562 225523 203919 213825
7754B13825K7416J4710J388R278J8803J7926K5864L4579k686p8705j04899l7681
7742A39818M3759N7050L5240L9569L5880k7869q7781m4245O2449R6236K8794l6143
7730C42757l7891k2085j8952M515M2172K9134l3356n4961o480K5804p186l1017
7718B32454J2265N4074K1917l1419k7733k155k3608n3271j5101M9211L8992k4791
7706B30835k6079M6592P6534J5457m0801k1977M556l0600o5052j3224P2035P0939
7694C19215j0490m6653R457N5262N171p2327n9614L0197P2768J4957n4007l6918
7682B27018L8311P0754K7932k6506l2206j935J5412o28l0233m0504j5138K4626
7670B56903L0900j4404o1152m4540K6284P5427N8473O895l2774n0960m9001j7115
$$ plain form
7754 213825 241241 255951 257339 266617 285420 303346 329210 363789 361103 282398 177499 139818
7742 139818 183577 240627 275867 315436 351316 323447 235666 191421 253870 350106 378900 342757
7730 342757 304866 282781 263829 268344 310516 339650 306294 251333 244853 270657 263471 232454
7718 232454 244719 298793 320710 289291 261558 259403 235795 182524 167423 216634 255626 230835
7706 230835 204756 251348 327882 343339 302538 280561 285117 254517 189465 176241 248276 319215
7694 319215 308725 262072 271529 326791 331962 259635 200021 230218 302986 317943 263936 227018
7682 227018 265329 336083 364015 337509 305303 303368 318780 318152 287919 247415 232277 256903
7670 256903 287803 273399 212247 167707 193991 269418 327891 334786 302012 251052 202051 184936
7658A84936L0578M7606J8220j2333m975J7955K0176Q226k75j6488l9815k8533
7646B25278K8777O2383J6144n0784m4740J4386K7655j8937l9132p34K3038r411
7634B33923l0913J3166N9402K4784n4546p4256j5385M0658L7793O387q350j1042
7622B21621k2922l1512j1500K5845M0612K0694J018J2237L2527K0375j6069k7757
7610B65169q353j0893n0799n7144J6174Q6972M7983n8295q4418J997O9550L0084
7598B48027l1580j0610M4209K2221n5394o5032K0636Q7185M6388m8207q8015m3812
7586A26016K3908M5697N735m9344n1944J1875P2612N7180j0285l8708n30L2990
7574B25202O643l5452k6920J3408J6335k3257l9086n00M0232L0912m599j3378
$$ plain form
7658 184936 215514 263120 281340 269007 264032 281987 302163 310389 310114 293626 253811 225278
7646 225278 254055 316438 332582 281798 237058 251444 279099 260162 221030 220296 243334 233923
7634 233923 203010 216176 275578 300362 245816 171560 156175 196833 234626 241013 232663 221621
7622 221621 198699 167187 155687 181532 222144 242838 243856 256093 288620 308995 292926 265169
7610 265169 256816 245923 195124 137980 154154 241126 289109 230814 146396 148393 217943 248027
7598 248027 216447 205837 250046 272267 216873 151841 172477 259662 306050 257843 169828 126016
7586 126016 149924 195621 201356 152012 100068 111943 184555 241735 231450 192742 192212 225202
7574 225202 231845 196393 169473 182881 199216 175959 136873 136373 176605 207517 202918 189540
7562A89540K442J125j8915j4806K2716M4054J4856l0844m0833j1742K3013L7422
7550B18028J8097l2662o8285k7501O2714Q1777j6105j01234m3403P5792P2097
7539B39315n3662j13517k8427O2143M4825K172L4125P3706K1971o1874o2093j795
7527A56889J8968P71N735J3490k2604m3256J9055P3550j884j17656q1028P3701
7515I5731J12147k1284j10791k7967P0101K6041o2174l7868M8023N6513M758j092
7503A52138L0657K4937L518K3885L3164l7581j03558m1531P9056Q2703k4280o3708
7491A59400J5498O2522q965p9494l1440O5102P7898N994n2684m5543L599M6805
7479B18692M0745k0039o8877l5783L4625K9076n0999p2733J6347R0011L7356o2368
$$ plain form
7562 189540 191982 193107 174192 159386 182102 226156 241012 210168 169335 157593 180606 218028
7550 218028 236125 203463 135178 107677 170391 252168 236063 134829 91426 167218 239315
7539 239315 185653 72136 43709 105852 150677 152849 186974 260680 282651 220777 158684 156889
7527 156889 175857 176628 182363 195853 173249 129993 149048 222598 220714 103058 22030 95731
7515 95731 207878 186594 75803 47836 117937 143978 81804 43936 91959 148472 153230 152138
7503 152138 182795 207732 211250 235135 268299 230718 127160 85629 164685 247388 223108 159400
7491 159400 174898 237420 228455 148961 117521 182623 260521 266515 213831 168288 171887 218692
7479 218692 259437 239398 170521 134738 169363 198439 147440 74707 91054 181065 218421 156053
7467A56053o6588J8658P1718M0016k0539n1758m0669P616N9416M9920k8248p6644
7455A18951j8937P0129O7846p094l3578Q179J6171m1277o2520P899P0866K8648
7443B25283n5480n9473P033L2511j1073l3327J6837O4857K7076n8685q3478j5715
7431E6366O2451O5641M485m3870l4616M237K1365M262j7429j5681L858J3855J859
7418A26783j2771m906J7002J6369j6464l7375n629M7030M8524j0186n3854k7098
7406H7425K7462L6246L507n535K4940L5354j0551n9810m2675K4989O1797L1062
7394B14211j9086l3656k1754k0331k3994j933K9576J4666m7303p4942j4409P0350
7382G1395P6373M331m5848j6477L9776M8343Q762k8052l3863j9168l182K971m57
$$ plain form
7467 156053 89465 108123 179841 219857 199318 147560 106891 114507 173923 223843 195595 118951
7455 118951 100014 170143 237989 230895 197317 205496 221667 180390 117870 125769 196635 225283
7443 225283 169803 110330 117363 149874 138801 105474 122311 187168 214244 155559 72081 56366
7431 56366 118817 184458 188943 145073 110457 114694 136059 140321 122892 107211 111069 124924 126783
7418 126783 114012 109106 126108 142477 126013 88638 83009 130039 178563 168377 114523 87425
7406 87425 114887 151133 154640 149105 174045 209399 198848 139038 96363 121352 183149 214211
7394 214211 195125 161469 139715 119384 95390 93457 123033 137699 90396 15454 1045 71395
7382 71395 147768 152099 106251 89774 129550 177893 186655 158603 124740 105572 102390 105361 104904
7369A04904K03J3928K2400L246k5562k4108N249K0860J4233J9926L8331J8237
7357B11847n0271r3413n3824K3340N8603M2741J7227j547j6385j0702J7736K2602
7345A67954k3367o3020l0954L7488N3804Q094l0540k7677j1050N655L6953O2031
7333A85371L4863k8610n1980n902N3009O6102L3608j7613o3911p4033l1286K5761
7321A25379M2496K3805Q175j2694o2132q8522k2375Q0088Q3635j5540o8088m878
7309H9349N6592J5383m8492k5155L4540K0691l5657k0859N6683P5967O24p1405
7297A48261o2612p075K9385K9650R076j0827m804K4766L0714q923l5009M908N0456
7284A97966Q705q3546r4136M922Q8146N5977l6488p3597k4170N2391Q6250M8365
$$ plain form
7369 104904 105107 119035 141435 144681 119119 95011 100260 121120 135353 155279 193610 211847
7357 211847 161576 68163 14339 37679 96282 139023 156250 154703 138318 127616 145352 167954
7345 167954 144587 81567 50613 88101 141905 149999 119459 91782 80732 86387 123340 185371
7333 185371 220234 191624 139644 133742 186751 252853 286461 268848 204937 130904 99618 125379
7321 125379 167875 191680 199855 187161 125029 36507 14132 94220 177855 162315 94227 89349
7309 89349 145941 161324 112832 87677 122217 142908 107251 86392 143075 219042 219666 148261
7297 148261 85649 78574 107959 137609 146685 135858 131054 155820 186534 177611 142602 147510 197966
7284 197966 206671 123125 28989 33911 122057 178034 141546 67949 43779 96170 182420 230785
7272B30785l0595p2518l1058L5366L0443l8901o7782j3014M3994K9702j4912j6927
7260H4583J3103J9107M80L13K1094K0387j5763m5615k5566L3149O9312L4781m1634
7247A67731p3021k2538L7184K3669k8231k0269M5101O1542p030o4707m0279N311
7235H4463j469k0157J5381O2179L5617l9012n9995j1195K1542n239l3963j0448
7223C7704L7483N5981L6256J14l5382n1194k6286K6078N2550J9445l8793n5070
7211E8886q241N1024N8940J5393j7075j103J8127j6877p1914n8088K5252P1564
7199A25888K5109l0302n703M7796K3708o0943q4748p383P1280N7117j7942n7320
7187H6557k4728K9838L9903n164m8206k8512L4020N1430r592o6084l3938M2438
$$ plain form
7272 230785 200190 127672 96614 131980 162423 123522 55740 42726 86720 116422 101510 84583
7260 84583 97686 116793 117273 117586 138680 159067 143304 97689 72123 105272 174584 209365 167731
7247 167731 94710 72172 109356 133025 104794 84525 129626 191168 184138 119431 79152 84463
7235 84463 82994 62837 78218 140397 176014 137002 77007 65812 87354 82115 48152 37704
7223 37704 75187 131168 167424 167538 132156 80962 54676 80754 133304 152749 113956 58886
7211 58886 50645 101669 160609 176002 158927 157824 175951 159074 87160 29072 54324 125888
7199 125888 150997 120695 114992 162788 186496 125553 40805 33422 104702 161819 143877 86557
7187 86557 61829 91667 131570 126406 78200 49688 83708 135138 125546 59462 25524 67962
7175F7962N5104m810m4796k0154J5129J6468R640J6332Q082k4300l2809O881M0941
7162A09670J7031l2570m0711o35L6546L2680o288m7154n1644p245M6302N2464
7150A08446J2028j8253j1168L2o278r50K9152L8253m989n4159n1343j3318O959
7137C4412O739J7142L0348J3905j7285j3997K2355L3013o286m3221k5679K1004
7125G2450L0519j0829m5422k2777L2048N1658J7201j8228p903K2525J9227j6932
7113A23537l6997j9223J0083K4610K1585M003j5311n366L5474M5989j4737p6855
7101I6792m7087L2470L5860l5644m4165M5994Q6801q746j00015l4950R5625R2990
7089B15925m3089j27930p3469K1222N5088L8458O058l7586n7792n191P5252P1372
$$ plain form
7175 67962 123066 118256 73460 53306 68435 84903 94543 110875 118957 94657 61848 68729 109670
7162 109670 126701 94131 53420 52785 89331 122011 115723 68569 16925 9680 55982 108446
7150 108446 120474 102221 91053 91085 84807 83857 113009 151262 146273 92114 40771 27453 34412
7137 34412 41151 58293 88641 102546 85261 71264 93619 126632 120346 77125 51446 72450
7125 72450 102969 92140 46718 23941 55989 107647 124848 106620 98717 121242 140469 123537
7113 123537 86540 67317 77400 102010 123595 127598 112287 106921 142395 188384 173647 96792
7101 96792 49705 82175 118035 82391 38226 84220 171021 162275 62260 27310 122935 215925
7089 215925 172836 44906 -28563 -7341 47747 86205 92263 54677 -3115 -8306 66946 138318
7077A38318k3433q1709l0545M5168M5095n908k9298j6403l943N051K1999K6830
7065I1222N266j1862j09J1611n401k3624p224K3653K6567K887j4517j3589n816
7052G9064J227N770N507L733L69j9380n0967m2679L4265J02625N8227o2919j05414
7039I428j4016Q0337N3167m0678p1012k2590J9177J4329J20Q246L1626N3567N3335
7026A75036J2783l9742m1103P429K0492l5897p0780r660P2131O1450j5032m4003
7014I3104o199K1954J4388J4541K3918l195n2559n2890L018M1012K1289j8100
7002A00281l8173l4202Q39N8136P0932p834r8357p9625K4350P1503J9222k4775
6990F2297P074M4609K0519k4868m0059m3323m5314p274N9580P0561J1438j7253
$$ plain form
7077 138318 114885 33176 2631 47799 92894 86986 57688 41285 37342 42393 64392 91222
7065 91222 96488 84626 84517 96128 90727 67103 59879 83532 110099 112986 98469 84880 79064
7052 79064 80291 86061 91568 95301 95670 76290 25323 -17356 16909 119534 177761 114842 9428
7039 9428 -4588 75749 128916 88238 17226 -5364 13813 28142 28262 36508 68134 121701 175036
7026 175036 187819 148077 106974 114403 134895 98998 28218 18558 90689 152139 137107 93104
7014 93104 86905 108859 123247 137788 161706 158511 105952 53062 56080 97092 118381 100281
7002 100281 62108 27906 28745 86881 157813 149979 51622 -28003 -3653 67850 87072 62297
6990 62297 69371 113980 134499 109631 69572 26249 -19065 -26339 33241 103802 115240 97987
6978I7987K4606L3034m9555j01988j8726Q9830O1000n2354o9519K0811N5637k1855
6966F8908p7532j8650O3475N5136j0476l3483j906K2159J1377p959j3288o440
6954E1321M568J0237K123j0700o736J5387K9433J4142k2054m8786l6883J2148
6942A4200N1412L3825j5902k3848J6246K0528m2258p1878J0709J09498P8028n1617
6930A28943j10088m2492L4502L7318K0192L3394K7193k8150n5935j235N8380L2492
6918A34514l5035m4025L471L0299K0024J6761K1570m804m9414n4005j3947J3040
6906C8449J698j1279o32J2383J1523J2463K1510J8399k181j4924o633K461m225
6893G9012j3359p669P897J9001J9480P009j8495m3165m3073j0250L3805N5973
$$ plain form
6978 97987 122593 155627 106072 4084 -14642 75188 136188 83834 14315 35126 90763 68908
6966 68908 -8624 -27274 36201 91337 80861 47378 45472 67631 79008 71049 57761 51321
6954 51321 55889 66126 68249 57549 50813 66200 95633 109775 87721 38935 2052 14200
6942 14200 65612 99437 83535 59687 75933 96461 54203 -17675 -6966 102532 180560 128943
6930 128943 18855 -23637 10865 48183 68375 101769 128962 100812 44877 43642 102022 134514
6918 134514 99479 55454 58925 89224 109248 126009 147579 142775 93361 39356 25409 38449
6906 38449 40147 28868 28236 40619 52142 64605 86115 104514 102333 87409 80776 83237 79012
6893 79012 65653 57984 65881 84882 104362 111371 92876 49711 6638 -3612 30193 86166
6881H6166M0348K831k0655r361J6241J7103j3830m3099m2088j6856J1596K8038
6869E6434J9229j4585l7289r794M2349M6266j2618o0432m2013L609J8759J4788
6857B4703K5272L0717K112k9052k1824m356k0024l5852L721O5475O9261J7639
6845A27792j7789j9801k7991l4850J285M7149K6978l3450l3386K1147J8045m8699
6833B6430m4208O3542J10322j239j18420p3397M6998N6395k2063k1492O3849P5932
6821A62649j9788p4123j3428M7864J7443l4309k7688p540k4841k4834L3901O9094
6809A04400Q534o4279l2851N7852P0063j0262o4876l2937J9487K5011l29j8071
6797F1742k3909j8756N878L2033K3939j1282k4394K817L4206L6592J3362k0991
$$ plain form
6881 86166 126514 129345 108690 99329 115570 132673 118843 75744 33656 16800 28396 56434
6869 56434 75663 61078 23789 13995 56344 102610 89992 29560 -12453 -8844 9915 24703
6857 24703 49975 80692 82804 53752 31928 27572 7548 -28304 -24583 40892 110153 127792
6845 127792 110003 90202 62211 27361 28646 75795 102773 69323 35937 57084 75129 26430
6833 26430 -17778 45764 156086 154847 36427 -36970 10028 66423 44360 22868 86717 162649
6821 162649 142861 68738 55310 103174 120617 86308 58620 51080 26239 1405 35306 104400
6809 104400 112934 48655 15804 73656 143719 133457 68581 35644 55131 80142 79813 61742
6797 61742 37833 19077 24955 56988 80927 69645 45251 48068 82274 118866 132228 111237
6785A11237n0449m3941J1621O6304N7170L517j7319Q104J4791j8089k6336J6941
6773A33551L5107k5709q6870m8210M8877P7046J2853l9697j4791L1779L1206J617
6761A56759r068q873k7356m2545j1996M4439N9923J9408j5930j391K4786O175
6749A94331l5133k4826M4546Q4119K9527n8292p0264j816M3336N338n0536l8576
6737A21754K3420N1378J7796k5284k9856j694K9219L9956J7072k8937n1780j5076
6725A47968M7878O3977J6776l0657k2277K2844M8891L5371O404q898l014J1680
6713C36943J9346J9913K5693L0083M364m7493o4331q262O0480N9519J2622J1282
6701D60159N7562N9108k211k6377K7912N6338r848o2750Q103J05117O0452p8304
$$ plain form
6785 111237 60788 16847 28468 94772 151942 155459 138140 146244 161035 142946 116610 133551
6773 133551 168658 142949 56079 7869 56746 133792 146645 106948 92157 123936 155142 156759
6761 156759 147691 138818 111462 68917 56921 101360 161283 180691 164761 163370 188156 194331
6749 194331 159198 134372 178918 263037 292564 234272 164008 162192 205528 210866 160330 121754
6737 121754 145174 196552 214348 189064 159208 157514 186733 226689 243761 214824 163044 147968
6725 147968 195846 259823 276599 245942 223665 246509 295400 330771 337175 328277 325263 336943
6713 336943 356289 376202 401895 431978 436342 388849 324518 316256 376736 436255 448877 460159
6701 460159 517721 576829 574618 548241 576153 632491 622643 559893 567996 673113 733565 655261
6689F55261j01400L2939J28793O0557m3146k3124O4766O7845j4096n7683l0065
6678G40647j4289m0517l9668J6325N1414O731o5547q1278l4208J9963M1688K6904
6666F28165j3804n3459n3552r943K4922J945n4283p0251j7268M9495N5334q106
6654D79195p4942p8795k3208K8760L0794K278q316R046K0591M414k0841l0057
6642C38919k4687j6140l423J0056K513l1183n1184k2443J9484P804m7453n6964
6630A25299J4545Q0026N1647k6205m7569j0263n422n1108n7681J0559N9293J7413
6618A60534l8725j0639N7227N6290k466j8069J9831K3099k6481m5476p510P068
6606A74683l4321m6932J7256O8911K5336m9145n0586K136K3158Q458J1855K4921
$$ plain form
6689 655261 553861 586800 715593 776150 733004 709880 774646 842491 828395 770712 740647
6678 740647 726358 685841 646173 662498 713912 720643 655096 573818 539610 559573 601261 628165
6666 628165 614361 560902 507350 497407 522329 524274 469991 399740 382472 431967 487301 479195
6654 479195 404253 325458 302250 331010 361804 364082 355766 364812 385403 389817 368976 338919
6642 338919 314232 298092 294669 304725 307238 276055 224871 202428 221912 229716 182263 125299
6630 125299 139844 219870 271517 245312 197743 187480 182058 130950 73269 83828 143121 160534
6618 160534 121809 111170 168397 224687 222221 204152 223983 247082 220601 175125 167615 174683
6606 174683 140362 93430 110686 179597 204933 155788 105202 107338 130496 138954 150809 175730
6594A75730J207l5051k2937J4939L071m7582m7599J9670O6343L8346j3962l0151
6582A22024j8115q588n084n952j4475j2065J8096L9520O358m4552l2858L1395
6570G5704N2108k06m5451l0641j531J768J1300M0144L3176k3303m6338P975N1276
6557A25981J812p1169n3954K9718O3764J9681k7583l3969k3880j0710J5057K7821
6545F2569n425m5334k2592M3069O0748R053l5135k2163O736O602k416J0032K5638
6532I1382J3898j6229l2633k0553P271J9868n904m4277l2507L7413Q0213L1528
6520A29470m3836m3025J4505K6046j9033l0788J4794L7480N527j1219J2960M06
6508I3287p1951r1886O979J03307N9469n6984p4514J8449P3014K3078l2424j1552
$$ plain form
6594 175730 176937 141886 118949 133888 136959 89377 41778 61448 127791 166137 152175 122024
6582 122024 103909 95321 90237 84285 69810 57745 75841 115361 121719 77167 44309 75704
6570 75704 127812 127606 82155 51514 49983 51751 63051 103195 136371 113068 66730 74705 125981
6557 125981 127793 56624 2670 32388 96152 115833 88250 54281 30401 19691 34748 62569
6545 62569 57144 11810 -10782 32287 93035 102088 66953 44790 51526 58128 55712 65744 91382
6532 91382 105280 89051 56418 35865 43136 63004 57100 12823 -19684 17729 97942 129470
6520 129470 85634 42609 57114 83160 64127 33339 48133 85613 91140 79921 92881 93287
6508 93287 21336 -70550 -63571 39736 99205 42221 -32293 -13844 59170 82248 49824 38272
6496C8272L1226K2937o918j55J8980n963n2627m7330J4661N4682K4032l0269l8135
6483B3393j32K8747K2307M510m855j6426l1665k5082N794J7025j3032l2674O629
6470a5461N7742L9706k8609n0503o392J8491j3895k5507L6686R2111M8623m2427
6458A10565o0772k122K5486k1547n9383j4854O0210O4165j1773p2166m2591L5352
6446A0570O0812J0517l2086p866K0835k2739p8628k9665Q5129R5552k7219r6375
6434a1163J747J13027N6913p9813q6208L1871P9346Qn5524m627M4393M799m4515
6421E0254j8183K9101J8299j6765j1419J2026O023r127l596r808m9348o3566n486
6408g1595O5494O6875J3119k6216l1560k2845l133J5917m542n3850n0446K6430
$$ plain form
6496 38272 69498 92435 85517 85362 104342 98379 45752 -1578 13083 67765 91797 61528 23393
6483 23393 23261 52008 74315 78825 73970 57544 25879 797 6591 23616 10584 -22090 -15461
6470 -15461 42281 81987 53378 2875 -3517 14974 1079 -24428 12258 104369 152992 110565
6458 110565 49793 47671 73157 51610 -7773 -22627 37583 101748 89975 17809 -24782 10570
6446 10570 71382 81899 49813 41947 62782 40043 -38585 -68250 16879 112431 85212 -11163
6434 -11163 -9416 103611 160524 80711 -5497 26374 105720 105728 50204 45577 89970 94769 50254
6421 50254 32071 61172 79471 62706 51287 63313 69336 60209 56613 46805 -2543 -66109 -71595
6408 -71595 -6101 60774 73893 47677 16117 -6728 -9861 6056 1514 -52336 -102782 -76352
6396g6352P0788J1927n1146m028P9669M9876o2125q2897K0304Q6899K5020n2418
6384A5517k6328M5702M8748j720j2283K0877J9872l0774n8462k3106K4099K5746
6372D7888j512p906R054J1719n515k880L2698N0014P846m9784n3247j8539j8484
6359A352n1226l9441K3336M4183m196j8264N3277R1417j453j08019o2723P2816
6347A059R8100q878p5385k8143J5533j5405l2422J7797M3986o157l4983J6429
6335h469M0774l5816q9656m757J00186N1501q0027q4209M5516J07602K0436o9033
6323e952m0600L2934M4358J4361P598J2227o283k4710j5968q179k2464k1046K0167
6310a3557N3140L3810l814j0680k261j1971j9494M608K8864R941k4185j7311J4853
$$ plain form
6396 -76352 -5564 6363 -44783 -48811 30858 80734 18609 -64288 -43984 42915 67935 15517
6384 15517 -10811 34891 83639 81919 69636 90513 110385 79611 21149 -1957 22142 47888
6372 47888 46376 38470 47524 59243 53728 50848 83546 133560 141406 91622 38375 19836 1352
6359 1352 -49874 -89315 -65979 -21796 -25992 -44256 9021 100438 98985 -9034 -71757 1059
6347 1059 99159 90281 14896 -13247 2286 -13119 -45541 -27744 16242 10085 -24898 -8469
6335 -8469 32305 -3511 -93167 -97924 2262 53763 -26264 -110473 -64957 42645 63081 -5952
6323 -5952 -46552 -13618 30740 45101 52699 64926 58643 33933 17965 9786 -12678 -33724 -13557
6310 -13557 39583 73393 69579 58899 56638 44667 25173 29781 58645 68586 44401 27090 41943
6297D1943R721k8947k9381K6393O1241J8194m8723n2067L847L8286J5490j6639
6285C9358j5703o703k0686k7557R598M9652K3614m1363m2247L5958P6144L213
6273H3278r0226p9828L217L4856p35p239M1277N7319L201l8171r834K2317m919
6260A4513l5308M09M7165J2578o4346o0708L3343R0663L5648n2132o4813j2179
6248e5167K0126M497o367K4080N7447L7761k2268m7828j275N6581M1073l4269
6236G4391o7842j5076M2629J8878m6561n0920J2970N1404J7918k4122j0864K7955
6224C0760K8839q442l6610l6667k5140p670K3487N2855M7393M256l8442m6561
6212a1942k4204J971J3639R702k93m197J905P825L820j14J4064L8165L6513o563
$$ plain form
6297 41943 51664 22717 -6664 19729 80970 99164 50441 -1626 2221 40507 55997 39358
6285 39358 23655 16952 -3734 -31291 -21693 27959 51573 10210 -32037 3921 80065 83278
6273 83278 -6948 -86776 -83559 -48703 -49438 -56677 -15400 41919 45120 6949 -2885 19432 14513
6260 14513 -20795 -20386 26779 39357 -24989 -85697 -52354 38309 73957 21825 -42988 -55167
6248 -55167 -35041 -30544 -36911 -12831 44616 82377 60109 12281 11006 67587 108660 74391
6236 74391 6549 -8527 34102 52980 6419 -44501 -31531 19873 37791 13669 2805 30760
6224 30760 59599 51157 14547 -22120 -47260 -54930 -31443 21412 68805 73061 34619 -11942
6212 -11942 -36146 -34175 -20536 -10834 -11127 -15324 -13419 -5594 -1774 -1888 12176 50341 86854 80291
6198H0291n5800o3635k9056P291J8858J2750k530k7216m0033p101N3352O5309
6186A2480j808o9209m9707K3091M5530K109k2505R464L5080J2449q425Q951R772
6173G272m4595p7799j2033Q3367P9116j3640n9597q851M0525J3015l2938j7747
6161d3905L2189M0656l79l6212l1376N350M3737M4640r538o8043m9286L9626Q5441
6148E2900K2002o5943o4003O480L7163M706j5484P243J6405j4159k7632Q838L5728
6135D244J125m2808j8830M8195O4930P407n2952n7305k2206J4834M5459O1163
6123E3256L4338k9077o4039k6923K9680K4261k9091l6829K8220P6547L4702m0934
$$ plain form
6198 80291 24491 -39144 -68200 -60909 -42051 -29301 -31831 -59047 -99080 -106181 -52829 12480
6186 12480 10672 -58537 -108244 -85153 -39623 -37514 -60019 -50555 -15475 -3026 -11451 -2500 7272
6173 7272 -37323 -115122 -127155 -43788 35328 21688 -37909 -46760 -6235 6780 -26158 -43905
6161 -43905 -11716 28940 28561 -7651 -39027 -33677 10060 54700 45162 -22881 -72167 -32541 52900
6148 52900 74902 8959 -55044 -48564 -11401 -6695 -22179 -14936 1469 -12690 -40322 -31484 4244
6135 4244 5369 -37439 -56269 -8074 56856 64263 11311 -45994 -68200 -53366 -7907 53256
6123 53256 87594 58517 -5522 -32445 -2765 21496 -7595 -44424 -16204 60343 95045 54111
$$ [...]
##END NTUPLES=NMR SPECTRUM
##END=
