##TITLE=1H ikalashn
CA-9309-2
17.12.2024
##JCAMPDX= 6.0         $$ Bruker NMR JCAMP-DX V2.0
##DATA TYPE= NMR SPECTRUM
##DATA CLASS= NTUPLES
##ORIGIN= UXNMR, Bruker Analytische Messtechnik GmbH
##OWNER= root
$$ TOPSPIN		Version 1.3
$$ 2024-12-17 14:18:40.015 +0400  Irina@DPX200
$$ Compression mode = diff/dup
##.OBSERVE FREQUENCY= 200.131300845
##.OBSERVE NUCLEUS= ^1H
##.ACQUISITION MODE= SIMULTANEOUS
##.ACQUISITION SCHEME= undefined
##.AVERAGES= 16
##.DIGITISER RES= 18
##SPECTROMETER/DATA SYSTEM= spect
##.PULSE SEQUENCE= zg
##.SOLVENT NAME= CDCl3
##.SHIFT REFERENCE= INTERNAL, CDCl3, 1, 17.49637
##AUDIT TRAIL= $$ (NUMBER, WHEN, WHO, WHERE, WHAT)
$$ ##TITLE= Audit trail, TOPSPIN		Version 1.3
$$ ##JCAMPDX= 5.01
$$ ##ORIGIN= Bruker BioSpin GmbH
$$ ##OWNER= Irina
$$ $$ F:/spectra/data/iren/nmr/1H/4/pdata/1/auditp.txt
$$ ##AUDIT TRAIL=  $$ (NUMBER, WHEN, WHO, WHERE, VERSION, WHAT)
(   1,<2024-12-17 14:18:00.515 +0400>,<Irina>,<DPX200>,<TOPSPIN 1.3>,
      <created by zg
	started at 2024-12-17 14:16:52.406 +0400,
	POWCHK disabled, PULCHK disabled
       configuration hash MD5:
       BE 6D 3F 07 2A EA 11 49 91 17 2B D3 AF B3 58 0D
       data hash MD5: 16K
       20 D0 2B 23 99 6E DD EC D4 9D 32 01 A5 E6 68 39>)
(   2,<2024-12-17 14:18:10.140 +0400>,<Irina>,<DPX200>,<TOPSPIN 1.3>,
      <Start of raw data processing
       efp BC_mod = 2 LB = 0.02 FT_mod = 6 PKNL = 1 PHC0 = 144.7557 PHC1 = -21.10259 SI = 32K 
       data hash MD5: 32K
       28 64 BE 28 FD 45 7A 7D 1E C8 B2 25 53 6F 15 34>)
(   3,<2024-12-17 14:18:15.828 +0400>,<Irina>,<DPX200>,<TOPSPIN 1.3>,
      <apk 
       data hash MD5: 32K
       C2 60 C7 CF 1D FF 57 74 40 E6 83 AF 79 CF 9C 9B>)
(   4,<2024-12-17 14:18:18.281 +0400>,<Irina>,<DPX200>,<TOPSPIN 1.3>,
      <abs n ABSG = 5 
       data hash MD5: 32K
       88 14 02 DE B4 FA 34 EA F3 50 D6 05 13 D6 50 6B>)
(   5,<2024-12-17 14:18:29.296 +0400>,<Irina>,<DPX200>,<TOPSPIN 1.3>,
      <pk fgphup PHC0 = -5.020996 PHC1 = 4 
       data hash MD5: 32K
       F1 A4 9B D8 75 0A 90 5B 9E A0 4E C6 E6 CD B7 8D>)
(   6,<2024-12-17 14:18:30.875 +0400>,<Irina>,<DPX200>,<TOPSPIN 1.3>,
      <abs n ABSG = 5 
       data hash MD5: 32K
       9F 32 59 30 F6 C8 55 8B B5 A8 13 9B DF 08 35 18>)
$$ ##END=
$$ 
$$ $$ hash MD5
$$ $$ 2F 7F A4 19 33 3C 98 E5 F7 C4 A9 D1 87 E7 61 17
##$RELAX= 
##$RELAX= 
##$RELAX= 
##$RELAX= 
##$RELAX= 
##$RELAX= 
##$RELAX= 
##$RELAX= 
##$RELAX= 
$$ Bruker specific parameters
$$ --------------------------
##$DU= <F:/spectra>
##$EXPNO= 4
##$NAME= <1H>
##$PROCNO= 1
##$TYPE= <nmr>
##$USER= <iren>
##$AMP= (0..31)
100 100 100 100 100 100 100 100 100 100 100 100 100 100 100 100 100 100 
100 100 100 100 100 100 100 100 100 100 100 100 100 100 
##$ANAVPT= -1
##$AQSEQ= 0
##$AQ_mod= 1
##$AUNM= <au_zg>
##$AUTOPOS= <>
##$BF1= 200.13
##$BF2= 200.13
##$BF3= 200.13
##$BF4= 200.13
##$BF5= 200.13
##$BF6= 200.13
##$BF7= 200.13
##$BF8= 200.13
##$BYTORDA= 1
##$CFDGTYP= 0
##$CFRGTYP= 5
##$CHEMSTR= <none>
##$CNST= (0..63)
$$ [...]
##$SW_h= 4401.40845070422
##$TD= 16384
##$TD0= 1
##$TE= 300
##$TE2= 300
##$TE3= 300
##$TEG= 300
##$TL= (0..7)
0 120 120 120 120 120 120 120 
##$TP= (0..7)
150 150 150 150 150 150 150 150 
##$TP07= 0
##$TPNAME0= <>
##$TPNAME1= <>
##$TPNAME2= <>
##$TPNAME3= <>
##$TPNAME4= <>
##$TPNAME5= <>
##$TPNAME6= <>
##$TPNAME7= <>
##$TPOAL= (0..7)
0.5 0.5 0.5 0.5 0.5 0.5 0.5 0.5 
##$TPOFFS= (0..7)
0 0 0 0 0 0 0 0 
##$TUNHIN= 0
##$TUNHOUT= 0
##$TUNXOUT= 0
##$USERA1= <user>
##$USERA2= <user>
##$USERA3= <user>
##$USERA4= <user>
##$USERA5= <user>
##$V9= 5
##$VALIST= <valist>
##$VCLIST= <CCCCCCCCCCCCCCC>
##$VD= 0
##$VDLIST= <DDDDDDDDDDDDDDD>
##$VPLIST= <PPPPPPPPPPPPPPP>
##$VTLIST= <TTTTTTTTTTTTTTT>
##$WBST= 1024
##$WBSW= 25
##$XGAIN= (0..3)
0 0 0 0 
##$XL= 0
##$YL= 0
##$YMAX_a= 1253789
##$YMIN_a= -962489
##$ZGOPTNS= <>
##$ZL1= 120
##$ZL2= 120
##$ZL3= 120
##$ZL4= 120
##$ABSF1= 17.49637
##$ABSF2= -4.496376
##$ABSG= 5
##$ABSL= 3
##$ALPHA= 0
##$AQORDER= 0
##$ASSFAC= 0
##$ASSFACI= 0
##$ASSFACX= 0
##$ASSWID= 0
##$AUNMP= <proc_1d>
##$AXLEFT= 0
##$AXRIGHT= 0
##$AXTYPE= 0
##$AXUNIT= <>
##$AZFE= 0.1
##$AZFW= 0.1
##$BCFW= 0
##$BC_mod= 2
##$BYTORDP= 0
##$COROFFS= 0
##$CY= 7568.61572265625
##$DATMOD= 1
##$DC= 0
##$DFILT= <>
##$DTYPP= 0
##$F1P= 17.9538593292236
##$F2P= -4.03888763876832
##$FCOR= 0.5
##$FTSIZE= 32768
##$FT_mod= 6
##$GAMMA= 0
##$GB= 0
##$INTBC= 0
##$INTSCL= 5.656564e-011
##$ISEN= 128
##$LB= 0.02
##$LEV0= 0
##$LPBIN= 0
##$MAXI= 945.577
##$MC2= 0
##$MEAN= 0
##$ME_mod= 0
##$MI= -402.1523
##$NCOEF= 0
##$NC_proc= -4
##$NLEV= 6
##$NOISF1= 8.587773
##$NOISF2= 6.764455
##$NSP= 0
##$NTH_PI= 0
##$NZP= 0
##$OFFSET= 17.49637
##$PC= 1
##$PHC0= 145.3543
##$PHC1= -20.01435
##$PH_mod= 1
##$PKNL= yes
##$PPARMOD= 0
##$PPDIAG= 0
##$PPIPTYP= 0
##$PPMPNUM= 100
##$PPRESOL= 1
##$PSCAL= 0
##$PSIGN= 0
##$REVERSE= no
##$SF= 200.13
##$SI= 32768
##$SIGF1= 16.12182
##$SIGF2= -4.496377
##$SINO= 3.521527
##$SIOLD= 32768
##$SREGLST= <1H.CDCl3>
##$SSB= 0
##$STSI= 32768
##$STSR= 0
##$SW_p= 4401.40845070422
##$SYMM= 0
##$S_DEV= 0
##$TDeff= 16384
##$TDoff= 0
##$TI= <>
##$TILT= no
##$TM1= 0
##$TM2= 0
##$TOPLEV= 0
##$USERP1= <user>
##$USERP2= <user>
##$USERP3= <user>
##$USERP4= <user>
##$USERP5= <user>
##$WDW= 1
##$XDIM= 32768
##$YMAX_p= 419380377
##$YMIN_p= -213653
$$ End of Bruker specific parameters
$$ ---------------------------------
##NTUPLES= NMR SPECTRUM
##VAR_NAME=  FREQUENCY,     SPECTRUM/REAL,   SPECTRUM/IMAG
##SYMBOL=    X,             R,               I
##VAR_TYPE=  INDEPENDENT,   DEPENDENT,       DEPENDENT
##VAR_FORM=  AFFN,          ASDF,            ASDF
##VAR_DIM=   32768,         32768,           32768
##UNITS=     HZ,            ARBITRARY UNITS, ARBITRARY UNITS
##FACTOR=    0.134324425510551, 1,           1
##FIRST=     4401.40845070422, 28884,        -1126378
##LAST=      0,             -161263,         -964594
##MIN=       0,             -213653,         0
##MAX=       4401.40845070422, 419380377,    0
$$ Real data points
##PAGE= N=1
##DATA TABLE= (X++(R..R)), XYDATA
$$ [...]
10867B09805M5308L6476j0448n5469l5851K7786M4799p663m7116j7997K4847J5924
10855B30401j5424p799K4206K3741n470j0564J5480K5354l3k5475k3944j0757
10843B19716m988j708M598O275M386J2662K8079K6507J472j8386q782J1081J538
10830B82450l9183o1108k2033M7020O5480P051n3368l6617K5260L6607j1479k8727
10818B11353K0172N1934P674m0404j0708M4672K9289l1291m2028j1442k4927o6440
10806A37854l0143P6480J08938J5878o5924k8688L9484J6205n1268m2814K4897
10795B00899L9410r530k6108J6656M0172N918k6156j0111J7626J5238j575o329
10783B56110m823m043O373K2343K4533J7783J9996J3721k8308p1426m9542K3648
$$ plain form
10867 209805 255113 291589 281141 225672 189821 217607 262406 254743 207627 189630 214477 230401
10855 230401 214977 207178 231384 255125 249655 239091 254571 279925 279892 254417 230473 219716
10843 219716 214728 213020 217618 223893 228279 240941 269020 295527 296999 278613 269831 280912 282450
10830 282450 243267 182159 160126 207146 272626 279677 226309 189692 214952 251559 240080 211353
10818 211353 231525 283459 291133 250729 240021 284693 313982 282691 240663 229221 204294 137854
10806 137854 107711 184191 293129 309007 243083 214395 253879 270084 218816 176002 200899
10795 200899 240309 230779 204671 221327 261499 267417 241261 231150 248776 264014 262439 256110
10783 256110 251287 247244 253617 275960 300493 318276 338272 351993 323685 252259 202717 226365
10771B26365N6484J5152k5021j652L9377K5053l0406n6374l1402J827O711q937
10759B17177j6564j285K2291K3361r48p956K7976N5837J4059n7396n7914J5532
10747B34170N2926L376m5350j6010L3548J8223l0790l1666O933J9455P465J8071
10735B70351L5424Q978l3262j7449L9478M4337j5637m8601j2330K2061L18k7083
10723B66585m244L3361K9990N570P216J9306k925m5409n1680j0078L2264L4865
10711C14821K656l1855l5407L162N2123N7831R546m0225m4029j9175r095j5247
10699B45106q179J4503K5971J7659R120J0758R147n589k1512k1095k761J7374
10687B90502K0397M244j0656n069J1014J0930q327k1907j6438n998j352O419J8905
$$ plain form
10771 226365 282849 298001 272980 271328 310705 335758 305352 248978 217576 219403 226114 217177
10759 217177 200613 199328 221619 244980 244032 236076 264052 319889 333948 276552 218638 234170
10747 234170 287096 290472 245122 229112 262660 280883 250093 218427 225360 244815 252280 270351
10735 270351 305775 314753 281491 264042 303520 347857 332220 283619 271289 293350 293668 266585
10723 266585 262341 295702 325692 331262 338478 357784 354859 309450 257770 247692 279956 314821
10711 314821 317477 285622 250215 253377 305500 363331 372877 332652 288623 269448 260353 245106
10699 245106 236927 251430 277401 295060 304180 314938 324085 318496 296984 275889 273128 290502
10687 290502 310899 315143 304487 299418 310432 321362 313035 291128 274690 268692 267340 273759 292664
10674B92664J7757k754j8113q955R583J3358K226r827j6152j3340K440K1452K4955
10661C15294J3182L791j206j3331k1777n405J5915K88l5309k4442L4822N6910
10649C38732K941m6857j9383L3621K8638j0729j0417J6460N384k6376q624M0981
10637C44371L6053k1473l6555J1289K9811k0239n2178n705M6683K4665k8377k9339
10625B99006Q519J8517q08m104P392m83j8729j3133M974j899k6366k9165n637
10612B38084J7190K8852K9779P343k9136k8112K6956O3288J8605m6655l1774M0683
10600C35103N5114j2775o0973k7645K1589J4424j9153j7049J3047K5575J4625
10589C41882J503j1170k3416j5431J5215L2099J4747n450j622K830j1919j3492
$$ plain form
10674 292664 310421 307667 289554 280599 290182 303540 305766 295939 279787 266447 268887 290339 315294
10661 315294 328476 332267 331061 317730 295953 290548 306463 306751 271442 247000 281822 338732
10649 338732 341673 294816 275433 309054 337692 326963 316546 333006 338390 312014 303390 344371
10637 344371 380424 358951 322396 333685 363496 343257 291079 285374 332057 356722 328345 299006
10625 299006 307525 326042 325234 321130 328522 328039 309310 296177 301151 299252 272886 243721 238084
10612 238084 255274 284126 313905 321248 292112 264000 290956 354244 372849 326194 294420 335103
10600 335103 390217 377442 316469 288824 310413 324837 305684 288635 301682 327257 341882
10589 341882 343385 332215 308799 293368 308583 340682 355429 349979 348357 351187 339268 325776
10577C25776K1529M5622R523m3088l1065L3460N5920L069m7166k4972L0782L4904
10565D14294k4195p4262n3647J8627O8557M8468j1802l8891l263M4341L9990j0580
10553D17637m7785m1756j7058K711K5450N2389N4963J7880k6488l7846k0656p311
10541C72130n752K802K1376K7381J0941n141M59J2573J880k4499k3934J8755N5541
10528D64512L3172k6936n0552j5903J5230l829k9592l113M5135M0538r411k4054
10516D35197J3838K8015j5600m1140Q513O1561K6518n0349m8156L7087Q3073K8935
10504E67492m1211l8611N502J5839m218l430J4906O037k3759j8712L0779O3075
10492E73689L5481j2609j8020J7480L3827j389m6726m0854J2938M5446J4548l1842
$$ plain form
10577 325776 347305 392927 402450 359362 328297 361757 417677 420746 373580 348608 379390 414294
10565 414294 390099 315837 262190 280817 349374 397842 386040 347149 343886 388227 428217 417637
10553 417637 369852 328096 311038 313749 339199 391588 446551 464431 437943 400097 379441 372130
10541 372130 366378 369180 390556 417937 428878 423737 424196 436769 438649 414150 390216 408971 464512
10528 464512 497684 470748 420196 404293 419523 415694 386102 382989 428124 468662 459251 435197
10516 435197 449035 477050 461450 420310 428823 490384 516902 466553 418397 455484 538557 567492
10504 567492 526281 487670 493172 509011 504793 501363 516269 522306 498547 479835 510614 573689
10492 573689 609170 596561 578541 596021 629848 628459 581733 540879 553817 599263 613811 581969
10480E81969k2773K6819L4978j6993m7488k182N3741L5282k7136l8418Q869L2337
10468F19005L191j1297K8662O3026K9723l8348o9787n3253k3705N010L5336M7145
10456F34708K1994j4470k3818j0503k553J348J7743L1417J5001j7374k7564j5390
10444F10539j1295j4487M236L6438L3330j4835n0652k8236K2035M0007J6451p627
10432F35904m681J0986J5944J0522P373K559j9363m8246m3623P315M9922K6979
10420F51591k8754l3232J3604J7680n1355q9726j8342P8127P5947M628j5198K3170
10408F28140K1216l0960l5584K2160L2946l6892o6204J7542J01733O4939l2833
10397F86203o1107k0300J693n520O712K1527q929m6061j8384L8696L2349k2416
$$ plain form
10480 581969 559196 586015 620993 604000 556512 554330 608071 643353 616217 577799 586668 619005
10468 619005 622196 610899 639561 702587 732310 693962 624175 570922 547217 552227 587563 634708
10456 634708 656702 642232 618414 607911 605358 606706 624449 655866 670867 653493 625929 610539
10444 610539 599244 584757 588993 625431 658761 643926 593274 565038 587073 627080 643531 635904
10432 635904 631223 642209 658153 668675 676048 678607 659244 610998 567375 574690 624612 651591
10420 651591 622837 589605 603209 620889 569534 479808 461466 539593 615540 620168 604970 628140
10408 628140 649356 618396 582812 604972 637918 601026 534822 552364 654097 719036 686203
10397 686203 625096 604796 606489 600969 607681 629208 620279 574218 555834 594530 626879 604463
10385F04463k7427K1651L0068j9333l3524J9980N2583J0655l7602k8643k76J317
10373E93912L496K7236K5990j9576l8668J4007O3723K9131m1525m7266P570L4839
10361F52869O630k0856j1173J0190J4117J770j7599l2661k2905J2872L8042K5618
10349F56914m15o906j305j270M612K1330J7604j7041l2997K717L9426K0536k0209
10336F82996j9159N407o596l9695k6669K8401N1756K0397j2942j6493j2363j0022
10324F45018O000J8404n039l2872k870O0256O3183l471m0849k253L4643P060k9602
10311G17608r249K8684J6995k0504k0969K853n701l8941l8635L063L6589L7184
10299G08977K4916J1313r893k3041k131L3912L1079k1978o7219m7069K2688O8352
$$ plain form
10385 604463 577036 598687 628755 609422 575898 595878 648461 659116 621514 592871 592595 593912
10373 593912 597408 624644 650634 631058 592390 606397 670120 699251 657726 610460 618030 652869
10361 652869 659499 638643 627470 637660 651777 653547 635948 603287 580382 593254 631296 656914
10349 656914 656499 649593 648288 647018 651630 672960 690564 673523 640526 643243 682669 703205 682996
10336 682996 663837 669244 662648 622953 596284 624685 676441 696838 683896 667403 655040 645018
10324 645018 651018 669422 664383 631511 628641 688897 752080 748609 707760 705507 740150 747210 717608
10311 717608 708359 737043 754038 733534 712565 715418 709717 670776 632141 635204 671793 708977
10299 708977 733893 745206 735313 712272 710141 744053 775132 753154 685935 638866 661554 729906
10287G29906M2487j7840l2443J6020M9852O429n6275l8061M0314N7205j4874n5603
10275G27117R674Q2163M6954m1858n3793J0722M1165O860j2964J7423L6581N643
10263H75687k7954j9715O521J5686J2196N873j0058k5761j7822K503L310l130
10251H17336K0288N1116K8712l0104l4976L0244O5577R882n8316m3585K3985N0082
10239I30241J7763j6189k1742j2028P680L3178L0497j7276n5993k4310M6385O8293
10227I86499K3610j8253j1241J0334K128k2109k1659R850M1241M2544J3020j7290
10215A038674j3454K2856M5878J9493l2146n2030j9606L1778N8066M2048p85l0428
10203A110344j1403M0359N9323J1574m7854m3132J4572M3342R822k9458j9129
$$ plain form
10287 729906 772393 754553 722110 738130 787982 794411 738136 700075 740389 797594 782720 727117
10275 727117 736791 818954 865908 824050 770257 780979 822144 829004 816040 833463 870044 875687
10263 875687 847733 828018 834539 850225 862421 868294 858236 832475 814653 817156 820466 817336
10251 817336 837624 888740 917452 887348 852372 882616 948193 958075 899759 856174 880159 930241
10239 930241 948004 931815 910073 898045 905725 938903 969400 952124 896131 871821 918206 986499
10227 986499 1010109 991856 980615 990949 993077 970968 949309 959159 1000400 1042944 1055964 1038674
10215 1038674 1025220 1048076 1093954 1113447 1081301 1029271 1009665 1041443 1099509 1141557 1140772 1110344
10203 1110344 1098941 1139300 1198623 1210197 1162343 1119211 1133783 1177125 1186947 1157489 1138360
10192A138360K0366L8550K8894J7185Q014j1012k6964j0959K6842L4011j1145
10181A252142n4064k8395M5912P5806J9335m9668l9502L1807O6338K8751j3152
10170A335310j258L1753K9887K090p680M257R885M110J005j394p848j173K6078
10157A425022M1315J9555o224O311L6824L6111Q672m39J6506K7398K1200J1291
10145A643542m233k3860j0333M9382Q2031K0121o7573n2429N3277J03113M2037
10134A835075j6235J2824N1399J1353m5627j9067N2211N7461R29j4635L6800P4598
10122B037086N4142K4727K8884M0261K9183J3587J4858K1731K3413L0351M2945
10111B361168M2062K5823J7417K4985K9171J9477J0513J5793L3170N6303P4154
$$ plain form
10192 1138360 1158726 1197276 1226170 1243355 1251369 1240357 1213393 1202434 1229276 1263287 1252142
10181 1252142 1198078 1169683 1215595 1291401 1310736 1261068 1221566 1253373 1319711 1348462 1335310
10170 1335310 1334052 1365805 1395692 1397782 1390102 1394359 1404244 1408354 1409359 1407965 1400117 1398944 1425022
10157 1425022 1466337 1485892 1479668 1485979 1522803 1558914 1567586 1567147 1583653 1611051 1632251 1643542
10145 1643542 1639309 1615449 1605116 1654498 1736529 1756650 1689077 1636648 1689925 1793038 1835075
10134 1835075 1818840 1831664 1883063 1894416 1848789 1829722 1881933 1939394 1940323 1925688 1962488 2037086
10122 2037086 2091228 2115955 2144839 2185100 2214283 2227870 2242728 2264459 2287872 2318223 2361168
10111 2361168 2403230 2429053 2446470 2471455 2500626 2520103 2530616 2546409 2579579 2635882 2710036
10100B710036O7045L3564R286K4320N6615O5513N3293M8667M9233L4675K1135
10089C173382M0667P6032Q0613N8901N8958Q4119Q4924M8869K5201M1457O4827
10078C837950P0198P8581R9060R9278O9491N3900P8473J04898R7626Q1239Q7269
10067D757963R8080R1719R0601J13766J30524J17262J10870J42651J66949J30874
10057E951259P6112Q5007J48353J78551J50100J34779J78659K26984K11785J54446
10047G496035J31550J71544K29395K50478K27209J93589J82722J96824K16804
10038I296150K33114K51468K66825K58134K25148K05468K29344K76623L05688
10029A1547962L08042L06443L15109L30972L49639L62726L56539L39755L48658
$$ plain form
10100 2710036 2777081 2810645 2819931 2844251 2900866 2966379 3019672 3068339 3117572 3152247 3173382
10089 3173382 3214049 3290081 3370694 3429595 3488553 3572672 3657596 3706465 3731666 3773123 3837950
10078 3837950 3908148 3986729 4085789 4185067 4254558 4308458 4386931 4491829 4589455 4670694 4757963
10067 4757963 4856043 4947762 5038363 5152129 5282653 5399915 5510785 5653436 5820385 5951259
10057 5951259 6027371 6112378 6260731 6439282 6589382 6724161 6902820 7129804 7341589 7496035
10047 7496035 7627585 7799129 8028524 8279002 8506211 8699800 8882522 9079346 9296150
10038 9296150 9529264 9780732 10047557 10305691 10530839 10736307 10965651 11242274 11547962
10029 11547962 11856004 12162447 12477556 12808528 13158167 13520893 13877432 14217187 14565845
10020A4565845L93574M28953M16916L89515L95986M16654L95014L37243L05771
10011A8045471L17575L24920L05840K98289L22488L40959L30377L30563L77974
10002B0994456M40409M66211M61603M71434N07764N40980N48114N35827N22462
9993B5489260N17752N11907M77452M00653L13350K61270K35110J76926P2110j3438
9983B8442352j9566K7179O0178O6738Q7664J43359K09236K60601L02832L50289
9973B9930862L97784M21159M01293L48448K95660K54255J91564Q4333k4962q1522
9963C2218874j18586k24855l95936n08009m85190m08596l89633m09337l75446
9954B8903286k83776k13630j87798j46149o1059J5466L5982J1807l2950r1839
$$ plain form
10020 14565845 14959419 15388372 15805288 16194803 16590789 17007443 17402457 17739700 18045471
10011 18045471 18363046 18687966 18993806 19292095 19614583 19955542 20285919 20616482 20994456
10002 20994456 21434865 21901076 22362679 22834113 23341877 23882857 24430971 24966798 25489260
9993 25489260 26007012 26518919 26996371 27397024 27710374 27971644 28206754 28383680 28455790 28442352
9983 28442352 28422786 28449965 28510143 28576881 28664545 28807904 29017140 29277741 29580573 29930862
9973 29930862 30328646 30749805 31151098 31499546 31795206 32049461 32241025 32325358 32300396 32218874
9963 32218874 32100288 31875433 31479497 30971488 30486298 30077702 29688069 29278732 28903286
9954 28903286 28619510 28405880 28218082 28071933 28010874 28026340 28062322 28074129 28041179 27949340
9944B7949340j44737j63749j70880k27208l42015m50599n05539n33958n77321
9935B4833334o26204o45705o24263n72358n08832m63154m50518m35825l71435
9926B0135040k78553k31965k51045k73588k59702k48061k73867l04923l07851
9917A7705485l10877l44582l80735l90100m02902m44987m69107m26225l58828
9908A4177142l40889l62576l59891l27810l12604l12803k83782k33359k17931
9899A1425497k39381k37303j96954j76635k04413k30094k12407j81048j75454
9890I571808j85602j90736j99569k15341k12829j84280j60015j54458j43079j20207
9880G805692j21475j55536j73964j48899j20276j21608j22154r6145q4190j18165
$$ plain form
9944 27949340 27804603 27640854 27469974 27242766 26900751 26450152 25944613 25410655 24833334
9935 24833334 24207130 23561425 22937162 22364804 21855972 21392818 20942300 20506475 20135040
9926 20135040 19856487 19624522 19373477 19099889 18840187 18592126 18318259 18013336 17705485
9917 17705485 17394608 17050026 16669291 16279191 15876289 15431302 14962195 14535970 14177142
9908 14177142 13836253 13473677 13113786 12785976 12473372 12160569 11876787 11643428 11425497
9899 11425497 11186116 10948813 10751859 10575224 10370811 10140717 9928310 9747262 9571808
9890 9571808 9386206 9195470 8995901 8780560 8567731 8383451 8223436 8068978 7925899 7805692
9880 7805692 7684217 7528681 7354717 7205818 7085542 6963934 6841780 6745635 6661445 6543280
9870F543280j44964j06562m7876n4012j13276j37326r9578o0592o0967p6513q3078
9859E558536q5704p8273m9875l3139o6776j10045q6184j7711j1823q5730j22175
9848D811101n2751K6031J882q2108j07800o3758l3459m5524n0943l1935k6643
9837D344093m4378m8774l3356l2270m6548l8020q387o894m1860n9934l5812r904
9825C937956j1091j5621j2926l4990p9288q0747j6341L4534K447o1771o6452j6388
9813C579322J4767Q041K039k47k9445o5186n0689L898K4279q700l1536j0839N778
9800C441482j4696l0471p841J3797l126k4112j1599o8k8009n1784j4779M0921
9788C309715L0313l2336n1518o015K0255j7820n3579k3906K8352L0234p212k2542
$$ plain form
9870 6543280 6398316 6291754 6243878 6189866 6076590 5939264 5839686 5779094 5718127 5641614 5558536
9859 5558536 5472832 5394559 5344684 5311545 5244769 5134724 5048540 5030829 5019006 4933276 4811101
9848 4811101 4758350 4784381 4786263 4704155 4596355 4532597 4499138 4453614 4402671 4370736 4344093
9837 4344093 4299715 4250941 4217585 4185315 4138767 4100747 4092360 4085466 4043606 3983672 3947860 3937956
9825 3937956 3926865 3911244 3898318 3863328 3784040 3703293 3686952 3721486 3723933 3662162 3595710 3579322
9813 3579322 3594089 3602130 3604169 3603922 3574477 3509291 3458602 3462500 3486779 3478079 3446543 3435704 3441482
9800 3441482 3426786 3396315 3388474 3402271 3399145 3375033 3363434 3363366 3335357 3283573 3268794 3309715
9788 3309715 3340028 3307692 3256174 3250159 3270414 3252594 3199015 3175109 3203461 3233695 3226483 3203941
9776C203941r043j0820l4436l7452n565K1018J2917o195n575K904p800k7523k0454
9763C075917J7511M6061L3479j400j7263n629M860m727j8679j6284l285L170M519
9750C118250J4678L3255M4637L8419J5590j6048l6835k1369K5654N5421L0506
9739C302158j6648k1937J8069M0357J0091k9270k3584J7154M4516M0690K5862
9728C407458J7098J4235J5530J9879K0063J2760P135J0637J8703K7900M0288M6215
9716C657901K9715L914P920M8085P7157N9615K3013J0417J6177J1522L427J7410
9704C966273M2882M7245L0755J9845J9144J6491J9618L7466M2339P965k9920j5442
9692D204661L5669N6420L4726K1656L2413K5236o369j0071K7502M7125K0854L434
$$ plain form
9776 3203941 3194898 3184078 3149642 3112190 3106625 3127643 3140560 3134365 3128790 3131694 3123894 3096371 3075917
9763 3075917 3093428 3139489 3172968 3171568 3154305 3148676 3153536 3148809 3130130 3113846 3110561 3113731 3118250
9750 3118250 3132928 3166183 3210820 3249239 3264829 3248781 3211946 3190577 3216231 3271652 3302158
9739 3302158 3285510 3263573 3281642 3321999 3332090 3302820 3279236 3296390 3340906 3381596 3407458
9728 3407458 3424556 3438791 3454321 3474200 3494263 3507023 3514158 3524795 3543498 3571398 3611686 3657901
9716 3657901 3687616 3691530 3699450 3747535 3824692 3884307 3907320 3917737 3933914 3945436 3948863 3966273
9704 3966273 4009155 4056400 4087155 4107000 4126144 4142635 4162253 4199719 4242058 4250023 4220103 4204661
9692 4204661 4240330 4296750 4331476 4353132 4385545 4410781 4404412 4394341 4421843 4468968 4489822 4493256
9680D493256L0165M9690K1815k223K3999M5760L951m2266o142O5905N7581k0420
9668D721071m0701L0217P6737K6969l3998j1573N0946O2591L4716L5955N5979
9657E008909K8276l5512m4873K6794R2406P7107K1994J3335N6690Q1815N4023
9646E380964J9512K7959N9108O2789M3713N3442R8727J15621O3805n77L747O8309
9634E997119J10903R3909O2749O2335P8774Q5093Q9020J02637J07948Q9275O8366
9623F948128P3787J00008J24350J39062J40936J17535P4597N2097P9411J31775
9613G981686J59767J46921J16177R7839J10585J50924J83446J70051J26418J11692
9603I355506J41422J60813J37612J22123J60104K03001J82094J29177J31512J90228
$$ plain form
9680 4493256 4523421 4573111 4594926 4592703 4616702 4662462 4666413 4624147 4618005 4683910 4741491 4721071
9668 4721071 4680370 4710587 4787324 4814293 4780295 4768722 4819668 4882259 4916975 4952930 5008909
9657 5008909 5037185 5001673 4956800 4983594 5076000 5153107 5175101 5188436 5245126 5326941 5380964
9646 5380964 5400476 5428435 5487543 5550332 5594045 5647487 5746214 5861835 5925640 5925063 5928810 5997119
9634 5997119 6108022 6201931 6264680 6327015 6405789 6490882 6579902 6682539 6790487 6879762 6948128
9623 6948128 7021915 7121923 7246273 7385335 7526271 7643806 7718403 7770500 7849911 7981686
9613 7981686 8141453 8288374 8404551 8502390 8612975 8763899 8947345 9117396 9243814 9355506
9603 9355506 9496928 9657741 9795353 9917476 10077580 10280581 10462675 10591852 10723364 10913592
9593A0913592K21540J94391J68027J79741J91160J76946J79384K28109K76213
9584A2729103K69059K24177J95877K04587K40169K90491L29763L24401K86999
9575A5094626K77423L15505L46314L30929L10151L28859L62551L79874M09200
9566A8155432M65423M81581M16308L67782M50247N95444O28571N35831M91852
9557B2588471N87024O94011O87235O46379P14427Q60195R33636R01422Q78373
9548B9491173R40488J040497J119229J185010J255488J318006J381705J485398
9540C9216994J617960J709166J740674J790922J918478K068678K157218K188543
9532E4408633K222861K272366K303192K304278K279879K204053K062718J917196
$$ plain form
9593 10913592 11135132 11329523 11497550 11677291 11868451 12045397 12224781 12452890 12729103
9584 12729103 12998162 13222339 13418216 13622803 13862972 14153463 14483226 14807627 15094626
9575 15094626 15372049 15687554 16033868 16364797 16674948 17003807 17366358 17746232 18155432
9566 18155432 18620855 19102436 19518744 19886526 20336773 20932217 21560788 22096619 22588471
9557 22588471 23175495 23869506 24556741 25203120 25917547 26777742 27711378 28612800 29491173
9548 29491173 30431661 31472158 32591387 33776397 35031885 36349891 37731596 39216994
9540 39216994 40834954 42544120 44284794 46075716 47994194 50062872 52220090 54408633
9532 54408633 56631494 58903860 61207052 63511330 65791209 67995262 70057980 71975176
9524G1975176J836087J775193J623315J372652J139184R87702Q44718O39621M30916
9515H2624564L06709K37265J30846j1032j02772j17978j19225j44894j63085j54890
9505H2485508j56930j91162k25382k40153k74474l65952m93811o16915p27388
9496G9193341q37807r56255j098887j281841j475885j619414j704288j792275
9488F8426689j912053k004537k020834k009802k038095k075380k042479j941051
9480E2382458j850447j810125j780879j716336j607578j465234j318705j220272
9472C9612882j187017j154957j057827r30225q55117q31679p89328p17747o72988
9463C1415997o54378n96062n00780m57099m84196m83966m04790l29555l24787
$$ plain form
9524 71975176 73811263 75586456 77209771 78582423 79721607 80709309 81554027 82193648 82624564
9515 82624564 82931273 83168538 83299384 83288352 83185580 83067602 82948377 82803483 82640398 82485508
9505 82485508 82328578 82137416 81912034 81671881 81397407 81031455 80537644 79920729 79193341
9496 79193341 78355534 77399279 76300392 75018551 73542666 71923252 70218964 68426689
9488 68426689 66514636 64510099 62489265 60479463 58441368 56365988 54323509 52382458
9480 52382458 50532011 48721886 46941007 45224671 43617093 42151859 40833154 39612882
9472 39612882 38425865 37270908 36213081 35282856 34427739 33596060 32806732 32088985 31415997
9463 31415997 30761619 30165557 29664777 29207678 28723482 28239516 27834726 27505171 27180384
9454B7180384l23675k58714j97840k23208k67828k17907j10964p7609j26845j47081
9444B5228713j03903p8458j00350r5710l6089q11l7950q1725o9629l9808m6947
9433B4537333o9716o8943o2360p7012r2903r2263j02030j33452j44676j17642
9423B3576336j03924j35585j61776j40189j18806j48833j86719j73183j45621
9414B2261700j68190k04106j74885j10127j12707j89658k42404k28332k11065
9405B0620226k31167k43511k19692k06879k35225k57993k39075k19941k40389
9396A8526354k64335k47631k16708k12707k12943j80237j44229j55349j90567
9387A6701648j85484j42269j25677j53877j68881j31196q0111o9960r1957r6427
$$ plain form
9454 27180384 26856709 26597995 26400155 26176947 25909119 25691212 25580248 25502639 25375794 25228713
9444 25228713 25124810 25046352 24946002 24850292 24814203 24813392 24775442 24693717 24624088 24584280 24537333
9433 24537333 24467617 24398674 24336314 24259302 24166399 24074136 23972106 23838654 23693978 23576336
9423 23576336 23472412 23336827 23175051 23034862 22916056 22767223 22580504 22407321 22261700
9414 22261700 22093510 21889404 21714519 21604392 21491685 21302027 21059623 20831291 20620226
9405 20620226 20389059 20145548 19925856 19718977 19483752 19225759 18986684 18766743 18526354
9396 18526354 18262019 18014388 17797680 17584973 17372030 17191793 17047564 16892215 16701648
9387 16701648 16516164 16373895 16248218 16094341 15925460 15794264 15714153 15644193 15552236 15455809
9377A5455809o8422m3742n1462o8274m9464J207K2667k0711p3392n3180K7381
9366A5078417O8317K6143k0728O585O7265P3133L3181L4170R4132J31644R6446
9355A5688705M7065N9843J22130J64121J58090J38343J41257J64206J80278J72281
9345A7036319J53567J60166K11191K77225L08299K94640K74653K80319L05851
9336A9302230L36694L72637M06367M15399L99480L95238M26576M67823M84906
9327B3007350M86078M96895N07914M89643M47161M17386M13763M09999L80840
9318B7057029L28744K68757K15268J83570J75032J60960J13628N3407K6286K9796
9308B8612477R084n4877j03689q5506l7844l3306p0415q1958m2173K162J7026
$$ plain form
9377 15455809 15387387 15343645 15292183 15223909 15174445 15175652 15198319 15177608 15104216 15051036 15078417
9366 15078417 15146734 15172877 15152149 15158734 15225999 15299132 15332313 15366483 15460615 15592259 15688705
9355 15688705 15735770 15795613 15917743 16081864 16239954 16378297 16519554 16683760 16864038 17036319
9345 17036319 17189886 17350052 17561243 17838468 18146767 18441407 18716060 18996379 19302230
9336 19302230 19638924 20011561 20417928 20833327 21232807 21628045 22054621 22522444 23007350
9327 23007350 23493428 23990323 24498237 24987880 25435041 25852427 26266190 26676189 27057029
9318 27057029 27385773 27654530 27869798 28053368 28228400 28389360 28502988 28556395 28582681 28612477
9308 28612477 28621561 28566684 28462995 28377489 28339645 28306339 28235924 28153966 28111793 28113955 28130981
9297B8130981L0908P0938J08856J16052J24938J77176K43973K64912K48199K59607
9287B9776540L13542L51794L47260L52981M10609M77207M96595M90397N14556
9278C3531481N64563N93444N99046O22392O71156P12806P40541P81548Q38678
9269C9655655Q85635R22514R73779J029833J060318J089318J175615J303740J386396
9260D9482803J406049J455856J588795J726933J797252J861928K009383K194806
9252F3523805K316409K395490K538228K746099K916215L032157L197261L440428
9244H6106092L639199L709807L744303L857888M001787M047821L989658L929492
9236A17026047L895818L802112L595722L343546L134229K964593K763383K487851
$$ plain form
9297 28130981 28161889 28232827 28341683 28457735 28582673 28759849 29003822 29268734 29516933 29776540
9287 29776540 30090082 30441876 30789136 31142117 31552726 32029933 32526528 33016925 33531481
9278 33531481 34096044 34689488 35288534 35910926 36582082 37294888 38035429 38816977 39655655
9269 39655655 40541290 41463804 42437583 43467416 44527734 45617052 46792667 48096407 49482803
9260 49482803 50888852 52344708 53933503 55660436 57457688 59319616 61328999 63523805
9252 63523805 65840214 68235704 70773932 73520031 76436246 79468403 82665664 86106092
9244 86106092 89745291 93455098 97199401 101057289 105059076 109106897 113096555 117026047
9236 117026047 120921865 124723977 128319699 131663245 134797474 137762067 140525450 143013301
9228A43013301K163512J846586J567359J307858J034044P45867M74401K28396
9220A52381324j5507k53654m38420n56581o72148q36819j004662j105674j166003
9211A46331856j269257j419008j534349j584188j634949j744490j887961k017823
9203A33239831k128804k231905k324668k417687k534592k659919k746111k795452
9195A13400693k864803k958926l002038k965841k939318k993557l051022k990178
9187H9635010k830656k703330k659013k618771k516533k385623k276864k177742
9179F9466478k053953j908664j761946j618790j488049j389976j317650j230585
9171E6696865j112148r96521r15981q58107p97383p32534o69776o05140n46236
$$ plain form
9228 143013301 145176813 147023399 148590758 149898616 150932660 151678527 152152928 152381324
9220 152381324 152365817 152112163 151673743 151117162 150445014 149608195 148603533 147497859 146331856
9211 146331856 145062599 143643591 142109242 140525054 138890105 137145615 135257654 133239831
9203 133239831 131111027 128879122 126554454 124136767 121602175 118942256 116196145 113400693
9195 113400693 110535890 107576964 104574926 101609085 98669767 95676210 92625188 89635010
9187 89635010 86804354 84101024 81442011 78823240 76306707 73921084 71644220 69466478
9179 69466478 67412525 65503861 63741915 62123125 60635076 59245100 57927450 56696865
9171 56696865 55584717 54588196 53672215 52814108 52016725 51284191 50614415 50009275 49463039
9162D9463039n14650n02797m66733l89583l15482k90809l06100l24446l29856
9153D6022583l17549k79409k36095k37902k87843l11041k58012j91638j98283
9144D3704811k52447k60847k15757j97737k26642k24348j55829r9477j19793j61079
9134D1790855j43017q9771p6277r8567r4190o1960o2190j04469j29617j15386
9124D0815411j13752j55314j94206j91028j86205k35087l15877l63199l66445
9115C8694298l75896m22835m86881n41327n83710o14114o24015o21630o36798
9106C3787092o81805p28642p42475p23287p00491o97805p14416p30062p18688
9097B7349421o68798o02488n64306n75636o04700n97425n39449m74510m54106
$$ plain form
9162 49463039 48948389 48445592 47978859 47589276 47273794 46982985 46676885 46352439 46022583
9153 46022583 45705034 45425625 45189530 44951628 44663785 44352744 44094732 43903094 43704811
9144 43704811 43452364 43191517 42975760 42778023 42551381 42327033 42171204 42071727 41951934 41790855
9134 41790855 41647838 41558067 41481790 41383223 41289033 41227073 41164883 41060414 40930797 40815411
9124 40815411 40701659 40546345 40352139 40161111 39974906 39739819 39423942 39060743 38694298
9115 38694298 38318402 37895567 37408686 36867359 36283649 35669535 35045520 34423890 33787092
9106 33787092 33105287 32376645 31634170 30910883 30210392 29512587 28798171 28068109 27349421
9097 27349421 26680623 26078135 25513829 24938193 24333493 23736068 23196619 22722109 22268003
9088B2268003m76571m88242m47746l77722l38134l51144l75093l63998l29217
9079A8720136l14013l21425l08353k56207k07011k07365k45382k70491k56455
9070A6333434k17906j79990j59883j66889j91899k04175j85220j57388j50981
9061A4719103j55063j37333j03823r2733j09031j16860j07129j15440j47871j48258
9051A3485562q5923k6506m9910j26729j50177q5153j3262j4782o9073j03768r4484
9040A2665795p3676o9026p5479p9323p9308q3138r6801j13589j10749p3940l0329
9029A1780437l0472q1701j27400j17653p5459n9779q3303j08486j13498j13480
9019A0869206j14105r4611n5652m0137p4304j19390j20062q1070n4848o2910p4410
$$ plain form
9088 22268003 21791432 21303190 20855444 20477722 20139588 19788444 19413351 19049353 18720136
9079 18720136 18406123 18084698 17776345 17520138 17313127 17105762 16860380 16589889 16333434
9070 16333434 16115528 15935538 15775655 15608766 15416867 15212692 15027472 14870084 14719103
9061 14719103 14564040 14426707 14322884 14230151 14121120 14004260 13897131 13781691 13633820 13485562
9051 13485562 13399639 13373133 13323223 13196494 13046317 12961164 12947902 12933120 12864047 12760279 12665795
9040 12665795 12592119 12523093 12447614 12368291 12288983 12205845 12109044 11995455 11884706 11810766 11780437
9029 11780437 11749965 11668264 11540864 11423211 11347752 11287973 11204670 11096184 10982686 10869206
9019 10869206 10755101 10660490 10604838 10564701 10490397 10371007 10250945 10169875 10115027 10052117 9977707
9008I977707o6415n9918p4527q4610n7572j5943j7037o9433j09895q3185j7499
8997I321673R681k9511q0669p9454l0042Q913L126k1050k3753q171o830k4835
8985I039078l0752r224J1242M433q040P733L6156L2526j64r350K0685L7672P580
8972I139575k1938M269N3181N0417O96j5723L1125P4454N4811P064K608M8734
8960I429273Q9717Q2787L7188n509n360M3080R4213R2156M3110J4008M1254Q3354
8948A0039271R1905Q1152Q4525Q8914O9407N0822O7751R2210P4244L5073M1041
8937A0816315R3778J27766J17838J05657J10649J02693Q3112J00755J53352J66573
8927A1978488J21079J05377J70896K25912J73694Q3233R7560K12649K83247K44043
$$ plain form
9008 9977707 9911292 9851374 9776847 9692237 9634665 9618722 9601685 9532252 9422357 9339172 9321673
8997 9321673 9331354 9301843 9221174 9141720 9111678 9120591 9123717 9102667 9078914 9070743 9063913 9039078
8985 9039078 9008326 8999102 9010344 9014777 9006737 9014470 9050626 9083152 9082988 9073638 9094323 9131995 9139575
8972 9139575 9117637 9121906 9175087 9225504 9226200 9210477 9241602 9316056 9370867 9377931 9380539 9429273
8960 9429273 9518990 9601777 9638965 9633456 9628096 9671176 9765389 9857545 9900655 9914663 9955917 10039271
8948 10039271 10131176 10212328 10296853 10385767 10455174 10505996 10573747 10665957 10740201 10775274 10816315
8937 10816315 10910093 11037859 11155697 11261354 11372003 11474696 11557808 11658563 11811915 11978488
8927 11978488 12099567 12204944 12375840 12601752 12775446 12858679 12956239 13168888 13452135 13696178
8917A3696178J91188K13318K62581K58366K26636K49091L25693L75555L59840
8908A6158446L32070L55285M16514M49367M24919L94831M29229N18188N69564
8899B0048413N28755M64732M82675N72049O17769N67530N02106N03315N33410
8890B4820754N12248M53205M34748M66715M74962M18438L43624L06789L05290
8881B8536773L08736L06144K95368K67711K30101K08112K03965J86345J45548
8872C0688803J20082J35899J55895J33549Q8384P5645R6888R7866N4895P946n051
8861C1650801K035P15q845k0503m9786j01220j37450j24227q7048p8779j03963
8850C0941730j22894j23327j32884j54221j45665q9991l2271j3990j0044K5906
$$ plain form
8917 13696178 13887366 14100684 14363265 14621631 14848267 15097358 15423051 15798606 16158446
8908 16158446 16490516 16845801 17262315 17711682 18136601 18531432 18960661 19478849 20048413
8899 20048413 20577168 21041900 21524575 22096624 22714393 23281923 23784029 24287344 24820754
8890 24820754 25333002 25786207 26220955 26687670 27162632 27581070 27924694 28231483 28536773
8881 28536773 28845509 29151653 29447021 29714732 29944833 30152945 30356910 30543255 30688803
8872 30688803 30808885 30944784 31100679 31234228 31322612 31398257 31495145 31593011 31647906 31655852 31650801
8861 31650801 31652836 31653551 31644706 31624203 31574417 31473197 31335747 31211520 31124472 31045693 30941730
8850 30941730 30818836 30695509 30562625 30408404 30262739 30172748 30140477 30126487 30116443 30142349
8840C0142349Q4203J17140J17340J27833J75650K38225K82551L05061L23177L50630
8830C2264159L88508M26180M51475M71533N12695N83210O52198O89090P07161
8821C7146209P40988P99749Q72815R57045J041107J093339J115973J177294J319797
8812D6264316J466388J510797J485417J525089J654827J742675J709019J654084
8804E9012612J693609J777977J785735J713696J648495J606043J532465J435501
8796G2206133J383462J377453J343564J260373J184766J137172J068527R65509
8788H1926959Q84213Q42594P76243O49251N24038M66250M50328M12426L37134
8779H7269436K44865J50230P5153M5549L6219j9016j24277j98749k00583j96796
$$ plain form
8840 30142349 30226552 30343692 30461032 30588865 30764515 31002740 31285291 31590352 31913529 32264159
8830 32264159 32652667 33078847 33530322 34001855 34514550 35097760 35749958 36439048 37146209
8821 37146209 37887197 38686946 39559761 40516806 41557913 42651252 43767225 44944519 46264316
8812 46264316 47730704 49241501 50726918 52252007 53906834 55649509 57358528 59012612
8804 59012612 60706221 62484198 64269933 65983629 67632124 69238167 70770632 72206133
8796 72206133 73589595 74967048 76310612 77570985 78755751 79892923 80961450 81926959
8788 81926959 82811172 83653766 84430009 85079260 85603298 86069548 86519876 86932302 87269436
8779 87269436 87514301 87664531 87739684 87785233 87821452 87802436 87678159 87479410 87278827 87082031
8769H7082031k54103l39462l98674m56145n51006o42784o78459o98088p70802
8760H2292508q70378r19373r18212r19548r07400q24822p03289o34660o14454
8751G4980372n43397l99047k73013k04609j10808O0244K28084L11839L61424M64859
8741G4875948O03760O98409P39493P79691Q32813Q69916Q91450R23861R58089
8732H2173430R58816R25457Q87718Q50684P94626P19457O45758N82371N27504
8723H9065821M82624M33858L51004K42473J71096J66274J62158Q4758l8112j26157
8713I0995797j71134k26414k96536l37593l65282m56982o21738p63063q13715
8704H6943340q28269q90387r95677j086911j152550j223264j303503j370610j424685
$$ plain form
8769 87082031 86827928 86488466 86089792 85633647 85082641 84439857 83761398 83063310 82292508
8760 82292508 81422130 80502757 79584545 78664997 77757597 76932775 76229486 75594826 74980372
8751 74980372 74436975 74037928 73764915 73560306 73449498 73509742 73737826 74049665 74411089 74875948
8741 74875948 75479708 76178117 76917610 77697301 78530114 79400030 80291480 81215341 82173430
8732 82173430 83132246 84057703 84945421 85796105 86590731 87310188 87955946 88538317 89065821
8723 89065821 89548445 89982303 90333307 90575780 90746876 90913150 91075308 91160066 91121954 90995797
8713 90995797 90824663 90598249 90301713 89964120 89598838 89141856 88520118 87757055 86943340
8704 86943340 86115071 85224684 84229007 83142096 81989546 80766282 79462779 78092169 76667484
8695G6667484j484634j544436j581524j602951j637468j680764j692922j661743
8687F3781042j630127j637226j658633j636402j558726j476134j430720j399926
8679E1353148j336796j245931j177471j146740j107692j024456r25101q52654
8671D2536307q02014p46540o92160o54401o11547n39424m68626m40929m28404
8662C7152262l71826k87235k46493k51509k24660j41637p3004n9198m6148L177
8652C5453729L4883J3155O630P4550J52434J58811J40292J83557K45083K19178
8642C6682302J40453J49745K55725L03244K21393J38547J70184K37405K10160
8633C8509158J17867Q2025J14158J22607Q1607N6280O7537N7454M513l5634l4617
$$ plain form
8695 76667484 75182850 73638414 72056890 70453939 68816471 67135707 65442785 63781042
8687 63781042 62150915 60513689 58855056 57218654 55659928 54183794 52753074 51353148
8679 51353148 50016352 48770421 47592950 46446210 45338518 44314062 43388961 42536307
8671 42536307 41734293 40987753 40295593 39641192 39029645 38490221 38021595 37580666 37152262
8662 37152262 36780436 36493201 36246708 35995199 35770539 35628902 35555898 35496700 35450552 35453729
8652 35453729 35488612 35501767 35508397 35582947 35735381 35894192 36034484 36218041 36463124 36682302
8642 36682302 36822755 36972500 37228225 37531469 37752862 37891409 38061593 38298998 38509158
8633 38509158 38627025 38709050 38823208 38945815 39027422 39083702 39151239 39208693 39213206 39177572 39142955
8622C9142955m2059r0533j31093j16687q5575j01665j58325k02164k19126k35215
8612C7760513k51898k44006k19319k22486k66880l08473l09373k92521l04713
8603C5340844l47753l78774l71664l48580l45180l66246l88533l95264l92440
8594C2006410l93926m03823m15828m20538m10288l86274l65120l66723l86279
8585B8457611l90301l56738l09754k91022l00282k96927k68390k56941k89164
8576B5698092l14730k69004j80415j47091j95368k32998j83840j04982r9312j53996
8566B3816356j58920p7611j493p952n2847n6216k2528m413J246L6776Q9878J02095
8554B3664371O8836N5620J02284J72793K16202K24258K12726J95487J93714K24050
$$ plain form
8622 39142955 39100896 39010363 38879270 38762583 38677008 38575343 38417018 38214854 37995728 37760513
8612 37760513 37508615 37264609 37045290 36822804 36555924 36247451 35938078 35645557 35340844
8603 35340844 34993091 34614317 34242653 33894073 33548893 33182647 32794114 32398850 32006410
8594 32006410 31612484 31208661 30792833 30372295 29962007 29575733 29210613 28843890 28457611
8585 28457611 28067310 27710572 27400818 27109796 26809514 26512587 26244197 25987256 25698092
8576 25698092 25383362 25114358 24933943 24786852 24591484 24358486 24174646 24069664 23970352 23816356
8566 23816356 23657436 23579825 23578332 23570380 23517533 23461317 23438789 23434376 23435622 23472398 23562276 23664371
8554 23664371 23733207 23788827 23891111 24063904 24280106 24504364 24717090 24912577 25106291 25330341
8544B5330341K63257K72031K63707K91668L54913L87218L68412L68023M29039
8535B8328609M86038M72369M41996M89200N91775O42665O19496O11403O69269
8526C3352820P36042P59114P78815Q50811R50331J016419J045721J083148J148984
8517D1722205J227816J310284J398617J481159J541937J592473J662381J756728
8509E3693600J844705J893498J901425J896915J909253J938292J956901J950000
8501F8984589J936415J933707J924120J893563J882603J936831K011986K004428
8493H4508242J892968J771970J708623J647893J515566J337833J176055J005966
8485I6565116P67456M98443L03413J94093P2434j13363l03350m51271o12907q46423
$$ plain form
8544 25330341 25593598 25865629 26129336 26421004 26775917 27163135 27531547 27899570 28328609
8535 28328609 28814647 29287016 29729012 30218212 30809987 31452652 32072148 32683551 33352820
8526 33352820 34088862 34847976 35626791 36477602 37427933 38444352 39490073 40573221 41722205
8517 41722205 42950021 44260305 45658922 47140081 48682018 50274491 51936872 53693600
8509 53693600 55538305 57431803 59333228 61230143 63139396 65077688 67034589 68984589
8501 68984589 70921004 72854711 74778831 76672394 78554997 80491828 82503814 84508242
8493 84508242 86401210 88173180 89881803 91529696 93045262 94383095 95559150 96565116
8485 96565116 97332572 97831015 98134428 98328521 98400955 98287592 97984242 97532971 96920064 96073641
8475I6073641j104974j307380j461807j636626j839617k008492k113867k198416
8467H2402462k301482k401253k454734k457597k439334k420654k397974k361801
8459F3167633k314282k265006k213594k144334k047202j939459j848828j774263
8451D6620665j686186j573276j464290j388117j334289j272593j193808j110559
8443C5597547j033529r67631r18503q83145q45936p99570p55012p16704o70179
8434B8007338o12652n69751n56504n48397n21388m91990m80180m62601m11986
8425B3351889l57448l45807l60669l47656l10256l02875l25391l11524k46096
8416B0444167k06056k38485k77647k48599j85984j69089j90266j81585j41618
$$ plain form
8475 96073641 94968667 93661287 92199480 90562854 88723237 86714745 84600878 82402462
8467 82402462 80100980 77699727 75244993 72787396 70348062 67927408 65529434 63167633
8459 63167633 60853351 58588345 56374751 54230417 52183215 50243756 48394928 46620665
8451 46620665 44934479 43361203 41896913 40508796 39174507 37901914 36708106 35597547
8443 35597547 34564018 33596387 32677884 31794739 30948803 30149233 29394221 28677517 28007338
8434 28007338 27394686 26824935 26268431 25720034 25198646 24706656 24226476 23763875 23351889
8425 23351889 22994441 22648634 22287965 21940309 21630053 21327178 21001787 20690263 20444167
8416 20444167 20238111 19999626 19721979 19473380 19287396 19118307 18928041 18746456 18604838
8407A8604838j34377j68113j75178j29703r3372j08077j23667q5861l1803l2153
8397A7522534q0355j08372q9620o0463m7816l8190k5258l2458o7334r5745q8995
8386A6787928o7406o8140r0284j03493j00919j09542j42932j72440j64911j34825
8376A5633036j33665j84083k44595k55544k11979j71310j84868k38289k72392
8367A3736311k54431k11436j90784k03037k17347k09084j93257j98715k20899
8358A1837321k24094j93679j60047j53435j57918j40340j10368j09972j42624
8349A0444844j58764j29378r1886r1786j13856j14509r7572j03926j33766j36347
8339I273054q8450l3809k1804m5723o8316p5318p2853n9573l6829k5774l8666
$$ plain form
8407 18604838 18470461 18302348 18127170 17997467 17904095 17796018 17672351 17586490 17554687 17522534
8397 17522534 17442179 17333807 17244187 17183724 17135908 17097718 17072460 17040002 16972668 16876923 16787928
8386 16787928 16720522 16652382 16562098 16458605 16357686 16248144 16105212 15932772 15767861 15633036
8376 15633036 15499371 15315288 15070693 14815149 14603170 14431860 14246992 14008703 13736311
8367 13736311 13481880 13270444 13079660 12876623 12659276 12450192 12256935 12058220 11837321
8358 11837321 11613227 11419548 11259501 11106066 10948148 10807808 10697440 10587468 10444844
8349 10444844 10286080 10156702 10064816 9973030 9859174 9744665 9647093 9543167 9409401 9273054
8339 9273054 9184604 9150795 9128991 9083268 9014952 8939634 8866781 8807208 8770379 8744605 8705939
8328H705939n0924l9171k7971n0742p9210n5137O106J7354m8762j03435o9646
8317H204401k919n573o4728p7171k2575K687m9179r0723m4235K0650m553q3597
8305G782485q5039N199N2888j8564j10950j01825j8237K5103j461k8299j4973
8294G486327J528j2481l6269m1504l3760k8322k6178k7670l5590l7905k1158j561
8282G185457m735j7062l409K7289K8995l170k2243j0795p012k5435k2775J8170
8270G143275M1418R431k4303l162L2029J4261k7954j9573K4765K5708j4450j1838
8258G189607M3354N7443k673l7988K1755R2420O5063k0288m1025J9832O7721N4894
8246G510115L0826L2256K7817k042j6970J2507N2694O4575N9395N8209M6463J2728
$$ plain form
8328 8705939 8655015 8615844 8587873 8537131 8457921 8402784 8408890 8426244 8377482 8274047 8204401
8317 8204401 8201482 8195909 8131181 8054010 8031435 8034122 7984943 7894220 7849985 7870635 7866082 7782485
8305 7782485 7697446 7702645 7755533 7736969 7626019 7524194 7505957 7531060 7529599 7501300 7486327
8294 7486327 7487855 7475374 7439105 7397601 7363841 7335519 7309341 7281671 7246081 7208176 7187018 7185457
8282 7185457 7180722 7163660 7160251 7187540 7216535 7213365 7191122 7180327 7173315 7147880 7125105 7143275
8270 7143275 7184693 7194124 7169821 7166659 7198688 7212949 7184995 7165422 7190187 7215895 7201445 7189607
8258 7189607 7232961 7290404 7287731 7249743 7271498 7363918 7428981 7408693 7367668 7387500 7455221 7510115
8246 7510115 7540941 7573197 7601014 7598972 7582002 7594509 7647203 7711778 7771173 7829382 7875845 7888573
8234G888573j0272P423L7189L3870R850J3605M6924N9326K8102o297j409K9043
8222H135927M2522K8176J3144J8942L4455L4158J2097p711L841M4739P7221O8162
8210H505673K7731o325j6361j3795j651L7475R8724J31725R5300K0218k0819j417
8198H856478L8343O0323P0777Q0068P0035L7374K8207P6147J31341J15480M1907
8187I606480J2541P7985J63020J67949R6800L7843M7472J02168J48756J56129
8177A0617143J24103Q1398P3536J18136J72652J78318J35525J03278J22020J69448
8167A1895557J98878J91523J62226J39443J47738J86103K17058K01250J48833
8158A3488609J11920J21165J56679J85777J96843J87531J57132J28313J40297
$$ plain form
8234 7888573 7878301 7885724 7922913 7956783 7966633 7980238 8027162 8086488 8114590 8108293 8106884 8135927
8222 8135927 8178449 8206625 8219769 8238711 8273166 8307324 8319421 8311710 8315551 8360290 8437511 8505673
8210 8505673 8533404 8527079 8510718 8496923 8495272 8532747 8631471 8763196 8858496 8878714 8857895 8856478
8198 8856478 8894821 8955144 9025921 9105989 9176024 9213398 9241605 9317752 9449093 9564573 9606480
8187 9606480 9619021 9697006 9860026 10027975 10124775 10162618 10210090 10312258 10461014 10617143
8177 10617143 10741246 10822644 10896180 11014316 11186968 11365286 11500811 11604089 11726109 11895557
8167 11895557 12094435 12285958 12448184 12587627 12735365 12921468 13138526 13339776 13488609
8158 13488609 13600529 13721694 13878373 14064150 14260993 14448524 14605656 14733969 14874266
8149A4874266J94707K39005K32859K03811K03812K34020K52640K43582K34495
8140A6913197K46574K63696K63032K51512K55677K84696L15850L20968L05237
8131A9420439L06411L41685L71989L53385L14766L30402M04373M47042M04283
8122B2694775L48225L74791M57641M89364M46674M19907M68853N38215N52021
8113B6790466N21622N09813N36000N69823N89610N99522O03878O01715N99170
8104C1921619O03895O17602O46561O96449P42871P42013O97388O78700P32694
8095C8079792Q06103Q12357P58036P39059Q06320Q96127R20417Q79887Q48666
8086D5546764Q74024R34458R90161J035351J088374J155319J225224J293190J366814
$$ plain form
8149 14874266 15068973 15307978 15540837 15744648 15948460 16182480 16435120 16678702 16913197
8140 16913197 17159771 17423467 17686499 17938011 18193688 18478384 18794234 19115202 19420439
8131 19420439 19726850 20068535 20440524 20793909 21108675 21439077 21843450 22290492 22694775
8122 22694775 23043000 23417791 23875432 24364796 24811470 25231377 25700230 26238445 26790466
8113 26790466 27312088 27821901 28357901 28927724 29517334 30116856 30720734 31322449 31921619
8104 31921619 32525514 33143116 33789677 34486126 35228997 35971010 36668398 37347098 38079792
8095 38079792 38885895 39698252 40456288 41195347 42001667 42897794 43818211 44698098 45546764
8086 45546764 46420788 47355246 48345407 49380758 50469132 51624451 52849675 54142865 55509679
8077E5509679J445301J509532J545946J569526J606323J659870J714157J764479
8069F8324813J819379J872804J907507J935786K001088K117617K241702K334273
8061H4554969K421013K547030K695811K811991K899962L035067L257498L512336
8053A07735677L732782L937139M188725M486510M763476M997652N261452N628407
8045A44731820O074127O516261O929894P370082P882329Q446780R033806R668187
8037B06653286J0394126J1201885J2038283J2881295J3751851J4639652J5457595
8030B97017973J6088358J6443559J6454828J6037300J5099963J3591307J1519371
8023D02252659Q928999N862207K336512j615109n835753r970349j3556129j6234017
$$ plain form
8077 55509679 56954980 58464512 60010458 61579984 63186307 64846177 66560334 68324813
8069 68324813 70144192 72016996 73924503 75860289 77861377 79978994 82220696 84554969
8061 84554969 86975982 89523012 92218823 95030814 97930776 100965843 104223341 107735677
8053 107735677 111468459 115405598 119594323 124080833 128844309 133841961 139103413 144731820
8045 144731820 150805947 157322208 164252102 171622184 179504513 187951293 196985099 206653286
8037 206653286 217047412 228249297 240287580 253168875 266920726 281560378 297017973
8030 297017973 313106331 329549890 346004718 362042018 377141981 390733288 402252659
8023 402252659 411181658 417043865 419380377 417765268 411929515 401959166 388403037 372169020
8015C72169020j7873079j8516983j8298656j7448231j6290268j5110157j4013194
8008B54618452j2967688j1963903j1060531j0293474r631203r038106q511670
8001A81151877q038919p584078p144692o758707o428412o096089n724600n344103
7993A28032277m986813m637027m286595l977480l735192l515324l279282l074414
7985I6540150k964184k912528k817481k645343k459227k319741k223096k138541
7977G6060009k047329j938153j813209j702184j628026j565560j479991j391633
7969F2493924j343582j318526j260751j177589j135880j145264j132156j059697
7961E2920479r88707r73669r77248r47988r11387r08952r06452q51139p78696
$$ plain form
8015 372169020 354295941 335778958 317480302 300032071 283741803 268631646 254618452
8008 254618452 241650764 229686861 218626330 208332856 198701653 189663547 181151877
8001 181151877 173112958 165528880 158384188 151625481 145197069 139100980 133376380 128032277
7993 128032277 123045464 118408437 114121842 110144362 106409170 102893846 99614564 96540150
7985 96540150 93575966 90663438 87845957 85200614 82741387 80421646 78198550 76060009
7977 76060009 74012680 72074527 70261318 68559134 66931108 65365548 63885557 62493924
7969 62493924 61150342 59831816 58571065 57393476 56257596 55112332 53980176 52920479
7961 52920479 51931772 50958103 49980855 49032867 48121480 47212528 46306076 45454937 44676241
7952D4676241p67135q05526q06457p47180p02762p20730p50760p35649o99216
7943C7940826o94870p21329p41010p42762p36982p18399o81640o51870o54474
7934C1597490o69795o59933o26785o00832n84181n53278n15015n07706n34696
7925B6345269n44486n01148m38136m11552m24407m30194m00411l59304l49843
7916B2485788l81496m16101m04643l43132k86483k88461l31181l45152l05104
7907A9384035k65571k79072l19054l23895k87726k58379k61523k77037k83669
7898A6828109k79504k62037k35055k29937k66429k97053k57169j75370j54794
7889A4670761k21025k74165k38952j78180j83305k25160k12379j50521j29655
$$ plain form
7952 44676241 43909106 43103580 42297123 41549943 40847181 40126451 39375691 38640042 37940826
7943 37940826 37245956 36524627 35783617 35040855 34303873 33585474 32903834 32251964 31597490
7934 31597490 30927695 30267762 29640977 29040145 28455964 27902686 27387671 26879965 26345269
7925 26345269 25800783 25299635 24861499 24449947 24025540 23595346 23194935 22835631 22485788
7916 22485788 22104292 21688191 21283548 20940416 20653933 20365472 20034291 19689139 19384035
7907 19384035 19118464 18839392 18520338 18196443 17908717 17650338 17388815 17111778 16828109
7898 16828109 16548605 16286568 16051513 15821576 15555147 15258094 15000925 14825555 14670761
7889 14670761 14449736 14175571 13936619 13758439 13575134 13349974 13137595 12987074 12857419
7880A2857419j70958j99162j76492j57204j78545j93382j60749j24313j39308
7871A1357306j80398j87007j58116j38397j39474j37087j29647j40650j66494
7862I980036j73006j49779j27449j29706j40516j36344j28267j46240j85237j93774
7852H469718j37225o0179m7126j11362j68816j54561j16389j32668j78824j64983
7842G197585q9287m8202q1953j17013r8537p5382r5414j14156q4948n4509p8513
7831F259671j16190j08243r2140j26472j59205j04237j1622j3939j10579j54864
7821E262180p9606M352j5092r5834j30102r5608m7943k9655m6475q2019r5020
7810D549178n4246j404j3686q3279j15995p5902l4469l7410l2730Q075J2808n8716
$$ plain form
7880 12857419 12686461 12487299 12310807 12153603 11975058 11781676 11620927 11496614 11357306
7871 11357306 11176908 10989901 10831785 10693388 10553914 10416827 10287180 10146530 9980036
7862 9980036 9807030 9657251 9529802 9400096 9259580 9123236 8994969 8848729 8663492 8469718
7852 8469718 8332493 8272314 8225188 8113826 7945010 7790449 7674060 7541392 7362568 7197585
7842 7197585 7108298 7060096 6978143 6861130 6762593 6687211 6591797 6477641 6392693 6338184 6259671
7831 6259671 6143481 6035238 5943098 5816626 5657421 5553184 5541562 5527623 5417044 5262180
7821 5262180 5182574 5186926 5171834 5076000 4945898 4850290 4802347 4772692 4726217 4644198 4549178
7810 4549178 4494932 4493528 4479842 4396563 4280568 4204666 4170197 4132787 4100057 4108132 4120940 4062224
7798D062224j11784n9078K4003J4379o1299q4697m6853l8744p1612o5525j4057
7787C546957m428n2455o5423j0424J9669l1222q1098n0643L748p757n9504o6472
7775C140948k7888j0947k8825l2686q233N058j2055l4540m4201m7903m4358k3836
7763B830534k035o763k8266k8811p426q514n0236q6199o6662j0427J8144o838
7751B546501m4787m9471k8513j9882k8444k4515n117q805m6951o7301l0178J8020
7739B210557Q487m0906n5518k8185k4031n5788n3586P635M7184M622n6277m7657
7727A916537L769R128l6500n8196k9782l276j0841k1577q697J0110J6342J6769
7715A803786J1019j4246m4682m2131m889K2368J4260m747j0979j6057k9262k9413
$$ plain form
7798 4062224 3950440 3891362 3915365 3929744 3868445 3783748 3736895 3698151 3626539 3561014 3546957
7787 3546957 3542529 3490074 3424651 3414227 3433896 3402674 3321576 3270933 3274681 3266924 3207420 3140948
7775 3140948 3113060 3102113 3073288 3040602 3032369 3037427 3025372 2990832 2946631 2898728 2854370 2830534
7763 2830534 2828499 2821736 2793470 2764659 2757233 2748719 2698483 2612284 2545622 2535195 2553339 2546501
7751 2546501 2501714 2452243 2423730 2403848 2375404 2350889 2345772 2336967 2290016 2222715 2192537 2210557
7739 2210557 2219044 2178138 2122620 2094435 2070404 2014616 1961030 1968665 2015849 2020471 1964194 1916537
7727 1916537 1920306 1929434 1892934 1834738 1804956 1801680 1790839 1769262 1760565 1770675 1787017 1803786
7715 1803786 1814805 1800559 1755877 1713746 1708857 1731225 1745485 1740738 1729759 1713702 1684440 1655027
7703A655027k936K4350K2429j858k3031l2837l5479k7715o601J6120K4323J3976
7691A625768p464k7144l1683k0550j1215j4502j5736m230l441l2970n7546k8600
7679A370687K9320L8739j5414n9166m1706n964p560k5556j0099K7275L4387K363
7667A337306k9210l5313k4781q902N692L847j9283l7295k5635j532L493p109j0766
7654A150512j0206j8728k1011J262K1029o69m2357m4028p17K7847J0170j4907
7642A058197p328J7962K9140K4500J3887n495k7578k8756o508Q899M063L943J8945
7629A103871J6769j7976m2534k0639J3443J0090j3611j1567K362j8264n2693l1067
7617I38184M0943O8853J2758m3102j9590L3965K4061l4040m5118P995L8867Q6
$$ plain form
7703 1655027 1652091 1676441 1698870 1697012 1673981 1641144 1605665 1577950 1571349 1587469 1611792 1625768
7691 1625768 1618304 1591160 1559477 1538927 1527712 1513210 1497474 1493244 1489803 1456833 1399287 1370687
7679 1370687 1400007 1438746 1423332 1364166 1322460 1316496 1308936 1283380 1273281 1300556 1334943 1337306
7667 1337306 1308096 1272783 1248002 1239100 1244792 1248639 1229356 1192061 1166426 1164894 1168387 1161278 1150512
7654 1150512 1140306 1121578 1100567 1101829 1122858 1122189 1079832 1035804 1035087 1062934 1073104 1058197
7642 1058197 1050869 1068831 1097971 1122471 1136358 1130863 1103285 1074529 1068021 1076920 1080983 1084926 1103871
7629 1103871 1120640 1102664 1060130 1039491 1052934 1063024 1049413 1037846 1040208 1021944 969251 938184
7617 938184 979127 1047980 1060738 1017636 998046 1032011 1056072 1022032 976914 984909 1023776 1023862
7605A023862m4471k8368J5582K0702m153j504L2855M9080L1701J8252K5226J9916
7593A158680j5027m3208k9023J0453L7110M1259L1699R779j4184r165L3401O8795
7581A280569N3363J1687M573M1216P1392O3342M1235L6237M3729M6330M4343M3500
7569A781516M0174L7006M8196P1592Q0430O3245M8149O2324Q7115Q3794N2600
7558B456141L3543M7592O4549M1034k3897q4352r7778p2491n7361q1093j13877
7547B112010j06793o2341l6519o3112j06606j11830p6657m4873m1007m8133m8670
7536A365469n0997o3043o7779m7159j5204l498j8292l3201k8316j8459l0020n9549
7524I29952p3344n0391j1011P503m233k0641j8080n066p860l2966n5876n0552
$$ plain form
7605 1023862 979391 951023 966605 987307 983154 981650 1014505 1063585 1095286 1113538 1138764 1158680
7593 1158680 1143653 1100445 1071422 1081875 1118985 1160244 1191943 1201722 1187538 1178373 1211774 1280569
7581 1280569 1333932 1345619 1350192 1391408 1462800 1526142 1567377 1603614 1647343 1693673 1738016 1781516
7569 1781516 1821690 1858696 1906892 1978484 2058914 2122159 2170308 2232632 2319747 2403541 2456141
7558 2456141 2489684 2537276 2601825 2642859 2618962 2534610 2436832 2364341 2306980 2225887 2112010
7547 2112010 2005217 1942876 1906357 1843245 1736639 1624809 1548152 1503279 1462272 1414139 1365469
7536 1365469 1314472 1251429 1183650 1136491 1121287 1117789 1099497 1066296 1037980 1019521 989501 929952
7524 929952 856608 806217 795206 802709 798476 777835 759755 754689 746829 713863 657987 607435
7512F07435k2291j517n682j9806k0992r012Q50L707M144j223j5186k2107j0044
7499D88276k989k8027n4426k5102M1781N6882l179m5196m777M1371R06o9341n0977
7486C45202K9893L7784m0014o3994J9847P9838J5479p4896n8084K4032M6648J1252
7474C72987Q447L3296L045o6743o7292J4610O2959J7920m0071l7075j3156k1605
7462B67322l0336j319K1294j0276m8959k3812L7426M7110o446m6122k3825K0415
7450B02472K8041k471l0256l0591j6214r541r716J665K2200J9958j6042m2291
7438A17214j7833K5814K6297j1190k3921K508J4695j0818l0101j6143j641n365
7426F9516L981L0899K4401k3329l6898J8610O1372K1340l9566l4759j534k1319
$$ plain form
7512 607435 585144 583627 577945 558139 537147 528135 528985 532692 536836 535613 520427 498320 488276
7499 488276 485287 457260 402834 377732 419513 476395 473216 428020 423243 464614 465520 396179 345202
7486 345202 375095 412879 372865 308871 328718 408556 424035 349139 291055 315087 361735 372987
7474 372987 381434 414730 417775 351032 283740 298350 361309 379229 339158 302083 288927 267322
7462 267322 236986 235667 256961 246685 197726 173914 211340 258450 252004 205882 182057 202472
7450 202472 230513 228042 197786 167195 150981 141440 131724 133389 155589 175547 159505 117214
7438 117214 99381 125195 151492 140302 116381 118889 133584 122766 92665 76522 74881 69516
7426 69516 73497 104396 128797 105468 68570 87180 148552 169892 130326 95567 94033 72714
7414G2714n5837p533R0726J01399o20q3035n6822R289K1877m844j2737l228o835
7401F4514j5472p996M451O176P095J0486l222l0631l2983J419L2189L0733J7753
7388H4512J3262N161q639p174J154j9532n3478l5051L5107O3562O299n0740k3533
7375A0910L9785M6175L629j7772j2695k2327l1939K699N1453M1379j8336m5584
7363D7377j7321O537l657q138J1563J5394j3501l1956j5412j096j5864k5432L328
7350d8178M2603M7631J9747r247k2549k0986r480k51l455p358J876N520j8443
7337b2570l9616j0554M2783M1060k3555o3061k5035L0848L3567L899l152N176
7325c0210p266k4158o134K9040L0123j362j6636k352N278j1293k3763p225K4129
$$ plain form
7414 72714 16877 9344 100070 201469 200849 117814 60992 70281 92158 87314 74577 71349 64514
7401 64514 49042 41046 45497 51673 58768 69254 66032 35401 2418 3837 36026 66759 84512
7388 84512 97774 102935 94296 87122 88276 68744 15266 -19785 15322 78884 85183 34443 10910
7375 10910 50695 96870 100499 82727 70032 47705 15766 18465 69918 111297 92961 47377
7363 47377 30056 36593 32936 24798 36361 51755 38254 6298 -9114 -10210 -26074 -51506 -48178
7350 -48178 -5575 42056 61803 52556 30007 9021 -459 -710 -4165 -11523 -9647 -4127 -22570
7337 -22570 -62186 -72740 -29957 11103 -12452 -75513 -100548 -69700 -36133 -32234 -35386 -30210
7325 -30210 -37476 -61634 -67768 -38728 -8605 -9967 -26603 -28955 -23677 -34970 -58733 -65958 -41829
7312d1829L8651J9070k4090n1149k3509L9017N8908j973p4499o4702J5355O2580
7300d8170K5195l5115l8731R778M4720K8686j3016l2332j2208J7119J3813k0931
7288f1192l9500j3449K1617J7367j2859j5668J7401L8090J7929j2788j7438k740
7276f3230N292K706J294L235K831k37l085m811l864j267n481j8989k4675o348
7262a16629K1405K7955Q501j3484k2025k0236j0602N713J3239p41j5693o25L2883
7249i0339M0285R881k2598l1161k7203k0517l87K7401L1427N850j2400k641O456
7236h5946q422k1776p465J0478n1j9805j0365J8222K3285o9j2826O297L3392L6906
7222c8145J3569j6285l0433k2740r257p351o648J4032L7710K0486l2285n4540
$$ plain form
7312 -41829 -3178 15892 -8198 -59347 -82856 -43839 15069 13096 -61403 -126105 -110750 -48170
7300 -48170 -22975 -58090 -96821 -87043 -42323 -13637 -26653 -58985 -71193 -54074 -40261 -61192
7288 -61192 -100692 -114141 -92524 -75157 -88016 -103684 -86283 -48193 -30264 -43052 -60490 -63230
7276 -63230 -57938 -55232 -53938 -50703 -47872 -48109 -51194 -56005 -59869 -61136 -66617 -85606 -110281 -116629
7262 -116629 -95224 -67269 -58768 -72252 -94277 -114513 -125115 -119402 -106163 -106904 -122597 -123222 -90339
7249 -90339 -50054 -40173 -62771 -93932 -121135 -141652 -142039 -114638 -83211 -77361 -89761 -92402 -85946
7236 -85946 -94368 -116144 -123609 -113131 -113182 -132987 -143352 -125130 -101845 -101914 -114740 -108443 -75051 -38145
7222 -38145 -24576 -40861 -71294 -94034 -103291 -110642 -117290 -103258 -65548 -45062 -77347 -131887
7210a31887j7376J9161K424k3104N040M9523L0641k9662l3467K8209N4756L857
7198d1885l7482k982L9417O309n5189m5583J8870L3977j8189m2263R692N9222
7186g6086K8817l8337n2462j1370J6877J0901J1968L1250K5510j5223l2323O088
7174i4390L9291P255m0652j6286N4953N7351l1457q9739l1413O1470O4546o557
7162b5628m0753r490J3918m474j4181J0989K3797l197k3842k526K1827O243k3184
7149g0501k1696P56Q574J411k206n466j3381q307J3116J6848j3096l7074k1799
7136a52821M896R681J3285L5144L2825k5289p4515l6693M3923N4736r529m0680
7124a45037N191M2601O630m1169k1446L3821M0168p549m1833k9664k088J0087
$$ plain form
7210 -131887 -149263 -130102 -127678 -150782 -145742 -96219 -65578 -95240 -128707 -100498 -45742 -41885
7198 -41885 -79367 -82349 -42932 -36623 -91812 -137395 -118525 -84548 -102737 -145000 -135308 -76086
7186 -76086 -47269 -85606 -138068 -149438 -132561 -121660 -109692 -78442 -52932 -68155 -100478 -94390
7174 -94390 -55099 -47844 -88496 -104782 -49829 7522 -23935 -113674 -145087 -83617 -19071 -25628
7162 -25628 -66381 -75871 -61953 -66427 -80608 -69619 -45822 -49019 -72861 -75387 -53560 -47317 -70501
7149 -70501 -92197 -91441 -82867 -81456 -83662 -89128 -102509 -110816 -97700 -80852 -93948 -131022 -152821
7136 -152821 -147925 -138244 -124959 -89815 -56990 -82279 -156794 -193487 -149564 -94828 -104357 -145037
7124 -145037 -139846 -97245 -90615 -131784 -153230 -119409 -79241 -86790 -128623 -158287 -160375 -150288
7112a50288J2140J6948K0648J3061n843j9699n615L2811M9283P983n0778n1310
7100a30659M957L4940L321k1614J2885M7993J0955n4213m9251K1460N7846J7652
7088d3728l2928l1450K448K2784K1070P329j5201l0699j4805K0987L4298J5775
7076d4120q68m089k0540m7748l8436J4735M5273J1139l2886j9207K8151M0901
7064f7695J7194Q413K1665J5709j5094k9845j7447j2886k5632j9183J6720L5232
7052g2849N221l5848l7112k748K8299L6546K3833o544l7743l6665J549L1673J6523
7039h5865j7715k1995L587K1787K2450K4202K3255m293m7043n7961k2614J6861
7027a45344K3655J2385J2356K0566J8286O918p86n758j3968j8266j0515J588P757
$$ plain form
7112 -150288 -138148 -121200 -100552 -87491 -93334 -113033 -118648 -85837 -36554 -28571 -79349 -130659
7100 -130659 -125702 -90762 -87441 -109055 -96170 -48177 -37222 -91435 -140686 -119226 -61380 -43728
7088 -43728 -76656 -108106 -105658 -82874 -61804 -54475 -69676 -100375 -115180 -94193 -59895 -44120
7076 -44120 -44988 -49077 -69617 -117365 -155801 -141066 -95793 -84654 -117540 -136747 -108596 -67695
7064 -67695 -50501 -42088 -20423 -4714 -19808 -49653 -67100 -79986 -105618 -124801 -108081 -72849
7052 -72849 -67628 -103476 -140588 -143336 -115037 -78491 -54658 -61202 -98945 -135610 -134061 -102388 -85865
7039 -85865 -103580 -125575 -121988 -100201 -77751 -53549 -30294 -34587 -81630 -139591 -162205 -145344
7027 -145344 -121689 -109304 -96948 -76382 -58096 -51178 -51964 -57722 -71690 -89956 -100471 -98883 -91126
7014i1126J1020J4410Q956p229j5964n697N737k352j9324j9462m8J9536K5916
7001g5627J8479J087j3321o629J4595J4326k0754m8119k4476K6979M7296K4099
6989d2065l381j0486q267m078P365J4243o40j8215m915K5198K7796N968K322J1798
6975B643j3735n9395m4593L4814O6440p675p8209k6366Q3673R4059j0672r0144
6963d9160n9479J3273L8640K2340J1286J1694R300Q531J0644r6k0906k4798o712
6950c5443R818J8494K9215K2490k4695o6076k8611N6779P0568j1583o2539J177
6938b0406P7248L4305p5290r0796J4921J04486P9768n471n5194n1171k7627l663
6926a8890J6370K4755K4420K7364K6381M355k4826k7277l825J1375Q382R021J4908
$$ plain form
7014 -91126 -80106 -65696 -56740 -63969 -79933 -85630 -79893 -82245 -101569 -121031 -121079 -101543 -75627
7001 -75627 -57148 -56061 -69382 -76011 -61416 -47090 -67844 -115963 -140439 -113460 -66164 -42065
6989 -42065 -45446 -55932 -64199 -68277 -60912 -46669 -47309 -65524 -70439 -45241 -17445 -11477 -9155 2643
6975 2643 -11092 -70487 -115080 -80266 -13826 -21501 -99710 -126076 -42403 51656 40984 -49160
6963 -49160 -108639 -95366 -56726 -34386 -23100 -11406 -2106 6425 17069 16973 -3933 -28731 -35443
6950 -35443 -25625 -7131 22084 44574 19879 -46197 -74808 -18029 52539 40956 -21583 -20406
6938 -20406 56842 91147 15857 -74939 -60018 44468 124236 118765 63571 12400 -15227 -18890
6926 -18890 -2520 22235 46655 74019 100400 104755 79929 52652 48827 60202 68584 77605 92513
6913I2513K139k4902k9591m674J6021J8934K5913L3905N845n1384o7319q901N6934
6900F5433N3151k013l4211j9055Q685K2694K3399Q099k1426l4239n972L0343K1872
6887A16760k0767l3673L032L5109J9671j1342o889K2629K5846o592k7442n880
6875A10462K5476K0336j0149j3174K3967M9280K0395l1257m3641r067K5242L0610
6863A98480K5136K7254K6261J2024l190q221q047m500P531J8415J4176J1162L3650
6850C50131N3013J3158o5705q4763q893O4798M4309k0567k3840K9368M6754J0251
6838D08014l433L3869N1248M403m4529k6551K7036M0069O249j4936P775M2454
6826E31668M7703K3071P52M051J9378J3560j4857k0316K6185P7972O5500N96l2337
$$ plain form
6913 92513 94652 69750 40159 35485 51506 70440 96353 130258 136103 84719 17400 8499 65433
6900 65433 118584 116571 82360 63305 71990 94684 118083 126182 104756 70517 64545 94888 116760
6887 116760 95993 62320 65352 100461 120132 108790 101901 124530 150376 143784 116342 110462
6875 110462 135938 156274 146125 132951 156918 206198 226593 195336 151695 142628 167870 198480
6863 198480 223616 250870 277131 289155 285965 277744 269697 265197 272728 291143 305319 316481 350131
6850 350131 403144 416302 350597 265834 256941 321739 366048 345481 321641 351009 397763 408014
6838 408014 404581 438450 489698 494101 449572 423021 450057 490126 496375 481439 489214 531668
6826 531668 579371 602442 603194 607245 626623 640183 625326 605010 631195 709167 774667 775263 742926
6813G42926K483M4533L5739M549P999L9806N0494K7905M614K486J4403K8989L5963
6800A042889J9322j8784l9203p852N0683P7260N3344J9483J7101M0860N6378M5165
6788A356646K2819J9938M6664P5841P2078L9471K0416L8620O7792P3141N8783
6777A892209N0355N2394N2285N1365O1679Q0244R2825R6839R7878R1941P5052
6766B695066O3129P7378J12870J42584J49904J39451J21736J07407J11943J43546
6756C865014J84916K05854J99154J90550K06110K38985K60546K65265K87951L55787
6746F260132M32866M54164M25000M31162N11882N82317N51585M64674M26126M20293
6736A0960201L39219J79647N5629j4140j60247m26715o48001o84596o34302o51568
$$ plain form
6813 742926 745409 789942 825681 830230 838229 878035 928529 956434 961048 963534 977937 1006926 1042889
6800 1042889 1062211 1043427 1004224 996372 1047055 1124315 1177659 1197142 1214243 1255103 1311481 1356646
6788 1356646 1379465 1399403 1446067 1521908 1593986 1633457 1653873 1692493 1760285 1833426 1892209
6777 1892209 1942564 1994958 2047243 2098608 2160287 2240531 2333356 2430195 2528073 2620014 2695066
6766 2695066 2758195 2835573 2948443 3091027 3240931 3380382 3502118 3609525 3721468 3865014
6756 3865014 4049930 4255784 4454938 4645488 4851598 5090583 5351129 5616394 5904345 6260132
6746 6260132 6692998 7147162 7572162 8003324 8515206 9097523 9649108 10113782 10539908 10960201
6736 10960201 11299420 11479067 11534696 11520556 11360309 10933594 10285593 9600997 8966695 8315127
6726H315127o85240n94148m31010l79475m44825m42871l09378j95526k04444k41401
6716D386809k08938j65290j82050k02930j63152j17164j27806j44486j10922q6233
6706B877838j33576j85277j49652o8804l9837n5626n6195o3812j22709j68349
6696A834001j12002r479J1069m4348o0398j9331j4818o4035p7355l3693k0390
6685A389221o2766p2754j7902J1147l2201o1013j4380K8141r625o1553l7376J9262
6673A078201J3150l9101n2837k5707k0214l5106j6646K2423J3586m0331n8444
6662H38974j5468J7846m635l3176j5661J1785j1121o2140o4116l391M4369K0316
6650G23582l6199m8578j4378o80l2443n1398j5086K5459N183m6007n1687j5066
$$ plain form
6726 8315127 7629887 7035739 6604729 6225254 5780429 5337558 5028180 4832654 4628210 4386809
6716 4386809 4177871 4012581 3830531 3627601 3464449 3347285 3219479 3074993 2964071 2877838
6706 2877838 2744262 2558985 2409333 2340529 2300692 2245066 2188871 2125059 2002350 1834001
6696 1834001 1721999 1712520 1723589 1679241 1618843 1599512 1584694 1520659 1443304 1409611 1389221
6685 1389221 1326455 1253701 1235799 1246946 1214745 1153732 1139352 1167493 1157868 1096315 1058939 1078201
6673 1078201 1091351 1052250 999413 973706 953492 918386 901740 924163 937749 897418 838974
6662 838974 823506 841352 836717 803541 787880 799665 788544 726404 662288 658897 703266 723582
6650 723582 687383 638805 624427 623747 591304 539906 524820 550279 555462 509455 457768 442702
6638D42702m338k5491j4572L3822M0573k0145o1679k0419M0777L4909j9452m7068
6626C79619l2482j0538Q345K8276K5816j2592m8044m3524k0110p514P255K7806
6614C02313J2942m0870n7705k659L8136n324n6937k2662L7061J2799m9306k6975
6602A40813M5243K5810o9621p4526L6097Q5798n262q1088j7353P0211L1897o5508
6590A22511o6933J4301M8250J3481m978J0376K494k3933j0976K3368M378n6159
6578G6180o6398q140L7040K5952L756m26j6540m5210l1301L3245P0498K9484l4742
6565G3398m5529j0257R111r119k8200j1378L0779M8473P764n6431o7879j1407
6553g0675L4681J1315k8348q717L6749K3952k7691k2715L8629N1005j4560n6495
$$ plain form
6638 442702 438364 412873 398301 432123 472696 452551 390872 370453 411230 446139 426687 379619
6626 379619 347137 336599 344944 373220 399036 386444 338400 294876 274766 267252 274507 302313
6614 302313 315255 274385 216680 214021 252157 246833 189896 167234 204295 217094 167788 140813
6602 140813 186056 211866 142245 67719 103816 189614 184352 103264 85911 156122 188019 122511
6590 122511 55578 69879 118129 131610 126632 137008 139502 115569 104593 127961 132339 76180
6578 76180 9782 1642 38682 64634 68390 67964 51424 6214 -25087 8158 78656 108140 73398
6565 73398 27869 17612 26723 17604 -10596 -21974 8805 57278 65042 8611 -59268 -70675
6553 -70675 -35994 -24679 -53027 -61744 -24995 -1043 -28734 -51449 -12820 38185 23625 -32870
6541c2870j6343K4101q184m9081j4458M9550M4628j8500m9502k5125N46M736J4245
6528g6257K8695J6737j4462k4142j0114n634r660Q413L7311L0180j2977l8372
6516g0282k3028j392K917P356J7776R555j7266k3689J973J9191M515q651P046
6503g3979K2112M206k1669j5319R914J1442j1753k2264p341O189o79j2859q242
6490a20242J2170K6423J3401k3263m7661k4896K7939M9211J0986l7535l5234O992
6478a41709K8716J0063r742j094J8284K4115K0061J3849k993k8851l7759j7421
6466a24481N612N558l377K291R943n229k8695k3318J0136L3806L3055K9585K9249
6453b5865P651l4358n0892j8409J9923J7220o554o087P941q533m3896l5837K5391
$$ plain form
6541 -32870 -49213 -25112 -33296 -82377 -96835 -47285 -2657 -21157 -70659 -95784 -95238 -90502 -76257
6528 -76257 -47562 -30825 -45287 -69429 -79543 -85177 -94837 -86424 -49113 -18933 -31910 -70282
6516 -70282 -93310 -94702 -91785 -84429 -66653 -57098 -74364 -98053 -96080 -76889 -72374 -81025 -73979
6503 -73979 -51867 -47661 -69330 -84649 -74735 -63293 -75046 -97310 -104651 -98462 -99141 -112000 -120242
6490 -120242 -108072 -81649 -68248 -91511 -139172 -164068 -136129 -86918 -75932 -113467 -148701 -141709
6478 -141709 -112993 -102930 -112672 -113766 -95482 -71367 -51306 -37457 -40450 -69301 -107060 -124481
6466 -124481 -118869 -113311 -116688 -114397 -104454 -109683 -138378 -161696 -151560 -117754 -84699 -55114 -25865
6453 -25865 -18214 -52572 -103464 -121873 -101950 -84730 -91284 -97371 -89430 -97963 -141859 -177696 -152305
6440a52305O5745L0133l5882n0538p658K5279O380l0255k9169J4570N5182N3703
6428e4815J8412j3615k3432k3460k4361j3915J2816K6236J90l6759l2250J1077
6416a53876L6906K1508M311J3493J7809j1757m2482l0745N223J6742R86q833q205
6403a38920j7341k5138O00M6363N5228Q540m3618n0795k0692P937J5994Q836j969
6390a54975m680N317J5824J3897J0309K1455L0957P049l8810n3576j6967K5501
6378a38699K5623m805k0041l409K2666L2985K2799L964p484o232m391j3291k3097
6365a13412j8973r549j1353j2802Q243L4428K3554k0123l9696p869L2631L5113
6353i9808J0316p584j4472k0308j5148R952L3416K8912J798k3984l3719k0770
$$ plain form
6440 -152305 -86560 -56427 -92309 -142847 -150505 -125226 -118846 -149101 -178270 -163700 -108518 -54815
6428 -54815 -36403 -50018 -73450 -96910 -121271 -135186 -122370 -96134 -95944 -132703 -164953 -153876
6416 -153876 -116970 -95462 -91151 -77658 -59849 -71606 -114088 -144833 -139610 -122868 -121882 -130715 -138920
6403 -138920 -156261 -181399 -180799 -134436 -79208 -70668 -114286 -165081 -185773 -177836 -161842 -153006 -154975
6390 -154975 -159655 -154338 -138514 -124617 -114308 -92853 -61896 -54847 -93657 -147233 -164200 -138699
6378 -138699 -113076 -117881 -137922 -141331 -118665 -85680 -62881 -58917 -66401 -72633 -77024 -90315 -113412
6365 -113412 -132385 -141934 -153287 -166089 -157846 -123418 -99864 -119987 -159683 -167552 -134921 -99808
6353 -99808 -89492 -97076 -111548 -131856 -147004 -137052 -103636 -74724 -72926 -96910 -130629 -151399
6341a51399J1414L2529J1459k6400k1100K3216L0575k1454n0129o47N2775K6080
6329h3081k9489j5540L7578K1222n3421o0795K5888P9688K3974m7591l0408K9614
6317a02361L1682j3492k4062O028J3458j2406j9654L232Q730j8495l2247n042
6305a64629K7979K9651J2641M259J633q793j8158j0964N640J3577J2090J2643
6293h2431J4498P214m623j345J9241K8037K267l4101l5388P04K6704J5007n345
6280d9561o282j1041m1648n7031j1767N0009M3986j8828m0220R605M5825J3578
6268g3375k4486o547J9295q401m1422n922N1375K8856n0329o1711J7676O6810
6256h8181J4294n1550l0329L6120M4629o217l2671p644J1701p139k1142P136M0506
$$ plain form
6341 -151399 -139985 -107456 -95997 -122397 -143497 -120281 -89706 -111160 -161289 -161936 -109161 -83081
6329 -83081 -112570 -128110 -90532 -69310 -122731 -183526 -157638 -77950 -53976 -101567 -131975 -102361
6317 -102361 -70679 -84171 -108233 -102205 -88747 -101153 -120807 -117575 -108845 -127340 -159587 -164629
6305 -164629 -136650 -106999 -94358 -90099 -88466 -97259 -115417 -126381 -120741 -107164 -95074 -82431
6293 -82431 -67933 -60719 -65342 -66687 -47446 -19409 -17142 -51243 -86631 -85927 -59223 -44216 -49561
6280 -49561 -55843 -66884 -108532 -165563 -177330 -127321 -83335 -102163 -142383 -132778 -86953 -73375
6268 -73375 -97861 -104408 -85113 -93514 -134936 -140858 -89483 -60627 -110956 -172667 -154991 -88181
6256 -88181 -73887 -125437 -155766 -119646 -75017 -81234 -113905 -121549 -109848 -116987 -138129 -130993 -90487
6243i0487K1760l4987n5925r226M6383L9458j4502l6424j449K6186k90l1622o494
6230a47619L7159J8307m6577n8299P090N6676K7151k2216j6145J9344J7981j1509
6218a18657j3845J0885J7184Q86l745J676j2818l0420k080N6438O4608j96n5819
6205h5903l3707K0043J9867l0160n2379j8234J7604J0025j2675l434K9969M2628
6193i6356J9096j4162l1128k7609n875K7268M5210K0853k7469m4397j0417K8040
6181a16946K6038J106q317p826k0234k6332K464L3945J3698l5530l7812R320K6401
6168a40025j0074k4506J9795M5322n145n6561k1934M5961M1044j7222k3860K7134
6156a20071L9439j1131l9701q757J2820j2835k2215K2560N0319L448n1430k7423
$$ plain form
6243 -90487 -68727 -103714 -159639 -168865 -122482 -83024 -97526 -133950 -135399 -109213 -109503 -141125 -147619
6230 -147619 -110460 -92153 -138730 -197029 -189939 -133263 -106112 -128328 -144473 -125129 -107148 -118657
6218 -118657 -132502 -121617 -104433 -103547 -107292 -105616 -118434 -148854 -150934 -94496 -29888 -30084 -85903
6205 -85903 -119610 -99567 -79700 -109860 -162239 -180473 -162869 -152844 -165519 -168953 -138984 -96356
6193 -96356 -77260 -91422 -122550 -150159 -156034 -128766 -83556 -62703 -90172 -134569 -144986 -116946
6181 -116946 -90908 -89802 -98119 -105945 -126179 -152511 -150047 -116102 -102404 -137934 -175746 -166426 -140025
6168 -140025 -150099 -174605 -154810 -109488 -114633 -171194 -193128 -147167 -106123 -123345 -147205 -120071
6156 -120071 -80632 -91763 -131464 -140221 -127401 -140236 -162451 -139891 -89572 -86124 -137554 -164977
6144a64977M0402N3197j355m8858m5515j3304J8752L6464K3437j4128k6989J2688
6132a30186N2429K8134l4696n7668k5274Q487J2813N506k743j5442j0479L0941
6120a38178O2950K4555n0919o4398J390N4138L3507j0416j5315K256J467j1165
6108a10128j6033k2315k7826j054M9164N5115l589m7636j8029K5764J0455k0654
6096a26766J1232O5780L9000n3556q4910j3859N4269L5049k1665l5721j5719q987
6084a55853r715J0057L0785J6366j8467k9476q459J7333K9513K6195Q845q081
6072i0957j335K0603J4764k9880o2314m0934M499K3048J5534J0871P202r732k0811
6059a59442l292J8836J0563j1745j1030J683p309k2473l816L1869L1173j863j2132
$$ plain form
6144 -164977 -124575 -71378 -72733 -121591 -167106 -180410 -161658 -125194 -101757 -115885 -142874 -130186
6132 -130186 -77757 -49623 -84319 -141987 -167261 -158774 -145961 -140455 -143198 -158640 -169119 -138178
6120 -138178 -75228 -50673 -101592 -165990 -164600 -110462 -76955 -87371 -102686 -100430 -98963 -110128
6108 -110128 -126161 -148476 -176302 -177356 -128192 -73077 -76666 -124302 -142331 -116567 -106112 -126766
6096 -126766 -115534 -49754 -10754 -64310 -149220 -163079 -108810 -73761 -95426 -131147 -146866 -155853
6084 -155853 -165568 -155511 -124726 -108360 -126827 -156303 -164762 -147429 -117916 -91721 -82876 -90957
6072 -90957 -92292 -71689 -56925 -86805 -149119 -190053 -185554 -162506 -146972 -136101 -128899 -138631 -159442
6059 -159442 -162734 -143898 -133335 -145080 -156110 -154427 -161736 -184209 -188025 -156156 -124983 -126846 -138978
6046a38978N990n7l7373m3235P851N4466M4230O488j3136k1175l0808j5285L3745
6033a47277N9744J9816l6876l7929L113J7064r647k6705q076J8508K6237J7899
6021a04129J697j6167j9555k065J2363M916k030J4222K5668l425m4800l8996J2374
6008a59927M8754L9433J1688o320j3399p796J2246K1196o059m1868l6535L614
5996a34973K6929J7928M650o031k7658l6697O40M5972K6790l6699m5991J5777
5984a49363N0930R632l2292j3852J0045j4373l2262J1324N2515J3945m9913l8517
5972a82181K4662L9416J228j0089J3830N735l3570k6398L4261N8780J1489l0979
5960i3816j1781K1671J2681j7724k8363k2710j1005J8046M7296K8643k8916m7371
$$ plain form
6046 -138978 -132988 -133045 -170418 -213653 -205802 -151336 -107106 -100618 -113754 -134929 -165737 -181022 -147277
6033 -147277 -87533 -67717 -104593 -142522 -139409 -122345 -131992 -158697 -166773 -148265 -122028 -104129
6021 -104129 -102432 -118599 -138154 -140219 -127856 -122940 -124970 -110748 -85080 -88505 -133305 -172301 -159927
6008 -159927 -111173 -71740 -60052 -66372 -79771 -87567 -75321 -54125 -60184 -102052 -138587 -134973
5996 -134973 -108044 -90116 -85466 -91497 -119155 -155852 -155212 -109240 -82450 -119149 -165140 -149363
5984 -149363 -98433 -88801 -121093 -134945 -124900 -139273 -171535 -160211 -107696 -93751 -143664 -182181
5972 -182181 -157519 -118103 -116875 -126964 -113134 -107399 -140969 -167367 -133106 -74326 -62837 -93816
5960 -93816 -105597 -83926 -71245 -88969 -117332 -140042 -151047 -133001 -85705 -57062 -85978 -133349
5948a33349j54L7670J1984k2746n350K3939J685m0203l0764J3190J7348k0929
5936a47679l2149N056L3881J8148n583L653K8195K4613j4002m9860m1502J0397
5924a66832N3839L8492j6308l9800r225J7130n241l5201j7816K3453L1066R164
5912a17279K772J1766K518j5741n409K0745J4630j8123k2767R466K8536J4434
5900g4452J364J824j4097m4264l8516J3167M9622L0742n778j5540r647p525N923
5887a07177L1055K6515j7456m1828j1806J7173o205l2894K452N5805L6999l4538
5875h1905n2566N163M5332J5113k2396r678J0816j2019l7869j0079L1875J2223
5863a05990m4658m2051L0584O9977J5963n3932m0279L4416O8291K8158k1220k4937
$$ plain form
5948 -133349 -133503 -95833 -83849 -106595 -111945 -88006 -86321 -126524 -157288 -144098 -126750 -147679
5936 -147679 -179828 -174772 -140891 -122743 -128326 -124673 -96478 -71865 -85867 -135727 -177229 -166832
5924 -166832 -112993 -74501 -90809 -130609 -139834 -122704 -127945 -163146 -180962 -157509 -126443 -117279
5912 -117279 -114507 -102741 -100223 -115964 -121373 -100628 -85998 -104121 -126888 -117422 -88886 -74452
5900 -74452 -73088 -71264 -85361 -129625 -168141 -154974 -105352 -74610 -80388 -95928 -105575 -113100 -107177
5887 -107177 -76122 -49607 -67063 -108891 -120697 -103524 -109729 -142623 -140171 -84366 -47367 -81905
5875 -81905 -134471 -129308 -83976 -68863 -91259 -100937 -90121 -102140 -140009 -150088 -118213 -105990
5863 -105990 -150648 -192699 -162115 -92138 -76175 -130107 -170386 -135970 -67679 -39521 -60741 -85678
5851h5678l590J662p950q169M251J5293J7491R119r884k6396k0888J606J3179
5838i9954O467M079J2195O797j3906j3491J4311J7283k7123n3337o497N2837L3569
5825f6770l4289m1490K2909N5375R306l7919k3850P243N164J216K5129K9858j6951
5812f5069m9792q532M6547K7511l2845l9729K160J0867j7019o805M2004M0435
5800e0267k9096o5631j1766N0859L4916j9173k3745J5491K7751j921k5742k0607
5788a18931p918q8J0196J6513P857J985J9703L5860R068m4272o1037k2201J9805
5775a33460J9547l042o369J0722K1460J6276K601j7981l7615k6082L0006Q0726
5763d3211N7138k8900q1232m2719K5425L2432j3404k9866O171L0388L231k8481
$$ plain form
5851 -85678 -89268 -87606 -95556 -103725 -99474 -84181 -66690 -57571 -67455 -93851 -114739 -113133 -99954
5838 -99954 -93487 -89408 -77213 -70416 -84322 -97813 -83502 -66219 -93342 -146679 -153176 -100339 -66770
5825 -66770 -101059 -142549 -119640 -64265 -54959 -92878 -116728 -109485 -104321 -103105 -77976 -48118 -65069
5812 -65069 -114861 -123393 -76846 -49335 -82180 -121909 -119749 -108882 -125901 -132706 -90702 -50267
5800 -50267 -79363 -144994 -156760 -105901 -70985 -90158 -113903 -98412 -70661 -72582 -98324 -118931
5788 -118931 -126849 -126937 -116741 -100228 -92371 -90386 -70683 -34823 -25755 -70027 -131064 -153265 -133460
5775 -133460 -113913 -116955 -123324 -112602 -91142 -74866 -72265 -90246 -127861 -153943 -123937 -43211
5763 -43211 13927 -14973 -96205 -138924 -113499 -81067 -94471 -124337 -118166 -87778 -84547 -113028
5751a13028j4921J9101K7636J9579K3891K3336j0790m8467l5780J5617M0789J7245
5739c5792j3503j9223j3009j1472r657m664k34J2211L4546L4423j0524n4018l2358
5726a23274L2519N5133J2892k8994k8964k1020l2774l5358q977J7679K8991M8731
5714h3416P0628M4400k7080o3116k8854N907q475j5953K6558M6757j8336q4953
5702a35933m3192N2806O4728l773k3180L4469N3546j7649p8181m8457P471J0307
5690a27038k491L2345P3605M3102l5378o8143l1517J0505J4124J676j97j126j2126
5677a02659j9396j1698j622k080l654O808J8208P167k1495k8488P576M7810L7673
5664f5850j1134l1958n792Q640k1266l6970J2048O6514M2157k7330l5793K7405
$$ plain form
5751 -113028 -127949 -108848 -81212 -61633 -37742 -14406 -25196 -73663 -109443 -93826 -53037 -35792
5739 -35792 -49295 -68518 -81527 -92999 -102656 -107320 -107554 -95343 -60797 -26374 -36898 -90916 -123274
5726 -123274 -90755 -35622 -22730 -51724 -80688 -101708 -134482 -169840 -178817 -161138 -132147 -83416
5714 -83416 -12788 31612 4532 -58584 -87438 -81531 -90006 -105959 -79401 -32644 -50980 -135933
5702 -135933 -179125 -126319 -61591 -65364 -88544 -54075 -529 -18178 -96359 -144816 -137345 -127038
5690 -127038 -129529 -97184 -23579 19523 -15855 -83998 -115515 -105010 -90886 -89210 -89407 -90533 -102659
5677 -102659 -122055 -133753 -135375 -137455 -141109 -134301 -116093 -108926 -130421 -158909 -151333 -103523 -65850
5664 -65850 -76984 -108942 -114734 -106094 -127360 -164330 -152282 -85768 -43611 -70941 -106734 -79329
5652g9329O4678K6442k7518m0637l1509k4080j702L0547K6156j7003l3688J621
5640a06022K7064J829k1107R932N4446N0283Q682k5595m6550n7360l2479K5836
5628a11041N5657K4909j0922m298M508k4076m1481k207L6098R487k8289M33M4861
5615d6361O854p3412o7509K6911P8838L4119j8656j5289m288k5309l0827J1073
5603a23856M5443K6126q119j2133o998j7936j6842J4464L2543L481l2648k4443
5591a20918J2818L1533K1254K039j3108j6684m162O881m824j9618k930K4432J1532
5578g1755k6068k0557K8014M3801P475j1199J3297J2690l8651n6164J0503P4517
5566c4097M4738l2219n9499l5840j4638M670L9058M6026o049n3260k8925J8963
$$ plain form
5652 -79329 -14651 11791 -15727 -56364 -87873 -111953 -113655 -83108 -56952 -73955 -107643 -106022
5640 -106022 -78958 -77129 -98236 -88304 -33858 16425 25107 -488 -47038 -104398 -136877 -111041
5628 -111041 -55384 -30475 -41397 -45695 -41187 -65263 -106744 -108951 -72853 -63366 -91655 -91222 -46361
5615 -46361 -39507 -112919 -180428 -153517 -74679 -40560 -59216 -74505 -78793 -104102 -134929 -123856
5603 -123856 -78413 -52287 -60406 -72539 -79537 -97473 -114315 -99851 -67308 -63827 -96475 -120918
5591 -120918 -108100 -76567 -55313 -53274 -66382 -83066 -87228 -80347 -85171 -104789 -107719 -83287 -71755
5578 -71755 -97823 -118380 -90366 -46565 -39090 -50289 -36992 -24302 -62953 -119117 -108614 -34097
5566 -34097 10641 -21578 -81077 -116917 -131555 -126885 -87827 -41801 -47850 -101110 -130035 -111072
5554a11072J1904j9850j623M0055K7267k0291k2432J1620R080j9924n568L3484
5542f7350J5796l8961k8193M6771P0194Q240m0262k1935m024k6819l1389Q201
5530a09731K4570o456j0297L4434L4118m3305p7701O139Q9855M5763n0781m9303
5518a12695L0449N1629m149k8904J1099L2049o069l8229j8454J1483Q669p368
5506g0490o850M971J4820J8313N803j9373k1361J6206M4069J6506k6709k3768
5494d7863O91j5939m9420k4380M2335N6311N358k0560J2312K8659j3587m8938
5482g5021k6643L093q503k0015J0371L5374M699l4668j5740L2306L8803J2316
5470d3628J0059K5267N880l6560l7064Q692L3759J1161r175O804K4579J0321j2298
$$ plain form
5554 -111072 -99168 -119018 -120641 -80586 -53319 -73610 -96042 -84422 -75342 -95266 -100834 -67350
5542 -67350 -51554 -90515 -118708 -71937 -1743 6497 -33765 -55700 -59724 -86543 -117932 -109731
5530 -109731 -85161 -91617 -101914 -67480 -33362 -76667 -154368 -148229 -58374 -12611 -63392 -112695
5518 -112695 -82246 -30617 -34766 -63670 -52571 -20522 -26591 -64820 -83274 -71791 -63122 -70490
5506 -70490 -77340 -72369 -57549 -39236 -33433 -52806 -74167 -57961 -13892 2614 -24095 -47863
5494 -47863 -47172 -63111 -112531 -136911 -94576 -38265 -32907 -53467 -41155 -12496 -26083 -75021
5482 -75021 -101664 -98571 -107074 -127089 -116718 -81344 -76645 -111313 -127053 -94747 -55944 -43628
5470 -43628 -33569 -8302 -2422 -38982 -76046 -67354 -33595 -22434 -31609 -24805 -226 10095 -2203
5457b203j1754l923j7200l8912l6192p846J7610K1798R852m997j1508m422P900
5444h1797R412j009o287Q24M202p455j7129n434J3571R713j4609k2620L309L3317
5430h1992L1669O046q560k168L033n948j5878j6942j7938j9061j222L5314N2059
5417d1588K4672j0673n219K4698J8673l1917o3503l1115K7209M4851J2024k5257
5405e7145l0840j1800N392P132p0k566K985O120K37m887l62M078o81n01J6395
5390f6513K6173K068l0778k3879J4665K8148M896l378K3755L4572l759m2597l3222
5377f9849q684j8568l5687o884M3008M6349Q663k698K1385J7832k9948n1610l711
5364i0402N3522M4720j1431l8806j3479J9480K1034K60j6431k0250j6471q949
$$ plain form
5457 -2203 -13957 -17880 -35080 -73992 -110184 -118030 -100420 -78622 -68770 -73767 -85275 -89697 -81797
5444 -81797 -72385 -73394 -79681 -78857 -74655 -82110 -99239 -104673 -91102 -81389 -95998 -118618 -115309 -81992
5430 -81992 -50323 -44277 -52837 -55005 -51972 -57920 -73798 -90740 -108678 -127739 -128961 -93647 -41588
5417 -41588 -16916 -27589 -32808 -8110 10563 -21354 -84857 -115972 -88763 -43912 -31888 -57145
5405 -57145 -87985 -99785 -94393 -87261 -87331 -89897 -86912 -80792 -80555 -85442 -85804 -81726 -82407 -82908 -66513
5390 -66513 -40340 -38272 -69050 -92929 -78264 -50116 -45220 -48598 -24843 9729 5970 -36627 -69849
5377 -69849 -78533 -97101 -132788 -139672 -96664 -50315 -41652 -44350 -22965 -5133 -35081 -86691 -90402
5364 -90402 -36880 7840 -3591 -42397 -55876 -36396 -15362 -15102 -31533 -51783 -68254 -77203
5352g7203R75R060R183L05r326r493p41P376J1998J7571J8282J334k3688k6450
5338g0817k764J1525l058j4680M938K7814J7009q548j2290j0331l4586n2280p042
5325a55110P0023Q3549J7560l6420j9988J2861j384l5580l2443j83J6399J3737
5313f6979J7389K5466J7251n333k4225l0118j6572J6302L5072J760n0261l8282
5301a18530L8712P4052J2819n2441k7349K9037P911n7426m3930M8079Q4429R510
5289D873o9619n2752J6243M2084J7338j413N336J1388K763q811j2746q535j492
5276e5343j211p030j9K3053K6519r544l7125p767L3095P521n4026m4104M1362
5263h4619P8839J1673n6085k8306L5154L1644j8072k6409R119K5206J4382J5199
$$ plain form
5352 -77203 -76228 -67168 -57985 -57680 -67006 -76499 -77240 -69864 -57866 -40295 -22013 -20679 -44367 -70817
5338 -70817 -73581 -62056 -65114 -79794 -74856 -47042 -30033 -38581 -50871 -61202 -95788 -148068 -155110
5325 -155110 -85087 -1538 16022 -20398 -40386 -27525 -28909 -64489 -96932 -97115 -80716 -66979
5313 -66979 -49590 -24124 -6873 -12206 -36431 -66549 -83121 -66819 -31747 -29987 -80248 -118530
5301 -118530 -79818 -5766 7053 -45388 -72737 -43700 -35789 -93215 -137145 -89066 -4637 4873
5289 4873 -64746 -117498 -101255 -59171 -41833 -43246 -37910 -26522 -23759 -32570 -45316 -53851 -55343
5276 -55343 -56554 -63584 -63603 -40550 -14031 -23575 -60700 -68467 -35372 -27851 -81877 -125981 -84619
5263 -84619 -5780 5893 -50192 -78498 -43344 -11700 -29772 -56181 -47062 -21856 -7474 7725
5251G725J6523j8652n8466l9354J6827K8494r888k3626R102K7741P107k364J8588
5238b0243J3818l9241o8044j4697O4232P5771J7821l5930m1842j7281R929K7705
5226b8002K5390k782l8191m7444j5769L5224N9930K7425l6091n9959j4088L9938
5214e4419K9292k0956k6897J8688L6544m736l9195j8909J2921J1117L290J6157
5202c7103J1851k8167l6887K8432Q2129K7287p6758q9753k875N7038K9768p124
5190d2162P972K5059o870m1476j9583K6736L0170o302k9294k1604p124K944J4820
5177f6714K2155J4158j369j2828k1740k2472K335M0007M1464p079m5739k0597
5165g8419L2155L5381j8652o2566m7391P447N2516N5321J4212l7869n0491r995
$$ plain form
5251 7725 24248 5596 -52870 -92224 -75397 -46903 -56791 -80417 -71315 -43574 -36467 -38831 -20243
5238 -20243 -6425 -45666 -113710 -128407 -64175 11596 29417 -6513 -48355 -65636 -55707 -28002
5226 -28002 -2612 -5394 -43585 -91029 -106798 -71574 -11644 15781 -20310 -80269 -94357 -54419
5214 -54419 -25127 -46083 -72980 -54292 -17748 -22484 -61679 -80588 -67667 -56550 -53260 -37103
5202 -37103 -25252 -53419 -90306 -61874 20255 47542 -29216 -118969 -121844 -64806 -35038 -42162
5190 -42162 -34190 -9131 -16001 -57477 -77060 -50324 -20154 -26456 -55750 -77354 -84478 -81534 -66714
5177 -66714 -44559 -30401 -31770 -44598 -66338 -88810 -86475 -46468 -5004 -12083 -57822 -78419
5165 -78419 -46264 -10883 -29535 -92101 -139492 -132045 -79529 -24208 -9996 -47865 -98356 -108351
5153a08351L4620L3080K446o306J0451J4084k882q440N025P694r247j7656o941
5140e2423j020n906M987L2525L4208n038l6235j8874J5140J4702j1163j7357J739
5127d4715J2973M589l901m699j0493k1225j9605k113J4872K0333J5750J658j7476
5114e4052k1707K286L2382L3232M112k3717l2848l1114k0511P506M0165M3935
5102b0331J1403k2087k4913p298M009N987J1970J9519J1214j4408l1824j7251
5090g4010J7297L0547J805l4450k6882J9126M0657N699l7588l3694k800J292j4794
5077a07795j214L8410M6007Q802j8278o973M588o222l718K6425L2156j4674n3607
5064e6093k7702K2376K9789P774J950n653m5443o3315N456R5617P8647l4039r1654
$$ plain form
5153 -108351 -73731 -40651 -38205 -44511 -34060 -19976 -22858 -31298 -26273 -18579 -27826 -45482 -52423
5140 -52423 -53443 -59349 -54362 -21837 12371 7333 -28902 -47776 -32636 -17934 -29097 -46454 -44715
5127 -44715 -31742 -27153 -31054 -35753 -46246 -67471 -87076 -89189 -74317 -53984 -38234 -36576 -54052
5114 -54052 -75759 -73473 -41091 -7859 -3747 -27464 -60312 -91426 -111937 -104431 -64266 -20331
5102 -20331 -8928 -31015 -55928 -63226 -59217 -53230 -41260 -21741 -10527 -24935 -56759 -74010
5090 -74010 -56713 -26166 -24361 -58811 -85693 -66567 -25910 -20211 -57799 -91493 -94293 -93001 -107795
5077 -107795 -109009 -70599 -24592 -15790 -34068 -41041 -36453 -42675 -46393 -19968 12188 -2486 -56093
5064 -56093 -83795 -61419 -31630 -23856 -21906 -27559 -73002 -136317 -130861 -35244 43403 9364 -82290
5051h2290k8268M8492L7922j2715j7214J0697J4745M351J4014K3115L342j3245
5039B946M136J4357k0477n0019j8545K6552J3812j9665N217N5112L3527m0928
5027F025n4266O123K8055k7626n8442k103N5292L0134k3072j9658J4652J2248
5015c2638j0969k396K1257J4523n746l281j589k7332l3110K0458O3768J8191n3867
5002c2731l5254M5669N5040j8309m2768K6058O5533k594p7088m8577K3803K4465
4990a6753k8849l6676P892K7771P417M443K8473K3487k0544l8754J315M4432L2741
4977C6395j5364m5265l9253j7201L423J8660K5735J9319l189l2731m2258q619
4965a00348M4834N6021K971n4442n0032L05L3658L4636L2996K8920l522m4613
$$ plain form
5051 -82290 -110558 -62066 -24144 -36859 -54073 -43376 -28631 -24280 -10266 12849 16191 2946
5039 2946 7082 21439 962 -49057 -67602 -41050 -27238 -46903 -41686 13426 46953 6025
5027 6025 -48241 -42118 -14063 -41689 -100131 -102234 -46942 -16808 -39880 -59538 -44886 -32638
5015 -32638 -43607 -46003 -24746 -10223 -15969 -19250 -20839 -48171 -81281 -60823 2945 21136 -32731
5002 -32731 -67985 -22316 32724 14415 -28353 -2295 63238 60644 -16444 -65021 -41218 -16753
4990 -16753 -45602 -82278 -74386 -46615 -39198 -34755 -6282 17205 -3339 -42093 -40778 3654 36395
4977 36395 21031 -24234 -63487 -80688 -77265 -58605 -32870 -13551 -16740 -49471 -91729 -100348
4965 -100348 -55514 507 3478 -50964 -100996 -100691 -67033 -32397 599 29519 25997 -18616
4953a8616m1678k150P332k4454k4143M1120R0111M2374n5059r0808m0586K0039
4941i6518L3724J9416J3905J7972J5241K842j1943k0809j4905M520J8456J2125
4929e974k981q839j0250j9861k6957j1397J9200L6105K8757J1004o007k0446k4799
4916d2445j1700Q472J8707J7733J0929n848k7608k6699N571K6109k165l8947j6964
4903h4855M4021N0933k0930p9591m7418K9939O0559L4904R593L927q709k5607
4891c3234j1532K5584K8251k0300n9122l4493K3841M8895K5844n215j4886j0607
4879c6974m433N776J6982J3667o335k0097j0285P196N688j1042j3835N242J7266
4866c1184N95k1193j0483K6614M5011K4083n929j3418j0305k1560l4336j6706
$$ plain form
4953 -18616 -60294 -62444 -55112 -79566 -103709 -62589 27522 69896 14837 -75971 -116557 -96518
4941 -96518 -62794 -43378 -29473 -11501 3740 6582 -5361 -26170 -41075 -36555 -18099 -5974
4929 -5974 -8955 -17794 -28044 -47905 -74862 -86259 -67059 -30954 -2197 8807 2800 -17646 -42445
4916 -42445 -54145 -45673 -26966 -9233 1696 -4152 -31760 -58459 -52888 -26779 -28944 -67891 -84855
4903 -84855 -40834 10099 -10831 -90422 -137840 -107901 -47342 -12438 -2845 1082 -7627 -33234
4891 -33234 -44766 -19182 9069 -11231 -70353 -104846 -81005 -32110 -6266 -11481 -26367 -36974
4879 -36974 -41407 -35631 -18649 -4982 -11317 -31414 -41699 -34503 -28815 -39857 -53692 -48450 -31184
4866 -31184 -30589 -51782 -62265 -35651 9360 33443 27514 14096 3791 -17769 -52105 -68811
4854f8811K0974K8465r111l8734j1141M3428N3120O497l1935j7078J4222O903
4842c201k4835k4485J1923K9250M806j5996L88J7970l366l2446j6108K7605L4366
4829E871k007k1648J537K1490K40l4328l9228j5248J3200L2937L1588j083l6094
4816d2773k1883L1822M7149l826m1992l582M7924J9744n3214n8141J5614O3629
4804D71L4182o997m368L893k2412m3621j4296L1073L3406m67k2163j5351N735
4791b0915L0351L8911L279n4389n8248J0197N9003J5973m9968l2780L7274M3891
4779B2579j9917m3599Q888L9777q698n3071j4519M6040L6100j2739j1764K3509
4767A2586O990n1963n0336L1236P8355J5494p3176o5798K4911Q2259M9439j6770
$$ plain form
4854 -68811 -47837 -19372 -28483 -67217 -78358 -34930 18190 24687 -7248 -24326 -10104 -3201
4842 -3201 -28036 -52521 -40598 -11348 -6542 -22538 -22150 -4180 -7546 -39992 -56100 -28495 5871
4829 5871 3864 -17784 -16247 5243 5483 -28845 -68073 -83321 -70121 -37184 -5596 -6679 -42773
4816 -42773 -64656 -32834 14315 10489 -31503 -35085 12839 32583 -20631 -78772 -63158 471
4804 471 34653 27656 23288 27181 4769 -38852 -53148 -22075 11331 10864 -11299 -26650 -20915
4791 -20915 9436 48347 51626 -2763 -61011 -50814 8189 24162 -25806 -58586 -21312 22579
4779 22579 2662 -40937 -32049 7728 -970 -54041 -68560 -22520 13580 841 -10923 12586
4767 12586 19576 -32387 -82723 -51487 26868 42362 -30814 -96612 -71701 10558 59997 43227
4755D3227m4578l0061j0827p287j2062j1185J159J6580J7063k373j9365r495J8614
4742e0590L3681K3279K652j4109k5064k3925l034K2966K6601P528o288k878K119
4729g062L350J2685J8471q942n1188m4495J6319M7046L627l2713J5034P6323L9639
4716H8094m9183m7925L9439N6360m1859j00432k0307P3357M2770l5034j7984M5521
4704C2817J2302q2672p4002L9546P9876o511n6473K4084R4028J9862r3124p4395
4692h4662L7667P5015J0595l2636m062J6579j6543m3778j9045J9311K9605K3085
4680A1131J0978j9394n0682l8784N524J7485j3312j7525L5747P5989L6783m2170
$$ plain form
4755 43227 -1351 -31412 -42239 -49526 -61588 -72773 -71614 -55034 -37971 -40344 -59709 -69204 -50590
4742 -50590 -16909 6370 9022 -5087 -30151 -54076 -57110 -34144 -7543 -15 -6303 -9181 -7062
4729 -7062 -3712 8973 27444 18502 -32686 -77181 -60862 -13816 -10189 -42902 -27868 48455 88094
4716 88094 38911 -9014 30425 86785 44926 -55506 -75813 -2456 40314 5280 -12704 32817
4704 32817 45119 -37553 -111555 -72009 7867 1356 -55117 -31033 62995 82857 -10267 -84662
4692 -84662 -46995 28020 38615 5979 1917 18496 1953 -41825 -60870 -41559 -11954 11131
4680 11131 22109 2715 -47967 -86751 -81227 -63742 -77054 -94579 -58832 17157 53940 11770
$$ [...]
##END NTUPLES=NMR SPECTRUM
##END=
